##TITLE=1H_EC-3338(2)
 CDCl3
 8 sc, 
 13.1.2025
##JCAMPDX= 6.0         $$ Bruker NMR JCAMP-DX V2.0
##DATA TYPE= NMR SPECTRUM
##DATA CLASS= NTUPLES
##ORIGIN= UXNMR, Bruker Analytische Messtechnik GmbH
##OWNER= root
$$ XWIN-NMR		Version 3.5
$$ Mon Jan 13 14:14:13 2025 Russian Standard Time (UT+4h)  she@DPX200
##.OBSERVE FREQUENCY= 200.1315
##.OBSERVE NUCLEUS= ^1H
##.ACQUISITION MODE= SIMULTANEOUS
##.ACQUISITION SCHEME= undefined
##.AVERAGES= 8
##.DIGITISER RES= 18
##SPECTROMETER/DATA SYSTEM= spect
##.PULSE SEQUENCE= zg30
##.SOLVENT NAME= CDCl3
##.SHIFT REFERENCE= (INTERNAL, CDCl3, 0, 21.6555)
##AUDIT TRAIL= $$ (NUMBER, WHEN, WHO, WHERE, WHAT)
$$ ##TITLE= Audit trail, XWIN-NMR		Version 3.5
$$ ##JCAMPDX= 5.01
$$ ##ORIGIN= Bruker BioSpin GmbH
$$ ##OWNER= she
$$ F:/spectra/data/she/nmr/H-F/1/pdata/1/auditp.txt
$$ ##AUDIT TRAIL=  $$ (NUMBER, WHEN, WHO, WHERE, WHAT)
(   1,<2025-01-13 14:12:54.15 +0400>,<she>,<DPX200>,
      <created by zg, POWCHK disabled, PULCHK disabled
       configuration hash MD5:
       00 E9 B6 7A A2 85 ED C7 34 08 36 98 17 FE 4E 26
       data hash MD5: 16K
       30 F5 42 5F 01 AE 1E 80 4E 8C 1B AB A1 5C 4C 71>)
(   2,<2025-01-13 14:12:56.98 +0400>,<she>,<DPX200>,
      <Start of raw data processing
       efp BC_mod = 2 LB = 0.24 FT_mod = 6 PKNL = 1 PHC0 = -26570.72 PHC1 = 10.58744 SI = 16K 
       data hash MD5: 16K
       3C 21 21 68 EC 6A 64 01 50 BA 8A 0C EE 2B 1E C8>)
(   3,<2025-01-13 14:13:23.51 +0400>,<she>,<DPX200>,
      <pk PHC0 = 5.249683 PHC1 = -7.999999 
       data hash MD5: 16K
       D7 45 80 45 D8 FD BB 04 A0 D4 FF 42 83 56 FD A8>)
(   4,<2025-01-13 14:13:26.42 +0400>,<she>,<DPX200>,
      <abs ABSG = 5 
       data hash MD5: 16K
       86 0E 72 77 1F E4 74 54 43 E5 F4 9D F7 D4 4B 20>)
$$ ##END=
$$ 
$$ hash MD5
$$ E4 F2 D7 15 DB 40 CE EB B0 1B 9E 3F 7B A6 BC E5
##$RELAX= 
##$RELAX= 
##$RELAX= 
##$RELAX= 
##$RELAX= 
##$RELAX= 
$$ Bruker specific parameters
$$ --------------------------
##$DU= <F:/spectra>
##$EXPNO= 1
##$NAME= <H-F>
##$PROCNO= 1
##$TYPE= <nmr>
##$USER= <she>
##$AMP= (0..31)
100 100 100 100 100 100 100 100 100 100 100 100 100 100 100 100 100 100 
100 100 100 100 100 100 100 100 100 100 100 100 100 100 
##$AQSEQ= 0
##$AQ_mod= 1
##$AUNM= <au_zg>
##$AUTOPOS= <>
##$BF1= 200.13
##$BF2= 200.13
##$BF3= 200.13
##$BF4= 200.13
##$BF5= 200.13
##$BF6= 200.13
##$BF7= 200.13
##$BF8= 200.13
##$BYTORDA= 1
##$CFDGTYP= 0
##$CFRGTYP= 5
##$CHEMSTR= <none>
##$CNST= (0..31)
1 1 145 1 1 1 1 1 1 1 1 1 1 1 1 1 1 1 1 1 1 1 1 1 1 1 1 1 1 1 1 1 
##$CPDPRG= <>
##$CPDPRG1= <>
##$CPDPRG2= <>
##$CPDPRG3= <>
##$CPDPRG4= <mlev>
##$CPDPRG5= <mlev>
##$CPDPRG6= <mlev>
##$CPDPRG7= <mlev>
##$CPDPRG8= <mlev>
##$CPDPRGB= <>
##$CPDPRGT= <>
##$D= (0..31)
0 1.2 0 0 0 0 0 0 0 0.06 0 0.03 0 0 0 0 0.0002 0 0 0 0 0 0 0 0 0 0 0 0 
0 0 0 
##$DATE= 1736763173
##$DBL= (0..7)
120 120 120 120 120 120 120 120 
##$DBP= (0..7)
150 150 150 150 150 150 150 150 
##$DBP07= 0
##$DBPNAM0= <>
##$DBPNAM1= <>
##$DBPNAM2= <>
##$DBPNAM3= <>
##$DBPNAM4= <>
$$ [...]
##$SUBNAM3= <"">
##$SUBNAM4= <"">
##$SUBNAM5= <"">
##$SUBNAM6= <"">
##$SUBNAM7= <"">
##$SUBNAM8= <"">
##$SUBNAM9= <"">
##$SW= 24.0689530833862
##$SWIBOX= (0..15)
0 0 2 0 0 0 0 0 0 0 0 0 0 0 0 0 
##$SW_h= 4816.95568400771
##$TD= 16384
##$TD0= 1
##$TE= 0
##$TE2= 300
##$TE3= 300
##$TEG= 300
##$TL= (0..7)
0 120 120 120 120 120 120 120 
##$TP= (0..7)
150 150 150 150 150 150 150 150 
##$TP07= 0
##$TPNAME0= <>
##$TPNAME1= <>
##$TPNAME2= <>
##$TPNAME3= <>
##$TPNAME4= <>
##$TPNAME5= <>
##$TPNAME6= <>
##$TPNAME7= <>
##$TPOAL= (0..7)
0.5 0.5 0.5 0.5 0.5 0.5 0.5 0.5 
##$TPOFFS= (0..7)
0 0 0 0 0 0 0 0 
##$TUNHIN= 0
##$TUNHOUT= 0
##$TUNXOUT= 0
##$USERA1= <user>
##$USERA2= <user>
##$USERA3= <user>
##$USERA4= <user>
##$USERA5= <user>
##$V9= 5
##$VALIST= <valist>
##$VCLIST= <CCCCCCCCCCCCCCC>
##$VD= 0
##$VDLIST= <DDDDDDDDDDDDDDD>
##$VPLIST= <PPPPPPPPPPPPPPP>
##$VTLIST= <TTTTTTTTTTTTTTT>
##$WBST= 1024
##$WBSW= 4
##$XGAIN= (0..3)
0 0 0 0 
##$XL= 0
##$YL= 0
##$YMAX_a= 420473
##$YMIN_a= -629303
##$ZGOPTNS= <>
##$ZL1= 120
##$ZL2= 120
##$ZL3= 120
##$ZL4= 120
##$ABSF1= 21.83327
##$ABSF2= -2.23592
##$ABSG= 5
##$ABSL= 3
##$ALPHA= 0
##$AQORDER= 0
##$ASSFAC= 0
##$ASSFACI= 0
##$ASSFACX= 0
##$ASSWID= 0
##$AUNMP= <proc_1d>
##$AZFE= 0.1
##$AZFW= 0.1
##$BCFW= 0
##$BC_mod= 2
##$BYTORDP= 0
##$COROFFS= 0
##$CY= -3
##$DATMOD= 1
##$DC= 0
##$DFILT= <>
##$DTYPP= 0
##$F1P= 0
##$F2P= 0
##$FCOR= 1
##$FTSIZE= 16384
##$FT_mod= 6
##$GAMMA= 0
##$GB= 0
##$INTBC= 1
##$INTSCL= 2.524811e-10
##$ISEN= 128
##$LB= 0.24
##$LEV0= 0
##$LPBIN= 0
##$MAXI= 10000
##$MC2= 0
##$MEAN= 0
##$ME_mod= 0
##$MI= 1.114404
##$NCOEF= 0
##$NC_proc= -6
##$NLEV= 6
##$NOISF1= 3.799351
##$NOISF2= 2.8
##$NSP= 0
##$NTH_PI= 0
##$NZP= 0
##$OFFSET= 21.65551
##$PC= 1
##$PHC0= -26565.47
##$PHC1= 2.58744
##$PH_mod= 1
##$PKNL= yes
##$PPARMOD= 0
##$PSCAL= 0
##$PSIGN= 0
##$REVERSE= no
##$SF= 200.129574570467
##$SI= 16384
##$SIGF1= 3
##$SIGF2= 2
##$SINO= 5.538805
##$SIOLD= 16384
##$SREGLST= <1H.CDCl3>
##$SSB= 0
##$STSI= 16384
##$STSR= 0
##$SW_p= 4816.95568400771
##$SYMM= 0
##$S_DEV= 0
##$TDeff= 16384
##$TDoff= 0
##$TI= <>
##$TILT= no
##$TM1= 0
##$TM2= 0
##$TOPLEV= 0
##$USERP1= <user>
##$USERP2= <user>
##$USERP3= <user>
##$USERP4= <user>
##$USERP5= <user>
##$WDW= 1
##$XDIM= 16384
##$YMAX_p= 298237216
##$YMIN_p= -620712
$$ End of Bruker specific parameters
$$ ---------------------------------
##NTUPLES= NMR SPECTRUM
##VAR_NAME=  FREQUENCY,     SPECTRUM/REAL,   SPECTRUM/IMAG
##SYMBOL=    X,             R,               I
##VAR_TYPE=  INDEPENDENT,   DEPENDENT,       DEPENDENT
##VAR_FORM=  AFFN,          ASDF,            ASDF
##VAR_DIM=   16384,         16384,           16384
##UNITS=     HZ,            ARBITRARY UNITS, ARBITRARY UNITS
##FACTOR=    0.29402158847633, 1,            1
##FIRST=     4333.90799314594, 0,            0
##LAST=      -483.047690861766, 0,           0
##MIN=       -483.047690861766, -620712,     0
##MAX=       4333.90799314594, 298237216,    0
$$ Real data points
##PAGE= N=1
##DATA TABLE= (X++(R..R)), XYDATA
$$ [...]
5799A340228k34963k38460J13619J21897q0410O0887M23982J28602l71472J17532
$$ 1340228 1105265 866805 980424 1102321 1021911 1082798 1506780 1635382 1263910 1381442
5789A381442k0359P1970J88031l3318r7958M4484L9016j322K22309J83502j06154
$$ 1381442 1361083 1433053 1621084 1587766 1489808 1534292 1573308 1571986 1794295 1977797 1871643
5778A871643j91863J40145j34262J36218K44592m3037k11402P5416N9945k59195
$$ 1871643 1679780 1819925 1685663 1821881 2066473 2023436 1812034 1887450 1947395 1688200
5768A688200J3902j08182j19730j14157K06347j06411l58291j72281K55997j6794
$$ 1688200 1702102 1593920 1474190 1360033 1566380 1459969 1101678 929397 1185394 1168600
5758A168600m4984J32686K0728J8865N8648K17306k3241l14196J7506n7476K14171
$$ 1168600 1123616 1256302 1277030 1295895 1354543 1571849 1548608 1234412 1251918 1194442 1408613
5747A408613J67466l18271R3145k71008L70670j59239N9982R6039k91588J54048
$$ 1408613 1576079 1257808 1350953 1079945 1450615 1291376 1351358 1447397 1155809 1309857
5737A309857m4567J71988p4916j9492p0325J22376K1433p8165M701L2234J34951
$$ 1309857 1265290 1437278 1362362 1342870 1272545 1394921 1416354 1338189 1342890 1375124 1510075
5726A510075j03703O4926J59742j15069R7071Q0348o4547k74916J88199p4398
$$ 1510075 1406372 1471298 1631040 1515971 1613042 1693390 1628843 1353927 1542126 1467728
5716A467728J13876J5468k40169n3522Q2386K37Q9853j28755J53640n7726l63331
$$ 1467728 1581604 1597072 1356903 1303381 1385767 1386004 1475857 1347102 1500742 1443016 1079685
5705A079685J26568K17588r2096r5667K10247k14707j878J51704j09975K885k30871
$$ 1079685 1206253 1423841 1331745 1236078 1446325 1231618 1229740 1381444 1271469 1274354 1043483
5694A043483Q0206J51434M41438k19849l02631J45626J18620k82014K250J62560
$$ 1043483 1123689 1275123 1716561 1496712 1194081 1339707 1458327 1176313 1178563 1341123
5684A341123n2252K22406k6804j67115k7370R5421J68205k74092p1023L2803j29378
$$ 1341123 1288871 1511277 1484473 1317358 1289988 1385409 1553614 1279522 1208499 1241302 1111924
5673A111924J26952j50173j01112r1650L67575J99863p3630j1000L52195o6087
$$ 1111924 1238876 1088703 987591 895941 1263516 1463379 1389749 1378749 1730944 1664857
5663A664857l52323J30654K2599k24900J20966J07908J9829L0807j03737l00272
$$ 1664857 1312534 1443188 1465787 1240887 1361853 1469761 1489590 1520397 1416660 1116388
5653A116388K08521L25173k44030j30221N4204K10766j68603k61286J60430K18849
$$ 1116388 1324909 1650082 1406052 1275831 1330035 1540801 1372198 1110912 1271342 1490191
5643A490191J10535M1004k1909M7638k01149q4245O4578O8891O0399m0152K25623
$$ 1490191 1600726 1641730 1619821 1667459 1466310 1382065 1446643 1515534 1575933 1535781 1761404
5632A761404j03610k65686K2118k33259J4858J75542J25185q2261r2190J62897
$$ 1761404 1657794 1392108 1414226 1180967 1195825 1371367 1496552 1414291 1322101 1484998
5622A484998j51055L05405l40413j00580L4672K6373k5890K41978j761k00108
$$ 1484998 1333943 1639348 1298935 1198355 1233027 1259400 1233510 1475488 1473727 1273619
5612A273619J11200J10807l0798J14938q4917K23924K9754j04000k82954J03213
$$ 1273619 1384819 1495626 1464828 1579766 1494849 1718773 1748527 1644527 1361573 1464786
5602A464786Q7578M6425j17684k1075K8645j73373j23351j55815J27812l3920
$$ 1464786 1552364 1598789 1481105 1460030 1488675 1315302 1191951 1036136 1163948 1130028
5592A130028L97994J25133l12785k4225K6910L8902J97996j85244K197J0275K0884
$$ 1130028 1528022 1653155 1340370 1316145 1343055 1381957 1579953 1394709 1396906 1407181 1428065
5581A428065j17155N0482n4074Lk47553K73846L27644l3050M2525J21614N9062
$$ 1428065 1310910 1361392 1307318 1307321 1059768 1333614 1661258 1628208 1670733 1792347 1851409
5570A851409l45436L00848j66104L06125K1712j59748o857O6332j300K5570M8087
$$ 1851409 1505973 1806821 1640717 1946842 1968554 1808806 1801949 1868281 1866981 1892551 1940638
5559A940638m1400R581O6611k4271J9751l8688q4167q3996K9816n5094p6065J63548
$$ 1940638 1899238 1908819 1975430 1951159 1970910 1932222 1848055 1764059 1793875 1738781 1662716 1826264
5547A826264J00542K40426o667j81537J96759m42J68772K50855k62044J83957
$$ 1826264 1926806 2167232 2160565 1979028 2175787 2175345 2344117 2594972 2332928 2516885
5537B516885M1422K00584k01271M9583k04755K58782m3653N014j02246J6714k98066
$$ 2516885 2558307 2758891 2557620 2607203 2402448 2661230 2617577 2622591 2520345 2537059 2238993
5526B238993k1250l38385j08351L53675j98836j13410K4645M7712K2202r1233
$$ 2238993 2217743 1879358 1771007 2124682 1925846 1812436 1837081 1884793 1906995 1815762
5516A815762J51022J54077j41628L8010J31379n9084J57252R208J90163J05752
$$ 1815762 1966784 2120861 1979233 2017243 2148622 2089538 2246790 2255998 2446161 2551913
5506B551913j70175k46132k93183P3486J22522j10568j06201L0906j81901N054
$$ 2551913 2381738 2135606 1842423 1915909 2038431 1927863 1821662 1852568 1670667 1675721
5496A675721J49720k36308k01160J38611K02938k7292r2044J58030L4269p3344
$$ 1675721 1825441 1589133 1387973 1526584 1729522 1702230 1610186 1768216 1802485 1729141
5486A729141M08676O2243k3880J16103J24548J32228M042K04198R1878R6169J30836
$$ 1729141 2137817 2200060 2176180 2292283 2416831 2549059 2553101 2757299 2849177 2945346 3076182
5475C076182J62889j16910m4987q2346L06805j84726j34003Q3084k20153k21652
$$ 3076182 3239071 3122161 3077174 2994828 3301633 3116907 2982904 3065988 2845835 2624183
5465B624183k78972J82211J37131j09770J74587K34092j73319K96002O9665j41309
$$ 2624183 2345211 2527422 2664553 2554783 2729370 2963462 2790143 3086145 3155810 3014501
5455C014501M86949J08271K7147L40L2670K110J08455j6636M50641J85686n9402
$$ 3014501 3501450 3609721 3636868 3637208 3669878 3671988 3780443 3763807 4214448 4400134 4340732
5444D340732N2667M7952L11997O01304M79866R58365J161904J290857L90040n93131
$$ 4340732 4393399 4441351 4753348 5354652 5834518 6792883 7954787 9245644 9635684 9042553
5434I042553j615331j355946q61112m99818j79465l51934k36277j83715j93543
$$ 9042553 7427222 6071276 5210164 4710346 4530881 4178947 3942670 3758955 3565412
5425C565412J12150J41958K02819M0436j23990M06748L45377O53445Q73114J108604
$$ 3565412 3677562 3819520 4022339 4062775 3938785 4345533 4690910 5344355 6217469 7326073
5415G326073J150169L40568p98131j401568j278134j007936o22888l62048j94764
$$ 7326073 8476242 8816810 8018679 6617111 5338977 4331041 3708153 3346105 3151341
5406C151341m96497k86128N0107l6395n8034j25726l0690j0202J58381j43955
$$ 3151341 2654844 2368716 2418823 2382428 2324394 2198668 2167978 2157776 2316157 2172202
5396B172202k06493j59436n8041K16456Q0450n9344k60395J4088r1303L0507Q0143
$$ 2172202 1965709 1806273 1748232 1964688 2045138 1985794 1725399 1739487 1648184 1678691 1758834
5385A758834K2266j32460j37631L07399k10583J63505k48791K2988J19666j56865
$$ 1758834 1781100 1648640 1511009 1818408 1607825 1771330 1522539 1545527 1665193 1508328
5375A508328O7325l6717J49183n4007m2772K00052j06967n623J9374J71302J17455
$$ 1508328 1575653 1538936 1688119 1634112 1591340 1791392 1684425 1678802 1698176 1869478 1986933
5364A986933J19333K58680j34955l5336M55786K14782K2527Q9643O30294N23369
$$ 1986933 2106266 2364946 2229991 2194655 2650441 2865223 2887750 2977393 3607687 4131056
5354D131056P52765P79044N97907K24540l68882o39452k71078k39603j97943j55513
$$ 4131056 4883821 5662865 6260772 6485312 6116430 5476978 5205900 4966297 4768354 4612841
5344D612841m1177l72217m96533l77187p02131j69402j56731l70183j46262J19253
$$ 4612841 4571664 4199447 3702914 3325727 2623596 2454194 2297463 1927280 1781018 1900271
5334A900271j07026k61310j16840K27285j64085o8091J81789K5985J25236l7943
$$ 1900271 1793245 1531935 1415095 1642380 1478295 1410204 1591993 1617978 1743214 1705271
5324A705271j18728j01816J40966J6267K6399l15484j8732P3660k06656j27742
$$ 1705271 1586543 1484727 1625693 1641960 1668359 1352875 1334143 1407803 1201147 1073405
5314A073405K79835q231J54016j57921k84397J45446Q8934K30090q9044K00410
$$ 1073405 1353240 1345009 1499025 1341104 1056707 1202153 1291087 1521177 1432133 1632543
5304A632543m7778J75413K36091K47983K48163l50881j48247q3158l42863K15288
$$ 1632543 1584765 1760178 1996269 2244252 2492415 2141534 1993287 1910129 1567266 1782554
5294A782554k36162k33553j07681q888j26248K02913j00222N5007K1820k1802
$$ 1782554 1546392 1312839 1205158 1196270 1070022 1272935 1172713 1227720 1249540 1227738
5284A227738k15005K7090J53452k8928Q0508K56111m5988N3928j35211L6323j08729
$$ 1227738 1012733 1039823 1193275 1164347 1244855 1500966 1454978 1508906 1373695 1410018 1301289
5273A301289k62333J89017j69413P6518J1540Q0046M8462q538O274m6601m32663
$$ 1301289 1038956 1227973 1058560 1135078 1146618 1226664 1275126 1266588 1272862 1226261 793598
5262G93598N1609J77784l5922k75638K49446n9476n8177K90457K5883o2986j31122
$$ 793598 845207 1022991 987069 711431 960877 901401 843224 1133681 1159564 1096578 965456
5251I65456P4957K61893k24567q9847L6412J02112L0500o0761p3518o4956N249
$$ 965456 1040413 1302306 1077739 987892 1024304 1126416 1156916 1096155 1022637 957681 962930
5240I62930J4676J27812J10660K26104j27032k11435K9907J82425K947O2858j83579
$$ 962930 977606 1105418 1216078 1442182 1315150 1103715 1133622 1316047 1318994 1381852 1198273
5229A198273L13473p0760j0314J36347R0215l81826O448r91o9187J09370K9780
$$ 1198273 1511746 1440986 1430672 1567019 1657234 1275408 1281856 1280865 1211678 1321048 1350828
5218A350828o7447o4720P8268k19592J49962Q1103j38246n500Q7241o3841J31546
$$ 1350828 1283381 1218661 1296929 1077337 1227299 1308402 1170156 1164656 1251897 1188056 1319602
5207A319602K94088q6385R1605P5961j01646K82565l4341L3129l11164J31787
$$ 1319602 1613690 1527305 1618910 1694871 1593225 1875790 1841449 1874578 1563414 1695201
5197A695201P8936k49112k45869l5134p4796p6823q6600k8181K66417K35115j6392
$$ 1695201 1774137 1525025 1279156 1244022 1169226 1092403 1005803 977622 1244039 1479154 1462762
5186A462762k14211m0523M48730J18762j04346M9170J24678j08774K0040K7044
$$ 1462762 1248551 1208028 1656758 1775520 1671174 1720344 1845022 1736248 1756288 1783332
5176A783332L0889k34536J10059j56529L1986j6055j06486n7555o9935J73277
$$ 1783332 1814221 1579685 1689744 1533215 1565201 1549146 1442660 1385105 1315170 1488447
5166A488447r5347l8834M0287J16309j47432K34018J15122K27241o7749q3161
$$ 1488447 1393100 1354266 1394553 1510862 1363430 1597448 1712570 1939811 1872062 1788901
5156A788901M00022J03241j36080K38584K45398L66456K63395P45943P56569J79859
$$ 1788901 2188923 2292164 2156084 2394668 2640066 3006522 3269917 4015860 4772429 4952288
5146D952288j06234p56254r24308n02650k00883l75948j55196l7434n95o8187
$$ 4952288 4846054 4089800 3165492 2662842 2461959 2086011 1930815 1893381 1892786 1824599
5136A824599l1849l70157K51038L6858k84434j19026P1657j44002N4041J05075
$$ 1824599 1792750 1422593 1673631 1710489 1426055 1307029 1378686 1234684 1288725 1393800
5126A393800l35640K00451J58319J15206k62224J02966p4659J24731l0754K30606
$$ 1393800 1058160 1258611 1416930 1532136 1269912 1372878 1298219 1422950 1392196 1622802
5116A622802k13816j21157M21249k94874j09833j1998K80649l9027r8343R0310
$$ 1622802 1408986 1287829 1709078 1414204 1304371 1292373 1573022 1533995 1435652 1525962
5106A525962J90273j23844m3586K61112J17111J72572O1100K74420o0200l40648
$$ 1525962 1716235 1592391 1548805 1809917 1927028 2099600 2160700 2435120 2374920 2034272
5096B034272J67564J81784j2360j30348J58257J55833J14220L88313L31079m9243
$$ 2034272 2201836 2383620 2371260 2240912 2399169 2555002 2669222 3057535 3388614 3339371
5086C339371n65989k33374J004J89317L6755K7997K91480L56185m08481J5730
$$ 3339371 2773382 2540008 2541012 2730329 2767084 2795081 3086561 3442746 3034265 3049995
5076C049995M313j09436k86341J53483J76186k14614j63072j41744k01349j02752
$$ 3049995 3054308 2944872 2658531 2812014 2988200 2773586 2610514 2468770 2267421 2164669
5066B164669p285J5527l2909n4562J43161j33692J06487j3276j56317K7848K63083
$$ 2164669 2157384 2172911 2140002 2085440 2228601 2094909 2201396 2188120 2031803 2059651 2322734
5055B322734L867l9478n7503L57933K49013j62106J08203j68740K08150l2630
$$ 2322734 2326601 2287123 2229620 2587553 2836566 2674460 2782663 2613923 2822073 2789443
5045B789443Q8391l104j98004k7815j15860n413j08904L4103J58019j1847J8163
$$ 2789443 2877834 2874730 2676726 2648911 2533051 2527638 2418734 2452837 2610856 2599009 2617172
5034B617172K57566L20818m9536K47060P9755J14560K74223j44588L43260J45859
$$ 2617172 2874738 3195556 3146020 3393080 3472835 3587395 3861618 3717030 4060290 4206149
5024D206149L04853L56375K65811j64846m27904k32487k63971k86958j55927k28699
$$ 4206149 4511002 4867377 5133188 4968342 4540438 4307951 4043980 3757022 3601095 3372396
5014C372396J34947Q247p0478K4269K84113k5627J7988K37719J81785P8130o1604
$$ 3372396 3507343 3515590 3445112 3469381 3753494 3727867 3745855 3983574 4165359 4243489 4181885
5003D181885J47542N10289L01083J94494R8478N1121N5083l18546p9897J60498
$$ 4181885 4329427 4839716 5140799 5335293 5433771 5484892 5539975 5221429 5141532 5302030
4993E302030k77701j50976l10489K99013J0560j04995j41889Q6341J01375j75612
$$ 5302030 5024329 4873353 4562864 4861877 4872437 4767442 4625553 4711894 4813269 4637657
4983D637657R6535j33742k94147j14477l2641j96758j71161q107K25975k76161
$$ 4637657 4734192 4600450 4306303 4191826 4159185 3962427 3791266 3783159 4009134 3732973
4973C732973K74963J47004N426j76714j35310L6365k4548M47384K00921Q2758
$$ 3732973 4007936 4154940 4160366 3983652 3848342 3884707 3860159 4307543 4508464 4591222
4963D591222L057k531K1421l64448j29147l78586k54838K34494J83570j05454
$$ 4591222 4594279 4591748 4613169 4248721 4119574 3740988 3486150 3720644 3904214 3798760
4953C798760q1140Q509O7128J02947R7178J96891K64722q3709J20686K73500J10227
$$ 3798760 3717620 3726129 3793257 3896204 3993382 4190273 4454995 4371286 4491972 4765472 4875699
4942D875699K02273k266J68770n4003j15471O906Q4696m5224J87195M550K11864
$$ 4875699 5077972 5075706 5244476 5190473 5075002 5081908 5166604 5121380 5308575 5313125 5524989
4931E524989J67877j20777M6414j43776M19477K62829K17448j0443K36017L69256
$$ 5524989 5692866 5572089 5618503 5474727 5894204 6157033 6374481 6364038 6600055 6969311
4921F969311L79863K60786L23192K84530M03050N04940K38821N08497Q2473L61029
$$ 6969311 7349174 7609960 7933152 8217682 8620732 9125672 9364493 9872990 9955463 10316492
4911A0316492J42997P2684J30633N63493L61487J87391K41733K12814L44475K88275
$$ 10316492 10459489 10532173 10662806 11226299 11587786 11775177 12016910 12229724 12574199 12862474
4901A2862474L5413P6327K56988J02532K97862M12267L22470K49389K95321J48630
$$ 12862474 12897887 12974214 13231202 13333734 13631596 14043863 14366333 14615722 14911043 15059673
4891A5059673L40709M57613Q58061K0302N88878P34169N09056O37729M87849L81310
$$ 15059673 15400382 15857995 16716056 16736358 17325236 18059405 18568461 19206190 19694039 20075349
4881B0075349J028142P75039J036244J093218J016622J030339J119175J554671
$$ 20075349 21103491 21878530 22914774 24007992 25024614 26054953 27174128 28728799
4873B8728799J150209J018414J341345J252711J385572J282667J884926J803266
$$ 28728799 29879008 30897422 32238767 33491478 34877050 36159717 38044643 39847909
4865C9847909K328786K396590K481742K948206L244122L548631M426218N772507
$$ 39847909 42176695 44573285 47055027 50003233 53247355 56795986 61222204 66994711
4857F6994711O951923Q314080J0144634J2651894J6915782K4265358L5607114
$$ 66994711 73946634 82260714 92405348 105057242 121973024 146238382 181845496
4850A81845496M5380724M8545074K2465922l1341595m6493408k9977328q790597
$$ 181845496 227226220 275771294 298237216 266895621 220402213 190424885 181634288
4843A81634288J0613836K6533242L6237967L0473230j5230858n8159501n4505060
$$ 181634288 192248124 218781366 255019333 285492563 270261705 212102204 157597144
4836A57597144l7200327k3049347j5005270j0609969r547354p637983o037598
$$ 157597144 120396817 97347470 82342200 71732231 62184877 54546894 48509296
4829D8509296m660430l919665k735312k582359k195330k420927k248276j851527
$$ 48509296 43848866 39929201 37193889 34611530 32416200 29995273 27746997 25895470
4821B5895470j594066j288053r67098j275370j065139q73202q39511p34844r40115
$$ 25895470 24301404 23013351 22046253 20770883 19705744 18832542 17993031 17258187 16318072
4812A6318072p64847p19638k56170p34626m79205o56447p50231l36167k54331
$$ 16318072 15553225 14833587 14577417 13842791 13363586 12707139 11956908 11620741 11366410
4803A1366410m34326n12725j37914m82269q1420l44526k36538k52689m53365k60516
$$ 11366410 10932084 10419359 10281445 9799176 9717756 9373230 9136692 8884003 8430638 8170122
4793H170122R324l90329r4543m29480k35392k08719j61338J50545k60648J3394
$$ 8170122 8179446 7789117 7694574 7265094 7029702 6820983 6659645 6810190 6549542 6562936
4783F562936m29677j54077k08918j73889N7242j05497m43087R6699L0704q9770
$$ 6562936 6133259 5979182 5770264 5596375 5653617 5548120 5105033 5201732 5232436 5142666
4773E142666n2372j72282j55102j22181K13440k79444P3498j3206k10135j79658
$$ 5142666 5090294 4918012 4762910 4640729 4854169 4574725 4648223 4635017 4424882 4245224
4763D245224N0909n1041l4862o1984j00207K0415o0121j30149R649J10072l82332
$$ 4245224 4296133 4245092 4210230 4148246 4048039 4068454 4008333 3878184 3887833 3997905 3615573
4752C615573J27691l00168m33712J39814J73365l3201j05516L51661k0799k65868
$$ 3615573 3743264 3443096 3009384 3149198 3322563 3289362 3183846 3535507 3514708 3248840
4742C248840p3324j48521K36106j15488l65799Q3509Q0370r8722j12702j7459
$$ 3248840 3175516 3026995 3263101 3147613 2781814 2865323 2945693 2846971 2734269 2716810
4732B716810r6224J77817o5733K05726j24057l6584L7847k25041J58272j25187
$$ 2716810 2620586 2798403 2732670 2938396 2814339 2777755 2815602 2590561 2748833 2623646
4722B623646Q5827o4935J68800n1746l61654k095L32394p3594Q4253J26307j15089
$$ 2623646 2709473 2644538 2813338 2761592 2399938 2397843 2730237 2656643 2740896 2867203 2752114
4711B752114j15034M8618j33337J07154M7633J56286J29048j05304P3115K1832
$$ 2752114 2637080 2685698 2552361 2659515 2707148 2863434 2992482 2887178 2960293 2982125
4701B982125q0072N4139L36408K51563K88381L00271O8083j8214j77097l26025
$$ 2982125 2902053 2956192 3292600 3544163 3832544 4132815 4200898 4182684 4005587 3679562
4691C679562j41367k58834R7748K96013j50078q0372J68874l83073k24344k85596
$$ 3679562 3538195 3279361 3377109 3673122 3523044 3442672 3611546 3228473 3004129 2718533
4681B718533m7701K1951k97686j0022k86538Q8129n2088k8204k37647N1261N1259
$$ 2718533 2670832 2692783 2395097 2385075 2098537 2186666 2134578 2106374 1868727 1919988 1971247
4670A971247j09742p9457J46922j12812N761M26625r9748j00641Q2082k75401
$$ 1971247 1861505 1782048 1928970 1816158 1821919 2248544 2148796 2048155 2130237 1854836
4660A854836j67463L51073q5691j56627Q1247P2417o8461J45123O1040m0990j03613
$$ 1854836 1687373 2038446 1952755 1796128 1877375 1949792 1881331 2026454 2087494 2046504 1942891
4649A942891k3587l2089N3138j19067K5975J52833P896M7491M8816j128K51635
$$ 1942891 1919304 1887215 1940353 1821286 1847261 2000094 2007990 2055481 2104297 2103169 2354804
4638B354804Q2549j13685J7061K80760j24203J99744o9034j04966n2852K01972
$$ 2354804 2437353 2323668 2340729 2621489 2497286 2697030 2627996 2523030 2470178 2672150
4628B672150J57854N3380K1909M2777J55675J5287Q2902J82414J15496j36852
$$ 2672150 2830004 2883384 2905293 2948070 3103745 3119032 3201934 3384348 3499844 3362992
4618C362992J00850k03821k56826P71L10843L3367N8275K9089N5015K9612k92361
$$ 3362992 3463842 3260021 3003195 3003966 3314809 3348176 3406451 3435540 3490555 3520167 3227806
4607C227806J46564K72273j71895k93641n1404N3750l52153L627L3220K12277
$$ 3227806 3374370 3646643 3474748 3181107 3129703 3183453 2831300 2834927 2868147 3080424
4597C080424p3511O4780j70963n7884j54418k87566k8874j75567k41248q2419
$$ 3080424 3006913 3071693 2900730 2842846 2688428 2400862 2371988 2196421 1955173 1872754
4587A872754j5340m9709j18944k9421R7126P9838o8772N6836L22299m0492l372
$$ 1872754 1857414 1807705 1688761 1659340 1756466 1836304 1767532 1824368 2146667 2106175 2102803
4576B102803J47902L15393j54439L86910K83895j40021L21354o5572j89842j99970
$$ 2102803 2250705 2566098 2411659 2798569 3082464 2942443 3263797 3198225 3008383 2808413
4566B808413J50916j6265N4034N2484l1582J39506J81956M3908O6901K5087k49972
$$ 2808413 2959329 2943064 2997098 3049582 3018000 3157506 3339462 3383370 3450271 3475358 3225386
4555C225386o6991k04297k5185J11883L76851N7755o3880J06209r953n24950k59189
$$ 3225386 3158395 2954098 2928913 3040796 3417647 3475402 3411522 3517731 3507778 2982828 2723639
4544B723639m72703j5187O0345j77665o6726k10716l29447L3698k58548L02597
$$ 2723639 2250936 2235749 2296094 2118429 2051703 1840987 1511540 1545238 1286690 1589287
4534A589287N4160j38199l4371p4816m3825J27112P722j42871n0571j34256r9931
$$ 1589287 1643447 1505248 1470877 1396061 1352236 1479348 1487070 1344199 1293628 1159372 1059441
4523A059441N2142n416r4996K03505k35575j23101Q2799K7143K28558k61690J65826
$$ 1059441 1111583 1106167 1011171 1214676 979101 856000 938799 965942 1194500 932810 1098636
4512A098636k600k91829n5021Q4942J38994R103N3410k1320K7017n3282O4960
$$ 1098636 1096036 804207 749186 834128 973122 982225 1035635 1014315 1041332 988050 1053010
4501A053010m3785Q5946l1109L2277p4318J30082P803K28200j84167n9649O2709
$$ 1053010 1009225 1095171 1064062 1096339 1022021 1152103 1159906 1388106 1203939 1144290 1206999
4490A206999K20061k70952l6068K42083K32047j45138J13622k00694Q822J78671
$$ 1206999 1427060 1156108 1120040 1362123 1594170 1449032 1562654 1361960 1370782 1549453
4480A549453n0906k55621o6949r1273j26565J28610k0600l4136Q2910j11042j52000
$$ 1549453 1498547 1242926 1175977 1084704 958139 1086749 1066149 1032013 1114923 1003881 851881
4469H51881J56983J73281k06500k9160J30991J03771j77260q1783K7125k29121
$$ 851881 1008864 1182145 975645 946485 1077476 1181247 1003987 922204 949329 720208
4459G20208L76988Q3756k58168j06305L438K31831q9182N9059J25376J14500J57885
$$ 720208 1097196 1180952 922784 816479 819917 1051748 962566 1021625 1147001 1261501 1419386
4448A419386k9114l7476j08655p8427Q9632K60631k16867j05228j53686O0827
$$ 1419386 1390272 1352796 1244141 1165714 1255346 1515977 1299110 1193882 1040196 1101023
4438A101023L3374O9750K90735P2786M0172j1092m0483j0051J05003j41316l11209
$$ 1101023 1134397 1204147 1494882 1567668 1607840 1596748 1556265 1546214 1651217 1509901 1198692
4427A198692J02492K94907j5692J07587n7189K89620n1689J10091J51727N3096
$$ 1198692 1301184 1596091 1580399 1687986 1630797 1920417 1868728 1978819 2130546 2183642
4417B183642Q7070k95240n1710m379M18465J40591L84624j40795j50312l96975
$$ 2183642 2270712 1975472 1923762 1919383 2337848 2478439 2863063 2722268 2571956 2174981
4407B174981j03421k77683j95800J77873j42664J82514J95684n69640k6646K2961
$$ 2174981 2071560 1793877 1598077 1775950 1633286 1815800 2011484 1441844 1415198 1438159
4397A438159o5755k38744j04135j07748j65140K26984L5207r2290L7802j18323
$$ 1438159 1372404 1133660 1029525 921777 756637 983621 1018828 926538 964340 846017
4387H46017J54226L2627j89007p1568K99861k13431j16767q7573k6480J37071
$$ 846017 1000243 1032870 843863 772295 1072156 858725 741958 654385 627905 764976
4377G64976o5415J00648N330j41652Q3399k4739P2875Q3289Q1476j06390j96661
$$ 764976 699561 800209 805539 663887 747286 722547 795422 878711 960187 853797 657136
4366F57136K24797j65553j10531K83672k77447r516J66232j17934J40353k54328
$$ 657136 881933 716380 605849 889521 612074 602558 768790 650856 791209 536881
4356E36881O3976Q8715Q9325j07748K10943P5787J62141o9964O5647J26907R9433
$$ 536881 600857 689572 778897 671149 882092 957879 1120020 1050056 1115703 1242610 1342043
4345A342043l77544j01481J45234m1785J71992K02549n8989k03396r4907N9755
$$ 1342043 964499 863018 1008252 966467 1138459 1341008 1282019 1078623 983716 1043471
4335A043471j80943J04979J78084k15235K1526j94676R3641J33237k23659J02237
$$ 1043471 862528 967507 1145591 930356 951882 757206 850847 984084 760425 862662
4325H62662P9401r2698J09724J18242j52456q2383Q8395j81135k2630j05136J21977
$$ 862662 942063 849365 959089 1077331 924875 842492 930887 749752 727122 621986 743963
4314G43963J56359n0587r4364L3494j354q6116K54821p4067M7431p2947N7953
$$ 743963 900322 849735 755371 788865 787511 701395 956216 882149 929580 856633 914586
4303I14586R0121j69199n3500J91324j56113R5634n679J36283K89766L9264p2430
$$ 914586 1004707 835508 782008 973332 817219 912853 907174 1043457 1333223 1372487 1300057
4292A300057p1996p0690P1090J34551j45492K20720j71049p6276l7558M4567J11012
$$ 1300057 1228061 1157371 1228461 1363012 1217520 1438240 1267191 1190915 1153357 1197924 1308936
4281A308936R2294J82041k52999J03226J80730l27179K3917J82654J66930o96
$$ 1308936 1401230 1583271 1330272 1433498 1614228 1287049 1310966 1493620 1660550 1659854
4271A659854J51800n9780p1002n0423M6299J45326r4360p5565N3061J49690l65479
$$ 1659854 1811654 1751874 1680872 1630449 1676748 1822074 1727714 1652149 1705210 1854900 1489421
4260A489421K95489j1925j48891J27683j54788j44040P9887J1413J54076j63818
$$ 1489421 1784910 1772985 1624094 1751777 1596989 1452949 1532836 1544249 1698325 1534507
4250A534507r6390M8590p2889L01643R7386o5130J66463N6246l17589L3598L7187
$$ 1534507 1438117 1486707 1413818 1715461 1812847 1747717 1914180 1970426 1652837 1686435 1723622
4239A723622J70440k01932q000j2276k5485J52898K5775K9192p6396O8208k88991
$$ 1723622 1894062 1692130 1684130 1671854 1646369 1799267 1825042 1854234 1777838 1846046 1557055
4228A557055J90936K5358k89431K07846n2240M9531j36540k2182k4399q1453J09298
$$ 1557055 1747991 1773349 1483918 1691764 1639524 1689055 1552515 1530333 1505934 1424481 1533779
4217A533779o2577m1541k1947O498j20688K231K7907M32907j07572k48408J09285
$$ 1533779 1471202 1429661 1407714 1414212 1293524 1295755 1323662 1756569 1648997 1400589 1509874
4206A509874j483j7287K4222k7462k74741J41932K60202q5474j29750J09111j15374
$$ 1509874 1508391 1491104 1515326 1487864 1213123 1355055 1615257 1529783 1400033 1509144 1393770
4195A393770R9062J11055O6421o4706J82486J00587J6271N8154l54717j88521
$$ 1393770 1492832 1603887 1670308 1605602 1788088 1888675 1904946 1963100 1608383 1419862
4185A419862J33393J51113K18022j52402o4440O2607p6739J47546k38433N8980
$$ 1419862 1553255 1704368 1922390 1769988 1705548 1768155 1691416 1838962 1600529 1659509
4175A659509P606j71682K69027r811q1234k43143M09929Q415j62048L24481Q8588
$$ 1659509 1667115 1495433 1764460 1754649 1673415 1430272 1840201 1848616 1686568 2011049 2099637
4164B099637L47851j08858K78400K35967K96161M01441l08844o7233l1994l32861
$$ 2099637 2447488 2338630 2617030 2852997 3149158 3550599 3241755 3174522 3142528 2809667
4154B809667m1433P6508M07456J66100j29622M8767n35345n1171m91600k41795
$$ 2809667 2768234 2844742 3252198 3418298 3288676 3337443 2802098 2750927 2259327 2017532
4144B017532K55083p3193k28947l1704M7007r1081j15696R4473J21420K57254
$$ 2017532 2272615 2199422 1970475 1938771 1985778 1894697 1779001 1873474 1994894 2252148
4134B252148k49350k42023Q4473O0792q1616k47535J78913J7937N9742p3745K36187
$$ 2252148 2002798 1760775 1845248 1906040 1824424 1576889 1755802 1773739 1833481 1759736 1995923
4123A995923J73626O8593j0611K39964K12552K92900m7220p9091P13J57871O6953
$$ 1995923 2169549 2238142 2227531 2467495 2680047 2972947 2925727 2846636 2847349 3005220 3072173
4112C072173j12791J68918l45909O462R9699J72943p297J45138J65017k699j1458
$$ 3072173 2959382 3128300 2782391 2788853 2888552 3061495 3054198 3199336 3364353 3361654 3350196
4101C350196J46340K69978J80333K51487N75843N53619J89355O6861k04487l58797
$$ 3350196 3496536 3766514 3946847 4198334 4774177 5327796 5517151 5584012 5379525 5020728
4091E020728k90279J4088K15791J98699K06514j49126o58031n93527l40593m9678
$$ 5020728 4730449 4744537 4960328 5159027 5365541 5216415 4558384 3964857 3624264 3574586
4081C574586k26362k03725r7933j82365K4965J90741R9421J64144j24297K26493
$$ 3574586 3348224 3144499 3046566 2864201 2889166 3079907 3179328 3343472 3219175 3445668
4071C445668J35359K65710J25579L41448r463j47702j89050k61051k12472j6802
$$ 3445668 3581027 3846737 3972316 4313764 4304301 4156599 3967549 3706498 3494026 3477224
4061C477224J64719k22815l02227n2578n7580r2227k8927j26173k4910j85597
$$ 3477224 3641943 3419128 3116901 3064323 3006743 2914516 2885589 2759416 2734506 2548909
4051B548909j87445j04789L4232q1902m5776j40130n8583J59125M4990j21591
$$ 2548909 2361464 2256675 2290907 2209005 2163229 2023099 1964516 2123641 2168631 2047040
4041B047040l9227R1271j69214Q8103K1517l48742o92K31706k9281l5604j36525
$$ 2047040 2007813 2099084 1929870 2017973 2039490 1690748 1690056 1921762 1892481 1856877 1720352
4030A720352k78706J22071L7779M787Q3025J66032n8277K41670k3339l50741K22846
$$ 1720352 1441646 1563717 1601496 1606283 1689308 1855340 1797063 2038733 2015394 1664653 1887499
4019A887499L04925j0773k94756Q928j98293N6331R7905Q8249K14054j28054j30056
$$ 1887499 2192424 2181651 1886895 1895823 1697530 1753861 1851766 1940015 2154069 2026015 1895959
4008A895959k4339j08777j27222R7903J36709N8355P0285k42508m376K2409j47288
$$ 1895959 1871620 1762843 1635621 1733524 1870233 1928588 1998873 1756365 1751989 1774398 1627110
3997A627110J2644M5457j65751k4389K0579J11602M9966o5050n1101o2800j18882
$$ 1627110 1639754 1685211 1519460 1495071 1515650 1627252 1677218 1612168 1561067 1498267 1379385
3986A379385j04910p552n012M3388k98986p4134K37849p9386J32355J43320O4237
$$ 1379385 1274475 1266923 1261911 1305299 1006313 932179 1170028 1090642 1222997 1366317 1430554
3975A430554M2286j02096Q1575l85890R1506k8604l6762P9366J64911J36128p8844
$$ 1430554 1472840 1370744 1452319 1066429 1157935 1129331 1092569 1171935 1336846 1472974 1394130
3964A394130L8538k02445P3303L1609K09390q068j75311j9462k09219O1188P7762
$$ 1394130 1432668 1230223 1303526 1335135 1544525 1536457 1361146 1341684 1132465 1193653 1271415
3953A271415J99494j90856J11914j11184j65666l7030J28727o2982K45977j27446
$$ 1271415 1470909 1280053 1391967 1280783 1115117 1078087 1206814 1143832 1389809 1262363
3943A262363j44526K50087j32284J50169J87095j48206R3677N2292p6729J99346
$$ 1262363 1117837 1367924 1235640 1385809 1572904 1424698 1518375 1570667 1493938 1693284
3933A693284j11836k58357j08434r811p3368K04057K66983j01468k85142J05827
$$ 1693284 1581448 1323091 1214657 1204846 1131478 1335535 1602518 1501050 1215908 1321735
3923A321735K11568M1269r535m2313P3877j40353j16135J49522O0009j8012n4740
$$ 1321735 1533303 1574572 1565037 1522724 1596601 1456248 1340113 1489635 1549644 1531632 1476892
3912A476892j14599K84644q8431k6914r1756k513j88375L63617j10303J51430
$$ 1476892 1362293 1646937 1558506 1531592 1439836 1437323 1248948 1612565 1502262 1653692
3902A653692j20097q0086Q6506J25668J39560Q0836K04983l898N2472J21855k47699
$$ 1653692 1533595 1453509 1540015 1665683 1805243 1886079 2091062 2087164 2139636 2261491 2013792
3891B013792j40750k8360p7567N1418k68866L08558L5089M9237l38624K00436
$$ 2013792 1873042 1844682 1767115 1818533 1549667 1858225 1893314 1942551 1603927 1804363
3881A804363k01583P573j91460J09874j05742P0046K80974j6598M1281J56539
$$ 1804363 1602780 1610353 1418893 1528767 1423025 1493071 1774045 1757447 1798728 1955267
3871A955267m07318P1995J04469R160O7650q886J17384j90287P1743j36832J96430
$$ 1955267 1547949 1619944 1724413 1733573 1801223 1792337 1909721 1719434 1791177 1654345 1850775
3860A850775Q8361j80207q364K1372J36108q309k3506r8331P466J36193J548L3371
$$ 1850775 1939136 1758929 1750565 1771937 1908045 1899736 1876230 1777899 1785365 1921558 1923106 1956477
3848A956477L18070l14512m7071L3433N2879o1826K07519k4139j73896j17253
$$ 1956477 2274547 1960035 1912964 1946397 1999276 1937450 2144969 2120830 1946934 1829681
3838A829681N9530J6577J4239j84626P5478n0553l4960P0248l0383Q4686q2815
$$ 1829681 1889211 1905788 1920027 1735401 1810879 1760326 1725366 1795614 1765231 1849917 1767102
3827A767102k7749j63785L19410P1508n8716k82150K49173J75333k41653M7492
$$ 1767102 1739353 1575568 1894978 1966486 1907770 1625620 1874793 2050126 1808473 1855965
3817A855965O7042m7859l0544K40199j316j366J53687k35402O3922k88486L41616
$$ 1855965 1923007 1875148 1844604 2084803 2083487 2082121 2235808 2000406 2064328 1775842 2117458
3806B117458J05814l8088K01315o1976r0068R0890J34021j92331m2011Q3276l276
$$ 2117458 2223272 2185184 2386499 2324523 2234455 2325345 2459366 2267035 2225024 2308300 2305024
3795B305024k0325K22324J35701j79206K8165q6094N6685P2605K69739K0190j47852
$$ 2305024 2284699 2507023 2642724 2463518 2491683 2405589 2462274 2534879 2804618 2824808 2676956
3784B676956O5235j91268M5614l1807L1437N1533R9524j40687J50251K37789p643
$$ 2676956 2742191 2550923 2596537 2564730 2596167 2647700 2747224 2606537 2756788 2994577 2986934
3773B986934o7085O5Q4950J46619K26577J34029q5612R0410J76739p9331Q9187
$$ 2986934 2919849 2919914 3004864 3151483 3378060 3512089 3426477 3516887 3693626 3614295 3703482
3762C703482k52379R5153J13693K79904l97227Q0787Q7719k84270J1880l9215
$$ 3703482 3451103 3546256 3659949 3939853 3542626 3623413 3711132 3426862 3438742 3399527
3752C399527J16326K36920j7992l03703J55021R050k13667K10192K73199J27736
$$ 3399527 3515853 3752773 3734781 3431078 3586099 3595149 3381482 3591674 3864873 3992609
3742C992609K57671k30057J08632J8988J50441j57244J2188M95402M1435j65244
$$ 3992609 4250280 4020223 4128855 4147843 4298284 4141040 4153228 4648630 4690065 4524821
3732D524821j87080m4717j01798P5728N115k4143k10402J77231L9951N5223L5779
$$ 4524821 4337741 4293024 4191226 4266954 4272069 4247926 4037524 4214755 4254706 4309929 4345708
3721D345708K0919K58249M1582K24189l2640L5627J38760j77745L60312J49900
$$ 4345708 4366627 4624876 4666458 4890647 4858007 4893634 5032394 4854649 5214961 5364861
3711E364861j23935l5220n0034K13140m8320j18168M51620K9251Q2664J80904
$$ 5364861 5240926 5205706 5155672 5368812 5320492 5202324 5653944 5683195 5765859 5946763
3701E946763L5136M7522j13987O2454K11418P0911L40367L07684j68835j22431
$$ 5946763 5981899 6029421 5915434 5977888 6189306 6260217 6600584 6908268 6739433 6617002
3691F617002k7675o6183j29285K79061N4790J9719J14655J93906J05953M3607
$$ 6617002 6589327 6523144 6393859 6672920 6727710 6747429 6862084 7055990 7161943 7205550
3681G205550L0898J57328K40798l00358k07823L38710m618n1147l5480J02021
$$ 7205550 7236448 7393776 7634574 7334216 7126393 7465103 7460485 7409338 7373858 7475879
3671G475879Q3905M5321J81837k323J81237J49386J38554M40645L83989J61789
$$ 7475879 7559784 7605105 7786942 7784619 7965856 8115242 8253796 8694441 9078430 9240219
3661I240219O6854M23220J56693J60854k30885J5267L006m1973L53914K37490
$$ 9240219 9307073 9730293 9886986 10047840 9816955 9832222 9835228 9793255 10147169 10384659
3651A0384659O3371O5595J58457O4504o0625K70869L36126K63171K58841N56119
$$ 10384659 10448030 10513625 10672082 10736586 10675961 10946830 11282956 11546127 11804968 12361087
3641A2361087K66578j26620M31751k61304L8711R4247K27208K98785j26993J02233
$$ 12361087 12627665 12501045 12932796 12671492 12710203 12804450 13031658 13330443 13203450 13305683
3631A3305683K33912K61659K46034J30512L0430K29973K2256L27076L12153L58868
$$ 13305683 13539595 13801254 14047288 14177800 14208230 14438203 14460459 14787535 15099688 15458556
3621A5458556M08868J43889M5665R9717K39805p50N26221J57845O2854K11040
$$ 15458556 15867424 16011313 16056978 16156695 16396500 16395750 16921971 17079816 17142670 17353710
3611A7353710J46376K38923J5065K57413K9614k54L60900R9717K73907l4142K5741
$$ 17353710 17500086 17739009 17754074 18011487 18041101 18040847 18401747 18501464 18775371 18741229 18766970
3600A8766970Q5598K35351M93020K06660K02456P48710K13456L15441M04697L73040
$$ 18766970 18852568 19087919 19580939 19787599 19990055 20738765 20952221 21267662 21672359 22045399
3590B2045399R84202O79164R36640R33206L77287P2888j36611L6738K10364L08365
$$ 22045399 23029601 23708765 24645405 25578611 25955898 26028786 25892175 25928913 26139277 26447642
3580B6447642L76106L97298Q17617O20911k42798k91563m07769k90426j35430
$$ 26447642 26823748 27221046 28038663 28659574 28416776 28125213 27717444 27427018 27291588
3571B7291588J93924J33259J20494L14100K20071K02834J61087l8967L65712K21545
$$ 27291588 27485512 27618771 27739265 28053365 28273436 28476270 28637357 28598390 28964102 29185647
3561B9185647j02926K93355J17734L38956J75703J60048J44339P08108M96706
$$ 29185647 29082721 29376076 29493810 29832766 30008469 30168517 30312856 31020964 31517670
3552C1517670N86935P20841N12165P70813Q99808R47976J269999R21438J119685
$$ 31517670 32104605 32825446 33337611 34108424 35008232 35956208 37226207 38147645 39267330
3543C9267330P58768P02173P99502O92641P37540Q68296R71034J167994J915723
$$ 39267330 40026098 40728271 41527773 42220414 42957954 43826250 44797284 45965278 47881001
3534D7881001K027326K145134K854174K842871L379562L417900L332887L554117
$$ 47881001 49908327 52053461 54907635 57750506 61130068 64547968 67880855 71434972
3526G1434972M886358N380839O097850O250401O759427P316759O571505N039365
$$ 71434972 76321330 81702169 87800019 94050420 100809847 108126606 114698111 119737476
3518A19737476K593882J289943M45063K19560n44802j411679j827967j677263
$$ 119737476 122331358 123621301 124066364 124285924 123741122 122329443 120501476 118824213
3510A18824213o3193J902048L234052M835495O462786Q099867Q501927Q924193
$$ 118824213 118761020 120663068 123897120 128732615 135195401 143295268 151797195 160721388
3502A60721388R241467J0005584J0438459Q597503L798651k587729o595280o717349
$$ 160721388 169962855 179968439 190406898 199004401 202803052 200215323 193620043 186902694
3494A86902694n197301n034553o822982q426204p815021n424900k669968j47259
$$ 186902694 181705393 176670840 169847858 161421654 153606633 148181733 145511765 145364506
3486A45364506K131787L694462L575148L665756L046714L237919L788688M512300
$$ 145364506 147496293 151190755 154765903 158431659 161478373 164716292 168504980 173017280
3478A73017280M320540K494932P20980O50630J671312J947212J844577J557453
$$ 173017280 177337820 179832752 180553732 181204362 182875674 184822886 186667463 188224916
3470A88224916K187996L105775K494995J401292o95266n97824J338410J693495
$$ 188224916 190412912 193518687 196013682 197414974 196719708 196121884 197460294 199153789
3462A99153789j065979n095816p075236o588229m754278k948325j582328p47044
$$ 199153789 198087810 192991994 185916758 179328529 174574251 171625926 170043598 169296554
3454A69296554K44443R24489K455798M999476Q052054J0546567J1449039R795702
$$ 169296554 169540997 170465486 172921284 177920760 185972814 196519381 207968420 217764122
3446B17764122P406980O340322P175585Q037989N470255k134468r950992j3546176
$$ 217764122 225171102 231511424 238687009 246724998 252195253 250060785 240109793 226563617
3438B26563617j2317411r505364q995920j0033878r967053q675411p039348n190150
$$ 226563617 214246206 204740842 195744922 185711044 175743991 167068580 160029232 154839082
3430A54839082l178402j500432J15797J217924Q86732M18552O0733o36150k599405
$$ 154839082 151660680 150160248 150276045 151493969 152380701 152799253 152859986 152223836 149624431
3421A49624431o376166r897269j0936776j0177109q603274q360918q317068q383072
$$ 149624431 143248265 133350996 122414220 112237111 103633837 95272919 86955851 78572779
3413G8572779p545885o250779m787228l887220l775059l120270k996002k734193
$$ 78572779 71026894 64776115 59988887 56101667 52326608 49206338 46210336 43476143
3405D3476143j716601j806815j424896j414164j117677j320126r21245m79979
$$ 43476143 41759542 39952727 38527831 37113667 35995990 34675864 33754619 33274640
3397C3274640p43202o73388m61264r1024j73305J04641O47870L60936O2061m59427
$$ 33274640 32531438 31858050 31396786 31305762 31132457 31237098 31884968 32245904 32307965 31848538
3387C1848538q42765r41312j030127m41972m86209l79351k46647j90338o13479
$$ 31848538 31005773 30064461 29034334 28592362 28106153 27726802 27480155 27289817 26676338
3378B6676338j106485q92625o34944o62761p24725q60812o15161k34579K2071
$$ 26676338 25569853 24677228 24042284 23379523 22654798 21793986 21178825 20944246 20966317
3369B0966317J61040k0624m7260J29206l50943o79892n75420p07014j020742r43509
$$ 20966317 21127357 21106733 21059473 21188679 20837736 20157844 19582424 18875410 17854668 16911159
3359A6911159j57585K32003N2726J0220j08776J40714l59755o56012m86845n51774
$$ 16911159 16753574 16985577 17038303 17048523 16939747 17080461 16720706 16064694 15577849 15026075
3349A5026075o29734p1941r3857Q6227J64569J93926M7223M7032n07378m32907
$$ 15026075 14396341 14324400 14230543 14316770 14481339 14675265 14722488 14769520 14262142 13829235
3339A3829235n31919j35179m46033p9507K3732k40522K80896j17901J49196j79865
$$ 13829235 13297316 13162137 12716104 12636597 12660329 12419807 12700703 12582802 12731998 12552133
3329A2552133K29767K07487J10831L98504M53117O43565M0601J40955J07642p07921
$$ 12552133 12781900 12989387 13100218 13498722 13951839 14595404 14636005 14776960 14884602 14176681
3319A4176681j002423o72632o10197l44386j98587k65190J9996j96017l0286j52626
$$ 14176681 13174258 12501626 11891429 11547043 11348456 11083266 11103262 10907245 10876959 10724333
3309A0724333J2935O4337K0814K96182j79591j43059J18062K99192K57106K10250
$$ 10724333 10737268 10801605 10822419 11118601 10939010 10795951 10914013 11213205 11470311 11680561
3299A1680561k5527M25704j14460q2275k9413k6500k41518r633m804Q3475M69532
$$ 11680561 11655034 12080738 11966278 11884003 11854590 11828090 11586572 11576939 11572135 11655610 12125142
3288A2125142J16404J07769j38477K02440N46220K34940N07609N15018M25723
$$ 12125142 12241546 12349315 12210838 12413278 12959498 13194438 13702047 14217065 14642788
3279A4642788K68546K92095K5544Q5394n6185j17952k35518j34113j02216K2866
$$ 14642788 14911334 15203429 15228973 15314367 15258182 15140230 14904712 14770599 14668383 14691249
3269A4691249K03371J13331J99453J18883J05625n1231J26175n436k6283K10958
$$ 14691249 14894620 15007951 15207404 15326287 15431912 15380681 15506856 15501420 15475137 15686095
3259A5686095J56409J26500J04418K87500M60102L64848N28048O35228O70401
$$ 15686095 15842504 15969004 16073422 16360922 16821024 17185872 17713920 18349148 19019549
3250A9019549O98990P84306M01091P6333K96871K14361P15012Q53855P78794R97184
$$ 19019549 19718539 20502845 20903936 20980269 21277140 21491501 22206513 23060368 23839162 24836346
3240B4836346L09411K08779J333P59522J236645J997960K898949K564338n44552
$$ 24836346 25145757 25354536 25355869 26115391 27352036 29349996 32248945 34813283 34268731
3231C4268731k076821k316995j735052r83131o4529L23293O23065J072667J126403
$$ 34268731 32191910 29874915 28139863 27156732 27092203 27415496 28038561 29111228 30237631
3222C0237631Q47806l96506p81383j014564m60022j3623m853L07087J79135Q41903
$$ 30237631 31085437 30688931 29907548 28892984 28432962 28419339 28414486 28721573 28900708 29742611
3212B9742611J090459J414985J814211K146170R00751j270q1538P50652J054479
$$ 29742611 30833070 32248055 34062266 36208436 37109187 37107917 37026379 37777031 38831510
3203C8831510J515226J098283J115969J479887K192698M578523O940657Q808731
$$ 38831510 40346736 41445019 42560988 44040875 46233573 50812096 57752753 66561484
3195F6561484Q124865k324410p852890q136628o574251l590925j610132q82520
$$ 66561484 74686349 72361939 64509049 56372421 49798170 46207245 44597113 43714593
3187D3714593K34476O65743Q61952J251573K233105K337320L497640N203090Q161546
$$ 43714593 43949069 44614812 45476764 46728337 48961442 51298762 54796402 59999492 68161038
3178F8161038J0293292J2321934J104441p610466o009606k748594J819235P984357
$$ 68161038 78454330 90776264 91880705 84270239 78260633 75512039 77331274 85315631
3170H5315631J2582536J8602843J1428819j6554197j9523093j5192304p838726
$$ 85315631 97898167 116501010 127929829 111375632 91852539 76660235 68821509
3163F8821509k658932K467798M586384O169508l379731j1486458j0148864p804195
$$ 68821509 66162577 68630375 73216759 79386267 76006536 64520078 54371214 46567019
3155D6567019m598646k941513k342361j286354j051097r59743n77109n54894J09835
$$ 46567019 41968373 39026860 36684499 35398145 34347048 33387305 32810196 32255302 32365137
3146C2365137n69056k53678l76877n73379j75801j11059K23204O77814N91027
$$ 32365137 31796081 31542403 31165526 30592147 30416346 30305287 30528491 31206305 31797332
3137C1797332Q77275j61884j215196j371963j423241j115721n59113k88507o77904
$$ 31797332 32674607 32512723 31297527 29925564 28502323 27386602 26827489 26538982 25861078
3128B5861078p14477j39914m01740m2462L04936J45463J15930M71424K52488P14484
$$ 25861078 25146601 25006687 24604947 24562485 24867421 25012884 25128814 25600238 25852726 26567210
3118B6567210N16522O82258M52237L35454L38067J50088l23050L77438J088839
$$ 26567210 27083732 27765990 28218227 28553681 28891748 29041836 28718786 29096224 30185063
3109C0185063J873826K836975L217698L929308K199633k105769m088719m589063
$$ 30185063 32058889 34895864 38113562 42042870 44242503 42136734 38048015 33458952
3101C3458952l234714k021531r77213n87782j53972j75826q67940j027764j058053
$$ 33458952 30224238 28202707 27225494 26637712 26483740 26307914 25439974 24412210 23354157
3092B3354157o48580n24993k38272K08287j17376q3930j16493n66315j94461m82001
$$ 23354157 22705577 22180584 21942312 22150599 22033223 21949293 21832800 21266485 21072024 20590023
3082B0590023j66920Q9759K86881J84984k67008k33513j78703r6871L16401K28675
$$ 20590023 20423103 20512862 20799743 20984727 20717719 20484206 20305503 20208632 20525033 20753708
3072B0753708N42279O61028L0023n39892p06391o24586m97199k10164J2684M63681
$$ 20753708 21295987 21957015 21987038 21447146 20740755 20116169 19618970 19408806 19421490 19885171
3062A9885171L57704K77154q2907r4624j44620J75932J4429J96325J11172M7729
$$ 19885171 20242875 20520029 20437122 20342498 20197878 20373810 20388239 20584564 20695736 20743465
3052B0743465l1064O416O6165K08757M38577K61420L40833M20417K2674K55445
$$ 20743465 20712401 20718817 20784982 20993739 21432316 21693736 22034569 22454986 22477660 22733105
3042B2733105K30383N3391K04056K53816M20672N01092L59090J79420N08737L79699
$$ 22733105 22963488 23016879 23220935 23474751 23895423 24396515 24755605 24935025 25443762 25823461
3032B5823461N13010K91887M09669L18064O78977K67413O22374O11624P61891
$$ 25823461 26336471 26628358 27038027 27356091 28035068 28302481 28924855 29536479 30298370
3023C0298370P66038J032432J162382J364923J344600K09524K36996J05798R21313
$$ 30298370 31064408 32096840 33259222 34624145 35968745 36178269 36415265 36521063 37442376
3014C7442376J170453J496190J533022K126052K353913L51310J27303P49132J614626
$$ 37442376 38612829 40109019 41642041 43768093 46122006 46473316 46600619 47349751 48964377
3005D8964377K399433K545374K594619J653738J356539N47553M8549n30752k96785
$$ 48964377 51363810 53909184 56503803 58157541 59514080 60061633 60110182 59579430 59282645
2996E9282645M49694J137273K297264L104705K962318K806221J714126J549007
$$ 59282645 59732339 60869612 63166876 66271581 69233899 72040120 73754246 75303253
2988G5303253K156414K350403K621413K669359L043132L038739K310571K349227
$$ 75303253 77459667 79810070 82431483 85100842 88143974 91182713 93493284 95842511
2980I5842511J690688O96844J45550l92103J033281K483707M913909O238426P555003
$$ 95842511 97533199 98230043 98375593 97983490 99016771 101500478 106414387 112652813 120207816
2971A20207816P152152L556031J78099j169389M739J148992J572988M23281k05740
$$ 120207816 127359968 130915999 131094098 129924709 129929448 131078440 132651428 133074709 132868969
2962A32868969N81493J861635K497153K234368k5385k292593k462695j165146
$$ 132868969 133450462 135312097 137809250 140043618 140018233 137725640 135262945 134097799
2954A34097799J417466M267351O324131P219905O774453L910498J863640J285840
$$ 134097799 135515265 139782616 146106747 153326652 160101105 164011603 165875243 167161083
2946A67161083K142608L471879L064783J884638P05683R58084O57300j780924
$$ 167161083 169303691 172775570 175840353 177724991 178430674 179388758 180046058 178265134
2938A78265134l007883k620993j921584m13194J638510M722105P485326Q590388
$$ 178265134 175257251 172636258 170714674 170301480 171939990 176662095 184147421 192737809
2930A92737809P323343N863143M743040M399877M944442N728665N725959K474031
$$ 192737809 200061152 205924295 210667335 215067212 220011654 225740319 231466278 233940309
2922B33940309l259762p982260q501816o630636l352897L33970L822896N644466
$$ 233940309 230680547 222698287 214196471 207565835 204212938 204546908 208369804 214014270
2914B14014270M000229J796284M35518J163882J272573o44654k484389m590337
$$ 214014270 218014499 219810783 220246301 221410183 222682756 222038102 219553713 214963376
2906B14963376m821983k972314o12007q46288m607047j0298974j2784311j1209218
$$ 214963376 210141393 207169079 206557072 205710784 201103737 190804763 178020452 166811234
2898A66811234q129687m313373q36839J307299R66222j062294l358980m278509
$$ 166811234 158681547 154368174 153531335 154838634 155804856 154742562 151383582 147105073
2890A47105073l880100l252528l176716l884039k852308j533986m11504l16575
$$ 147105073 143224973 139972445 136795729 132911690 130059382 128525396 128113892 127797317
2882A27797317k523268o883824q916104q185224n888481m064931k465968n74615
$$ 127797317 125274049 118390225 109474121 101288897 95400416 91335485 88869517 88294902
2874H8294902l4661n76955k571515k812958l203743l284056k606524k217762j799300
$$ 88294902 88260241 87683286 85111771 82298813 79095070 75811014 73204490 70986728 69187428
2865F9187428j294022j611028k137373k225036k598523l561126l544556k514190
$$ 69187428 67893406 66282378 64145005 61919969 59321446 55760320 52215764 49701574
2857D9701574j751744j048884o04786o57599j046947j158620j650166q47656r33145
$$ 49701574 47949830 46900946 46296160 45638561 44591614 43432994 41782828 40935172 40002027
2848D0002027k080059j954445k221721j996780j460213j220150j220681q42024
$$ 40002027 37921968 35967523 33745802 31749022 30288809 29068659 27847978 27005954
2840B7005954l42324q50330p88261q79390p96578q05451l27102n77844l42821
$$ 27005954 26663630 25813300 25025039 24145649 23349071 22543620 22216518 21638674 21295853
2831B1295853j92506o47582l65085k30920m30544o12194n03004L1239N6559j84047
$$ 21295853 21103347 20455765 20090680 19859760 19429216 18817022 18314018 18345257 18401816 18217769
2821A8217769L7741j01748M38706J79087J63910J246j84409l41324k56951r6090
$$ 18217769 18255510 18153762 18592468 18771555 18935465 18936711 18752302 18410978 18154027 18057937
2811A8057937P0234J27018J41428M54875L81023M52897n1647q84516r48473n34684
$$ 18057937 18128171 18255189 18396617 18851492 19232515 19685412 19633765 18749249 17800776 17266092
2801A7266092m28772m68580j31176J31538M5499J70596o969k2212k11795m26536
$$ 17266092 16837320 16368740 16237564 16369102 16414601 16585197 16578228 16556016 16344221 15917685
2791A5917685m59497m72231k0124J98578O6357l5402Q6918O8835R088J84755q3635
$$ 15917685 15458188 14985957 14965833 15164411 15230768 15195366 15282284 15351119 15360207 15544962 15461327
2780A5461327m05669K8582N9985j42671M5617j90073J09233R4305J13617L03513
$$ 15461327 15055658 15084240 15144225 15001554 15047171 14857098 14966331 15060636 15174253 15477766
2770A5477766J41953J89666j84656p7577r1324j34866J18577K78056L10804J04840
$$ 15477766 15619719 15809385 15624729 15547152 15455828 15320962 15439539 15717595 16028399 16133239
2760A6133239K99855O70677K68427K2498K90388J26723k76583J20168J23909J54778
$$ 16133239 16433094 17103771 17372198 17394696 17685084 17811807 17535224 17655392 17779301 17934079
2750A7934079j31732L35871l1182k10427k07221k80339n88878L0229j34704n03632
$$ 17934079 17802347 18138218 18107036 17896609 17689388 17409049 16820171 16850400 16715696 16212064
2740A6212064k93308j79076j00646q31612o62932l27092l48200n31064j83563
$$ 16212064 15918756 15739680 15639034 14807422 14144490 13817398 13469198 12938134 12754571
2731A2754571l85662j89100j31500l97234n72476l26337J27950k93696k42836
$$ 12754571 12368909 12179809 12048309 11651075 11078599 10752262 10880212 10586516 10343680
2722A0343680o619j38679l5360j79049j60757k33695j78546l26475K5093j92318
$$ 10343680 10337061 10198382 10163022 9983973 9823216 9589521 9410975 9084500 9109593 8917275
2712H917275k64762j42546k73060j20878j48258l9336J3371K664j41982j82082
$$ 8917275 8652513 8509967 8236907 8116029 7967771 7928435 7941806 7944470 7802488 7620406
2702G620406J07567J14870n5817N1589j07599J27439k32675J8115J74173m05830
$$ 7620406 7727973 7842843 7787026 7838615 7731016 7858455 7625780 7643895 7818068 7412238
2692G412238l88999j59583K16746Q1943J77349P1577J53277j19478q8009l03525
$$ 7412238 7023239 6863656 7080402 7162345 7339694 7411271 7564548 7445070 7357061 7053536
2682G053536k90499N5388N2707l4106j19288J75552J65959o5260Q2450J17402
$$ 7053536 6763037 6818425 6871132 6837026 6717738 6893290 7059249 6993989 7076439 7193841
2672G193841o6942k53096J81108N1698k09101j7431n4480j24961m3556r6769j55718
$$ 7193841 7126899 6873803 7054911 7106609 6897508 6880077 6825597 6700636 6657080 6560311 6404593
2661F404593M20306K23040k33162L33807K80919j7207J24604j12140j76135j98487
$$ 6404593 6824899 7047939 6814777 7148584 7429503 7412296 7536900 7424760 7248625 7050138
2651G050138k98691J83437J60297o31l01307R0577K60883K46071M044P6033j5598
$$ 7050138 6751447 6934884 7095181 7094550 6793243 6883820 7144703 7390774 7394818 7470851 7455253
2640G455253j01419q4187r8893j7984q4410m8483r3029O1457j32641M45582K2110
$$ 7455253 7353834 7269647 7170754 7152770 7068360 7019877 6926848 6988305 6855664 7301246 7323356
2629G323356L07880K7922n9791m12988j6831j24582j28074k30258j00364L21362
$$ 7323356 7631236 7659158 7599367 7186379 7169548 7044966 6916892 6686634 6586270 6907632
2619F907632J3594M0522p814L17648J94547k95125R4053L10327J68049M9714O6941
$$ 6907632 6921226 6961748 6953934 7271582 7466129 7171004 7265057 7575384 7743433 7793147 7860088
2608G860088j30328N179k43169Q2003K97359p7859R557M0589J72724p3291p3743
$$ 7860088 7729760 7734939 7491770 7573773 7871132 7793273 7802830 7843419 8016143 7942852 7869109
2597G869109N151j9985K37181M0099j52100J21115L7191L46238l3295K26555J89790
$$ 7869109 7874260 7854275 8091456 8131555 7979455 8100570 8137761 8483999 8450704 8677259 8867049
2586H867049o950M71422L71785K80248j68740N4361J18526j6395K7902j98997
$$ 8867049 8860099 9331521 9703306 9983554 9814814 9869175 9987701 9971306 9999208 9800211
2576I800211K34848L50526K37503L26831J87264J51356J80697M24385L69267K94711
$$ 9800211 10035059 10385585 10623088 10949919 11137183 11288539 11469236 11893621 12262888 12557599
2566A2557599L09890L89197O73805J60984L93747K31918M82427M14410K72689
$$ 12557599 12867489 13256686 13930491 14091475 14485222 14717140 15199567 15613977 15886666
2557A5886666K10031K51138M99597L44212K81794K98477K92745K06004J32478
$$ 15886666 16096697 16347835 16847432 17191644 17473438 17771915 18064660 18270664 18403142
2548A8403142K69445N39581O57618O46258O23774L08474P00386P64225R43144
$$ 18403142 18672587 19212168 19869786 20516044 21139818 21448292 22148678 22912903 23856047
2539B3856047P66187O24305M42971Q10149R80147O94028N47149P64715O77774
$$ 23856047 24622234 25246539 25689510 26499659 27479806 28173834 28720983 29485698 30163472
2530C0163472J050812P02542Q86766P55875M93643P53648J369079J622335J578649
$$ 30163472 31214284 31916826 32803592 33559467 34053110 34806758 36175837 37798172 39376821
2521C9376821J569727J227551J517177J271366J169459J021410J161108J607093
$$ 39376821 40946548 42174099 43691276 44962642 46132101 47153511 48314619 49921712
2513D9921712J645121K342130K915203L398772M254586N106350N259170N033083
$$ 49921712 51566833 53908963 56824166 60222938 64477524 69583874 74843044 79876127
2505G9876127M817822L567234K328298L54157j779538l318014m392591n051772
$$ 79876127 84693949 88261183 90589481 90943638 89164100 85846086 81453495 76401723
2497G6401723n095084m323984l699553l603198l747023l732242l399181l207755
$$ 76401723 71306639 66982655 63283102 59679904 55932881 52200639 48801458 45593703
2489D5593703l196353k715873k568237k689424k394846k542770k079026j971209
$$ 45593703 42397350 39681477 37113240 34423816 32028970 29486200 27407174 25435965
2481B5435965j720149j637097j147087j110299q42946n40195p38091m30461k64486
$$ 25435965 23715816 22078719 20931632 19821333 18978387 18438192 17700101 17269640 17005154
2472A7005154j92082j66428p62734l92342q42106q81006m79835o27412l70826
$$ 17005154 16813072 16646644 15883910 15491568 14649462 13768456 13288621 12661209 12290383
2463A2290383l13337o18767n89494n48242K8121k10535m24668j13982j59982k90412
$$ 12290383 11977046 11358279 10768785 10220543 10248664 10038129 9613461 9499479 9339497 9049085
2453I049085j88921k14156K68986k75627P0154q3529j22857k69926l17519J66395
$$ 9049085 8860164 8646008 8914994 8639367 8709521 8625992 8503135 8233209 7915690 8082085
2443H082085l10800k93276J84694N2024l08345k0615k64182j24373J37448R5267
$$ 8082085 7771285 7478009 7662703 7714727 7406382 7385767 7121585 6997212 7134660 7229927
2433G229927k59531j19736k37356L9272o9302j84418J71905J6873j16241n3679
$$ 7229927 6970396 6850660 6613304 6652576 6583274 6398856 6570761 6587634 6471393 6417714
2423F417714M6370l94306j83283J91214l77541j45240k87448p0666M79693K13198
$$ 6417714 6464084 6069778 5886495 6077709 5700168 5554928 5267480 5196814 5676507 5889705
2413E889705j58990J16513J53314J677O6777q2405k30824j98263O4094k59385
$$ 5889705 5730715 5847228 6000542 6002219 6068996 5986591 5755767 5557504 5621598 5362213
2403E362213K77965k51440n2896K52974K7717j3820K10407k12071j79906n2822
$$ 5362213 5640178 5388738 5335842 5588816 5616533 5602713 5813120 5601049 5421143 5368321
2393E368321k33536k05252R1346M7893j93371O0767j92301k86098j70497Q8324
$$ 5368321 5134785 4929533 5020879 5068772 4875401 4936168 4743867 4457769 4287272 4375596
2383D375596o3484j89588j02468o4468l6593k7200J88528L7821k15943J50702
$$ 4375596 4312112 4122524 4020056 3955588 3918995 3891795 4080323 4118144 3902201 4052903
2373D052903k49974j5629k20826j16983R3944L71475l31772K68526M11111J9327
$$ 4052903 3802929 3787300 3566474 3449491 3543435 3914910 3583138 3851664 4262775 4282102
2363D282102n47168o6208j13080P1720k27807j84077j0166P6549j50033J36361
$$ 4282102 3734934 3668726 3555646 3627366 3399559 3215482 3205316 3281865 3131832 3268193
2353C268193K5111k02964J6480j71697j05687j2933J56279n8024j73310k22294
$$ 3268193 3293304 3090340 3106820 2935123 2829436 2816503 2972782 2914758 2741448 2519154
2343B519154J24665L70854j7909j81633L84639k1597K4259j09162M196O2986J00285
$$ 2519154 2643819 3014673 2996764 2815131 3199770 3178173 3202432 3093270 3097466 3160452 3260737
2332C260737N1243k96830J85049Q5628O6262J98064K5736j9711K41565N0007J99632
$$ 3260737 3311980 3015150 3200199 3285827 3352089 3550153 3575889 3556178 3797743 3847750 4047382
2321D047382q828J4901L74215K99413J92872J46082K59281j02826j53042J69485
$$ 4047382 4038554 4053455 4427670 4727083 4919955 5066037 5325318 5222492 5069450 5238935
2311E238935K17676J30706J66739P4815N7298j2317K02085J49895J67940N9381
$$ 5238935 5456611 5587317 5754056 5828871 5886169 5873852 6075937 6225832 6393772 6453153
2301F453153K22265K56439K64682L68379J62184K61771L69392O96294M33313O0419
$$ 6453153 6675418 6931857 7196539 7564918 7727102 7988873 8358265 9054559 9487872 9548291
2291I548291K25039K36197l5923o537J09440M5682L13415Q2763N56888L90817
$$ 9548291 9773330 10009527 9973604 9967067 10076507 10122189 10435604 10518367 11075255 11466072
2281A1466072N56966M28347Q47381O11480O49757J066818P91717R32149J075959
$$ 11466072 12023038 12451385 13298766 13910246 14560003 15626821 16418538 17350687 18426646
2272A8426646J208053J277315J632183J963434K248012K096587J852629J962221
$$ 18426646 19634699 20912014 22544197 24507631 26755643 28852230 30704859 32667080
2264C2667080J525648M56868k91741m18420l24660p8441Q3966l5351J61009K16031
$$ 32667080 34192728 34649596 34357855 33939435 33614775 33536334 33620300 33584949 33745958 33961989
2254C3961989L54595M57563N70816P38943Q33398J147828J497819K425334L702131
$$ 33961989 34316584 34774147 35344963 36083906 36917304 38065132 39562951 41988285 45690416
2245D5690416N443193O838493P975275J848607m829686p264606q267062o860715
$$ 45690416 51133609 57972102 65947377 67795984 62966298 55701692 47434630 40573915
2237D0573915m954895l298224k183397j608795j650972j182332j195556p05216
$$ 40573915 35619020 32320796 30137399 28528604 26877632 25695300 24499744 23794528
2229B3794528l48693q900j84634J22091J82514M37587R25055R37142J035879P63031
$$ 23794528 23445835 23436935 23252301 23374392 23556906 23994493 24919548 25856690 26892569 27655600
2219B7655600o29620j732709j861136k496581k634531j991725j922603j394691
$$ 27655600 27025980 25293271 23432135 20935554 18301023 16309298 14386695 12992004
2211A2992004j214997j022099o35671n35733o73953p67208m66949q18562m54259
$$ 12992004 11777007 10754908 10119237 9583504 8909551 8142343 7675394 6856832 6402573
2202F402573m61852n36041l09989k46497k86529j99860l34004R0962o8379m28919
$$ 6402573 5940721 5404680 5094691 4848194 4561665 4361805 4027801 4118763 4050384 3621465
2192C621465l18309j45638r3704j83215l4371j49587l4312l6798l40760l01280
$$ 3621465 3303156 3157518 3063814 2880599 2846228 2696641 2662329 2625531 2284771 1983491
2182A983491P8223j00974J537P1287j61466j02457k41973L26739j68807p7793
$$ 1983491 2061714 1960740 1962277 2033564 1872098 1769641 1527668 1854407 1685600 1607807
2172A607807L2346k73037k05851J33385K53596j18773j48226k39419q3542j55119
$$ 1607807 1640153 1367116 1161265 1294650 1548246 1429473 1281247 1041828 958286 803167
2162H03167R5486M9473Q9096n1756L744r8605q7260o4626L72953K3472j73869
$$ 803167 898653 948126 1037222 985466 989210 890605 803345 738719 1111672 1135144 961275
2151I61275j85898p8951O7363j4005n8755J18940j22639m15920J49053M81804
$$ 961275 775377 696426 763789 749784 691029 809969 687330 271410 420463 902267
2141I02267l53834j63747J03909j75718L08098j87235K2754R5611n3897k93809
$$ 902267 548433 384686 488595 312877 620975 433740 456494 552105 498208 204399
2131B04399l69497K27148K93899n1559J09560j67410j32871K50195J3141J65115
$$ 204399 -165098 62050 355949 304390 413950 246540 113669 363864 377005 542120
2121E42120k32331j43707n2209K54193k76184r930J86570j37719j40960J16346
$$ 542120 309789 166082 113873 368066 91882 81952 268522 130803 -10157 106189
2111A06189L8523o9215M923J20847q5114J38377J1103j24603L3265j35541K6857
$$ 106189 144712 75497 80420 201267 116153 254530 265633 141030 174295 38754 65611
2100F5611Q4165r7866k42479J61580j2945o1311j28875J04866n1094K98301J0425
$$ 65611 149776 51910 -190569 -28989 -41934 -103245 -232120 -127254 -178348 119953 130378
2089A30378j2282o6443K2139O4293n9882k94932K9447J16333o0030J65911k83954
$$ 130378 118096 51653 73792 138085 78203 -216729 -187282 -70949 -130979 34932 -249022
2078b49022J0651J33588O6822p6676j59549K43323k70040J00976J27671p3032
$$ -249022 -238371 -104783 -37961 -114637 -274186 -30863 -300903 -199927 -72256 -145288
2068a45288q2778m1495J92727M2738J15638l9247j47892J1530j7386j0642q9602
$$ -145288 -228066 -269561 -76834 -34096 81542 42295 -105597 -94067 -111453 -122095 -211697
2057b11697q0349J27439J17006l5096p7007J17873l5451N8428j25563q777K05907
$$ -211697 -292046 -164607 -47601 -82697 -159704 -41831 -77282 -18854 -144417 -153194 52713
2046E2713N9010j27550J11666p4560Q027J61134q4848o4728j36678J18353K75275
$$ 52713 111723 -15827 95839 21279 29306 190440 105592 40864 -95814 22539 297814
2035B97814k62710P0049K10163Q4859r5381K5604L2853k55471J36253j68690o1455
$$ 297814 35104 105153 315316 400175 304794 330398 363251 107780 244033 75343 13888
2024A3888J20017m155l095k92207M6337J64388j05486k2071j11936K16462M8753
$$ 13888 133905 129750 126655 -165552 -119215 45173 -60313 -82384 -194320 22142 70895
2013G0895k44512J51206m0896J07253J60449l13992L8821L6858r5207j7392j39370
$$ 70895 -173617 -22411 -63307 43946 204395 -109597 -70776 -33918 -129125 -146517 -285887
2002b85887J42312l86062J41894K13881J42912j28403o1153K10875j79285Q6402
$$ -285887 -143575 -529637 -387743 -173862 -30950 -159353 -220506 -9631 -188916 -102514
1992a02514n8172P3255j54842J35136J7795k8078j44725n9880l653J63165j8488
$$ -102514 -160686 -87431 -242273 -107137 -89342 -117420 -262145 -322025 -325678 -162513 -181001
1981a81001n4531M803J5081N9788k2375k57897L6690J48607J01356o2384k6150
$$ -181001 -235532 -230729 -215648 -155860 -178235 -436132 -399442 -250835 -149479 -211863 -238013
1970b38013j61480L03500M0637p9839j12434j5871N0969j00160K11584K57705
$$ -238013 -399493 -95993 -55356 -135195 -247629 -263500 -212531 -312691 -101107 156598
1960A56598o8859j15045j50572k17756K83855O0612J47667j38121r3179L2152
$$ 156598 87739 -27306 -177878 -395634 -111779 -51167 96500 -41621 -134800 -102648
1950a02648k99491J80246J23392j95333j6627K11735K82117j15744N3832J05913
$$ -102648 -402139 -221893 -98501 -293834 -310461 -98726 183391 67647 121479 227392
1940B27392n6126R31J44460J52245j64968r2263r9371l57197K73422O2207j651
$$ 227392 171266 172197 316657 468902 303934 211671 112300 -244897 28525 90732 89081
1929H9081j11027j57840j55734o425J35010k0266j73639K21948j38303j78690
$$ 89081 -21946 -179786 -335520 -341945 -206935 -227201 -400840 -178892 -317195 -495885
1919d95885K35749J72947M5422N0914J39422p2914k53095R7693j80707L8464J21504
$$ -495885 -260136 -87189 -41767 9147 148569 75655 -177440 -79747 -260454 -221990 -100486
1908a00486K49436o0294k89613J73976j74084M5657O9142k03763k80741J82094
$$ -100486 148950 88656 -200957 -26981 -201065 -155408 -86266 -290029 -570770 -388676
1898c88676Q8957k26816o8815J36202K10441j16153J23319J26172l9748j00372
$$ -388676 -299719 -526535 -595350 -459148 -248707 -364860 -241541 -115369 -155117 -255489
1888b55489Q9516j51797j24592p376J34892L3486J61100J05963k24843j518r1645
$$ -255489 -165973 -317770 -442362 -449738 -314846 -281360 -120260 -14297 -239140 -240658 -332303
1877c32303q2896J87585J15362l33119Q8343O1507q8767K94383j51748M1441r3993
$$ -332303 -415199 -227614 -112252 -445371 -357028 -295521 -384288 -89905 -241653 -200212 -294205
1866b94205N9453M1208Q5007Q0653j56942P9583n1717l9482L2O8716j46533j43929
$$ -294205 -234752 -193544 -108537 -27884 -184826 -105243 -156960 -196442 -196410 -127694 -274227 -418156
1854d18156J08316K42995K446l8684n317J06153O6765r78j60575K60081O02j51131
$$ -418156 -309840 -66845 -64399 -103083 -108400 -2247 64518 63540 -97035 163046 163648 12517
1842A2517M841J00992j76944k28184k7808J04037J23947M34740k23143j4008r6288
$$ 12517 17358 118350 -58594 -286778 -314586 -210549 -86602 348138 124995 110987 14699
1831A4699k19939N9511K5900J04582L4087n8735P0149k03543p6183J43707L3994
$$ 14699 -205240 -145729 -119829 -15247 18840 -39895 30254 -173289 -249472 -105765 -71771
1820g1771j06691q1322J18164r6371j00488J36909k9121J89832m7378j75374R2970
$$ -71771 -178462 -259784 -141620 -237991 -338479 -201570 -230691 -40859 -88237 -263611 -170641
1809a70641M9303L2781J22995p4855O8331l18754R270K98002k24301j77841M5801
$$ -170641 -121338 -88557 34438 -40417 27914 -290840 -281570 16432 -207869 -385710 -339909
1798c39909J76436K45348m5169j90528K65290l13307L4146k2046m189O6226L2788
$$ -339909 -163473 81875 36706 -153822 111468 -201839 -167693 -189739 -193928 -127702 -94914
1787i4914j09341J83184J44597j68112k4630j41381k184j78064J85520J50673
$$ -94914 -204255 -21071 123526 -44586 -69216 -210597 -212781 -390845 -205325 -54652
1777e4652j50832m0024j72776o823K06096N5740R2141J77765j88027q4886k14470
$$ -54652 -205484 -245508 -418284 -425107 -219011 -163271 -71130 106635 -81392 -166278 -380748
1766c80748O9214J63665j85055J32895L19850j63968P3168j54149o4501J86130
$$ -380748 -311534 -147869 -332924 -200029 119821 -44147 29021 -125128 -189629 -3499
1756c499m5682K84222o9469l53708j32524R9959K00392P3512J61454j59716j63875
$$ -3499 -49181 235041 165572 -188136 -320660 -220701 -20309 53203 214657 54941 -108934
1745a08934L70949j29880l68393J00571K62853j51432r0751O2702P657N454L13076
$$ -108934 262015 132135 -236258 -135687 127166 -24266 -115017 -52315 -44658 -39204 273872
1734B73872J51491j70833j12137P5049j4610q6281J62505j6738m373j12205N3482
$$ 273872 425363 254530 142393 217442 202832 116551 279056 262318 257945 145740 199222
1723A99222J50195O1447N0399k76226j27343N4668J41539K44563k4282R9457N4848
$$ 199222 349417 410864 461263 185037 57694 112362 253901 498464 474182 573639 628487
1712F28487O5402j28099J14138j09283J00696Q4765L55172j59036k48022J31857
$$ 628487 693889 565790 679928 570645 671341 756106 1111278 952242 704220 836077
1702H36077J39056N9493l06867Q338P9221J38555K32765N9338m3734k51728L13959
$$ 836077 975133 1034626 727759 736097 815318 953873 1186638 1245976 1202242 950514 1264473
1691A264473q0285k8578J97705j9157N133k1j33094K95293o4399M0799K7903K34677
$$ 1264473 1184188 1155610 1353315 1334158 1339291 1339270 1206176 1501469 1437070 1477869 1505772 1740449
1679A740449J09586L95019k46912L50855j02559K06712J72817O4566J64595J66225
$$ 1740449 1850035 2245054 1998142 2348997 2246438 2453150 2625967 2690533 2855128 3021353
1669C021353J29407L75927m2317K53846N7257j68474J30748L40694M49047n0889
$$ 3021353 3150760 3526687 3484370 3738216 3795473 3626999 3757747 4098441 4547488 4496599
1659D496599O91516M54692K56956O33581Q80650P52296N93579K07482R88731J152509
$$ 4496599 5188115 5642807 5899763 6533344 7413994 8166290 8759869 8967351 9956082 11108591
1649A1108591J756099J941361L103436M963737P292609J0139449J2586294m852609
$$ 11108591 12864690 14806051 17909487 22873224 30165833 40305282 52891576 48038967
1641D8038967r914307r929259r115677m770991l524707j941679j190042p47700
$$ 48038967 38124660 28195401 19079724 14308733 10784026 8842347 7652305 6904605
1633F904605q11791k80152n63735l59648o47434o63851o15249K1669l91939p1811
$$ 6904605 6092814 5812662 5248927 4889279 4241845 3577994 2962745 2984414 2592475 2520664
1623B520664k59993l15700m14508J23728j78666j28256k02622J08759j09119r7346
$$ 2520664 2260671 1944971 1530463 1654191 1475525 1347269 1144647 1253406 1144287 1046941
1613A046941N4718J76392l21694l2102P3204k53123j09076K01335l65271j59942
$$ 1046941 1101659 1278051 956357 924255 997459 744336 635260 836595 471324 311382
1603C11382J87213p3617j50104k47039P5224J27031K9766J18463j69071R0433
$$ 311382 498595 424978 274874 27835 103059 230090 259856 378319 209248 299681
1593B99681j21199p8250L02311n9439k25920K17985j02319J8351j36955q757J02452
$$ 299681 178482 100232 402543 343104 117184 335169 232850 251201 114246 105489 207941
1582B07941R9995m3396k07686P5736L6679k10920K13645k67093N7092P8489k6041
$$ 207941 307936 264540 56854 132590 169269 -41651 171994 -95099 -38007 40482 14441
1571A4441Q6485j70359k133R2464j82250r4510n1360J35023j09798K37393r2991
$$ 14441 100926 -69433 -71566 20898 -161352 -255862 -307222 -172199 -281997 -44604 -137595
1560a37595K9009j8127N6796l4531R7221k18402m4164K21932j63169L39414l7238
$$ -137595 -108586 -126713 -69917 -104448 -7227 -225629 -269793 -47861 -211030 128384 91146
1549I1146n9175p4623o5311j09757p1337K48352m8419J15638k2504o2411j08115
$$ 91146 31971 -42652 -107963 -217720 -289057 -40705 -89124 26514 4010 -58401 -166516
1538a66516j80136J21156J52599M862o7974n5329J6432N4153l901M6711J1556
$$ -166516 -346652 -225496 -72897 -68035 -136009 -191338 -174906 -120753 -124654 -77943 -66387
1527f6387Q7497j14114K25883j42313k69378p5949M5044P6129q348L2865k6394
$$ -66387 21110 -93004 132879 -9434 -278812 -354761 -309717 -233588 -241936 -209071 -235465
1516b35465J25956J36600j86749K14606j30743k8219k5889k5483L4217r1924J38741
$$ -235465 -109509 27091 -159658 54948 -75795 -104014 -129903 -155386 -121169 -213093 -74352
1505g4352j80432J39981P1381J33144N2884j65121J5159k08409O7734P7250r672
$$ -74352 -254784 -114803 -43422 89722 142606 -22515 -7356 -215765 -148031 -70781 -80453
1494h0453j80262o7048J72929m5352o8097O6740j28541J16236j2838R425m2758
$$ -80453 -260715 -327763 -154834 -200186 -268283 -201543 -330084 -213848 -226686 -217261 -260019
1483b60019o6740J20856o5225Q0549P2304l3089J09923j43976j43594l912k180
$$ -260019 -326759 -205903 -271128 -190579 -118275 -151364 -41441 -185417 -329011 -332923 -335103
1472c35103K92877N3912J8741l7486k75766O8220n9258l5800J78833l591J64920
$$ -335103 -42226 11686 30427 -7059 -282825 -214605 -273863 -309663 -130830 -134421 30499
1461C0499j91272J25351J06904k53599L7563p278o6558J90297k10384j4866N2192
$$ 30499 -160773 -35422 71482 -182117 -144554 -151832 -218390 -28093 -238477 -253343 -201151
1450b01151K29020j81920k1475j24707J69488J94059q6554j51741R0080p5716
$$ -201151 27869 -154051 -175526 -300233 -130745 63314 -23240 -174981 -84901 -160617
1440a60617J64744Q7707j5157K5396j88577M5015J10332M6563j19264j47449j24654
$$ -160617 4127 91834 76677 102073 -86504 -41489 68843 115406 -3858 -151307 -275961
1429b75961j6742p7447L6496P0683L18716k1957j6668j74424q679m4499J47651
$$ -275961 -292703 -370150 -333654 -262971 55745 33788 17120 -157304 -165983 -210482 -62831
1418f2831j33226r661j32254J35640O4776r1368m4789p2600K63760K63638k56090
$$ -62831 -196057 -205718 -337972 -202332 -137556 -228924 -273713 -346313 -82553 181085 -75005
1407g5005l06962q0943Q4184J94331J52240m0464P5763k85073O3742n9493J52126
$$ -75005 -381967 -462910 -378726 -184395 -32155 -72619 3144 -281929 -218187 -277680 -125554
1396a25554j12076j74470P0962J68595J445J8544J42689j06553q8286R3066M7215
$$ -125554 -237630 -412100 -341138 -172543 -171098 -152554 -9865 -116418 -204704 -111638 -64423
1385f4423J21260j30925l9615j06485j6380J54265j53455m874q9723K43172j55765
$$ -64423 56837 -74088 -113703 -220188 -236568 -82303 -235758 -240632 -330355 -87183 -242948
1374b42948j33162J81006J8632J36087k14390o7241l0244P4647K15392j02949
$$ -242948 -376110 -195104 -176472 -40385 -254775 -322016 -352260 -277613 -62221 -165170
1364a65170p0080P5321o0540K94467j2752l25401J17504j68899J92155j0609q8077
$$ -165170 -235250 -159929 -220469 73998 61246 -264155 -146651 -315550 -123395 -134004 -222081
1353b22081O4786k53535K51524j13794P0109K24723k0861p9513k51043K15256
$$ -222081 -157295 -410830 -159306 -273100 -202991 21732 871 -78642 -329685 -114429
1343a14429r0403P2907L32303k40678j62695J41243J9098k35833J25852K5480
$$ -114429 -204832 -131925 200378 -40300 -202995 -61752 -42654 -278487 -152635 -127155
1333a27155M7752Q7135k82531o0332k382j32213K7489J5058J36995J10954L9872
$$ -127155 -79403 7732 -274799 -335131 -337513 -469726 -442237 -427179 -290184 -179230 -139358
1322a39358L635k81526J26185J83692r1706o0027J92194j52900K29356m8943O520
$$ -139358 -135723 -417249 -291064 -107372 -199078 -259105 -66911 -219811 9545 -39398 -32878
1311c2878j53322r221o8944r8687L36724j631m2237j50146N5406J23963k60001
$$ -32878 -186200 -195421 -264365 -363052 -26328 -27959 -70196 -220342 -164936 -40973 -300974
1300c00974l528j45120K32303j7401J38904l0713Q6213O3123R4983l72025j7170
$$ -300974 -304502 -449622 -217319 -234720 -95816 -126529 -40316 22807 117790 -254235 -271405
1289b71405n2300p2570K56245L4748j37248R3603M8287j83494j8632J3122k6206
$$ -271405 -323705 -396275 -140030 -105282 -242530 -148927 -100640 -284134 -302766 -289644 -315850
1278c15850Q5640j1112Q7488J38055j30227k80205J24716J49821j06561j85294
$$ -315850 -230210 -241322 -153834 -15779 -146006 -426211 -301495 -151674 -258235 -443529
1268d43529L16335J17202j87099O4487R8974k04927q4330L20043k37829J7984
$$ -443529 -127194 -9992 -197091 -132604 -33630 -238557 -322887 -2844 -240673 -222689
1258b22689J69552j93317L45265O2805k80281K75529j52344J05955k23348k72645
$$ -222689 -53137 -246454 98811 161616 -118665 156864 4520 110475 -112873 -385518
1248c85518K61100J9405l5558j23818j46486L41749J73399k86751q4119o2441
$$ -385518 -124418 -105013 -140571 -264389 -410875 -69126 104273 -182478 -266597 -329038
1238c29038m1628L29019p8965J44547k2231o5460o6686J54187j27831J30310Q9250
$$ -329038 -370666 -41647 -120612 23935 1704 -63756 -130442 23745 -104086 26224 115474
1227A15474k04694K1957J41596k77021j63290K5222l9142L38152J6758l3060j48361
$$ 115474 -89220 -67263 74333 -202688 -365978 -340756 -379898 -41746 -24988 -58048 -206409
1216b06409o2115J36245K76941l05518j52279r50n0621K84856J42123j41115j516
$$ -206409 -268524 -132279 144662 -160856 -313135 -314085 -364706 -79850 62273 -78842 -80358
1205h0358j94445P6204L3206q9851J68210r6939K0134j66440l7158P4878P4478
$$ -80358 -274803 -198599 -165393 -255244 -87034 -183973 -163839 -330279 -367437 -292559 -218081
1194b18081j71240J76344L29568R731k37085j68352j2410L23397k92901j0906
$$ -218081 -389321 -212977 116591 126322 -110763 -279115 -291525 31872 -261029 -271935
1184b71935M231o686K79113j39832R3996K54698l81438n1868J89008J41524j36045
$$ -271935 -267704 -274390 4723 -135109 -41113 213585 -167853 -219721 -30713 110811 -25234
1173b5234j34690J43741j94718n3590O1702J53056Q2647o7718O4030l6181k39894
$$ -25234 -159924 -16183 -210901 -264491 -202789 -49733 32914 -34804 29226 -6955 -246849
1162b46849k9954J13051l7337j3771K01692J5020k31745N8816j06510M095L40901
$$ -246849 -276803 -163752 -201089 -214860 -13168 1852 -229893 -171077 -277587 -273492 67409
1151F7409r294j04874P4830m14684K44031J26344o7997j40653J40929j05016j16568
$$ 67409 58115 -46759 28071 -386613 -142582 -16238 -84235 -224888 -83959 -188975 -305543
1140c05543K07207J41660j3422m3006o8160j96006N5475J81051k5488j02104j99519
$$ -305543 -98336 43324 29902 -13104 -81264 -277270 -221795 -40744 -66232 -168336 -367855
1129c67855R7055K58797N0881r4856J06377O7842k76395o835M9984J36763j40273
$$ -367855 -270800 -12003 38878 -55978 50399 118241 -158154 -164989 -115005 21758 -118515
1118a18515O7028R6464m0801j62400k16031K99048m0377j64170m5039J27145J49704
$$ -118515 -51487 44977 4176 -158224 -374255 -75207 -115584 -279754 -324793 -197648 -47944
1107d7944Q5555N0444r5305j59227j38332L1745J18736n8760j76123J42997Q0158
$$ -47944 37611 88055 -7250 -166477 -304809 -273064 -154328 -213088 -389211 -246214 -166056
1096a66056J45966k72126Q7328J35870l7836k09864J42409o1146j9303O9906j8967
$$ -166056 -20090 -292216 -204888 -69018 -106854 -316718 -174309 -235455 -254758 -184852 -203819
1085b03819J30904J29110o0524k3753r2055R2182j30339M906J82291j0067j10984
$$ -203819 -72915 56195 -4329 -28082 -120137 -27955 -158294 -153388 28903 18836 -92148
1074i2148J19084k31256K40679J91267O4830k22054K6283k40410M6556J65655
$$ -92148 26936 -204320 36359 227626 292456 70402 96685 -143725 -97169 68486
1064F8486j99086J3770J46107j29111j58405J17060K21869R757j0830k53125N4280
$$ 68486 -130600 -116830 29277 -99834 -258239 -141179 80690 90447 79617 -173508 -119228
1053a19228P7490j78148j78657K56353K22839p6292L5109K12393O7759j5128k83276
$$ -119228 -41738 -219886 -398543 -142190 80649 4357 39466 251859 319618 304490 21214
1042B1214J1795k10020l4597m7175J50488J48723j63686J49194J50387K4772j11457
$$ 21214 33009 -177011 -211608 -258783 -108295 40428 -123258 25936 176323 201095 89638
1031H9638O9545j66474L9860l3727N570j10018J19547k682m7045j05938Q4691
$$ 89638 159183 -7291 32569 -1158 4412 -105606 13941 11259 -35786 -141724 -57033
1020e7033m4416Q188j93600j88681K43684J64123k24340J88855j61705P5498K53920
$$ -57033 -101449 -93261 -286861 -475542 -231858 -67735 -292075 -103220 -264925 -189427 64493
1009F4493M7232q4861k59757j9522L65745K19033m08330l34185M03715l36713
$$ 64493 111725 26864 -232893 -252415 113330 332363 -75967 -410152 -6437 -343150
999c43150K83486K06133l2130k144k8406k99664j5397K48601O7790J7212Q3259
$$ -343150 -59664 146469 114339 112195 83789 -215875 -231272 17329 85119 102331 185590
988A85590k27998M1354J70593M7857k67226m9811j47501n8038L78621J00062o8921
$$ 185590 -42408 -1054 169539 217396 -49830 -99641 -247142 -305180 73441 173503 104582
977A04582j75066j85411N9123J09522k57965J59839J26982J23260j2299M0428
$$ 104582 -70484 -255895 -196772 -87250 -345215 -185376 -58394 64866 52567 92995
967I2995m5788j46238j62011R9525J96549K30078N1300r6505J1846l91884j5808
$$ 92995 47207 -99031 -261042 -161517 35032 265110 316410 219905 231751 -160133 -175941
956a75941P288J96679O2371p8576Q1015r3839k23331L5253O9341j3043j30297
$$ -175941 -168653 28026 90397 11821 92836 -1003 -224334 -189081 -119740 -132783 -263080
945b63080K09210O4379j62127p7372J3530Q8003j3189M256j36118Q7333k3525
$$ -263080 -53870 10509 -151618 -228990 -215460 -127457 -140646 -136390 -272508 -185175 -208700
934b08700Q4160m9636J29205J98732j52921m2673J5369K8375N4068q4109J79023
$$ -208700 -124540 -174176 -44971 153761 840 -41833 -26464 1911 55979 -28130 150893
923A50893l55j60500k45736J52484j41781K71154J48717M310j53554o3049K70584
$$ 150893 150538 -9962 -255698 -103214 -244995 26159 174876 179186 25632 -37417 233167
912B33167j84794j73777J28085O3239O5766l2181m7076k69330N99L19831j06275
$$ 233167 48373 -125404 2681 65920 131686 99505 52429 -216901 -216302 103529 -2746
901b746J32002M4707m0794j74119l167J72314P343o8572j79487j86820J78274
$$ -2746 129256 173963 133169 -40950 -44117 128197 135540 66968 -112519 -299339 -121065
890a21065J13222j17218K49135r1047K9331r4462J93745J22650l60649p8280n4198
$$ -121065 -7843 -125061 124074 33027 62358 -32104 161641 284291 -76358 -154638 -208836
879b08836P2240J36355P5393J50178m6480L4747k18718N0513K3885K5336m65j32019
$$ -208836 -136596 -241 75152 225330 178850 213597 -5121 45392 69277 94613 94148 -37871
867c7871L5918p1202J57443j34161M0686n3254J68149k62249J41297O3592j18448
$$ -37871 -1953 -73155 84288 -49873 -9187 -62441 105708 -156541 -15244 48348 -70100
856g0100K39983j593O9565k00017k31552M1279J92955m5858P7374j48151L8827
$$ -70100 169883 168290 237855 37838 -193714 -152435 40520 -5338 72036 -76115 -37288
845c7288J8227J48196L6420l09126J8223j4425J8148J5414n6365J23573k14845
$$ -37288 -19061 129135 165555 -143571 -125348 -139773 -121625 -106211 -162576 -39003 -253848
834b53848J3581K47148J29480j74989l8972k0919O6065J4770L7022q2920j0865
$$ -253848 -240267 6881 136361 -38628 -77600 -98519 -32454 -17684 19338 -63582 -74447
823g4447j6740J51975J87304k88607M9616j73416j1422n9154K15593J70342l1368
$$ -74447 -91187 60788 248092 -40515 9101 -164315 -175737 -234891 -19298 151044 119676
812A19676o0244j50517j12090J01677n2537J19440P925M2470m1046P233j64264
$$ 119676 59432 -91085 -203175 -101498 -154035 -34595 -26670 15800 -25246 -18013 -182277
801a82277R7286k7895K29117j830k57108m035j11271l2846R9427J61691j91069
$$ -182277 -84991 -112886 116231 114401 -142707 -146742 -258013 -290859 -191432 -29741 -220810
790b20810k1120J45228J95156J3881K9882j027j42157J51103o8555K5837L0857
$$ -220810 -241930 -96702 98454 112335 142217 141190 -967 150136 81581 107418 138275
779A38275m7955j46509j64389l0170L4303K14426l8883K94838k95686k9242N8639
$$ 138275 90320 -56189 -220578 -250748 -216445 -2019 -40902 253936 -41750 -70992 -12353
768a2353J20571K6877L2547Q3575k52550J74014M3188o7559j72536l1726J77813
$$ -12353 108218 135095 167642 251217 -1333 172681 215869 148310 -24226 -55952 121861
757A21861N0878L786l2449j30533J0244J25795p6926J39358j13860O9832M6062
$$ 121861 172739 176525 144076 13543 23787 149582 72656 212014 98154 167986 214048
746B14048j2288N0676q8317o6987j51373o1027K57181J8925j8877M6793j65140
$$ 214048 201760 252436 164119 97132 -54241 -115268 141913 160838 141961 188754 23614
735B3614J65952m584n663j0794j41989l3462K53222j67951Q0010K5759R9302J17165
$$ 23614 189566 184982 179319 168525 26536 -6926 246296 78345 158355 184114 283416 400581
723D00581j06832M4416j19485J35531j51528j00434M6814M0109K06293l80294
$$ 400581 293749 338165 218680 354211 202683 102249 149063 189172 395465 15171
713A5171k96153K04175J17413m4195k1511K96812j12495P1126J52302k85573r7079
$$ 15171 -280982 -76807 40606 -3589 -25100 271712 159217 230343 382645 97072 -7
702gl513K0421J75972k614j6785q2911k23387l2368K52052K077j13796J03740
$$ -7 -3520 16901 192873 190259 173474 90563 -132824 -165192 86860 88937 -24859 78881
690G8881K0780j31800K6273J2098k7900q600N0166Q6177k48545J31205J61659
$$ 78881 99661 -32139 -5866 6232 -21668 -30268 19898 106075 -142470 -11265 150394
679A50394l0170m0381J28346q6239J76234n3730r1867r7618k3406L76710l0032
$$ 150394 120224 79843 208189 121950 298184 244454 152587 54969 31563 408273 378241
668C78241r2515L5315j54585j02546J9292j7102J30438J42384k09366j99554N1381
$$ 378241 285726 321041 166456 63910 83202 66100 196538 338922 129556 -69998 -18617
657a8617Q1511l111l22n0347J14267K25909k12077M8881K6485l23576J08956J45786
$$ -18617 62894 59783 59461 9114 123381 349290 137213 186094 212579 -110997 -2041 143745
645A43745k30709J04557k9478L32969k5214j73105R6239k43565j16730J80769
$$ 143745 -86964 17593 -11885 321084 295870 122765 219004 -24561 -141291 39478
635C9478J75584j77998k1412J81284p0304r0599J15366L374j4418J5531j31441
$$ 39478 215062 37064 15652 196936 126632 36033 151399 154773 140355 155886 24445
624B4445J66493m1810Q2271M0488p2935J07665j02157j45210P604r408M7609N7281
$$ 24445 190938 149128 231399 271887 198952 306617 204460 59250 66854 57446 105055 162336
612A62336P194j60729K99563J9008k56110j62698L19209P5429l83239K89825J51468
$$ 162336 169530 8801 308364 327372 71262 -91436 227773 303202 -80037 209788 361256
601C61256j6499M5186J3763j94174j09186K1718Q0272l59664P1776K43295J63917
$$ 361256 344757 389943 403706 209532 100346 122064 202336 -157328 -85552 157743 321660
590C21660j05836r187o2002J58443j15748m7915m6441p4508M4126j97664J70783
$$ 321660 215824 206637 144635 303078 187330 139415 92974 18466 62592 -135072 35711
579C5711J77897k29217K24625J13979N4317k64699J8921K03738j55535J10111
$$ 35711 213608 -15609 209016 322995 377312 112613 131534 335272 179737 289848
569B89848j51556J8255q9077R6717l1645n3943J41374l5293n523j48293q8687
$$ 289848 138292 156547 67470 164187 132542 78599 219973 184680 179157 30864 -57823
558e7823K97928q6591m1565j07658J45567j20978n4024K46036Q4172j75145K8393
$$ -57823 240105 153514 111949 4291 149858 28880 -25144 220892 305064 129919 158312
547A58312J8076j05182J17059K40045l46535j38707M05426k20734J18048j927
$$ 158312 176388 71206 188265 428310 81775 -56932 348494 127760 245808 243881
537B43881N9578o4693Q8521j47492q4790k5305J9848J39106O0309O3416k05401
$$ 243881 303459 238766 327287 179795 95005 69700 89548 228654 288963 352379 146978
526A46978n0362Q7640r4704J87574j33450r7886J90832j85409O627k0788R8475
$$ 146978 96616 184256 89552 277126 143676 45790 236622 51213 57840 37052 135527
515A35527K81557n9204l96226J0453m3336K52110O3814M784l15488K06239K24679
$$ 135527 417084 357880 -38346 -27893 -71229 180881 244695 249479 -66009 140230 364909
504C64909p3659o0875J391J13535j18773J38572o1843p9834N1230K3258L5901
$$ 364909 291250 230375 231766 345301 226528 365100 303257 223423 274653 297911 333812
493C33812o4544n3184j6087r6319q5r1839K49019P5363l24567J94087o1835o5585
$$ 333812 269268 216084 199997 103678 103593 11754 260773 336136 11569 205656 143821 78236
481G8236J26680P2110K24769j74453r8759p9305k03404J56847J7147J08616J26175
$$ 78236 204916 277026 501795 327342 228583 149278 -54126 102721 119868 228484 354659
470C54659J7615p316j09173K42003j66257j67234k9418j80806K71592J0824l6025
$$ 354659 372274 364958 255785 497788 331531 164297 134879 -45927 225665 236489 200464
459B00464R3903k67587N2839K27029l4181O1111o0025j49930J28330K04692k7161
$$ 200464 294367 26780 79619 306648 272467 333578 273553 123623 251953 456645 429484
448D29484r6892l9888j92713J85940j62730p4372L15102J55287k65519k01754
$$ 429484 332592 292704 99991 285931 123201 48829 363931 519218 253699 51945
438E1945J1584k7633K24940p62j17150j04436L26244j67511j40073J91639Q2161
$$ 51945 63529 35896 260836 260074 142924 38488 364732 197221 57148 248787 330948
427C30948P6210k77614P4780R1223r4360J32465J58303l6749q5567j2582M642
$$ 330948 407158 129544 204324 295547 201187 333652 491955 455206 369639 357057 361699
416C61699j0587Q3931k34114N1892r9522k4349j58885K1842J20009K3995J4681
$$ 361699 351112 435043 200929 252821 153299 128950 -29935 -8093 111916 135911 150592
405A50592k4996J18044L9021j56901p202L430m0281J00458q2867Q7485j45888
$$ 150592 125596 243640 282661 125760 118558 121988 81707 182165 99298 186783 40895
394D0895J12436j84759J47322j70217P6262M03184r4162o7724K6844Q283j87065
$$ 40895 153331 -31428 115894 -54323 21939 425123 330961 263237 290081 298364 111299
383A11299Q386l7890J40552J91730j22715j12428q3025J44836m0087l6180J38904
$$ 111299 119685 81795 222347 414077 291362 178934 95909 240745 200658 164478 303382
372C03382l44224m3144K83515O5304p4174J63252j20628j40791J00808J33575
$$ 303382 -40842 -83986 199529 264833 190659 353911 233283 92492 193300 326875
362C26875k6077j1160j68907q7945K31942J54341j78754R4771p5096j46591r677
$$ 326875 300798 289638 120731 32786 264728 419069 240315 335086 259990 113399 103722
351A03722j86700K04126L08963n7075j50653P5580k20385j95898O8466J47420
$$ 103722 -82978 121148 430111 373036 222383 297963 77578 -118320 -49854 97566
341I7566l02798L19358J64672Q5502j08976k28920J53587k84985j36639K50655
$$ 97566 -205232 114126 278798 364300 255324 26404 179991 -104994 -241633 9022
331I022K54255K5232k2645j77070J9734q4284J09379O1973k11429J5757p2823
$$ 9022 263277 288509 265864 88794 108528 24244 133623 195596 -15833 -76 -72899
320g2899J69649J16673J32756r878m3785Q2805r3617m7940J23557j38050P3204
$$ -72899 96750 213423 346179 336301 292516 375321 281704 233764 357321 219271 292475
309B92475J24211l06119O1669P5199m0663j40733J11793j6850l09L2018l4879
$$ 292475 416686 110567 172236 247435 206772 66039 177832 160982 160673 192691 157812
298A57812j26293L31171J05239l13099j70397O810J13858j30047M7816k366j20397
$$ 157812 31519 362690 467929 154830 -15567 -8757 105101 -24946 22870 20504 -99893
287i9893J20273J38363J374j04347j4389K2177p7376J23883l2154N7083Q9993
$$ -99893 20380 158743 160117 55770 41381 63558 -13818 110065 77911 134994 224987
276B24987P0278O0005P9454m48531P7435K99502l0537k32225j40938K68365K6940
$$ 224987 295265 355270 434724 -13807 63628 363130 332593 100368 -40570 227795 254735
265B54735k18942K42903K9063j23954L27547k10401j90307k4738J26260J11270
$$ 254735 35793 278696 307759 183805 511352 300951 110644 85906 212166 323436
255C23436p3273M3640n0747j00135J35159n6994L2130O3823n5150K8997J18618
$$ 323436 250163 293803 243056 142921 278080 221086 253216 317039 261889 290886 409504
244D09504k98868J16628j21834j03301K78054P6028j63670K39716k23432j48269
$$ 409504 110636 227264 105430 2129 280183 356211 192541 432257 208825 60556
234F0556J63306j48946J71006o7708J6426L1660l0248l091Q2717M771J35055l0143
$$ 60556 223862 74916 245922 178214 194640 226300 196052 192961 275678 280449 415504 385361
222C85361n3068k99011J00887n2312K61804o1807k87741Q0382P35J07591j1830
$$ 385361 332293 33282 134169 81857 343661 281854 -5887 74495 75230 182821 170991
211A70991r8967J54104J55210o8031l14425R1231P0937J68875p8544j67309L7108
$$ 170991 72024 226128 381338 313307 -1118 90113 161050 329925 251381 84072 121180
200A21180k8496J66018k31187M6021N7111k11675J26517J14228j98715J52233
$$ 121180 92684 258702 27515 73536 130647 -81028 45489 159717 -38998 113235
190A13235j96614J08112j4027M7464K16952j55236j37970R2302K35329j13112
$$ 113235 -83379 24733 10706 58170 275122 119886 -18084 74218 309547 196435
180A96435R2474J907l1044M6428M1292j85885k7740J51418Q9793P607k61374K71570
$$ 196435 288909 290816 259772 306200 347492 161607 133867 285285 375078 382685 121311 392881
168C92881k4817j79205j85659J22071n154J64377L5355P0706l9871k07179l720
$$ 392881 368064 188859 3200 125271 120117 284494 319849 390555 350684 143505 139785
157A39785J33863J76951q3608j80273Q6049o3224K02487o9884k23924J08625k77422
$$ 139785 273648 450599 366991 186718 272767 209543 412030 342146 118222 226847 -50575
146e0575K02183k0842l1951R4393l7748q23J87042J57515k1112j43110j02934
$$ -50575 151608 130766 98815 193208 155460 154637 341679 499194 478082 334972 232038
135B32038j94992j14921J79304p8345j04963K42657P5129j21328l4842K16568
$$ 232038 37046 -77875 101429 23084 -81879 160778 235907 114579 79737 296305
125B96305L4689k78018J36863P0585q1407j70957J06443J39965j53127K35215
$$ 296305 330994 52976 189839 260424 179017 8060 114503 254468 101341 336556
115C36556m1065q5895o5514N5947N330J96614j79358R8378j47440Q3529r1152
$$ 336556 295491 209596 144082 200029 205359 401973 222615 320993 173553 257082 165930
104A65930m6648K59745j44859k47050M2546J49274L4624k7565K5792K29831p203
$$ 165930 119282 379027 234168 -12882 29664 178938 213562 185997 211789 441620 434417
93D34417o5354l6647j16203j80342J36179r2966O7253J32380m074j16601J83982
$$ 434417 369063 332416 216213 35871 172050 79084 146337 278717 274643 158042 342024
82C42024J08054K9010j43268M416j27419j4851j8105j4359K26165n0470o0505
$$ 342024 450078 479088 335820 340236 212817 197966 179861 165502 391667 341197 280692
71B80692k852N7076j11305j38188m122L5362R5002j07721P7433p345J4250M7021
$$ 280692 277840 334916 223611 85423 81301 116663 211665 103944 181377 174032 188282 235303
59B35303j06439Q3408q6265N7724N4710m2978p4112M3372L272M2335q704N3694
$$ 235303 128864 212272 126007 183731 238441 195463 121351 164723 167995 210330 201626 255320
47B55320M5079j92605M6446m9224L5446J7685J12165j0426J9116o3749l4217l8564
$$ 255320 300399 107794 154240 105016 140462 158147 270312 259886 279002 215253 181036 142472
35A42472j16651J32677J91863K6586j00982m215j48477j70286J24200n4955N6914
$$ 142472 25821 158498 350361 376947 275965 271750 123273 -47013 77187 22232 79146
24G9146J81302N8844r9192n7765P0863O9182M0783k08131k1116J26331K44209
$$ 79146 260448 319292 220100 162335 233198 302380 343163 135032 113916 240247 484456
13D84456j79210l3081Q5116N4391k29250j47853J86044M6504K8780n429j71027
$$ 484456 305246 272165 357281 411672 182422 34569 220613 267117 295897 290468 119441
2A19441N8950J89968
$$ 119441 178391 368359
0C68359
$$ 368359
$$ Imaginary data points
##PAGE= N=2
##DATA TABLE= (X++(I..I)), XYDATA
16383c161535J49360J13388K6655p4902r644L33443N4510l5818l5855J62490j35289
$$ -3161535 -3012175 -2898787 -2872132 -2947034 -2956678 -2623235 -2568725 -2604543 -2640398 -2477908 -2613197
16372b613197J0560N4240J85813M2338l7190M1418j5397J8252K11478K2665j37966
$$ -2613197 -2602637 -2548397 -2362584 -2320246 -2357436 -2316018 -2331415 -2313163 -2101685 -2079020 -2216986
16361b216986n7217Q1181q8204n291L72988P1018K4012O4785j92277j18892K05839
$$ -2216986 -2274203 -2193022 -2281226 -2286517 -1913529 -1842511 -1818499 -1753714 -1945991 -2064883 -1859044
16350a859044K79737N6507n0953o4761M662N6010j82607Q1730K6192P2004M1470
$$ -1859044 -1579307 -1522800 -1573753 -1638514 -1633852 -1577842 -1760449 -1678719 -1652527 -1580523 -1539053
16339a539053J1148j10541J72445O9753J2678J22187M0978l8030k9935p3553M2351
$$ -1539053 -1527905 -1638446 -1466001 -1396248 -1383570 -1261383 -1220405 -1258435 -1288370 -1361923 -1319572
16328a319572Q6217K1425R0830r4504J38508J27247P8339r9471O6376n0576j10377
$$ -1319572 -1233355 -1211930 -1121100 -1215604 -1077096 -949849 -871510 -970981 -904605 -955181 -1065558
16317a065558J23528K12972J18731j0197n7500J04093R2548M8975k2292o5216
$$ -1065558 -942030 -729058 -610327 -620524 -678024 -573931 -481383 -432408 -454700 -519916
$$ [...]
##END NTUPLES=NMR SPECTRUM
##END=
