##TITLE=1H_EC-3338(1)
 CDCl3
 8 sc, 
 13.1.2025
##JCAMPDX= 6.0         $$ Bruker NMR JCAMP-DX V2.0
##DATA TYPE= NMR SPECTRUM
##DATA CLASS= NTUPLES
##ORIGIN= UXNMR, Bruker Analytische Messtechnik GmbH
##OWNER= root
$$ XWIN-NMR		Version 3.5
$$ Mon Jan 13 14:18:27 2025 Russian Standard Time (UT+4h)  she@DPX200
##.OBSERVE FREQUENCY= 200.1315
##.OBSERVE NUCLEUS= ^1H
##.ACQUISITION MODE= SIMULTANEOUS
##.ACQUISITION SCHEME= undefined
##.AVERAGES= 8
##.DIGITISER RES= 18
##SPECTROMETER/DATA SYSTEM= spect
##.PULSE SEQUENCE= zg30
##.SOLVENT NAME= CDCl3
##.SHIFT REFERENCE= (INTERNAL, CDCl3, 0, 21.6628)
##AUDIT TRAIL= $$ (NUMBER, WHEN, WHO, WHERE, WHAT)
$$ ##TITLE= Audit trail, XWIN-NMR		Version 3.5
$$ ##JCAMPDX= 5.01
$$ ##ORIGIN= Bruker BioSpin GmbH
$$ ##OWNER= she
$$ F:/spectra/data/she/nmr/H-F/1/pdata/1/auditp.txt
$$ ##AUDIT TRAIL=  $$ (NUMBER, WHEN, WHO, WHERE, WHAT)
(   1,<2025-01-13 14:17:18.67 +0400>,<she>,<DPX200>,
      <created by zg, POWCHK disabled, PULCHK disabled
       configuration hash MD5:
       00 E9 B6 7A A2 85 ED C7 34 08 36 98 17 FE 4E 26
       data hash MD5: 16K
       18 5E DC 92 48 F6 68 D9 6A C8 34 52 CA E7 8B 3D>)
(   2,<2025-01-13 14:17:24.51 +0400>,<she>,<DPX200>,
      <Start of raw data processing
       efp BC_mod = 2 LB = 0.24 FT_mod = 6 PKNL = 1 PHC0 = -26565.47 PHC1 = 2.587441 SI = 16K 
       data hash MD5: 16K
       FC 51 72 59 20 BC 75 49 D3 B4 50 A6 99 3D DA 7C>)
(   3,<2025-01-13 14:17:47.23 +0400>,<she>,<DPX200>,
      <pk PHC0 = 1.173308 PHC1 = -0.6000001 
       data hash MD5: 16K
       05 A6 F1 C3 08 82 24 26 E7 D0 D4 FB 10 F9 2D DF>)
(   4,<2025-01-13 14:17:50.31 +0400>,<she>,<DPX200>,
      <abs ABSG = 5 
       data hash MD5: 16K
       AD 8E 94 BC 84 30 FB 76 21 B6 72 5F AF 07 47 61>)
$$ ##END=
$$ 
$$ hash MD5
$$ 24 DA 41 74 7B 90 1F 27 43 60 A2 67 A3 15 0E BE
##$RELAX= 
##$RELAX= 
##$RELAX= 
##$RELAX= 
##$RELAX= 
##$RELAX= 
$$ Bruker specific parameters
$$ --------------------------
##$DU= <F:/spectra>
##$EXPNO= 1
##$NAME= <H-F>
##$PROCNO= 1
##$TYPE= <nmr>
##$USER= <she>
##$AMP= (0..31)
100 100 100 100 100 100 100 100 100 100 100 100 100 100 100 100 100 100 
100 100 100 100 100 100 100 100 100 100 100 100 100 100 
##$AQSEQ= 0
##$AQ_mod= 1
##$AUNM= <au_zg>
##$AUTOPOS= <>
##$BF1= 200.13
##$BF2= 200.13
##$BF3= 200.13
##$BF4= 200.13
##$BF5= 200.13
##$BF6= 200.13
##$BF7= 200.13
##$BF8= 200.13
##$BYTORDA= 1
##$CFDGTYP= 0
##$CFRGTYP= 5
##$CHEMSTR= <none>
##$CNST= (0..31)
1 1 145 1 1 1 1 1 1 1 1 1 1 1 1 1 1 1 1 1 1 1 1 1 1 1 1 1 1 1 1 1 
##$CPDPRG= <>
##$CPDPRG1= <>
##$CPDPRG2= <>
##$CPDPRG3= <>
##$CPDPRG4= <mlev>
##$CPDPRG5= <mlev>
##$CPDPRG6= <mlev>
##$CPDPRG7= <mlev>
##$CPDPRG8= <mlev>
##$CPDPRGB= <>
##$CPDPRGT= <>
##$D= (0..31)
0 1.2 0 0 0 0 0 0 0 0.06 0 0.03 0 0 0 0 0.0002 0 0 0 0 0 0 0 0 0 0 0 0 
0 0 0 
##$DATE= 1736763438
##$DBL= (0..7)
120 120 120 120 120 120 120 120 
##$DBP= (0..7)
150 150 150 150 150 150 150 150 
##$DBP07= 0
##$DBPNAM0= <>
##$DBPNAM1= <>
##$DBPNAM2= <>
##$DBPNAM3= <>
##$DBPNAM4= <>
$$ [...]
##$SUBNAM3= <"">
##$SUBNAM4= <"">
##$SUBNAM5= <"">
##$SUBNAM6= <"">
##$SUBNAM7= <"">
##$SUBNAM8= <"">
##$SUBNAM9= <"">
##$SW= 24.0689530833862
##$SWIBOX= (0..15)
0 0 2 0 0 0 0 0 0 0 0 0 0 0 0 0 
##$SW_h= 4816.95568400771
##$TD= 16384
##$TD0= 1
##$TE= 0
##$TE2= 300
##$TE3= 300
##$TEG= 300
##$TL= (0..7)
0 120 120 120 120 120 120 120 
##$TP= (0..7)
150 150 150 150 150 150 150 150 
##$TP07= 0
##$TPNAME0= <>
##$TPNAME1= <>
##$TPNAME2= <>
##$TPNAME3= <>
##$TPNAME4= <>
##$TPNAME5= <>
##$TPNAME6= <>
##$TPNAME7= <>
##$TPOAL= (0..7)
0.5 0.5 0.5 0.5 0.5 0.5 0.5 0.5 
##$TPOFFS= (0..7)
0 0 0 0 0 0 0 0 
##$TUNHIN= 0
##$TUNHOUT= 0
##$TUNXOUT= 0
##$USERA1= <user>
##$USERA2= <user>
##$USERA3= <user>
##$USERA4= <user>
##$USERA5= <user>
##$V9= 5
##$VALIST= <valist>
##$VCLIST= <CCCCCCCCCCCCCCC>
##$VD= 0
##$VDLIST= <DDDDDDDDDDDDDDD>
##$VPLIST= <PPPPPPPPPPPPPPP>
##$VTLIST= <TTTTTTTTTTTTTTT>
##$WBST= 1024
##$WBSW= 4
##$XGAIN= (0..3)
0 0 0 0 
##$XL= 0
##$YL= 0
##$YMAX_a= 388281
##$YMIN_a= -560662
##$ZGOPTNS= <>
##$ZL1= 120
##$ZL2= 120
##$ZL3= 120
##$ZL4= 120
##$ABSF1= 21.65551
##$ABSF2= -2.413675
##$ABSG= 5
##$ABSL= 3
##$ALPHA= 0
##$AQORDER= 0
##$ASSFAC= 0
##$ASSFACI= 0
##$ASSFACX= 0
##$ASSWID= 0
##$AUNMP= <proc_1d>
##$AZFE= 0.1
##$AZFW= 0.1
##$BCFW= 0
##$BC_mod= 2
##$BYTORDP= 0
##$COROFFS= 0
##$CY= -3
##$DATMOD= 1
##$DC= 0
##$DFILT= <>
##$DTYPP= 0
##$F1P= 0
##$F2P= 0
##$FCOR= 1
##$FTSIZE= 16384
##$FT_mod= 6
##$GAMMA= 0
##$GB= 0
##$INTBC= 1
##$INTSCL= 2.524811e-10
##$ISEN= 128
##$LB= 0.24
##$LEV0= 0
##$LPBIN= 0
##$MAXI= 10000
##$MC2= 0
##$MEAN= 0
##$ME_mod= 0
##$MI= 1.114404
##$NCOEF= 0
##$NC_proc= -6
##$NLEV= 6
##$NOISF1= 3.799351
##$NOISF2= 2.8
##$NSP= 0
##$NTH_PI= 0
##$NZP= 0
##$OFFSET= 21.66285
##$PC= 1
##$PHC0= -26564.3
##$PHC1= 1.987441
##$PH_mod= 1
##$PKNL= yes
##$PPARMOD= 0
##$PSCAL= 0
##$PSIGN= 0
##$REVERSE= no
##$SF= 200.129573100743
##$SI= 16384
##$SIGF1= 3
##$SIGF2= 2
##$SINO= 5.538805
##$SIOLD= 16384
##$SREGLST= <1H.CDCl3>
##$SSB= 0
##$STSI= 16384
##$STSR= 0
##$SW_p= 4816.95568400771
##$SYMM= 0
##$S_DEV= 0
##$TDeff= 16384
##$TDoff= 0
##$TI= <>
##$TILT= no
##$TM1= 0
##$TM2= 0
##$TOPLEV= 0
##$USERP1= <user>
##$USERP2= <user>
##$USERP3= <user>
##$USERP4= <user>
##$USERP5= <user>
##$WDW= 1
##$XDIM= 16384
##$YMAX_p= 385402686
##$YMIN_p= -656632
$$ End of Bruker specific parameters
$$ ---------------------------------
##NTUPLES= NMR SPECTRUM
##VAR_NAME=  FREQUENCY,     SPECTRUM/REAL,   SPECTRUM/IMAG
##SYMBOL=    X,             R,               I
##VAR_TYPE=  INDEPENDENT,   DEPENDENT,       DEPENDENT
##VAR_FORM=  AFFN,          ASDF,            ASDF
##VAR_DIM=   16384,         16384,           16384
##UNITS=     HZ,            ARBITRARY UNITS, ARBITRARY UNITS
##FACTOR=    0.29402158847633, 1,            1
##FIRST=     4335.376807825, 0,              0
##LAST=      -481.578876182713, 0,           0
##MIN=       -481.578876182713, -656632,     0
##MAX=       4335.376807825, 385402686,      0
$$ Real data points
##PAGE= N=1
##DATA TABLE= (X++(R..R)), XYDATA
$$ [...]
7797e5983J86465j96073j45708j24397L1140L598N9731m1055O8391J98951P5492
$$ -55983 130482 -65591 -211299 -335696 -304556 -300958 -241227 -282282 -213891 -14940 60552
7786F0552J17653n2835K0324k02442l0746J01388J8442j8493k67121n2728j5972
$$ 60552 178205 125370 145694 -56748 -87494 13894 32336 13843 -253278 -306006 -321978
7775c21978j0210L7295m2044K55780J63317j35234p3649P6814j71680J74743p0618
$$ -321978 -332188 -294893 -336937 -81157 82160 -53074 -126723 -49909 -221589 -46846 -117464
7764a17464j96231Q2596j65341r7194J32302J28408J03656R2598j04310k96749
$$ -117464 -313695 -231099 -396440 -493634 -361332 -232924 -129268 -36670 -140980 -437729
7754d37729J63434J36164K3255l8811R1364k3851l26409J94562J48096J30237
$$ -437729 -274295 -138131 -114876 -153687 -62323 -86174 -412583 -218021 -69925 60312
7744F0312j12875m3105J1729J15878j4671P105j29408k40738L58320j59183K0795
$$ 60312 -52563 -95668 -83939 31939 17268 24373 -105035 -345773 12547 -146636 -125841
7733a25841n2619P6529r2798Q4123o4593K97616n9333j20711J28541j29417m6249
$$ -125841 -178460 -101931 -194729 -110606 -175199 122417 63084 -57627 70914 -58503 -104752
7722a04752k63162J56336J02662r130P9447J9982j07508o3547l3015l6076l199
$$ -104752 -367914 -211578 -108916 -118046 -38599 -18617 -126125 -189672 -222687 -258763 -261962
7711b61962j10666o8578K01702J609j48156J99628q479l41629O3292K30975l3753
$$ -261962 -372628 -441206 -239504 -237895 -386051 -186423 -194902 -536531 -473239 -242264 -276017
7700b76017J4398K48881j08136o2901K00989j70862j38930O454J65764j9138J29949
$$ -276017 -261619 -12738 -120874 -183775 17214 -153648 -292578 -286124 -120360 -139498 -9549
7689i549k58100J63271L7744Q6494j23821j50062J07658J10608j36177P7336O0926
$$ -9549 -267649 -104378 -66634 19860 -103961 -254023 -146365 -35757 -171934 -94598 -33672
7678c3672j52332L50697j70786j81982r0355K1131j5668j57973J9636K95688K09280
$$ -33672 -186004 164693 -6093 -188075 -278430 -257299 -272967 -430940 -411304 -115616 93664
7667I3664l5985o2332l3081k6271k5486k3308j28086k38998K16744K00586n930
$$ 93664 57679 -4653 -37734 -64005 -89491 -112799 -240885 -479883 -263139 -62553 -68483
7656f8483K1581j05573n6490n4911l1793J21820j15683p7702J92939q871n6203
$$ -68483 -46902 -152475 -208965 -263876 -295669 -173849 -289532 -367234 -174295 -183166 -239369
7645b39369J61543N1262p7505J71347l594r0655k89491j54845J5531M3163K19162
$$ -239369 -77826 -26564 -104069 67278 63684 -26971 -316462 -471307 -455776 -412613 -193451
7634a93451M8098Q3297r0410p2250J44024j06553k99443L78975K7197J49713J07108
$$ -193451 -145353 -62056 -152466 -224716 -80692 -187245 -486688 -107713 -80516 69197 176305
7623A76305k15487k54905O734K59439M3344J0203L0070k19334m5505J89253j68267
$$ 176305 -39182 -294087 -287353 -27914 15430 25633 55703 -163631 -209136 -19883 -188150
7612a88150J41399L4118J6469j06506m1486q4939J23690J79344O1684j67131j37341
$$ -188150 -46751 -12633 3836 -102670 -144156 -229095 -105405 73939 135623 -31508 -168849
7601a68849J1200j49046k54505J75538M3399K1964O8439J36972k3254P2536J74660
$$ -168849 -157649 -306695 -561200 -385662 -342263 -320299 -251860 -114888 -138142 -65606 109054
7590A09054j090L7097k28294J81346k08590K21085p0406q4982l7107n3843J47914
$$ 109054 107964 145061 -83233 98113 -110477 110608 40202 -44780 -81887 -135730 12184
7579A2184j39422N2972J19594k89271k07992J13337P2447j26342K04060r6687
$$ 12184 -127238 -74266 45328 -243943 -451935 -338598 -266151 -392493 -188433 -285120
7569b85120J0333L8021J36472O8175l4389J24823o6471p0867Q7823p4828j07274
$$ -285120 -274787 -236766 -100294 -32119 -66508 58315 -8156 -79023 8800 -66028 -173302
7558a73302J25219k9675j45069j14866K1154m5089k2168m0281J70510q9778J84460
$$ -173302 -48083 -77758 -222827 -337693 -316539 -361628 -383796 -424077 -253567 -343345 -158885
7547a58885k18333P6695K14675r1894N5014R1240K08378j94814j62485m3078J47034
$$ -158885 -377218 -300523 -85848 -177742 -122728 -31488 176890 -17924 -180409 -223487 -76453
7536g6453N5389j8111j30358l7982k4184L0189L6050p900M4299K42223k58323
$$ -76453 -21064 -39175 -169533 -207515 -231699 -201510 -165460 -173360 -129061 113162 -145161
7525a45161P5277k46576j68096J70881J99260O2351k3905o8046O0704K9851j38507
$$ -145161 -69884 -316460 -484556 -313675 -114415 -52064 -75969 -144015 -83311 -53460 -191967
7514a91967R1893n1172j00558N3786o0939j07501K13742m9774l2921j9136J65613
$$ -191967 -100074 -151246 -251804 -198018 -258957 -366458 -152716 -202490 -235411 -254547 -88934
7503h8934K2208M9826p8855j03206j43073K33078R8421l51094j0369Q2051K55715
$$ -88934 -66726 -16900 -95755 -198961 -342034 -108956 -10535 -361629 -371998 -289947 -34232
7492c4232K4001k88375K11188k81731l0170K05366m4347J23720O3498r9957M0684
$$ -34232 -10231 -298606 -87418 -369149 -399319 -193953 -238300 -114580 -51082 -151039 -110355
7481a10355j31470j40822P081J70973J9232l30461J64616J03639L33649j18807
$$ -110355 -241825 -382647 -375566 -204593 -185361 -515822 -351206 -247567 86082 -32725
7471c2725j91856J70487j36710J48398j09850P2729R293q0264K1053Q2632J65889
$$ -32725 -224581 -54094 -190804 -42406 -152256 -79527 -70234 -150498 -129445 -46813 119076
7460A19076j47496j25143l8086n0474M4177j24828j96263K33604j1343L0435m5082
$$ 119076 -28420 -153563 -191649 -242123 -197946 -322774 -519037 -285433 -296776 -266341 -311423
7449c11423J27357R4127j40336K44048p0715q6873j34423k6675O4384J50553j64002
$$ -311423 -184066 -89939 -230275 13773 -56942 -143815 -278238 -304913 -240529 -89976 -253978
7438b53978Q1436p4138p0295K8960n3368K65538j56072q5878l5099l1912q6284
$$ -253978 -172542 -246680 -316975 -288015 -341383 -75845 -231917 -317795 -352894 -384806 -471090
7427d71090m4746K03828O3231j60472M9112J7350J75609L9836J51962j55421j53263
$$ -471090 -515836 -312008 -248777 -409249 -360137 -342787 -167178 -127342 24620 -130801 -284064
7416b84064N8409k62714r556J54336J97126k14783j0744N8768J27423m734Q4435
$$ -284064 -225655 -488369 -497925 -343589 -146463 -361246 -371990 -313222 -185799 -190533 -106098
7405a06098J08543o6337o1313K27408n3758k7734j87607m3881k9995J31801l3820
$$ -106098 2445 -63892 -125205 102203 48445 20711 -166896 -210777 -240772 -108971 -142791
7394a42791P829P4212M7411O5271M7485k03178j17967m5453n7624K53663L2685
$$ -142791 -134962 -60750 -13339 51932 99417 -103761 -221728 -267181 -324805 -71142 -38457
7383c8457j9775j31592K55603k59001K08642r8411q2931j9262L00609o6363j45930
$$ -38457 -58232 -189824 65779 -193222 15420 -82991 -165922 -185184 115425 49062 -96868
7372i6868Q5436j98274N5722p4186Q4783j32992j6493R889J28760N6844j5524
$$ -96868 -11432 -209706 -153984 -228170 -143387 -276379 -292872 -282983 -154223 -97379 -112903
7361a12903j00222l6721L7751O1786l7549o7017R7116L2099p4421J44930P737
$$ -112903 -213125 -249846 -212095 -150309 -187858 -254875 -157759 -125660 -200081 -55151 -47414
7350d7414r8496J45618j32167j08230k55046L77672N945J55698k01083j6428K182
$$ -47414 -145910 -292 -132459 -240689 -495735 -118063 -112118 43580 -157503 -173931 -171749
7339a71749N3785N9006j02320O4504j4321p6642K86425n0865r7829q756j74579
$$ -171749 -117964 -58958 -161278 -96774 -111095 -187737 98688 47823 -50006 -58762 -233341
7328b33341R8408m25k8594k54559J08406J61589K4947n1154o1232k3953O6636
$$ -233341 -134933 -135358 -163952 -418511 -310105 -148516 -123569 -174723 -235955 -259908 -193272
7317a93272n2077L752k49823l7214K51688K02400r3001q5918K00536J33645k30431
$$ -193272 -245349 -241597 -491420 -528634 -276946 -74546 -167547 -253465 -52929 80716 -149715
7306a49715j15818R3441Q2304k05750K93892J21876k62789j17575Q2899J38745
$$ -149715 -265533 -172092 -89788 -295538 -1646 120230 -142559 -260134 -177235 -38490
7296c8490P4306l32398J26754L07785M9277p1920p6946n03R052o1263j44046j5214
$$ -38490 35816 -296582 -169828 137957 187234 115314 38368 37865 46917 -14346 -158392 -173606
7284a73606K24190p8038k47316K43442p9886L07787k50947J08629L2427k09743
$$ -173606 50584 -27454 -274770 -31328 -111214 196573 -54374 54255 86682 -123061
7274a23061J94937j23558J7567K0117j3462q9489N8531n436J97735l08884J00907
$$ -123061 71876 -51682 -34115 -13998 -27460 -116949 -58418 -63854 133881 -175003 -74096
7263g4096K924Q8342q1907j49789n7797K00589L8625l68889K62243k39579N1674
$$ -74096 -71172 17170 -64737 -214526 -272323 -71734 -33109 -401998 -139755 -379334 -327660
7252c27660J4538J30452J50250J30278l16858J73656j08082j59813M705L1486
$$ -327660 -313122 -182670 -32420 97858 -219000 -45344 -153426 -313239 -308534 -277048
7242b77048J20244K4855K2967P2124p4027n5765O4631k14934K0744K71720n5705
$$ -277048 -156804 -131949 -108982 -36858 -110885 -166650 -102019 -316953 -296209 -24489 -80194
7231h0194L76k2966O3523J81695m12394J71869N4830J10364K09081J8252o5429
$$ -80194 -79818 -102784 -39261 142434 -269960 -98091 -43261 67103 276184 294436 229007
7220B29007J07646o0420P9779J21333j84051j94652J18338P867l2802J85696j04708
$$ 229007 336653 276233 356012 477345 293294 98642 216980 224847 192045 377741 273033
7209B73033M7742o5920p204J16250j21447J25323R3727M4287P2291o5998L1355
$$ 273033 320775 254855 247651 363901 242454 367777 461504 505791 578082 512084 543439
7198E43439j08197j41199j66993K72692j29947m4915J63125J44121l1904r3640
$$ 543439 435242 294043 127050 399742 269795 224880 388005 532126 500222 406582
7188D06582j7037K6241J70122l28960m1800j13650M5345M180j30814q9060Q1765
$$ 406582 389545 415786 585908 256948 215148 101498 146843 151023 20209 -68851 12914
7177A2914l6430M5194K46770j50531k66195J44242L26274p7751M0391N506N6831
$$ 12914 -23516 21678 268448 117917 -148278 -4036 322238 244487 284878 290384 347215
7166C47215k12175k46951l1369J03962o3653j90449J73869J95039q1789J28063
$$ 347215 135040 -111911 -143280 -39318 -102971 -293420 -119551 75488 -6301 121762
7156A21762k906L6518M6632m5014o0210n5296J06113j40914K00455k6752j50692
$$ 121762 118856 155374 202006 156992 96782 41486 147599 6685 207140 180388 29696
7145B9696n7360K73815N8826j00102l97622N3644Q8555K0612O671j16842R1549
$$ 29696 -27664 246151 304977 204875 -192747 -139103 -50548 -29936 -23265 -140107 -48558
7134d8558J36630m2931k8333K4223p5198m3478j97508K75152o1488J32299o029
$$ -48558 88072 45141 16808 41031 -34167 -77645 -275153 -1 -61489 70810 64781
7123F4781j87533P6311J28531J50632k40985j62322L21604M4313O0900Q8k18516
$$ 64781 -122752 -46441 82090 232722 -8263 -170585 151019 195332 256232 256320 37804
7112C7804R0249j0708P7776j65684Q2665K47105j60372k68340o7816R1195K79992
$$ 37804 128053 117345 195121 29437 112102 359207 198835 -69505 -137321 -46126 233866
7101B33866k10350P0345J31232J21805j93648k46661k27132J0758K87876N0984
$$ 233866 23516 93861 225093 346898 153250 -93411 -320543 -309785 -21909 29075
7091B9075j60139K59246j00104j86764J94231M189k07846J3881K96341M6076O4057
$$ 29075 -131064 128182 28078 -158686 35545 39734 -168112 -154231 142110 188186 252243
7080B52243m3010j57736m5343j36736J99988J9650k71075N9684J2641R2054p7499
$$ 252243 209233 51497 6154 -130582 69406 89056 -182019 -122335 -109694 -17640 -95139
7069i5139j5154N8662M8203Q8065j24844k3400R1847k21564J29843j71410J76253
$$ -95139 -110293 -51631 -3428 84637 -40207 -63607 28240 -193324 -63481 -234891 -58638
7058e8638J06454M6341j97603O2257n4794j51106J23910K53429j28789M3891m9013
$$ -58638 47816 94157 -103446 -41189 -95983 -247089 -123179 130250 1461 45352 -3661
7047c661J04183j51216l2535J70698L9312j11610J10932L5427K53073l28969j33455
$$ -3661 100522 -50694 -83229 87469 126781 15171 126103 161530 414603 85634 -47821
7036d7821M6011J21334K20016l18337m1947M9698q8921J91144j11609J01638L22087
$$ -47821 -1810 119524 339540 21203 -20744 28954 -59967 131177 19568 121206 443293
7025D43293l50374P315l52J76227l9461k74083p153l6997l1215J01850J49443
$$ 443293 92919 100234 99882 276109 236648 -37435 -44588 -81585 -112800 -10950 138493
7014A38493j768j15020M4921l2091j47516p5878J87243L10643j12031l04323j57021
$$ 138493 136725 21705 66626 34535 -112981 -188859 -1616 309027 196996 -107327 -264348
7003b64348J93886J17514J72664q2086r6310o8497K2244L72473q2193j85056k05005
$$ -264348 -70462 47052 219716 137630 41320 -27177 -4933 367540 285347 100291 -104714
6992a04714J81503M2860J12363j76347j20586j92682R4053n1395O4458J73472
$$ -104714 76789 119649 232012 55665 -64921 -257603 -163550 -214945 -150487 22985
6982B2985M4011K3066l8709N5488R5231j93574n3063J4529M6870Q4215l1969r0152
$$ 22985 66996 90062 51353 106841 202072 8498 -44565 -30036 16834 101049 69080 -21072
6970b1072J531j6281R402r642J23345L3601n4080L2037j34074K4601K14525j89057
$$ -21072 -19541 -35822 -26420 -36062 87283 120884 66804 98841 -35233 -10632 203893 14836
6958A4836k45557L9779n9690J86156J66789k84578L01984J80984j90000Q0000
$$ 14836 -230721 -190942 -250632 -64476 102313 -182265 119719 300703 110703 190703
6948A90703j79308M3520n7693n4978J43121l60828K84911J1738J13331m4031K23435
$$ 190703 11395 54915 -2778 -57756 85365 -275463 9448 21186 134517 90486 313921
6937C13921j14199J06654q8448L1891M453j52915K3548J49396K2575j37622n0801
$$ 313921 199722 306376 217928 249819 254272 101357 124905 274301 296876 159254 108453
6926A08453k93811N7983K44978K45640j75830J07965q4536n6718J56938J41072
$$ 108453 -185358 -127375 117603 363243 187413 295378 210842 154124 311062 452134
6916D52134o7445O1567j3390M5947Q401J76711j2393j11746J28347r6j78225k51039
$$ 452134 384689 446256 432866 478813 487214 663925 651532 539786 668133 668037 489812 238773
6904B38773K34513j7816N0012l3892q911K71772j01448j27359j3038N3106P9189
$$ 238773 473286 455470 505482 471590 462679 734451 633003 505644 492606 545712 624901
6893F24901j7643p9740K55163k13360P692j39928J94003J19835j25627R66N3342
$$ 624901 607258 527518 782681 569321 577013 437085 631088 750923 625296 626262 679604
6882F79604q5852K91612j1390r5176l3689J63019M1911k0176p9581p089O0535
$$ 679604 593752 885364 873974 778798 745109 908128 950039 929863 850282 843193 903728
6871I03728Q0600k04059K07721J5045n9992k0036q9918r3017M7783K33039N2876
$$ 903728 984328 780269 987990 1003035 943043 923007 833089 740072 787855 1020894 1073770
6860A073770P2327J93673M3314J74112j07354J6539k1011J91027K20253J07383
$$ 1073770 1146097 1339770 1383084 1557196 1449842 1466381 1445370 1636397 1856650 1964033
6850A964033K07121L80J8519k16509j31274J17517m186J170J94749K3866J54031
$$ 1964033 2171154 2171534 2190053 1973544 1842270 1959787 1955601 1956771 2151520 2175386 2329417
6839B329417J79794L04287J43677J50674j87008j45800K98492N6145O8884N7214
$$ 2329417 2509211 2813498 2957175 3107849 2920841 2775041 3073533 3129678 3198562 3255776
6829C255776m7229K84119l15025J63699L11490R391O8153M16909r3099J17139
$$ 3255776 3208547 3492666 3177641 3341340 3652830 3662221 3730374 4147283 4054184 4171323
6819D171323J55020J58311J17848p7805J62514K33009q9799P1904P7633J83274
$$ 4171323 4326343 4484654 4602502 4524697 4687211 4920220 4830421 4902325 4979958 5163232
6809E163232k25528J95542j182Q9169K08333k6343J54371L23029K27708L74675
$$ 5163232 4937704 5133246 5132064 5221233 5429566 5403223 5557594 5880623 6108331 6483006
6799F483006P21334N8054P1779m99562o13755m31995n03152l75532j23698o5055
$$ 6483006 7204340 7262394 7334173 6834611 6220856 5788861 5285709 4910177 4786479 4721424
6789D721424L848m3327L53593Q8602L04486O19497M46274L5840o40033l94837
$$ 4721424 4725272 4681945 5035538 5124140 5428626 6048123 6494397 6530237 5890204 5495367
6779E495367k30797n34407l13229k50043l3860r9365J49471r0890L34315L70903
$$ 5495367 5264570 4730163 4416934 4166891 4133031 4033666 4183137 4092247 4426562 4797465
6769D797465P24143O83923K8499j08741o35340m15676n17747l35298p6789k92840
$$ 4797465 5521608 6205531 6234030 6125289 5489949 5074273 4556526 4221228 4144439 3851599
6759C851599O115j27012K50469N83267K84940N21542N13958J61404o12058p48683
$$ 3851599 3857714 3730702 3981171 4564438 4849378 5370920 5884878 6046282 5434224 4685541
6749D685541p29273k98964n69161j49790m36395J2145n962K01029k37164k4690
$$ 4685541 3956268 3657304 3088143 2938353 2501958 2514103 2508141 2709170 2472006 2447316
6739B447316n7698j17233J07148k3462R8597J9905Q8081O6908K61122j91245k55933
$$ 2447316 2389618 2272385 2379533 2356071 2454668 2474573 2562654 2629562 2890684 2699439 2443506
6728B443506L6505J73749j69192L25626J37445j68700K00863p4605n0255m729
$$ 2443506 2480011 2653760 2484568 2810194 2947639 2778939 2979802 2905197 2854942 2850213
6718B850213l97445J20545r6789k15684j08584L2963M5181J07656O8587J41126
$$ 2850213 2452768 2573313 2476524 2260840 2152256 2185219 2230400 2338056 2406643 2547769
6708B547769j27644J31810J88110k23283R9816j3907j97761J20133o9284l40683
$$ 2547769 2420125 2551935 2740045 2516762 2616578 2602671 2404910 2525043 2455759 2115076
6698B115076J3937M51727k1789P2658J24641L3420J3795N4851j88829J2056O1283
$$ 2115076 2129013 2580740 2558951 2631609 2756250 2789670 2803465 2858316 2669487 2681543 2742826
6687B742826j37293M7242k4195J5086l00282M64022J81184K94463j30883j88520
$$ 2742826 2605533 2652775 2628580 2643666 2343384 2807406 2988590 3283053 3152170 2963650
6677B963650L42379k15710l2246P1161j33275j92840n6666K87566Q0842J34770
$$ 2963650 3306029 3090319 3058073 3129234 2995959 2803119 2746453 3034019 3114861 3249631
6667C249631P627O4152j02951O4636Q9899j71939J12803r9867J34022J97605J75678
$$ 3249631 3257258 3321410 3218459 3283095 3372994 3201055 3313858 3213991 3348013 3545618 3721296
6656C721296J18476j15885L79817J64682p2384J62120n9604J48871j5944j9619
$$ 3721296 3839772 3723887 4103704 4268386 4196002 4358122 4298518 4447389 4431445 4411826
6646D411826P363J33109j48035L09754L8998P7390J67732O3093J99718J50614
$$ 4411826 4419189 4552298 4404263 4714017 4753015 4830405 4998137 5061230 5260948 5411562
6636E411562M94205j49504K57801j42500n0983L33714O165J59365O3297P4803
$$ 5411562 5905767 5756263 6014064 5871564 5820581 6154295 6160460 6319825 6383122 6457925
6626F457925M40050N0982J35086N35657J56384L25469m5445K30415J24010N68774
$$ 6457925 6897975 6948957 7084043 7619700 7776084 8101553 8056108 8286523 8410533 8979307
6616H979307J05953R8492M93072J20543J83633N09091K17680N93172K87746L06457
$$ 8979307 9085260 9183752 9676824 9797367 9981000 10490091 10707771 11300943 11588689 11895146
6606A1895146L89375K54691K71437M01133N28860L78485M40134R19710P03848
$$ 11895146 12284521 12539212 12810649 13211782 13740642 14119127 14559261 15478971 16182819
6597A6182819N69267M61380O68475P76306N79709P44952P85626J102331J153265
$$ 16182819 16752086 17213466 17881941 18658247 19237956 19982908 20768534 21870865 23024130
6588B3024130J584417J783698K276715K521549L097706L626524M752101O752685
$$ 23024130 24608547 26392245 28668960 31190509 34288215 37914739 42666840 49419525
6580D9419525R300480J2015859J1070354M490378l905035j0675108j1043805p258477
$$ 49419525 58720005 70735864 81806218 86296596 82391561 71716453 60672648 53414171
6572E3414171m386362j923765j78450J281782K425032M547634P785699J0637335
$$ 53414171 49027809 47104044 46925594 48207376 50632408 55180042 62965741 73603076
6564G3603076J2509166Q765919R39860o534049j0653406p559081k276665K840030
$$ 73603076 86112242 94878161 95818021 89283972 78630566 71071485 68794820 71634850
6556G1634850P316631J0752850N554415p510268o876803R63492P500065J1551638
$$ 71634850 78951481 89704331 95258746 87748478 80871675 81835167 89335232 100886870
6548A00886870J0977562K602759q047612j5666544j5721039j0578982o250192
$$ 100886870 111864432 114467191 106419579 90753035 75031996 64453014 58202822
6541E8202822l524473j944884O3463K236626M801965Q376832J1998096J4170385
$$ 58202822 54678349 52733465 52796928 55033554 59835519 68212351 80210447 94380832
6533I4380832R218494j414639j1064983j6835907j4417442r606952o190310m110077
$$ 94380832 103599326 102184687 91119704 74283797 59866355 50259403 44069093 39959016
6525C9959016l040257k478590j871199j322316j007149p26884m27612j22947j19146
$$ 39959016 36918759 34440169 32568970 31246654 30239505 29512621 29085009 28962062 28842916
6516B8842916p0123L45143m0505L52625M62952R49666J008674R33193J35636j1570
$$ 28842916 28772793 29117936 29077431 29430056 29893008 30842674 31851348 32784541 32920177 32908607
6506C2908607q7799R4501M27382M56187Q32636R54427J445388K001841K860150
$$ 32908607 32820808 32915309 33342691 33798878 34631514 35585941 37031329 39033170 41893320
6497D1893320L748803N335937O784060R112814J1395425J1725732P391455k28634
$$ 41893320 45642123 50978060 57762120 66874934 78270359 89996091 97387546 97158912
6489I7158912o983081r303457n107860J113057O328269J0629688J0305760K958208
$$ 97158912 90175831 80872374 75764514 76877571 83205840 93835528 104141288 107099496
6481A07099496o098564j1710124j1978420q691077n725245l502726k989746k851201
$$ 107099496 101000932 89290808 77312388 68621311 62896066 59393340 56403594 53552393
6473E3552393k558384k019278q25898J18082J140080J977285K452225K064128
$$ 53552393 50994009 48974731 48148833 48266915 49406995 51384280 53836505 55900633
6465E5900633J717990J841633K654903M763150Q147487J0643632R095457K416811
$$ 55900633 57618623 59460256 62115159 66878309 75025796 85669428 94764885 97181696
6457I7181696m914819r375576q152218k728500L221517P799528R833675N595737
$$ 97181696 92266877 82891301 74739083 72010583 75232100 83031628 92865303 98461040
6449I8461040l243268j1430517j4102331j1443646p381692m398049l323752l025663
$$ 98461040 95217772 83787255 69684924 58241278 50859586 46461537 43137785 40112122
6441D0112122l064082k658998k102270r61177l57246j75465j25402r73879j366120
$$ 40112122 37048040 34389042 32286772 31325595 30968349 30792884 30667482 29693603 28327483
6432B8327483j970496j639991j604788n56216l05644n3409L03485k23123r90478
$$ 28327483 26356987 24716996 23112208 22555992 22250348 22196939 22500424 22277301 21286823
6423B1286823j273060n92656n37482o15137j48056P5670k07031M4868m95037n45812
$$ 21286823 20013763 19421107 18883625 18268488 18120432 18196102 17989071 18033939 17538902 16993090
6413A6993090n09199j72062J54082J39235J36013M64756Q08734J136896R82345
$$ 16993090 16483891 16311829 16465911 16605146 16741159 17205915 18014649 19151545 20133890
6404B0133890R48254l13667j554771j446615o01836k96937J28769q4624J03413
$$ 20133890 21082144 20768477 19213706 17767091 17165255 16868318 16997087 16912463 17015876
6395A7015876j17850k67817j7409j45788r3152K78771M58336L85291K18959M02492
$$ 17015876 16898026 16630209 16612800 16467012 16373860 16652631 17110967 17496258 17715217 18117709
6385A8117709N34825O61708Q50190J099583N99710K12497K41084L89071R12453
$$ 18117709 18652534 19314242 20164432 21264015 21863725 22076222 22317306 22706377 23618830
6376B3618830J608655J554079J813624J771730K209793M256206O151783Q354757
$$ 23618830 25227485 26781564 28595188 30366918 32576711 36832917 42984700 51339457
6368E1339457R328663N681673k204174p632648p112831l458120J40184L255342
$$ 51339457 60668120 66349793 64145619 56512971 49400140 45942020 46082204 49337546
6360D9337546N645733N398992M42532o151528q560092o886845m105119k439126
$$ 49337546 54983279 60382271 60824803 54673275 46113183 39226338 35121219 32682093
6352C2682093j409464o08864m84725m1874K56270R97150J450320J726611K241597
$$ 32682093 31272629 30663765 30179040 30137166 30393436 31390586 32840906 34567517 36809114
6343C6809114K652693L728891N265351P037728R646654J1975925J1822251N997471
$$ 36809114 39461807 43190698 48456049 55493777 65140431 77116356 88938607 94936078
6335I4936078j419588q248011r722841o324993q05573M328731O746558N074854
$$ 94936078 93516490 85268479 75545638 69220645 68415072 72743803 79490361 84565215
6327H4565215n07725p158637j1855968j2038095q857908n393940l384492k148016
$$ 84565215 84057490 76898853 65042885 53004790 44146882 38752942 35368450 33220434
6319C3220434j206088r39012m98358m84328o17364l13729N07767J146504J623918
$$ 33220434 32014346 31075334 30576976 30092648 29475284 29161555 29669322 30815826 32439744
6310C2439744K000005K965693L953783N144388N558221K257298l400203o021425
$$ 32439744 34439749 37405442 41359225 46503613 52061834 54319132 50918929 44897504
6302D4897504m829516k301682j74301J607525L717540L040101j404104n901300
$$ 44897504 40067988 37766306 37592005 39199530 42917070 45957171 44553067 38651767
6294C8651767p033129n104161l266607j930526j317961m51293q8124j90718j4512
$$ 38651767 31618638 26514477 23247870 21317344 19999383 19548090 19459966 19269248 19254736
6285A9254736l39091m97985j179075n44133o34526q1062m6140j6664m14353m83858
$$ 19254736 18915645 18417660 17238585 16694452 16059926 15978864 15932724 15916060 15501707 15017849
6275A5017849p68010j154471q99162n34504l66242p20387o97524m31227o22151
$$ 15017849 14249839 13095368 12196206 11661702 11295460 10575073 9877549 9446322 8824171
6266H824171j29852l23904n00054m8610o4858q7031n7516n3437j160M32083P11905
$$ 8824171 8694319 8370415 7870361 7821751 7756893 7669862 7612346 7558909 7557749 7989832 8701737
6255H701737K24711k54233n51731l61401m49889l87804K2551K32338K67883o8420
$$ 8701737 8926448 8672215 8120484 7759083 7309194 6921390 6943941 7176279 7444162 7375742
6245G375742k93132p44207m91899l61550l63482K18497l22387k82308j17566m954
$$ 7375742 7082610 6338403 5846504 5484954 5121472 5339969 5017582 4735274 4617708 4612754
6235D612754J4518k94698k1309j8904J22005q8054j47033N531j91491L6409k87664
$$ 4612754 4627272 4332574 4311265 4292361 4414366 4326312 4179279 4184810 3993319 4029728 3742064
6224C742064J13771j62291J99333J35907l97113m0581P5202J24070Q071J27032
$$ 3742064 3855835 3693544 3892877 4028784 3631671 3591090 3666292 3790362 3798433 3925465
6214C925465j85107P18j28880m1613J29967j71187J42706R6581R0818l59786P5251
$$ 3925465 3740358 3741076 3612196 3570583 3700550 3529363 3672069 3768650 3859468 3499682 3574933
6203C574933j69946M8595l3235K2649q1623l1800L00318L1990o6642l21654k08323
$$ 3574933 3404987 3453582 3420347 3442996 3361373 3329573 3629891 3661881 3595239 3273585 3065262
6192C065262J15070m0544k94891L4256j14615J39293K154K64002k18849J28240
$$ 3065262 3180332 3139788 2844897 2879153 2764538 2903831 2905985 3169987 2951138 3079378
6182C079378k89393p118m4161K9979l98806Q1886O7865K06887L4095j14684Q88
$$ 3079378 2789985 2782867 2738706 2768685 2369879 2451765 2519630 2726517 2760612 2645928 2646816
6171B646816k77630l85011K00343P1691J51562j93912j01164M2009j54918Q9598
$$ 2646816 2369186 1984175 2184518 2256209 2407771 2213859 2112695 2154704 1999786 2089384
6161B089384N3596k11595J2676j92520k09352L29471P838J10786k07584K6750
$$ 2089384 2142980 1931385 1944061 1751541 1542189 1871660 1879498 1990284 1782700 1809450
6151A809450M8908n9764m1813J23063p2121N630J158J12465J2037J53068j73034
$$ 1809450 1858358 1798594 1756781 1879844 1807723 1813353 1814511 1926976 1939013 2092081 1919047
6140A919047k44771J29884j48126l638J67570r5665J09519M6755j16686m2945
$$ 1919047 1674276 1804160 1656034 1652396 1819966 1724301 1833820 1880575 1763889 1720944
6130A720944J78808M3774q0704K46596p7374k780j49271J57808j01201P7424J7282
$$ 1720944 1899752 1943526 1862822 2109418 2032044 2029264 1879993 2037801 1936600 2014024 2031306
6119B031306j54230l4850j9287J87936J76840J10808n0587J52961P0932J62030
$$ 2031306 1877076 1842226 1822939 2010875 2187715 2298523 2247936 2400897 2471829 2633859
6109B633859k43644k36758P6730j30907m0056j6654k5722K63468J74323P4665
$$ 2633859 2390215 2153457 2230187 2099280 2059224 2042570 2016848 2280316 2454639 2529304
6099B529304k13515J65946K50302j5006k77265J74905J59855R4138L89250O0178
$$ 2529304 2315789 2481735 2732037 2717031 2439766 2614671 2774526 2868664 3257914 3318092
6089C318092Q5554K13987l07704n9409O2933p9132K14226L28264j42092K24077
$$ 3318092 3403646 3617633 3309929 3250520 3313453 3234321 3448547 3776811 3634719 3858796
6079C858796m32702k73407j61070k68920P5863j60775M4578k02486r2786J63155
$$ 3858796 3426094 3152687 2991617 2722697 2798560 2637785 2682363 2479877 2387091 2550246
6069B550246Q4831J9693J66449k19702M3409M40224J60968K56231J45075N54502
$$ 2550246 2635077 2654770 2821219 2601517 2644926 3085150 3246118 3502349 3647424 4201926
6059D201926M53205j36652l22045k88680l42328J01372N0569r4260N92634J98473
$$ 4201926 4655131 4518479 4196434 3907754 3565426 3666798 3717367 3623107 4215741 4414214
6049D414214j68870l56771j64517n62843l69320j01616l9085j1335j84245K2743
$$ 4414214 4245344 3888573 3724056 3161213 2791893 2690277 2651192 2639857 2455612 2478355
6039B478355J82635j68362J70625k50245J6348J7615p922K60051L9717L93943
$$ 2478355 2660990 2492628 2663253 2413008 2429356 2446971 2439049 2699100 2738817 3132760
6029C132760K15805J40614L40164j66196l55413p0786j69708j8202K88806J82453
$$ 3132760 3348565 3489179 3829343 3663147 3307734 3236948 3067240 3049038 3337844 3520297
6019C520297K71711o435n11306k95281j48591k41418j27583P2942j85439o9406
$$ 3520297 3792008 3785573 3274267 2978986 2830395 2588977 2461394 2534336 2348897 2279491
6009B279491j4970O5239k6375M9821K8326K17120j65300J37557K40294J57892
$$ 2279491 2264521 2329760 2303385 2353206 2381532 2598652 2433352 2570909 2811203 2969095
5999B969095J14004L01382M91435O94378j36165l39275l85708m30608l64600L67726
$$ 2969095 3083099 3384481 3875916 4570294 4434129 4094854 3709146 3278538 2913938 3281664
5989C281664j20118l00067J57932j20355J14082K02927K11739M03013O16435O2928
$$ 3281664 3161546 2861479 3019411 2899056 3013138 3216065 3427804 3830817 4447252 4510180
5979D510180j50695l20690k69743n91610l23298j70893j12152J73935n9338j78646
$$ 4510180 4359485 4038795 3769052 3177442 2854144 2683251 2571099 2745034 2685696 2507050
5969B507050N3032L01826k9662P9902Q4466l8030o3965l11569k12085k41374M363
$$ 2507050 2560082 2861908 2832246 2912148 2996614 2958584 2894619 2583050 2370965 2129591 2133954
5958B133954L1944r9755o5974j72915j06095N32942J36147J31705K6923m7021
$$ 2133954 2165898 2066143 2000169 1827254 1721159 2254101 2390248 2521953 2548876 2501855
5948B501855k42037o4458j84060l10900L07481k05554J04856p925j93307J79521
$$ 2501855 2259818 2195360 2011300 1700400 2007881 1802327 1907183 1899258 1705951 1885472
5938A885472M6429J2943p5269k06404j78419j83186j2778j9108k1637j1811K516
$$ 1885472 1931901 1944844 1869575 1663171 1484752 1301566 1288788 1269680 1248043 1236232 1238748
5927A238748J2767j48293J67455k36512p7649j076j84115M0309P9593k31494J83414
$$ 1238748 1251515 1103222 1270677 1034165 956516 955440 771325 811634 891227 659733 843147
5916H43147K7019M4195k55344J30554M5898N6262j74866j6767J73491K03687k37766
$$ 843147 870166 914361 659017 789571 835469 891731 716865 700098 873589 1077276 839510
5905H39510r6188M8526l7874j49770r2502P5640q8846K09610j29286Q429p1115
$$ 839510 743322 791848 753974 604204 511702 587342 498496 708106 578820 587249 516134
5894E16134r338k9711J0574J51962K8581j55583K20500j06848L4080j3923l9699
$$ 516134 506796 477085 487659 639621 668202 512619 733119 626271 660351 646428 606729
5883F06729K17170k25166J08387r007j51132M0788M0678l1605k96289J64247J30493
$$ 606729 823899 598733 707120 698113 546981 587769 628447 596842 300553 464800 595293
5872E95293K27385k01536M7668l26327M4606L14209j55780L9074o5250K09666
$$ 595293 822678 621142 668810 342483 387089 701298 545518 584592 519342 729008
5862G29008K8239J65829j22920k24206J17617j1207K5730P9191k1943k21089k42364
$$ 729008 757247 923076 800156 575950 693567 682360 708090 787281 765338 544249 301885
5851C01885Q3481L38018N8096k08442J20303P0116K0622P2728N6292J2417m7882
$$ 301885 385366 723384 781480 573038 693341 763457 784079 856807 913099 925516 877634
5840H77634m1186J2396K07708J72001n3438J01085K8005j38062o8918j23345p3412
$$ 877634 836448 848844 1056552 1228553 1175115 1276200 1304205 1166143 1097225 973880 900468
5829I00468L199m8103N5179p5676K9701j94438J62430m5972Q1012k7467q4247
$$ 900468 903667 855564 910743 835067 864768 670330 832760 786788 867800 840333 756086
5818G56086J62504j11313n3592j5069O7771j25763J67883R6711P3244j20476L7181
$$ 756086 918590 807277 753685 738616 806387 680624 848507 945218 1018462 897986 935167
5807I35167j33680L83547j64409k00937L1175L35698k83944k06309K82656K65172
$$ 935167 801487 1185034 1020625 819688 850863 1186561 902617 696308 978964 1244136
5797A244136j96517p0817j21965r2958M870j70947L17677n1212M7075k8371N0228
$$ 1244136 1047619 976802 854837 761879 766749 595802 913479 862267 909342 880971 931199
5786I31199J07268j54792J47030J70083j56821J0608j79432J3322J82654N3631
$$ 931199 1038467 883675 1030705 1200788 1043967 1054575 875143 888465 1071119 1124750
5776A124750j96577k01494K48003p2656j45272J65985L4524J7521M6890M8732
$$ 1124750 928173 726679 974682 902026 756754 922739 957263 974784 1021674 1070406
5766A070406P309n7668m2188M7084N3227k74856J35927m2286l1891j08712R1540
$$ 1070406 1077715 1020047 977859 1024943 1078170 803314 939241 896955 865064 756352 847892
5755H47892n23601J29256Q3649n4582K52978l15583J66882k476K90101k59181
$$ 847892 324291 453547 537196 482614 735592 420009 586891 584415 874516 615335
5745F15335N0576J61890k8413n1895K21839m100j34028j25124K15930L9175j20008
$$ 615335 665911 827801 799388 747493 969332 965232 831204 706080 922010 961185 841177
5734H41177j75017k2956K58721j19936J24873K83118k51418j16896p1342J71797
$$ 841177 666160 643204 901925 781989 906862 1189980 938562 821666 750324 922121
5724I22121L9103J57383k9615j47767K3345K07588J77517p3956r4104r2696j41831
$$ 922121 961224 1118607 1088992 941225 964570 1172158 1349675 1275719 1181615 1088919 947088
5713I47088L3829J63962K8259o079l9520j80356l11507P8883k74040o8813K46155
$$ 947088 980917 1144879 1173138 1167059 1127539 947183 635676 714559 440519 371706 617861
5702F17861P4139J94102J43927k24116K1440J13420P3026N3361m3610N7953j01539
$$ 617861 692000 886102 1030029 805913 827353 940773 1013799 1067160 1023550 1081503 979964
5691I79964K31460k34239j56565J18499J65890N9795k66303R9662J8057N1646
$$ 979964 1211424 977185 820620 939119 1105009 1164804 898501 998163 1016220 1067866
5681A067866M5940K14028k2115k26470j22578J19945K64953k58726k07287K06025
$$ 1067866 1113806 1327834 1305719 1079249 956671 1076616 1341569 1082843 875556 1081581
5671A081581J89527q8541l52931j00740L45811K3105P6966J76526m4406j31825
$$ 1081581 1271108 1182567 829636 728896 1074707 1097812 1174778 1351304 1306898 1175073
5661A175073K22120P4104k52447k0077J44282J50395L9016j02075q9483q4142
$$ 1175073 1397193 1471297 1218850 1198773 1343055 1493450 1532466 1430391 1340908 1256766
5651A256766Q656J49452K7763k66812k29619J00492k87102N0074J80074J30278
$$ 1256766 1265422 1414874 1442637 1175825 946206 1046698 759596 809670 989744 1120022
5641A120022Q3072J022P8689J13441j07744K38873k34450J5749J59232n8506M5113
$$ 1120022 1203094 1204116 1282805 1396246 1288502 1527375 1292925 1308674 1467906 1409400 1454513
5630A454513j5668O7l612j3730k16862r7839L17648j15289j08005K09585l39012
$$ 1454513 1438845 1438912 1435300 1421570 1204708 1106869 1424517 1309228 1201223 1410808 1071796
5619A071796o3157J55097J8788P5530j46800q8871L24813q4698M0011N7804J13307
$$ 1071796 1008639 1163736 1182524 1258054 1111254 1022383 1347196 1262498 1302509 1360313 1473620
5608A473620j30090l4954m7083q9681p2583J22568o0678L4917J05662J17088j60354
$$ 1473620 1343530 1308576 1261493 1171812 1099229 1221797 1161119 1196036 1301698 1418786 1258432
5597A258432j51214J79792K68025J24785k29876l31391J48597j71201M4792R7950
$$ 1258432 1107218 1287010 1555035 1679820 1449944 1118553 1267150 1095949 1140741 1238691
5587A238691k72181J80059p468J04747O5697K6513k62668J04397L8256O336q824
$$ 1238691 966510 1146569 1139101 1243848 1309545 1336058 1073390 1177787 1216043 1222379 1213555
5576A213555j11499P1837q6311R1744q8246J36543K71961j40720k9814L7588l591
$$ 1213555 1102056 1173893 1087582 1179326 1091080 1227623 1499584 1358864 1329050 1366638 1363047
5565A363047K74354J90280Q7670J13402l27708J16243J13442n3119L71505k4629
$$ 1363047 1637401 1827681 1915351 2028753 1701045 1817288 1930730 1877611 2249116 2224487
5555B224487J24211r9701k83622K38064j44693p31o7346J03146L3459m51807j67933
$$ 2224487 2348698 2248997 1965375 2203439 2058746 2058015 1990669 2093815 2127274 1675467 1507534
5544A507534K95370L7456L4797J33950N5236L0703L16348L0931O0484j46959L07637
$$ 1507534 1802904 1840360 1875157 2009107 2064343 2095046 2411394 2442325 2502809 2355850 2663487
5533B663487K96181J3901p77k872k1030o3109J92635m48338l3352n3302M9975
$$ 2663487 2959668 2973569 2972792 2969920 2948890 2885781 3078416 2630078 2596726 2543424 2593399
5522B593399k28841Q3264r933l62570l40102R6137j06908J10429K95169j89782
$$ 2593399 2364558 2447822 2437889 2075319 1735217 1831354 1724446 1834875 2130044 1940262
5512A940262M9585J28182J49498J58296M7225p8124j76J04582n9757m1970j03924
$$ 1940262 1989847 2118029 2267527 2425823 2473048 2394924 2394748 2499330 2439573 2397603 2293679
5501B293679l09781K32888j63556k40718k46861J7744J80831n1171l26829q5094
$$ 2293679 1983898 2216786 2053230 1812512 1565651 1583395 1764226 1713055 1386226 1301132
5491A301132r2125J68147M8513j25853k0143J69298L2663j33830J06946J84215
$$ 1301132 1209007 1377154 1425667 1299814 1279671 1448969 1481632 1347802 1454748 1638963
5481A638963N0197j0515K00458k00313K15975J70959m6162J73871L12629j30636
$$ 1638963 1689160 1678645 1879103 1678790 1894765 2065724 2019562 2193433 2506062 2375426
5471B375426N099R1560p4177p6321j04849k1611L2342K77047k69813j11224N5773
$$ 2375426 2380525 2472085 2397908 2321587 2216738 2195127 2227469 2504516 2234703 2123479 2179252
5460B179252J41344q1993K04566J54624K30756k39628Q3310K71076J18562K78830
$$ 2179252 2320596 2238603 2443169 2597793 2828549 2588921 2672231 2943307 3061869 3340699
5450C340699j2970R9079O3275K03224j76208J67300K74089O0740M11475L59816
$$ 3340699 3327729 3426808 3490083 3693307 3517099 3684399 3958488 4019228 4430703 4790519
5440D790519R8134M33092O83173J039391J458444K099828K583540K270402L47208
$$ 4790519 4888653 5321745 6004918 7044309 8502753 10602581 13186121 15456523 15803731
5431A5803731k054718k872476k257170j591642j097222o14296m65502n0214l5523
$$ 15803731 13749013 10876537 8619367 7027725 5930503 5316207 4850705 4800491 4764968
5422D764968j24424J22565K9148L67949J91207K89895N94939Q82093J126779J805728
$$ 4764968 4640544 4763109 4792257 5160206 5351413 5641308 6236247 7118340 8245119 10050847
5412A0050847K117520J940268N65255j945205k795362k264551j730684j107932
$$ 10050847 12168367 14108635 14673890 12728685 9933323 7668772 5938088 4830156
5404D830156o61092m28339m80044j56606l02099p5934j87479j13617l30958j51404
$$ 4830156 4169064 3740725 3260681 3104075 2801976 2726042 2538563 2424946 2093988 1942584
5394A942584k07157R0649j78354k38692J45689j28003J73157j15174j67266j86861
$$ 1942584 1735427 1826076 1647722 1409030 1554719 1426716 1599873 1484699 1317433 1130572
5384A130572J56495J29934k07114j02727P775k8603k3655P2541J0933o1226j27762
$$ 1130572 1287067 1417001 1209887 1107160 1114935 1086332 1062677 1135218 1146151 1084925 957163
5373I57163j67791r604k04185K2130J46955K90195j04794k56348P2670R9517K3152
$$ 957163 789372 779768 575583 597713 744668 1034863 930069 673721 746391 845908 869060
5362H69060j34351l1472L345k15569K27048n1022k04929K1124Q3086K63247k42050
$$ 869060 734709 703237 706582 491013 718061 667039 462110 483234 566320 829567 587517
5351E87517l80079M79053j50933j20759K2531J28385J03330j38336k0274j04823
$$ 587517 207438 686491 535558 414799 437330 565715 669045 530709 510435 405612
5341D05612K37843j34788j0553J1766Q2364r7142j54123K44969k8152j09589j19427
$$ 405612 643455 508667 498114 509880 592244 495102 340979 585948 557796 448207 328780
5330C28780j1289K63063O2741p5819O9752j11413j8399j42754j6606K63936j47927
$$ 328780 317491 580554 643295 567476 637228 525815 507416 364662 348056 611992 464065
5319D64065j4964j75530O9347j4358P3365j34857J96527Q6032J41644k41463j92941
$$ 464065 449101 273571 342918 328560 401925 267068 463595 549627 691271 449808 256867
5308B56867j7907J06220O9921j87917P8246K62404j8704q2279K64673j60379J5211
$$ 256867 238960 345180 415101 227184 305430 567834 549130 466851 731524 571145 586356
5297E86356j27193L02410j99407k44384J1498J35784J11248k25989j69J11044
$$ 586356 459163 761573 562166 317782 329280 465064 576312 350323 350154 461198
5287D61198k352j87371O5890Q2199j17818J25187K39328K941j03226N6524J9106
$$ 461198 458846 271475 337365 419564 301746 426933 666261 669202 565976 622500 641606
5276F41606j37056l0115j5391j23636k1116O6464M3794j63021P6047Q6455K77740
$$ 641606 504550 474435 459044 335408 314292 380756 424550 261529 337576 424031 701771
5265G01771n8983k13151O2586K13585j20923j89457M4391J36739m7204N4822p4380
$$ 701771 642788 429637 492223 705808 584885 395428 439819 576558 529354 584176 509796
5254E09796K29862n7397k12863L4465M1997j70092J71322o5602k6013L1679J63930
$$ 509796 739658 682261 469398 503863 545860 375768 547090 481488 455475 487154 651084
5243F51084m8445n7751l06j5598J79086r1577k3036j95296N5830K81055K7810
$$ 651084 602639 544888 544582 528984 708070 616493 593457 398161 453991 735046 762856
5232G62856J03967k42867j26822J78132p7511j0923J19453P414j15012J34625
$$ 762856 866823 623956 497134 675266 597755 586832 706285 713699 598687 733312
5222G33312J58048K87170j41636M8837j1526R5341J23268j51852o2409r2755j90197
$$ 733312 891360 1178530 1036894 1085731 1074205 1169546 1292814 1140962 1078553 985798 795601
5211G95601j24409q4011J28441j18580J7408K46304P4013j56890P4059R6750q743
$$ 795601 671192 587181 715622 597042 614450 860754 934767 777877 851936 948686 939943
5200I39943J61488k50677m8758J15573o6321J9861P2361J41279k35800j67954
$$ 939943 1101431 850754 801996 917569 851248 871109 943470 1084749 848949 680995
5190F80995J48481j04870l93257J10533j282L80827j307k4963l4390j99687N2597
$$ 680995 829476 724606 331349 441882 440600 821427 820120 795157 760767 561080 613677
5179F13677L39217p9015k64248K9861P3037O7163o7971Q7357J03475p3297j74186
$$ 613677 952894 873879 609631 639492 712529 779692 711721 799078 902553 829256 655070
5168F55070k10117J98336k18305l4627J51271j08479J4352J20037L9952m7924
$$ 655070 444953 643289 424984 390357 541628 433149 447501 567538 607490 559566
5158E59566m2490J59545J63757l44991J18062K99122l40741K53148P4606k30172
$$ 559566 517076 676621 840378 495387 613449 912571 571830 824978 899584 669412
5148F69412j86166K31671Q5878l09031K61545L07479k34252l06795K4992K1302
$$ 669412 483246 714917 800795 491764 753309 1060788 826536 519741 544733 566035
5138E66035k17405J50181J05860j15083K02439q4532K20045k1309N8436q3422
$$ 566035 348630 498811 604671 489588 692027 607495 827540 806231 864667 781245
5128G81245p6889j71761K53789o1984j4125p6058J08435j0041P7404k29904k87397
$$ 781245 704356 532595 786384 724400 710275 634217 742652 732611 810015 580111 292714
5117B92714K25707J51130J49173j00110Q438K50144j61988J30238j16163k07423
$$ 292714 518421 669551 818724 718614 727052 977196 815208 945446 829283 621860
5107F21860R3237j555k4867K37806k77526P1655J32838j5725L16125o779p6526
$$ 621860 715097 713542 688675 926481 648955 720610 853448 837723 1153848 1147069 1070543
5096A070543k56832n4143J01908J92602O9755n641J13577J38382J4494M9564J34023
$$ 1070543 813711 759568 861476 1054078 1123833 1118192 1231769 1370151 1384645 1434209 1568232
5085A568232J63427K28681K91772J18364M86k55954q0723j33618J01047J33695
$$ 1568232 1731659 1960340 2252112 2370476 2370962 2115008 2034285 1900667 2001714 2135409
5075B135409K06405P0218j80435l34928j62691m13176j79663l5333k3697K15916
$$ 2135409 2341814 2412032 2231597 1896669 1733978 1320802 1141139 1105806 1082109 1298025
5065A298025j87284J36106n7132k42356J20149R6584K25456j21034o3992O4866
$$ 1298025 1110741 1246847 1189715 947359 1067508 1164092 1389548 1268514 1204522 1269388
5055A269388k14155K4761P6305k01136O6969J35326Q7454Q0549J18479l0202k99480
$$ 1269388 1055233 1079994 1156299 955163 1022132 1157458 1244912 1325461 1443940 1413738 1114258
5044A114258j84736O6876J49494K04182L0063p4517r036J24806R5838k10309N8558
$$ 1114258 929522 996398 1145892 1350074 1380137 1305620 1296584 1421390 1517228 1306919 1365477
5033A365477J93514r4086K20642K2393p7020j37444J23229n4526K3785j42797
$$ 1365477 1558991 1464905 1685547 1707940 1630920 1493476 1616705 1562179 1585964 1443167
5023A443167K44944K41195n6719j79793j4657L64078k10797k93119J88416Q0106
$$ 1443167 1688111 1929306 1872587 1692794 1678137 2042215 1831418 1538299 1726715 1806821
5013A806821J87437n6760r1091J93455j15426k2579m485r2239n8170M1179j6809
$$ 1806821 1994258 1937498 1846407 2039862 1924436 1901857 1897372 1805133 1746963 1788142 1771333
5002A771333K40247J8330R9001q3312J58612j20870J12209L0752J73769J97904
$$ 1771333 2011580 2029910 2128911 2045599 2204211 2083341 2195550 2226302 2400071 2597975
4992B597975J9331j68164r1195K14235J99279k9614l38003j40596J08278j9692
$$ 2597975 2617306 2449142 2357947 2572182 2771461 2741847 2403844 2263248 2371526 2351834
4982B351834J71384m0750O2942K1085j16469p7505j82119j64757N644L42326j49379
$$ 2351834 2523218 2482468 2545410 2566495 2450026 2372521 2190402 2025645 2031289 2373615 2224236
4971B224236P0286J30878j21889K45075P2706M3975j50601M7613N7870J07084
$$ 2224236 2294522 2425400 2303511 2548586 2621292 2665267 2514666 2562279 2620149 2727233
4961B727233Q3186q3004P6975K01300k21584n9887m8325J9821K2083K58181O3702
$$ 2727233 2810419 2727415 2804390 3005690 2784106 2724219 2675894 2695715 2717798 2975979 3039681
4950C039681k375r7167l452O5131m3576L90570J48453p1223J69601O6178J33341
$$ 3039681 3037306 2940139 2936687 3001818 2958242 3348812 3497265 3426042 3595643 3661821 3795162
4939C795162K33118N5348J54349J48918n7816j7899J26404Q9091P6148J37928
$$ 3795162 4028280 4083628 4237977 4386895 4329079 4311180 4437584 4526675 4602823 4740751
4929D740751J64028R4725J50719O4113J56390j55596K10933K32116J40345J25252
$$ 4740751 4904779 4999504 5150223 5214336 5370726 5215130 5426063 5658179 5798524 5923776
4919E923776J07799P8184L85897K66278K67387L65294L01769J50288L05321M75524
$$ 5923776 6031575 6109759 6495656 6761934 7029321 7394615 7696384 7846672 8151993 8627517
4909H627517K82741J57189K55046K72163M28277M51086L56935L89398N03566J18886
$$ 8627517 8910258 9067447 9322493 9594656 10022933 10474019 10830954 11220352 11723918 11842804
4899A1842804J05276P19525L46919L42569L79909L25018L35500L33176K29798
$$ 11842804 11948080 12667605 13014524 13357093 13737002 14062020 14397520 14730696 14960494
4890A4960494K98975M17335N64782M35212M61106P89549N97645P87413N21913
$$ 14960494 15259469 15676804 16241586 16676798 17137904 17927453 18525098 19312511 19834424
4881A9834424R63901P44621P30394J000073J097611R47419R97933J138310Q95601
$$ 19834424 20798325 21542946 22273340 23273413 24371024 25318443 26316376 27454686 28350287
4872B8350287J310116J508014J513304J178002J826737J899703J476761J478188
$$ 28350287 29660403 31168417 32681721 33859723 35686460 37586163 39062924 40541112
4864D0541112J678440K159839K270615K297225K534375K984641L253264M335898
$$ 40541112 42219552 44379391 46650006 48947231 51481606 54466247 57719511 62055409
4856F2055409L848940M818790N333077O567415Q017862R907689J2636783J5696507
$$ 62055409 65904349 70723139 76056216 82623631 90641493 100549182 113185965 128882472
4848A28882472K0061299K8183986L9936895N4719460O4748215M8870359p662082
$$ 128882472 148943771 177127757 217064652 271784112 336532327 385402686 377740604
4841C77740604n5014247n1969051k4224811K868529K5236523M3671347M6646226
$$ 377740604 322726357 270757306 246532495 249401024 274637547 318308894 364955120
4834C64955120J0300618n2228449p8149345o1236369l8575413k4718133j7218661
$$ 364955120 375255738 323027289 244877944 183641575 145066162 120348029 103129368
4827A03129368j3746744j1103465r263512p286048n579675m794864l739204l118358
$$ 103129368 89382624 78279159 69015647 61729599 56149924 51355060 47615856 44497498
4819D4497498l044902k987888k829683k484602k118380j887220j504277j263985
$$ 44497498 41452596 38464708 35635025 33150423 31032043 29144823 27640546 26376561
4811B6376561j274373j423757j290377r27475j072331j073879r01209n73621p27404
$$ 26376561 25102188 23678431 22388054 21460579 20388248 19314369 18413160 17839539 17112135
4802A7112135p55718p08115n77133r68332n28711o71243n05246k91887o13982
$$ 17112135 16356417 15648302 15071169 14102837 13574126 12902883 12397637 12105750 11491768
4793A1491768o05759k60447l99534l69935n06134n06218m61667l29177j69797
$$ 11491768 10886009 10625562 10226028 9856093 9349959 8843741 8382074 8052897 7883100
4784G883100l07780m11057r2696k5543k96843j96769k97739p1860n0532j82378
$$ 7883100 7575320 7164263 7071567 7046024 6749181 6552412 6254673 6182813 6132281 5949903
4774E949903O5182j27868m12605k080l24304j46938m5402p43L8902k08548P2949
$$ 5949903 6015085 5887217 5474612 5472532 5148228 5001290 4955888 4955145 4994047 4785499 4858448
4763D858448m07297J90459k44629J16260j71041k24901k3788l7770r5007n1829
$$ 4858448 4451151 4641610 4396981 4513241 4342200 4117299 4093511 4055741 3960734 3908905
4753C908905j50596r9396J05205k74352o9545m1201j00800k49320Q0578r780Q3740
$$ 3908905 3758309 3658913 3764118 3489766 3420221 3379020 3278220 3028900 3109478 3099698 3183438
4742C183438M8319j68468n9658O3020L28446l5294j31109l65857k77429K24994
$$ 3183438 3231757 3063289 3003631 3066651 3395097 3359803 3228694 2862837 2585408 2810402
4732B810402j53490J17891o6397P4324j75528j37680r2810j57220J04964J96483
$$ 2810402 2656912 2774803 2708406 2782730 2607202 2469522 2376712 2219492 2324456 2520939
4722B520939j92134k28867Q3724L39907q3132k82527j30170P8188P3136l4431
$$ 2520939 2328805 2099938 2183662 2523569 2440437 2157910 2027740 2105928 2179064 2144633
4712B144633j32595L4775p5495p0076K92685L9832j95872O4307L8981N4744J42340
$$ 2144633 2012038 2046813 1971318 1901242 2193927 2233759 2037887 2102194 2141175 2195919 2338259
4701B338259Q3487L9430o1405J9255K1724J00066r1110J42864K2534K6100J63895
$$ 2338259 2421746 2461176 2399771 2419026 2440750 2540816 2449706 2592570 2615104 2641204 2805099
4690B805099j88342j99336k05137M8078j34454K78855j29357Q9611j47639k46030
$$ 2805099 2616757 2417421 2212284 2260362 2125908 2404763 2275406 2365017 2217378 1971348
4680A971348l4364J82295k60339j50967L5481O6557k23319n5788R2998J29367
$$ 1971348 1936984 2119279 1858940 1707973 1743454 1810011 1586692 1530904 1623902 1753269
4670A753269p6679j91489l9663N490L60637p6000j80335r1997k8498L802J53818
$$ 1753269 1676590 1485101 1445438 1450928 1811565 1735565 1555230 1463233 1434735 1438537 1592355
4659A592355r620J03248L6766P5686j63619O3872K40888j6974m26974M1287J14810
$$ 1592355 1582735 1685983 1722749 1798435 1634816 1698688 1939576 1922602 1495628 1536915 1651725
4648A651725Q9589J34812k3024k25762q0125J93437n3743j56859j15259J08917
$$ 1651725 1741314 1876126 1853102 1627340 1547215 1740652 1686909 1530050 1414791 1523708
4638A523708K01505j10019R5610p5797N093K65895R2708m4744J06872J18469J24531
$$ 1523708 1725213 1615194 1710804 1635007 1640100 1905995 1998703 1953959 2060831 2179300 2303831
4627B303831o4988j06433K32564L0921J83100L10273J76672J71967L29206K04482
$$ 2303831 2238843 2132410 2364974 2395895 2578995 2889268 3065940 3237907 3567113 3771595
4617C771595k2893j95352n59812j86455R3860J17202m1994K56879J37233J99747
$$ 3771595 3748702 3553350 2993538 2807083 2900943 3018145 2976151 3233030 3370263 3570010
4607C570010j17358o91564N0588l9190K42296J55333J44648O1869j82858l64483
$$ 3570010 3452652 2761088 2811676 2772486 3014782 3170115 3314763 3376632 3193774 2829291
4597B829291k32026l2661K4707L94829M19192l0589k58994l27180o18163k3937
$$ 2829291 2597265 2564604 2589311 2984140 3403332 3372743 3113749 2786569 2168406 2144469
4587B144469k72942q3459M8324r3622j79865R2875J95888k31548j59642R4606
$$ 2144469 1871527 1788068 1836392 1742770 1562905 1655780 1851668 1620120 1460478 1555084
4577A555084K07399q5835m4649l3082j50501L04326J62556l4205M41981J45422
$$ 1555084 1762483 1676648 1631999 1598917 1448416 1752742 1915298 1881093 2323074 2468496
4567B468496J00913K5460p125P3080k72829r5018L24421K67569K99600L4141K67954
$$ 2468496 2569409 2594869 2587744 2660824 2387995 2292977 2617398 2884967 3184567 3218708 3486662
4556C486662K68103K00916j14367n41970j75289J39823l50043R6141M13332K56774
$$ 3486662 3754765 3955681 3841314 3299344 3124055 3263878 2913835 3009976 3423308 3680082
4546C680082J15573m90396m24657k92028l89294k3897j00366k20208M7716J53352
$$ 3680082 3795655 3305259 2880602 2588574 2199280 2175383 2075017 1854809 1902525 2055877
4536B055877m9795m43874J2491O6488j08589o1237q644k26815L2980k97600J35302
$$ 2055877 2006082 1562208 1574699 1641187 1532598 1471361 1462717 1235902 1268882 971282 1106584
4525A106584P8119J9295j18151j41963J08022P6700k15096l28503J46720Q4317
$$ 1106584 1184703 1203998 1085847 943884 1051906 1128606 913510 585007 731727 816044
4515H16044J17540k30530n1343K28998L4644r0358J7120k78538L03105m8742J66198
$$ 816044 933584 703054 651711 880709 915353 824995 842115 563577 866682 817940 984138
4504I84138q9959j38650m8994N3127K06832k88044j57665L6446N7240M5532J11436
$$ 984138 894179 755529 706535 759662 966494 678450 520785 557231 614471 660003 771439
4493G71439l63326K15069K43772l9446O6750p4141j7865o8238R8990J81758j41982
$$ 771439 408113 623182 866954 827508 894258 820117 802252 734014 833004 1014762 872780
4482H72780j551o0520Q1535k45045j82139J6278Q3684J87522p3695K5741r3382
$$ 872780 871229 810709 892244 647199 465060 481338 565022 752544 678849 704590 611208
4471F11208j4165k2017r0002K24510j11496Q1907k25791j64898R2970K1966K32408
$$ 611208 597043 575026 485024 709534 598038 679945 454154 289256 382226 404192 636600
4460F36600j75582j67225L59366J16093p8585k56335k761J43417J43857l5752
$$ 636600 461018 293793 653159 769252 690667 434332 431571 574988 718845 683093
4450F83093p4447n7653j01065K22459J29661k29300o5557k4293J0313L7331P784
$$ 683093 608646 550993 449928 672387 802048 572748 507191 482898 493211 530542 538326
4439E38326n5007J66133Q4355j70978j72043K52072J01544m65009K58287J03896
$$ 538326 483319 649452 733807 562829 390786 642858 744402 279393 537680 641576
4429F41576J65022p7859m12520K4953q6977J17739K67307N4945q1742j70132j05644
$$ 641576 806598 728739 316219 341172 254195 371934 639241 694186 612444 442312 336668
4418C36668J16241M53987l1361j84527m2085Q1043J58989o7047P9851J94323r1538
$$ 336668 452909 906896 875535 691008 648923 729966 888955 821908 901759 1096082 1004544
4407A004544J48394j14135N5604K61261R244j44796J76631O6806n5657j21868
$$ 1004544 1152938 1038803 1094407 1355668 1364912 1220116 1396747 1463553 1407896 1286028
4397A286028L801q2402r9320K3531l03380R7691j73903k26955J17639J17013M5639
$$ 1286028 1289829 1207427 1108107 1131638 828258 925949 752046 525091 642730 759743 805382
4386H05382j42382j04797O1221k777l2495P7950j08678q7990K49665l04185j74338
$$ 805382 663000 558203 619424 616647 584152 662102 553424 465434 715099 410914 236576
4375B36576L71728R1426j3315o2321J42935k30161l2956n4824o1831K31184o988
$$ 236576 608304 699730 686415 624094 767029 536868 503912 449088 387257 618441 611453
4364F11453q6780k28098Q7418Q9127r813J48543k1135o2455O807J16592m0614
$$ 611453 524673 296575 383993 473120 463307 611850 590715 528260 535067 651659 611045
4353F11045m9901q4034K02168m7859J77532m7370J22123m2038j05773J21481N1140
$$ 611045 561144 477110 679278 631419 808951 761581 883704 841666 735893 857374 908514
4342I08514O5542j57112r7725J37141M5370L6688K4902L6779r7676j9082j21313
$$ 908514 974056 816944 719219 856360 901730 938418 963320 1000099 902423 883341 762028
4331G62028o8976q7053R9682k29097J96874j30007j35099N6913k0995n9059l8608
$$ 762028 693052 605999 705681 476584 673458 543451 408352 465265 444270 385211 346603
4320C46603M10123r7053j14240j85356J59405L1570J28231k21187J13782R8096
$$ 346603 756726 659673 545433 360077 519482 551052 679283 458096 571878 669974
4310F69974j03544K4654r6984n6208L09371j37725J05006j32016K0557O1367J68551
$$ 669974 566430 591084 494100 437892 747263 609538 714544 582528 603085 664452 833003
4299H33003o4010j36134l96575J35653J20405K47830J7425j95525k5894J00059
$$ 833003 768993 632859 236284 371937 492342 740172 757597 562072 536178 636237
4289F36237Q2615k52625P8134K53167p2059k4862r3138J12005R4636q1123N0983
$$ 636237 718852 466227 544361 797528 725469 700607 607469 719474 814110 732987 783970
4278G83970j34650l23343L12805o5428J1426N9893r5166R5657j06565k9371n2538
$$ 783970 649320 325977 638782 573354 584780 644673 549507 645164 538599 509228 456690
4267D56690L89475N5360N4369j01170L93379l1753k27646j28685J77270j98625
$$ 456690 846165 901525 955894 854724 1248103 1216350 988704 860019 1037289 838664
4257H38664K5083M1801K8798M6676m7049m9102j66845L36349N1590m62396l09360
$$ 838664 863747 905548 934346 981022 933973 884871 718026 1054375 1105965 643569 334209
4246C34209K69574M03449q9072j49771k68097k8471K34584L08424j24844j62756
$$ 334209 603783 1007232 918160 768389 500292 471821 706405 1014829 889985 727229
4236G27229M5765k2569L86815j83351j2580n658m2447k73836j35658K66683k37187
$$ 727229 772994 750425 1137240 953889 941309 935651 893204 619368 483710 750393 513206
4225E13206R0710L61346j60053n1022k24435J81876R5419L1704J23638j25399
$$ 513206 603916 965262 805209 754187 529752 711628 807047 838751 962389 836990
4215H36990k62557L9604K64445K0746q1604k9584K61561j92324k10063J70540
$$ 836990 574433 614037 878482 899228 817624 788040 1049601 857277 647214 817754
4205H17754J57161j73966R6028O4138j56795J2320p5196j5860P1624q4730n5111
$$ 817754 974915 800949 896977 961115 804320 816640 741444 725584 797208 712478 657367
4194F57367R9154K9057O7456J51269o9604p1432R7437j2557j42296J67507Q7623
$$ 657367 756521 785578 853034 1004303 934699 863267 960704 948147 805851 973358 1060981
4183A060981j09546K19671j05606j18150J00757J0869J28409k65603j55767p1009
$$ 1060981 951435 1171106 1065500 947350 1048107 1058976 1187385 921782 766015 695006
4173F95006p301P6519J17510J08306J73662R2624K36375l65271K10314J37956
$$ 695006 687705 764224 881734 990040 1163702 1256326 1492701 1127430 1337744 1475700
4163A475700l157J98642L0529M21494L03398J49851K28623L39177j5290J1003
$$ 1475700 1472543 1671185 1701714 2123208 2426606 2576457 2805080 3144257 3128967 3139970
4153C139970k16913k96339j98093J66539L93195K89680M1532l62141l01917m53772
$$ 3139970 2923057 2626718 2428625 2595164 2988359 3278039 3319571 2957430 2655513 2201741
4143B201741q7764M557l60149p5537j86641q0718K7563k33413o0208k65993L24002
$$ 2201741 2113977 2118534 1758385 1682848 1496207 1415489 1443052 1209639 1149431 883438 1207440
4132A207440k20931m2947J13113r5336J02298K611L27013k19603m6573J59395
$$ 1207440 986509 943562 1056675 961339 1063637 1066248 1393261 1173658 1127085 1286480
4122A286480l0888l2037P1965J91998J30284l81242q2745L68109r1861n2833J38394
$$ 1286480 1255592 1223555 1295520 1487518 1617802 1236560 1153815 1521924 1430063 1377230 1515624
4111A515624j406L27980l93404k8524M8926K3388O3540j36132k7386k921K00347
$$ 1515624 1514218 1842198 1448794 1420270 1469196 1492584 1556124 1419992 1392606 1389685 1590032
4100A590032M39927k5290J13252J18459j59507L42351M35098L00960J25044L1802
$$ 1590032 2029959 2004669 2117921 2236380 2076873 2419224 2854322 3155282 3280326 3312128
4090C312128J1573k33443k53832K07073K14364K09454o8122l27477n46676l20104
$$ 3312128 3323701 3090258 2836426 3043499 3257863 3467317 3399195 3071718 2525042 2204938
4080B204938j98209k98493j72369R4195j94393J17542J25624N1425O9294l16443
$$ 2204938 2006729 1708236 1535867 1630062 1435669 1553211 1678835 1730260 1799554 1483111
4070A483111J78497Q7036k3424m6613J80021J03674K90730J24982j75029j90801
$$ 1483111 1661608 1748644 1725220 1678607 1858628 1962302 2253032 2378014 2202985 2012184
4060B012184l36349N774K08354j95850j63918m4316k07414K7128K94687j5675
$$ 2012184 1675835 1681609 1889963 1694113 1530195 1485879 1278465 1305593 1600280 1584605
4050A584605k36534j00959r384q4295N1794K63836l07403n943K15341J0081J72261
$$ 1584605 1348071 1247112 1237728 1153433 1205227 1469063 1161660 1155717 1371058 1381139 1553400
4039A553400l76193n0180L1181r3774j905q9605J11086k47954K41081j76623P839
$$ 1553400 1177207 1127027 1158208 1064434 1062529 972924 1084010 836056 1077137 900514 908353
4028I08353O4172j22612Q1974p3841M2425J40173l88378Q9102Q4794l357K07404
$$ 908353 972525 849913 931887 858046 900471 1040644 652266 741368 826162 822805 1030209
4017A030209j32160j54428Q6917K44993n5663j12257m5370R7888k17849J43418
$$ 1030209 898049 743621 830538 1075531 1019868 907611 862241 960129 742280 885698
4007H85698O960J36816P0057k68041r3706K36024j59768n638K27542P2560o4957
$$ 885698 892658 1029474 1099531 831490 737784 973808 814040 808402 1035944 1108504 1043547
3996A043547j2867J51454l00703k62449K94196K3635K25557R780j82016K2384
$$ 1043547 1030680 1182134 881431 618982 913178 936813 1162370 1172150 990134 1012518
3986A012518o9709P7474j76902n6969k88736K36364J72177N1666L22j9459P6804
$$ 1012518 942809 1020283 843381 786412 497676 734040 906217 957883 958205 938746 1015550
3975A015550j232j25473j18811j0700J14335o0969o2247o8684J3552Q8670j6386
$$ 1015550 1014318 888845 770034 759334 873669 812700 750453 681769 695321 783991 767605
3964G67605J14216j21417J29684k35344J28056O7603K7329p3709o7463N6120J81561
$$ 767605 881821 760404 890088 654744 782800 850403 877732 804023 736560 792680 974241
3953I74241n1542l15070J13495J05446m673J01286j24986j7037M0931o6951L2432
$$ 974241 922699 607629 721124 826570 821897 923183 798197 781160 822091 755140 787572
3942G87572J7391O928q924P9084k3402P2580q6661j96817K9193K75491J5036m7763
$$ 787572 804963 811891 802967 882051 858649 931229 844568 647751 676944 952435 967471 919708
3930I19708n2638k3004j07775k96647L75861j01268Q8939K97428q6941M532k3238
$$ 919708 867070 844066 736291 439644 815505 714237 803176 1100604 1013663 1018195 994957
3919I94957J25769P864m0719j07742J10153l87982K18884j85910K85919M4863
$$ 994957 1120726 1128590 1087871 980129 1090282 702300 921184 735274 1021193 1066056
3909A066056k88062L10424q9812N1969r5244n4534l2028R8121N4429L58176l9915
$$ 1066056 777994 1088418 998606 1050575 955331 900797 868769 966890 1021319 1379495 1339580
3898A339580j66917J38601J50301K43990J39482O6309j88702p2904k40660j14964
$$ 1339580 1172663 1311264 1461565 1705555 1845037 1911346 1722644 1649740 1409080 1294116
3888A294116k7130K0326j83307J9655K04011m46181J0524J09600M4682j13066
$$ 1294116 1266986 1287312 1104005 1123660 1327671 881490 892014 1001614 1046296 933230
3878I33230o7518k55073o810J45993J47946J49913J31880j79924j88983N5545
$$ 933230 865712 610639 603829 749822 897768 1047681 1179561 999637 810654 866199
3868H66199K0632L536j1939J05298k19704J64514k02439J80745p1278J29590j69751
$$ 866199 886831 890367 878428 983726 764022 928536 726097 906842 835564 965154 795403
3857G95403O0538J89684k12877O2564J61605M2029j3855K8172j27611N4013k55668
$$ 795403 855941 1045625 832748 895312 1056917 1098946 1085091 1113263 985652 1039665 783997
3846G83997Q6529j0708j400J18728p5941n6409m8642m0139L4884K27753r4086
$$ 783997 870526 859818 858418 977146 901205 844796 796154 756015 790899 1018652 924566
3835I24566J24559j79135l07757M36094J70211r8303Q5193j38025J6406J94809
$$ 924566 1049125 869990 562233 998327 1168538 1070235 1155428 1017403 1033809 1228618
3825A228618j88177J96575p8537k92024K23211R4584j07090K00066j53245K0452
$$ 1228618 1040441 1237016 1158479 866455 1089666 1184250 1077160 1277226 1123981 1144433
3815A144433m9357j61782K44509R8084L2059j14290k37543J75562J00905J80895
$$ 1144433 1095076 933294 1177803 1275887 1307946 1193656 956113 1131675 1232580 1413475
3805A413475q5230k61873j18414j15423R6590N4023n533M31164j3691o9522J64568
$$ 1413475 1328245 1066372 947958 832535 929125 983148 977615 1408779 1395088 1325566 1490134
3794A490134q7193n2632q6482L6410k3224N7371n6843j29296J62196K39661j04990
$$ 1490134 1402941 1350309 1263827 1300237 1277013 1334384 1277541 1148245 1310441 1550102 1445112
3783A445112Q6133m1534p6763J38944n3753P6231j06587q8987J86397P1886n7790
$$ 1445112 1531245 1489711 1412948 1551892 1498139 1574370 1467783 1378796 1565193 1637079 1579289
3772A579289J44314M2338j85679k463J19492J96503j57425J4752R7619Q488J00047
$$ 1579289 1723603 1765941 1580262 1577799 1697291 1893794 1736369 1751121 1848740 1857228 1957275
3761A957275l27965p5531K98481K6211p7664J53587J92479R230K3809n4035j31783
$$ 1957275 1629310 1553779 1852260 1878471 1800807 1954394 2146873 2156103 2179912 2125877 1994094
3750A994094R9075J053P959O6305J41926O6895q1082L42699j0197r3886l3064
$$ 1994094 2093169 2094222 2102181 2168486 2310412 2377307 2296225 2638924 2628727 2534841 2501777
3739B501777k11461N53652K5820J0964J66709K33668j07034J08822j11099J62876
$$ 2501777 2290316 2843968 2869788 2880752 3047461 3281129 3174095 3282917 3171818 3334694
3729C334694K18741l9414j71772k5810J3028K4943l5124j23699R5452j6030k94363
$$ 3334694 3553435 3514021 3342249 3316439 3329467 3354410 3319286 3195587 3291039 3275009 2980646
3718B980646J32843O27044l04752K68794j12266L886Q5433J59720K3351K36898
$$ 2980646 3113489 3740533 3435781 3704575 3592309 3596195 3681628 3841348 3864699 4101597
3708D101597j8114j45772L52680P4504R1810J19407j92968j25765L7990K0271
$$ 4101597 4083483 3937711 4290391 4364895 4456705 4576112 4383144 4257379 4295369 4315640
3698D315640K36912k836j37953J61470j23443Q6637j71909J48658K17512r864
$$ 4315640 4552552 4549716 4411763 4573233 4449790 4536427 4364518 4513176 4730688 4720824
3688D720824N6436k11721R9113J64189J36459K59128K1263J19921K07222k5029
$$ 4720824 4777260 4565539 4664652 4828841 4965300 5224428 5245691 5365612 5572834 5547805
3678E547805K0375J0978n824J05529R7240j97585j72999j42259o6610J59505r8122
$$ 5547805 5568180 5579158 5573334 5678863 5776103 5578518 5405519 5263260 5196650 5356155 5258033
3667E258033j42316K54360J49964L17127k97995O4119L03095l5513L10060J3480
$$ 5258033 5115717 5370077 5520041 5837168 5539173 5603292 5906387 5870874 6180934 6194414
3657F194414K59480O5294N6610q210K5012q7548J15429K03931j10349Q818j07697
$$ 6194414 6453894 6519188 6575798 6567588 6592600 6505052 6620481 6824412 6714063 6722881 6615184
3646F615184o359J20289J81577o2601J47748k3757J34205J75476j34711m3328
$$ 6615184 6608825 6729114 6910691 6848090 6995838 6972081 7106286 7281762 7147051 7103723
3636G103723j0660J88935K1988J29234Q5059O9250J48206j40831N5158J40135
$$ 7103723 7093063 7281998 7303986 7433220 7518279 7587529 7735735 7594904 7650062 7790197
3626G790197n1686K64687k4545K76032K56268j19753K67370K26392K50584K94623
$$ 7790197 7738511 8003198 7978653 8254685 8510953 8391200 8658570 8884962 9135546 9430169
3616I430169Q3541P3724N89276L17380L39592J31266J25755J42175L03892K65909
$$ 9430169 9513710 9587434 10176710 10494090 10833682 10964948 11090703 11232878 11536770 11802679
3606A1802679J52190P0793L19035M13097j09500L70816K87440K27428L42101M5904
$$ 11802679 11954869 12025662 12344697 12757794 12648294 13019110 13306550 13533978 13876079 13921983
3596A3921983M1045J24779K66719N94395J87392Q75502L61378J18657Q9876J36579
$$ 13921983 13963028 14087807 14354526 14948921 15136313 16011815 16373193 16491850 16581726 16718305
3586A6718305L67318P040L62856K48939J34246R006Q1236J37526L85365q5086
$$ 16718305 17085623 17092663 17455519 17704458 17838704 17847710 17928946 18066472 18451837 18366751
3576A8366751m6478K22196J48419L11243K38335J82594O79779K80013K57056J54041
$$ 18366751 18320273 18542469 18690888 19002131 19240466 19423060 20102839 20382852 20639908 20793949
3566B0793949N40568O76265L37072N32416M0932J92874L61182J92162J59069K5160
$$ 20793949 21334517 22010782 22347854 22880270 22921202 23114076 23475258 23667420 23826489 23851649
3556B3851649L92408M49366K47936P34286N62225J24076M56270O34436P72839
$$ 23851649 24244057 24693423 24941359 25675645 26237870 26361946 26818216 27452652 28225491
3547B8225491M09415R22161N71762L33783Q29533P05213R09607Q25881P65876
$$ 28225491 28634906 29557067 30128829 30462612 31292145 31997358 32906965 33732846 34498722
3538C4498722J283400R32782J139069J444204J173738J374135J524693K016639
$$ 34498722 35782122 36714904 37853973 39298177 40471915 41846050 43370743 45387382
3530D5387382J973940K159254K620107K449987K761038L771293M174275N012909
$$ 45387382 47361322 49520576 52140683 54590670 57351708 61123001 65297276 70310185
3522G0310185N881170O679630O979816O954117P512877Q171451Q641079Q364888
$$ 70310185 76191355 82870985 89850801 96804918 104317795 112489246 121130325 129495213
3514A29495213O399795L986014J830483P46174M98804o88952k052594k100460
$$ 129495213 135895008 139881022 141711505 142457679 142956483 142267531 140214937 138114477
3506A38114477j138379N29951K771461M716704O884921Q669233J0444272J1315085
$$ 138114477 136976098 137506049 140277510 144994214 151879135 160548368 170992640 182307725
3498A82307725J1772201J2664191J3064025J2960683R549942K245229o019685
$$ 182307725 194079926 206744117 219808142 232768825 242318767 244563996 238544311
3491B38544311j0286301r763919q358865q688219j1497894j4031115j2423302
$$ 238544311 228258010 218494091 210135226 201447007 189949113 175917998 163494696
3484A63494696q983908m960189j593806M94270K421300L027752L441559L745615
$$ 163494696 154510788 149550599 147956793 148451063 150872363 153900115 157341674 161087289
3476A61087289M757419O166729O106893M438456J499789j045937j537453j10745
$$ 161087289 165844708 172011437 178118330 182556786 184056575 183010638 181473185 181362440
3468A81362440P74190M42463k31631J04664Q3393K9491j490055k093120p96755
$$ 181362440 182136630 182579093 182347462 182452126 182535519 182565010 181074955 178981835 178185080
3459A78185080P95224P5886l803156o834786o624165n320172l170915j700978
$$ 178185080 178980304 179056190 175253034 168418248 161794083 156473911 153302996 151602018
3451A51602018p78815J77258J025307L130798N647645R311123J2342274J4235519
$$ 151602018 150823203 151000461 152025768 155156566 160804211 170115334 182457608 196693127
3443A96693127J2797055R250170O604542O874190Q782053P814421M51564r013338
$$ 196693127 209490182 218740352 225344894 232219084 241001137 248815558 249267122 240253784
3435B40253784j4818713j5668115j2618133j0302719r696888r732494q671128
$$ 240253784 225435071 209766956 197148823 186846104 177149216 167416722 158745594
3428A58745594o836983m791648k268340K07651J797680K609016K253528J28019
$$ 158745594 151908611 147116963 144848623 145056274 146853954 149462970 151716498 151844517
3420A51844517j373851j324967k239301n429700j0049997j1908898j1209633r443790
$$ 151844517 150470666 149145699 146906398 141476698 131426701 119517803 108308170 98864380
3412I8864380q367042q555606q393737p646024o510712n449160m525398l845932
$$ 98864380 90497338 81941732 73547995 65901971 59391259 53942099 49416701 45570769
3404D5570769l069893l151108k517166k279566k024271j894946j721404j281400
$$ 45570769 42500876 39349768 36832602 34553036 32528765 30633819 28912415 27631015
3396B7631015j209855j390400q85819q27286q94639p93110p05050o00315o32129
$$ 27631015 26421160 25030760 24144941 23317655 22423016 21629906 20924856 20324541 19692412
3387A9692412m60464l17999o78160m55389n51426l05108n57480n88462k04224
$$ 19692412 19231948 18913949 18235789 17780400 17228974 16923866 16366386 15777924 15573700
3378A5573700l86120m27221l59506m66919l07152k02086n60224k50367m47119
$$ 15573700 15187580 14760359 14400853 13933934 13626782 13424696 12864472 12614105 12166986
3369A2166986m57503j66397J16799k01183l79867m4081q43945k21342j73981n2357
$$ 12166986 11709483 11543086 11659885 11458702 11078835 11034754 10190809 9969467 9795486 9743129
3359I743129N9299o6004l14810j60235j73715j99619j89811k29190j44827p9237
$$ 9743129 9802428 9736424 9421614 9261379 9087664 8888045 8698234 8469044 8324217 8244980
3349H244980k24990p8062O4380j39074o5204J14428O5128k28349m3823m57964
$$ 8244980 8019990 7941928 8006308 7867234 7802030 7916458 7981586 7753237 7709414 7251450
3339G251450j14764J16839J57920k02920j6868o6934j01288J87473K7249k24830
$$ 7251450 7136686 7253525 7411445 7208525 7191657 7124723 7023435 7210908 7238157 7013327
3329G013327K8038L154r8134k36808P4086k11081l664J38161K20991q1342j31929
$$ 7013327 7041365 7044519 6946385 6709577 6783663 6572582 6568918 6707079 6928070 6846728 6714799
3318F714799k15554J4994M9009K56679J17854k49126m50728j1334R7732o2685
$$ 6714799 6499245 6514239 6563248 6819927 6937781 6688655 6237927 6226593 6324325 6261640
3308F261640J74651R8223K2089k36124j19922j26665j5279Q6315N6288R6562J79654
$$ 6261640 6436291 6534514 6556603 6320479 6200557 6073892 6058613 6144928 6201216 6297778 6477432
3297F477432l4846l4640R1320q6062k23906J9766j3135K0840j7249R364Q3226
$$ 6477432 6442586 6407946 6499266 6413204 6189298 6209064 6195929 6216769 6199520 6208884 6292110
3286F292110p7842K62143N1624J07277K10359J96728o1244J6034L78942k31650
$$ 6292110 6214268 6476411 6528035 6635312 6845671 7042399 6981155 6997189 7376131 7144481
3276G144481J05404J16666p5262j37349n807K60204q3742j53324J5159K67022
$$ 7144481 7249885 7366551 7291289 7153940 7148133 7408337 7324595 7171271 7186430 7453452
3266G453452q949L8226k13030K97N03980J7317j04021J51881R5943K14229P4352
$$ 7453452 7444503 7482729 7269699 7269996 7773976 7791293 7687272 7839153 7935096 8149325 8223677
3255H223677P2577M287L69814R0718j42896J28686L36469N25518Q4297K08889
$$ 8223677 8296254 8300541 8670355 8761073 8618177 8746863 9083332 9608850 9693147 9902036
3245I902036L0520M8065K95642K82013N52851P30948O31450R49392O82716K69967
$$ 9902036 9932556 9980621 10276263 10558276 11111127 11842075 12473525 13422917 14105633 14375600
3235A4375600k640n04344o04613m70846l82122n40953k16410j4874J74817K37896
$$ 14375600 14372960 13868616 13264003 12793157 12411035 11870082 11653672 11638798 11813615 12051511
3225A2051511N30046j2089j52861J46205L2908K99329J91330J23712R995J45517
$$ 12051511 12581557 12569468 12416607 12562812 12595720 12895049 13086379 13210091 13220086 13365603
3215A3365603K43413L51092J93353K33692J23289J59241L24314L88432J66856
$$ 13365603 13609016 13960108 14153461 14387153 14510442 14669683 14993997 15382429 15549285
3206A5549285J38962K72376M25201J51967N00393K93712M06182K88949K51541
$$ 15549285 15688247 15960623 16385824 16537791 17038184 17331896 17738078 18027027 18278568
3197A8278568L33771Q30442M37403M78697O75010N31514M44617N87294M47673
$$ 18278568 18612339 19442781 19880184 20358881 21033891 21565405 22010022 22597316 23044989
3188B3044989P03647Q75582J317819J208230J473835J173833J579581J923420
$$ 23044989 23748636 24624218 25942037 27150267 28624102 29797935 31377516 33300936
3180C3300936K201310K464798L613634M817462O413178Q282828J2306683J5155233
$$ 33300936 35502246 37967044 41580678 46398140 52811318 61094146 73400829 88556062
3172H8556062J1984286m388088j1928447o791551R39962P654879J4621404K1676015
$$ 88556062 100540348 96152260 84223813 77432262 78372224 86027103 100648507 122324522
3164A22324522K5332003M396007k9331091k8471090j6122865n872491o26646M390201
$$ 122324522 147656525 152052532 122721441 94250351 78127486 72254995 71628349 76018550
3156G6018550P570386N225436r481621j7560251j3026447p925647n404503l612012
$$ 76018550 83588936 88814372 79332751 61772500 48746053 40820406 35415903 31803891
3148C1803891k564465k075574j796873j778205j245795j212507o20010n01649
$$ 31803891 29239426 27163852 25366979 23588774 22342979 21130472 20510462 20008813
3140B0008813q64583n35170m60469q20829l24964k16127l17695q4853j45911j35226
$$ 20008813 19144230 18609060 18148591 17327762 17002798 16786671 16468976 16384123 16238212 16102986
3130A6102986l31591n26825m88895l87721l74422p7809l10255j71865j59771o3675
$$ 16102986 15771395 15244570 14755675 14367954 13993532 13915723 13605468 13433603 13273832 13210157
3120A3210157P922k560l90995j66156j33823K8333Q7619k79734n0157n923L6403
$$ 13210157 13218079 13215519 12824524 12658368 12524545 12552878 12640497 12360763 12310606 12304683 12341086
3109A2341086j53390j49917p3029K76672J10973M84531J58334L17717L24151J339
$$ 12341086 12187696 12037779 11964750 12241422 12352395 12836926 12995260 13312977 13637128 13638467
3099A3638467k1584o3118j74329j03743K95651L70879L51702J180407K09142o06675
$$ 13638467 13616883 13553765 13379436 13275693 13571344 13942223 14293925 15474332 15683474 15076799
3089A5076799r52269j27922J47014j44844j5979K33603p9185j30767m02278k55162
$$ 15076799 14124530 13996608 14143622 13998778 13982799 14216402 14137217 14006450 13604172 13349010
3079A3349010q6081k60000j93519j35076J64212K60920o5002J09095J47963L95356
$$ 13349010 13262929 13002929 12809410 12674334 12838546 13099466 13034464 13143559 13291522 13686878
3069A3686878l4666L8899Q4116K0483R8508m19629M5992j69831K6587L03186J88220
$$ 13686878 13652212 13691111 13775227 13795710 13894218 13474589 13520581 13350750 13377337 13680523 13868743
3058A3868743K03373J32257K02446Q4516K9910L01565L60738K24890J90501j23158
$$ 13868743 14072116 14204373 14406819 14491335 14521245 14822810 15183548 15408438 15598939 15475781
3048A5475781P8006J29081L95038J31444J35404L24951J86241J64674L63703M88107
$$ 15475781 15553787 15682868 16077906 16209350 16344754 16669705 16855946 17020620 17384323 17872430
3038A7872430K35472L06848O29663P5458m2965J74334N67651K39388M21585O35899
$$ 17872430 18107902 18414750 19044413 19119871 19076906 19251240 19818891 20058279 20479864 21115763
3028B1115763L19664K37096L55367K39903M10652R35200K97264M76006M57981
$$ 21115763 21435427 21672523 22027890 22267793 22678445 23613645 23910909 24386915 24844896
3019B4844896N71372P86725Q11289L94010O89613O89081Q34107J049509P89100
$$ 24844896 25416268 26202993 27014282 27408292 28097905 28786986 29621093 30670602 31459702
3010C1459702J152844J081178J211704J147859J061399J658008J737347K370133
$$ 31459702 32612546 33693724 34905428 36053287 37114686 38772694 40510041 42880174
3002D2880174L122328L249370L233581K653805K018436J533495O98478R91863
$$ 42880174 46002502 49251872 52485453 55139258 57157694 58691189 59389667 60381530
2994F0381530q1051j68304R71741J600546K926001M278399M270625L327296K135952
$$ 60381530 60300479 60132175 61103916 62704462 65630463 69908862 74179487 77506783 79642735
2985G9642735K029267K386740K626441L428705L470756L622615L627510L349287
$$ 79642735 81672002 84058742 86685183 90113888 93584644 97207259 100834769 104184056
2977A04184056K696262J710613P06403n11031o36981L58803K392781M974664P622643
$$ 104184056 106880318 108590931 109297334 108786303 108149322 108508125 110900906 115875570 123498213
2968A23498213R488583R104287N097291k40862k205289n63696J463557J663739
$$ 123498213 132986796 142091083 147188374 146947512 144742223 144178527 145642084 147305823
2960A47305823M33084p75544o34425J369430K743001K449060L38240l179290l704632
$$ 147305823 147738907 146963363 146328938 147698368 150441369 152890429 153228669 150049379 146344747
2951A46344747j716732J570127M750706P445374Q752771P886017M608479J079767
$$ 146344747 144628015 146198142 150948848 158394222 167146993 175033010 179641489 180721256
2943A80721256O30527K224193L601208L398317O36380j626138k136868j895264
$$ 180721256 181351783 183575976 187177184 190575501 191211881 189585743 187448875 185553611
2935A85553611l264016m766175m396188l524465j542508J410477M456290P241792
$$ 185553611 182289595 177523420 173127232 169602767 168060259 169470736 173927026 181168818
2927A81168818Q926945P930922N537155M089013K583614J648675J509055J106801
$$ 181168818 190095763 198026685 203563840 207652853 210236467 211885142 213394197 214500998
2919B14500998q70437m766219r009748j0620381q221685m586160j98686L609779
$$ 214500998 213630561 208864342 199854594 189234213 181012528 176426368 176227682 179837461
2911A79837461N659300N803701L847589J326738R38650Q74783O94464q42158l800547
$$ 179837461 185496761 191300462 195148051 196474789 197413439 198288222 198982686 198140528 194339981
2902A94339981n135935l183939p27081o94970n096396j0223147j1274337q863208
$$ 194339981 189204046 186020107 185293026 184598056 179501660 169278513 158004176 149140968
2894A49140968n593050j935437K010036L834826L199606L85521k522101l302304
$$ 149140968 143547918 141612481 143622517 147457343 150656949 151042470 148520369 145218065
2886A45218065k751548k982608l091883l829143l212198r35294J058788K182835
$$ 145218065 142466517 139483909 136392026 132562883 129350685 128415391 129474179 131657014
2878A31657014n64934o402396j0267741j0309684p544879m627801j948241M42693
$$ 131657014 131092080 124689684 114421943 104112259 96567380 91939579 89991338 90434031
2870I0434031J125836L78077k289830l604370m165336m118125l677016l080047
$$ 90434031 91559867 91937944 89648114 86043744 81878408 77760283 74083267 71003220
2862G1003220k853807j948411j892239k015216k200263k743993l844090m362015
$$ 71003220 68149413 66201002 64308763 62293547 60093284 57349291 53505201 49143186
2854D9143186l576602k226747j001280m00053o26833j355314j952595j617349
$$ 49143186 45566584 43339837 42338557 41938504 41311671 39956357 38003762 36386413
2846C6386413j362610r01968j701234k504420k383423k473996j823243j996811
$$ 36386413 35023803 34121835 32420601 29916181 27532758 25058762 23235519 21238708
2838B1238708r96752r41014q66023p68586p32495j045912p23321k81235l47717
$$ 21238708 20241956 19300942 18434919 17666333 16933838 15887926 15164605 14883370 14535653
2829A4535653p08335n42914l89793l45148j34939k89837j98022r7934m29053k99766
$$ 14535653 13827318 13284404 12894611 12549463 12414524 12124687 11926665 11828731 11399678 11099912
2819A1099912m07847j11589k19799k12315q1308j9329j03004j96199n5965l77131
$$ 11099912 10692065 10580476 10360677 10148362 10067054 10047725 9944721 9748522 9692557 9315426
2809I315426k11721m3714J2809N4901j39910o0444j33385N7217k35550l95647
$$ 9315426 9103705 9059991 9072800 9127701 8987791 8927347 8793962 8851179 8615629 8219982
2799H219982J0759n1870M7911j76001J37612q66J04820J87643m16029N8514O8442
$$ 8219982 8230741 8178871 8226782 8050781 8188393 8187527 8292347 8479990 8063961 8122475 8190917
2788H190917j04818m9117j7569R6659L4959J29037L2433Q11m0075l35370Q4877
$$ 8190917 8086099 8036982 8019413 8116072 8151031 8280068 8312501 8313312 8273237 7937867 8022744
2777H022744J89942P4017J7115L48170N6499j02021k25808p8055n0122j84251
$$ 8022744 8212686 8286703 8303818 8651988 8708487 8606466 8380658 8302603 8252481 8068230
2767H068230o4950R3818J45051j35054k99956j7253K1125N3244J30869J65566
$$ 8068230 8003280 8097098 8242149 8107095 7807139 7789886 7811011 7864255 7995124 8160690
2757H160690r0965j15729K87357N8012k17847j2842j2244j43482J03868J23793
$$ 8160690 8069725 7953996 8241353 8299365 8081518 8068676 8056432 7912950 8016818 8140611
2747H140611K56229J00937L5198K24818L34079j10887J12024j0000J70952K47282
$$ 8140611 8396840 8497777 8532975 8757793 9091872 8980985 9093009 9083009 9253961 9501243
2737I501243K2601K31921K48060J44706j17030r5117j23687j78030j79229K09855
$$ 9501243 9523844 9755765 10003825 10148531 10031501 9936384 9812697 9634667 9455438 9665293
2727I665293J59449L17635o6367q2725N932k7164p8010j49363L59866j93856j9298
$$ 9665293 9824742 10142377 10076010 9993285 9999217 9972053 9894043 9744680 10104546 9910690 9891392
2716I891392J64581M8726K00826L98557R9972j18782M40905M59320L65353L61158
$$ 9891392 10055973 10104699 10305525 10704082 10804054 10685272 11126177 11585497 11950850 12312008
2706A2312008L00977M01692M47659K52760O57775R33283L72575P27749Q07732
$$ 12312008 12612985 13014677 13462336 13715096 14372871 15306154 15678729 16406478 17214210
2697A7214210L74227M40873M07773M30978J50464j05902J45639l82170p02963
$$ 17214210 17588437 18029310 18437083 18868061 19018525 18912623 19058262 18676092 17973129
2688A7973129q38967q79919p14478q78520q32944l95192o12234j018244o85921
$$ 17973129 17134162 16254243 15539765 14661245 13828301 13433109 12820875 11802631 11116710
2679A1116710n29385q51110k46471l07866l62209k99588m5324m14815j12631l53500
$$ 11116710 10587325 9736215 9489744 9181878 8819669 8520081 8474757 8059942 7947311 7593811
2669G593811j11485m69707j70204j9455k67725l11832j31228M4347M1765k00496
$$ 7593811 7482326 7012619 6842415 6822960 6555235 6243403 6112175 6156522 6198287 5997791
2659E997791j81785j09630k69535j07908P557L4727J04815j95814o9843M5890
$$ 5997791 5816006 5706376 5436841 5328933 5336490 5371217 5476032 5280218 5210375 5256265
2649E256265l59868O173j61591M0032j13187J86762j83868j11155J78867l58001
$$ 5256265 4896397 4902570 4740979 4781011 4667824 4854586 4670718 4559563 4738430 4380429
2639D380429Q6430J04932j90441l8023Q3788o9571o471r0160o5474O1839l95058
$$ 4380429 4466859 4571791 4381350 4343327 4427115 4357544 4351073 4260913 4195439 4257278 3862220
2628C862220K3098N2927r0804j34119M5406n2972j19779o011J1881J23488J36782
$$ 3862220 3885318 3938245 3847441 3713322 3758728 3705756 3585977 3579966 3591847 3715335 3852117
2617C852117l84976J40085K8491J17995J80544j42112J28995j06981q0j33881
$$ 3852117 3467141 3607226 3635717 3753712 3934256 3792144 3921139 3814158 3814078 3680197
2607C680197l29322J51270P7398N5315r240K6333j19551L74406r9983j64804J45230
$$ 3680197 3350875 3502145 3579543 3634858 3625618 3651951 3532400 3906806 3806823 3642019 3787249
2596C787249J0556K06082p4203J34622r7303q9542n2913J51277K48355N2278r5859
$$ 3787249 3797805 4003887 3929684 4064306 3967003 3877461 3824548 3975825 4224180 4276458 4180599
2585D180599n469K13836r8575J24974k68086q4745K05507K82382j2482o5051J67486
$$ 4180599 4175130 4388966 4290391 4415365 4147279 4062534 4268041 4550423 4537941 4472890 4640376
2574D640376k4537m7168K62853k4396q3157q0624j52079K02511J0681J58201O3593
$$ 4640376 4615839 4568671 4831524 4807128 4723971 4643347 4491268 4693779 4704460 4862661 4926254
2563D926254l8221J96345K44694p6450K37675M51241n4124j981J57951J51213
$$ 4926254 4888033 5084378 5329072 5252622 5490297 5941538 5887414 5885433 6043384 6194597
2553F194597J69894K27502J72973J72933L47685J81332J82892K07237N1042J03579
$$ 6194597 6364491 6591993 6764966 6937899 7285584 7466916 7649808 7857045 7908087 8011666
2543H011666J54121L67205J2326J99803J8607O3751K31133r9967n4135J69238
$$ 8011666 8165787 8532992 8545318 8745121 8763728 8827479 9058612 8958645 8904510 9073748
2533I073748K17878p2121K30030L77886J45178P09921K33849K29288M75080K28890
$$ 9073748 9291626 9219505 9449535 9827421 9972599 10682520 10916369 11145657 11620737 11849627
2523A1849627O0911J21667O0584j0091M90941M09861N23295L59376K60398M03595
$$ 11849627 11910538 12032205 12092789 12082698 12573639 12983500 13506795 13866171 14126569 14530164
2513A4530164L02496K31281K99362L9263J78692L23027M98685M50463J081536
$$ 14530164 14832660 15063941 15363303 15402566 15581258 15904285 16402970 16853433 17934969
2504A7934969J116343J099723J284312J027849Q53597R02166M69432L8556j2398
$$ 17934969 19051312 20151035 21435347 22463196 23316793 24218959 24688391 24726947 24714549
2495B4714549l45597l3310k20090n08016n47568j065882j432386j744698j458812
$$ 24714549 24368952 24335642 24115552 23607536 23059968 21994086 20561700 18817002 17358190
2486A7358190j402067q80420q60086j017299q64970o22464m61939p40348n23419
$$ 17358190 15956123 15075703 14215617 13198318 12333348 11710884 11248945 10508597 9985178
2477I985178k79187p02687m84859l25888k11211l76288k10982l50989k30215J65556
$$ 9985178 9705991 9003304 8518445 8192557 7981346 7605058 7394076 7043087 6812872 6978428
2467F978428k09486n41683p0216j05779k08520j30172R230l18855l07106L1089
$$ 6978428 6768942 6227259 6157043 6051264 5842744 5712572 5721802 5402947 5095841 5126930
2457E126930r9765l24711j38211j45591k6351L14063j47878j51781l8480k52557
$$ 5126930 5027165 4702454 4564243 4418652 4392301 4706364 4558486 4406705 4368225 4115668
2447D115668j46347K44650k92125k80901J09211o9791o8692L1905n1560k44518
$$ 4115668 3969321 4213971 3921846 3640945 3750156 3680365 3611673 3643578 3592018 3347500
2437C347500j84712J61679J52972J01025k45785N382k00725j26884O4750J61891
$$ 3347500 3162788 3324467 3477439 3578464 3332679 3338061 3137336 3010452 3075202 3237093
2427C237093j03751j75419L51098j66817j30843j85010k45732K93995J33392j59893
$$ 3237093 3133342 2957923 3309021 3142204 3011361 2826351 2580619 2874614 3008006 2848113
2417B848113j36115k12383j32518O4228k53716K75988J96357K1079k06295m0137
$$ 2848113 2711998 2499615 2367097 2431325 2177609 2453597 2649954 2671033 2464738 2424601
2407B424601j9359k0378j05368J64138K0621n1924M9910k88130j3393R8978o8666
$$ 2424601 2405242 2384864 2279496 2443634 2464255 2412331 2462241 2174111 2160718 2259696 2191030
2396B191030q5627m9613q6718L9677M2552K436r1780K5066o2687P612j34321R2729
$$ 2191030 2105403 2055790 1969072 2008749 2051301 2053737 1961957 1987023 1924336 1931948 1797627 1890356
2384A890356P1763j38509j19396K72781k85989J41374k5531m5195K8842k1387
$$ 1890356 1962119 1823610 1704214 1976995 1691006 1832380 1806849 1761654 1790496 1769109
2374A769109N4439o4672J34543j48356j24259k2527J12302J40951n4505j21033
$$ 1769109 1823548 1758876 1893419 1745063 1620804 1598277 1710579 1851530 1797025 1675992
2364A675992j12598j65656k24732J81642J63677J0924m027J44901k20205J40095
$$ 1675992 1563394 1397738 1173006 1354648 1518325 1529249 1525222 1670123 1449918 1590013
2354A590013J17368l37853k1869J16740J67620l82832M4491J76847J51039j31618
$$ 1590013 1707381 1369528 1347659 1464399 1632019 1249187 1293678 1470525 1621564 1489946
2344A489946r3618j3204J63881J4329J17822j45106o4392Q9012m3160n2585M8718
$$ 1489946 1396328 1383124 1547005 1561334 1679156 1534050 1469658 1558670 1515510 1462925 1511643
2333A511643k42957J43746J66245r0159K16r5828j34694J62271P5000J77321J30719
$$ 1511643 1268686 1412432 1578677 1488518 1488734 1392906 1258212 1420483 1495483 1672804 1803523
2322A803523P4336k711j22037r5391j61351K01921r6881K17689k7375J73197k576
$$ 1803523 1877859 1875148 1753111 1657720 1496369 1698290 1601409 1819098 1791723 1964920 1962344
2311A962344J0561J6288K86003Q4481j36829J75313j87487o5584L7447P5617M7878
$$ 1962344 1972905 1989193 2275196 2359677 2222848 2398161 2210674 2145090 2182537 2258154 2306032
2300B306032K27060p121J03481K91905K5876j26786n1878j17267L50401J83203
$$ 2306032 2533092 2525971 2629452 2921357 2947233 2820447 2768569 2651302 3001703 3184906
2290C184906j06816o1935j36025K89411J40743L48169p2046k11161J11232P7881
$$ 3184906 3078090 3016155 2880130 3169541 3310284 3658453 3586407 3375246 3486478 3564359
2280C564359q8069R2944L5778K48608K73232n4799J6282M74139K73231K5232L57944
$$ 3564359 3476290 3569234 3605012 3853620 4126852 4072053 4088335 4562474 4835705 4860937 5218881
2269E218881K49002J18325K90074N32466K28093M18727K42657K71169N01805O71060
$$ 5218881 5467883 5586208 5876282 6408748 6636841 7055568 7298225 7569394 8071199 8742259
2259H742259L1792j53116L3668j43080K22669K47368k52776J86616N1478O1007
$$ 8742259 8774051 8620935 8654603 8511523 8734192 8981560 8728784 8915400 8966878 9027885
2249I027885J51470j3055J98953L38758P9074K96830R24402J279790Q33637J353308
$$ 9027885 9179355 9166300 9365253 9704011 9783085 10079915 11004317 12284107 13117744 14471052
2239A4471052J459865O89113j032707j513080j671974j123342o93973o94225n48393
$$ 14471052 15930917 16620030 15587323 14074243 12402269 11278927 10584954 9890729 9342336
2230I342336n69774k76984j85887l3563m3177J74358J30319J00258k9176N3567
$$ 9342336 8772562 8495578 8309691 8276128 8232951 8407309 8537628 8637886 8608710 8662277
2220H662277r3035M77391O2802r8957J30240l1298m91162o70423n40689n60520
$$ 8662277 8569242 9046633 9109435 9010478 9140718 9109420 8618258 7947835 7407146 6846626
2210F846626m25571l24174m07134k13249l29290j57828j41630O4653k06792l53914
$$ 6846626 6421055 6096881 5689747 5476498 5147208 4989380 4847750 4912403 4705611 4351697
2200D351697j98671K8904k27640k67450J0601k55269k67281P0786k32498k1482
$$ 4351697 4153026 4181930 3954290 3686840 3697441 3442172 3174891 3245677 3013179 2991697
2190B991697k84734j62532l8210k85327j48728J02041k4292k78705l4390o7546
$$ 2991697 2706963 2544431 2506221 2220894 2072166 2174207 2149915 1871210 1836820 1769274
2180A769274q042r6107P0343K6669p7542j9378j28878K36645j16761k37778N3019
$$ 1769274 1761232 1665125 1735468 1762137 1684595 1665217 1536339 1772984 1656223 1418445 1471464
2169A471464j22954n1955J76330k26984R4272j815r2409p1942j08628j66524j26391
$$ 1471464 1348510 1296555 1472885 1245901 1340173 1338358 1245949 1174007 1065379 898855 772464
2158G72464K86576p185k14244Q9593o0169R531k65190P566Q3064k6993J10686
$$ 772464 1059040 1051855 837611 927204 867035 876566 611376 618942 702006 675013 785699
2147G85699J30261k15656j94526K3596Q7076R8312p7506j97457j40971o5490K17172
$$ 785699 915960 700304 505778 529374 616450 714762 637256 439799 298828 233338 450510
2136D50510J20102k91233o3466q0502J36105J08563k62992K21097M06673k55307
$$ 450510 570612 279379 215913 135411 271516 380079 117087 338184 744857 489550
2126D89550O4045j59457l4802l0382j77432K74697K17124j59199l40277m0966
$$ 489550 553595 394138 359336 328954 151522 426219 643343 484144 143867 102901
2116A02901N1111k38787L88540k63576l2307N2033O3995K06365J22436L8595j65225
$$ 102901 154012 -84775 303765 40189 7882 59915 123910 330275 452711 491306 326081
2105C26081n8238j70455Q7375L4364k13399L3474J64783j91447j00100L733J98296
$$ 326081 267843 97388 184763 219127 5728 39202 203985 12538 -87562 -83829 114467
2094A14467m1345K2763j8014o403J4404j82412R1165j515J22581J05068r78M737
$$ 114467 73122 95885 77871 71468 85872 -96540 -5375 -6890 115691 220759 219781 224518
2082B24518k44641N504m7426k8414L026q2209l6446Q9372J47372j18902L74662
$$ 224518 -20123 -14619 -62045 -90459 -87433 -169642 -206088 -116716 30656 -88246 286416
2071B86416L252j89411j97151j19274M1901J79394K7377n4789k45L7040J11936
$$ 286416 289668 100257 -96894 -216168 -174267 5127 32504 -22285 -22530 14510 126446
2060A26446n9659r0924K81821K105k70172k5300K43681r7152k13497j77311J76122
$$ 126446 66787 -24137 257684 259789 -10383 -35683 207998 110846 -102651 -279962 -103840
2049a03840J17020k2092K8103O5349j56886k16806K35152j30578j88652J98895
$$ -103840 13180 -8912 19191 84540 -72346 -289152 -54000 -184578 -373230 -174335
2039a74335n4600j10698L15165l9207j70439L097o3724K89314q0641J45964n7055
$$ -174335 -228935 -339633 -24468 -63675 -234114 -231017 -294741 -5427 -86068 59896 2841
2028B841k88444R8238K0593J93424k29949Q1837K09161k20445N7397K72724k10277
$$ 2841 -285603 -187365 -166772 26652 -203297 -121460 87701 -132744 -75347 197377 -12900
2017a2900O3507J85631l86505P2519r7266m8538N689J03779o5236K85590r8342
$$ -12900 50607 236238 -150267 -77748 -175014 -223552 -217863 -114084 -179320 106270 7928
2006G928M7609J6283j51979o1418J28154j44416r3470K72447j30198J13513r600
$$ 7928 55537 71820 -80159 -141577 -13423 -157839 -251309 21138 -109060 4453 -5147
1995e147o2822J7227j31156o5543o3505N7676K9249K38257j06875j87848Q6713
$$ -5147 -67969 -50742 -181898 -247441 -310946 -253270 -224021 14236 -92639 -280487 -193774
1984a93774j60664K10981o3790O4920j31814J15061n3162j92244J72973L07950
$$ -193774 -354438 -143457 -207247 -142327 -274141 -159080 -212242 -404486 -231513 76437
1974G6437j66985j08020K104l1878R9523j7774N137l7649L6523Q7332n1481R6570
$$ 76437 -90548 -198568 -196464 -228342 -128819 -146593 -141456 -179105 -142582 -55250 -106731 -10161
$$ [...]
##END NTUPLES=NMR SPECTRUM
##END=
