##TITLE=1H_EC-3337(3)
 CDCl3
 8 sc, 
 6.12.2024
##JCAMPDX= 6.0         $$ Bruker NMR JCAMP-DX V2.0
##DATA TYPE= NMR SPECTRUM
##DATA CLASS= NTUPLES
##ORIGIN= UXNMR, Bruker Analytische Messtechnik GmbH
##OWNER= root
$$ XWIN-NMR		Version 3.5
$$ Fri Dec  6 13:54:03 2024 Russian Standard Time (UT+4h)  she@DPX200
##.OBSERVE FREQUENCY= 200.1315
##.OBSERVE NUCLEUS= ^1H
##.ACQUISITION MODE= SIMULTANEOUS
##.ACQUISITION SCHEME= undefined
##.AVERAGES= 8
##.DIGITISER RES= 18
##SPECTROMETER/DATA SYSTEM= spect
##.PULSE SEQUENCE= zg30
##.SOLVENT NAME= CDCl3
##.SHIFT REFERENCE= (INTERNAL, CDCl3, 0, 19.7134)
##AUDIT TRAIL= $$ (NUMBER, WHEN, WHO, WHERE, WHAT)
$$ ##TITLE= Audit trail, XWIN-NMR		Version 3.5
$$ ##JCAMPDX= 5.01
$$ ##ORIGIN= Bruker BioSpin GmbH
$$ ##OWNER= she
$$ F:/spectra/data/she/nmr/H-F/1/pdata/1/auditp.txt
$$ ##AUDIT TRAIL=  $$ (NUMBER, WHEN, WHO, WHERE, WHAT)
(   1,<2024-12-06 13:52:36.89 +0400>,<she>,<DPX200>,
      <created by zg, POWCHK disabled, PULCHK disabled
       configuration hash MD5:
       00 E9 B6 7A A2 85 ED C7 34 08 36 98 17 FE 4E 26
       data hash MD5: 16K
       41 68 C8 28 25 FA F2 B0 C0 65 1F 46 AF C7 4B 73>)
(   2,<2024-12-06 13:52:39.51 +0400>,<she>,<DPX200>,
      <Start of raw data processing
       efp BC_mod = 2 LB = 0.24 FT_mod = 6 PKNL = 1 PHC0 = -26708.27 PHC1 = 14.78744 SI = 16K 
       data hash MD5: 16K
       FC 63 58 56 E4 6D C8 A6 7B 33 CF 8D CF 8B C8 46>)
(   3,<2024-12-06 13:53:01.48 +0400>,<she>,<DPX200>,
      <pk PHC0 = -8.657266 PHC1 = 15.6 
       data hash MD5: 16K
       78 01 28 FE 6D 32 1F AB D8 9C 4F A4 97 E2 EC 2F>)
(   4,<2024-12-06 13:53:07.20 +0400>,<she>,<DPX200>,
      <abs ABSG = 5 
       data hash MD5: 16K
       78 62 EC EF CF 22 D7 90 E4 48 44 A6 6F 8D 56 38>)
(   5,<2024-12-06 13:53:32.98 +0400>,<she>,<DPX200>,
      <abs ABSG = 5 
       data hash MD5: 16K
       2C 9A 5D C0 2B A9 61 B3 D0 5F 16 15 FB 7C 65 11>)
$$ ##END=
$$ 
$$ hash MD5
$$ 72 96 BF E3 37 67 72 CA 53 E5 B4 69 35 46 18 55
##$RELAX= 
##$RELAX= 
##$RELAX= 
##$RELAX= 
##$RELAX= 
##$RELAX= 
$$ Bruker specific parameters
$$ --------------------------
##$DU= <F:/spectra>
##$EXPNO= 1
##$NAME= <H-F>
##$PROCNO= 1
##$TYPE= <nmr>
##$USER= <she>
##$AMP= (0..31)
100 100 100 100 100 100 100 100 100 100 100 100 100 100 100 100 100 100 
100 100 100 100 100 100 100 100 100 100 100 100 100 100 
##$AQSEQ= 0
##$AQ_mod= 1
##$AUNM= <au_zg>
##$AUTOPOS= <>
##$BF1= 200.13
##$BF2= 200.13
##$BF3= 200.13
##$BF4= 200.13
##$BF5= 200.13
##$BF6= 200.13
##$BF7= 200.13
##$BF8= 200.13
##$BYTORDA= 1
##$CFDGTYP= 0
##$CFRGTYP= 5
##$CHEMSTR= <none>
##$CNST= (0..31)
1 1 145 1 1 1 1 1 1 1 1 1 1 1 1 1 1 1 1 1 1 1 1 1 1 1 1 1 1 1 1 1 
##$CPDPRG= <>
##$CPDPRG1= <>
##$CPDPRG2= <>
##$CPDPRG3= <>
##$CPDPRG4= <mlev>
##$CPDPRG5= <mlev>
##$CPDPRG6= <mlev>
##$CPDPRG7= <mlev>
##$CPDPRG8= <mlev>
##$CPDPRGB= <>
##$CPDPRGT= <>
##$D= (0..31)
0 1.2 0 0 0 0 0 0 0 0.06 0 0.03 0 0 0 0 0.0002 0 0 0 0 0 0 0 0 0 0 0 0 
0 0 0 
##$DATE= 1733478756
##$DBL= (0..7)
$$ [...]
##$SUBNAM3= <"">
##$SUBNAM4= <"">
##$SUBNAM5= <"">
##$SUBNAM6= <"">
##$SUBNAM7= <"">
##$SUBNAM8= <"">
##$SUBNAM9= <"">
##$SW= 24.0689530833862
##$SWIBOX= (0..15)
0 0 2 0 0 0 0 0 0 0 0 0 0 0 0 0 
##$SW_h= 4816.95568400771
##$TD= 16384
##$TD0= 1
##$TE= 0
##$TE2= 300
##$TE3= 300
##$TEG= 300
##$TL= (0..7)
0 120 120 120 120 120 120 120 
##$TP= (0..7)
150 150 150 150 150 150 150 150 
##$TP07= 0
##$TPNAME0= <>
##$TPNAME1= <>
##$TPNAME2= <>
##$TPNAME3= <>
##$TPNAME4= <>
##$TPNAME5= <>
##$TPNAME6= <>
##$TPNAME7= <>
##$TPOAL= (0..7)
0.5 0.5 0.5 0.5 0.5 0.5 0.5 0.5 
##$TPOFFS= (0..7)
0 0 0 0 0 0 0 0 
##$TUNHIN= 0
##$TUNHOUT= 0
##$TUNXOUT= 0
##$USERA1= <user>
##$USERA2= <user>
##$USERA3= <user>
##$USERA4= <user>
##$USERA5= <user>
##$V9= 5
##$VALIST= <valist>
##$VCLIST= <CCCCCCCCCCCCCCC>
##$VD= 0
##$VDLIST= <DDDDDDDDDDDDDDD>
##$VPLIST= <PPPPPPPPPPPPPPP>
##$VTLIST= <TTTTTTTTTTTTTTT>
##$WBST= 1024
##$WBSW= 4
##$XGAIN= (0..3)
0 0 0 0 
##$XL= 0
##$YL= 0
##$YMAX_a= 1015006
##$YMIN_a= -682381
##$ZGOPTNS= <>
##$ZL1= 120
##$ZL2= 120
##$ZL3= 120
##$ZL4= 120
##$ABSF1= 19.71336
##$ABSF2= -4.355778
##$ABSG= 5
##$ABSL= 3
##$ALPHA= 0
##$AQORDER= 0
##$ASSFAC= 0
##$ASSFACI= 0
##$ASSFACX= 0
##$ASSWID= 0
##$AUNMP= <proc_1d>
##$AZFE= 0.1
##$AZFW= 0.1
##$BCFW= 0
##$BC_mod= 2
##$BYTORDP= 0
##$COROFFS= 0
##$CY= -3
##$DATMOD= 1
##$DC= 0
##$DFILT= <>
##$DTYPP= 0
##$F1P= 0
##$F2P= 0
##$FCOR= 1
##$FTSIZE= 16384
##$FT_mod= 6
##$GAMMA= 0
##$GB= 0
##$INTBC= 1
##$INTSCL= 2.524811e-10
##$ISEN= 128
##$LB= 0.24
##$LEV0= 0
##$LPBIN= 0
##$MAXI= 10000
##$MC2= 0
##$MEAN= 0
##$ME_mod= 0
##$MI= 1.114404
##$NCOEF= 0
##$NC_proc= -3
##$NLEV= 6
##$NOISF1= 3.799351
##$NOISF2= 2.8
##$NSP= 0
##$NTH_PI= 0
##$NZP= 0
##$OFFSET= 19.71336
##$PC= 1
##$PHC0= -26716.93
##$PHC1= 30.38744
##$PH_mod= 1
##$PKNL= yes
##$PPARMOD= 0
##$PSCAL= 0
##$PSIGN= 0
##$REVERSE= no
##$SF= 200.129963242219
##$SI= 16384
##$SIGF1= 3
##$SIGF2= 2
##$SINO= 5.538805
##$SIOLD= 16384
##$SREGLST= <1H.CDCl3>
##$SSB= 0
##$STSI= 16384
##$STSR= 0
##$SW_p= 4816.95568400771
##$SYMM= 0
##$S_DEV= 0
##$TDeff= 16384
##$TDoff= 0
##$TI= <>
##$TILT= no
##$TM1= 0
##$TM2= 0
##$TOPLEV= 0
##$USERP1= <user>
##$USERP2= <user>
##$USERP3= <user>
##$USERP4= <user>
##$USERP5= <user>
##$WDW= 1
##$XDIM= 16384
##$YMAX_p= 272055387
##$YMIN_p= -330995
$$ End of Bruker specific parameters
$$ ---------------------------------
##NTUPLES= NMR SPECTRUM
##VAR_NAME=  FREQUENCY,     SPECTRUM/REAL,   SPECTRUM/IMAG
##SYMBOL=    X,             R,               I
##VAR_TYPE=  INDEPENDENT,   DEPENDENT,       DEPENDENT
##VAR_FORM=  AFFN,          ASDF,            ASDF
##VAR_DIM=   16384,         16384,           16384
##UNITS=     HZ,            ARBITRARY UNITS, ARBITRARY UNITS
##FACTOR=    0.29402158847633, 1,            1
##FIRST=     3945.23397871163, 0,            0
##LAST=      -871.72170529608, 0,            0
##MIN=       -871.72170529608, -330995,      0
##MAX=       3945.23397871163, 272055387,    0
$$ Real data points
##PAGE= N=1
##DATA TABLE= (X++(R..R)), XYDATA
$$ [...]
8455D37967m917j8239j4966r754l5541O807q289l2435J96l7848m830k4900r880
8442B43371R062P201L40n844k0718k4317J3221l232J5791k8579j9372J4280P261
8429B08465n563K9042j4205r517J2831k9617K3988r294r726L8058L4342J345M987
8416B75136N531k8078o39k9706k5691p389J0632j4062R354J1478l739j5493M6986
8403B34320k6924k5678k084j1302J453P660j365p674P320J4142n950k0462l471
8390A59985N331J4305o719k385M166O574L1314K8173j8030j8895P633K0610k6958
8377B05104L1444J4503K006L5414r914K3076K8415J9179J5190K7345M1051J9434
8365D52247O9542J8465L1150O4784N4787K4712J4158J7930q674j339P571j3934
$$ plain form
8455 437967 433050 414811 399845 390091 354550 361357 353068 320633 320829 282981 278151 253251 243371
8442 243371 252433 259634 259974 254130 233412 209095 222316 219084 234875 206296 186924 201204 208465
8429 208465 202902 231944 217739 208222 221053 191436 215424 206130 196404 234462 268804 270149 275136
8416 275136 280667 252589 251950 222244 196553 189164 199796 185734 195088 206566 202827 187334 234320
8403 234320 207396 181718 179634 168332 169785 177445 176080 168406 175726 189868 183918 163456 159985
8390 159985 165316 179621 172902 170517 174683 181257 212571 240744 222714 203819 211452 232062 205104
8377 205104 236548 251051 253057 288471 278557 301633 330048 349227 364417 391762 432813 452247
8365 452247 521789 540254 571404 636188 690975 715687 729845 747775 739101 737762 745333 731399
8353G31399m2217k5706n7162n6051m5164m3042m8470j0273m6924l2625l7011J70
8341B86924k2265m2441J488J7975J2496k514k1164M599j0507l7354L2278j1303
8329B08212J2275k756j6417q34J2011j6918J01K3410j8736J7160J9647j9982L2961
8316B50134k9544m8386N9476J6500j1107R474L282K9303J8628K2016O523j4584
8304C11715J4624L9878M0360M8098k3641K7921R0013O3082M9271j4596m7957k426
8292E96342n0164m7729j9945o2399o544j3016k5011j0841k1497j8076j2911N8774
8280C66983l7051o519R050R287n655P824L4460M9042L0746O858O9810L6604O0132
8267F31571M6910J4162k2373j7648m9253p3182p3391n5955l1088l6613j2892n517
$$ plain form
8353 731399 689182 663476 606314 550263 505099 462057 413587 403314 356390 323765 286754 286924
8341 286924 264659 222218 223706 241681 254177 251663 230499 235098 224591 187237 219515 208212
8329 208212 220487 217731 201314 200480 212491 195573 195674 219084 200348 217508 237155 217173 250134
8316 250134 220590 172204 231680 248180 237073 246547 249829 279132 297760 319776 326299 311715
8304 311715 326339 366217 406577 454675 431034 458955 548968 612050 661321 646725 598768 596342
8292 596342 546178 498449 478504 416105 409561 396545 371534 360693 339196 321120 308209 366983
8280 366983 329932 323413 332463 341750 336095 343919 378379 427421 458167 465025 534835 571439 631571
8267 631571 678481 692643 670270 652622 603369 530187 456796 400841 369753 333140 320248 314731
8255C14731m1954k1150K3222j3355j8845O215j8008l5038L9804R377k6616j3657
8243B04726k7634K1982k0380O373L7676k2343p659k9514J4163J5588N687O426
8231B05091j9453L8795k2960m858l6340j5393j5362K3613N895P41N5746J7286
8219B32801n2464K2083j4341P448P545j7917J6392o521k6898K2044n632J990k8619
8206A57911l4269L36M7122k200M0328j8519k2320k5322M3524l1813K1443l5590
8194A40631N7598k95754k33470N42667J790J9920j1104J7740o3R289o536J3655
8182B56363j2349K932O08L641J4128k5303J0731j3262J1033q880k383N473J5598
8169B58330Q265J1300k7863l5837L1664J5524J3603p352r249K5569J2629J4273
$$ plain form
8255 314731 272777 251627 274849 261494 242649 248864 230856 195818 235622 244999 218383 204726
8243 204726 177092 199074 178694 185067 222743 200400 192741 163227 177390 192978 198665 205091
8231 205091 185638 224433 201473 196615 160275 144882 129520 153133 159028 159769 215515 232801
8219 232801 180337 202420 188079 195527 203072 185155 201547 195026 168128 190172 184540 186530 157911
8206 157911 123642 123978 171100 168900 209228 190709 168389 143067 186591 154778 176221 140631
8194 140631 198229 -97525 -330995 211672 213462 233382 222278 240018 239955 249244 242708 256363
8182 256363 244014 246946 247554 251195 265323 240020 250751 237489 248522 239642 237259 242732 258330
8169 258330 266595 277895 250032 214195 245859 261383 274986 267634 258385 283954 296583 310856
8157C10856m0358M1725p438J7417J2263k9936J8085K0408J041Q894K2059r937
8145C65079R168k0152K2462J4976j7670K1969J7168J4614k6244j3938K2334M0460
8133D50226r815M261j1138K2415j0841L0222P643o474L9175J0237L2724M2059
8121F00694N248P232K1807N3165P277L5470k136m778M3056L3050M2585K5277J5767
8108H83714P5752Q7519L7899M8151N211L8255O5219P477L6957P3973J3277K3705
8096A397109Q7581M4171J05928O9630P3819Q8242J04745Q6323J02920R5762Q9696
8085B345926J12922J11583J15373J64510J78698J60084J45011J71819J79214K20017
8075C905157K57756K32436L42485L58154N22878N39441O48000P88944R65632J117627
$$ plain form
8157 310856 270498 312223 304785 322202 334465 304529 322614 343022 344063 352957 375016 365079
8145 365079 374247 354095 376557 391533 373863 395832 413000 427614 401370 387432 409766 450226
8133 450226 440411 444672 433534 455949 445108 475330 482973 476499 515674 525911 558635 600694
8121 600694 605942 613174 634981 688146 695423 730893 728757 723979 767035 800085 842670 867947 883714
8108 883714 959466 1046985 1084884 1133035 1138246 1176501 1241720 1249197 1286154 1360127 1373404 1397109
8096 1397109 1484690 1528861 1634789 1704419 1778238 1866480 1971225 2057548 2160468 2256230 2345926
8085 2345926 2458848 2570431 2685804 2850314 3029012 3189096 3334107 3505926 3685140 3905157
8075 3905157 4162913 4395349 4737834 5095988 5618866 6158307 6806307 7595251 8560883 9678510
8065I678510J402124J662147K233092K947762M225335K702237L61187l220482
8057B1991912n143783l629244k399887j499836j123557p27915n93901l86586m05956
8048F081247k59337k57752j42610n6557J7280l9303N599J8492P0899M7589N2845
8037E538392N373J46192J04162J7266j38896k10486l59511m35388m03834l69674
8027C893596k89392k37850j65594j04530p7571m9989j18145k8004j0594l5647
8017B776280k442k8837l2797n7584j47528j31551j10890r5973p3697R467k2954
8006B081494m8459K2263j5262j6489J732j5116K4009L7568M2844P3174P1404J30648
7994B389810J28677J75851K27252K77713L06262K62180J76261O3999n9870k12915
$$ plain form
8065 9678510 11080634 12742781 14975873 17923635 22148970 24851207 25212394 21991912
8057 21991912 16848129 13218885 10818998 9319162 8195605 7467690 6873789 6487203 6081247
8048 6081247 5821910 5564158 5421548 5364991 5382271 5342968 5348567 5367059 5437958 5485547 5538392
8037 5538392 5543765 5689957 5794119 5811385 5672489 5462003 5102492 4667104 4263270 3893596
8027 3893596 3604204 3366354 3200760 3096230 3018659 2968670 2850525 2822521 2811927 2776280
8017 2776280 2773838 2745001 2712204 2654620 2507092 2375541 2264651 2168678 2094981 2104448 2081494
8006 2081494 2033035 2055298 2040036 2023547 2025279 2010163 2034172 2071740 2114584 2187758 2259162 2389810
7994 2389810 2518487 2694338 2921590 3199303 3505565 3767745 3944006 4008005 3948135 3735220
7984C735220k52228j93581j44052o7680J2235O8142R3172O3554K8281m1449r9668
7973C201946p2445l1094n5042n3787j20958k31730k09507k34573j84047j20573
7963A888190q6415m1614j01025q2333n1457r4170o6015n3463m6906P329j1556
7952A260565Q294J7665N802L6285K3470o111m6621k9781j8007j1540j7013j3836
7940A209172m4854l342l1762q1276j7251J8959n0762l5747k2750q5969r0404l0865
7928G33149k4585J2371k5752l2493r749j527l8901N764J1136l541L5764j7208
7916F44428j2926j8087n102j9553m0070p493O021J5307N392j3669L9280l0285
7904E63243J3382L9185K0478N8247p160k9150N3615L4676k2199L3081J1043o072
$$ plain form
7984 3735220 3482992 3289411 3145359 3077679 3089914 3158056 3251228 3314782 3343063 3301614 3201946
7973 3201946 3129501 3098407 3043365 2989578 2868620 2636890 2427383 2192810 2008763 1888190
7963 1888190 1801775 1760161 1659136 1576803 1525346 1431176 1365161 1311698 1264792 1272121 1260565
7952 1260565 1268859 1286524 1292326 1328611 1352081 1345970 1299349 1269568 1251561 1240021 1223008 1209172
7940 1209172 1164318 1160976 1129214 1047938 1030687 1049646 998884 963137 940387 854418 764014 733149
7928 733149 708564 720935 695183 662690 652941 651414 612513 618277 629413 625872 661636 644428
7916 644428 631502 613415 608313 588760 548690 541197 547218 562525 567917 554248 593528 563243
7904 563243 576625 615810 636288 694535 687375 658225 711840 746516 724317 757398 768441 762369
7892G62369n2613k8849k1540j6565l7067n6182n1232j2219k3613j8946m917r745
7880D28881l0195O411p985J4567M0642l7855p95J945j2663L790K9741J9160L385
7867D59029k852J8701j7632J6027j215j7690J1435l229R065P205L6146J5930j8368
7854E12552L3806J6439M184k7215o810o672N67l2701p752K2198L927J0037q948
7841E13612p819m0945j3851k8432K2203j9460k018K553M680j6717j549J1836L9149
7828D63242l5878O929L7716p841r898l1650l409L2312j3561j3099J1103J5961
7816D51927l427K7055j3267K849M4175K661k8896J7186j2349k4702k450p118N787
7803D59431l3450m2488n1353K0076k9977K981j391J4592j4036K2531k3030M0586
$$ plain form
7892 762369 709756 680907 659367 642802 605735 549553 498321 486102 462489 443543 438626 428881
7880 428881 398686 405097 397112 411679 452321 414466 413671 415616 402953 406743 436484 455644 459029
7867 459029 456177 474878 457246 473273 472058 454368 465803 462574 471639 478844 514990 530920 512552
7854 512552 546358 562797 566981 539766 532956 526284 526851 494150 486398 508596 512523 522560 513612
7841 513612 505793 464848 450997 422565 444768 425308 423290 425843 430523 413806 412257 424093 463242
7828 463242 427364 434293 472009 464168 454270 422620 419211 451523 437962 424863 435966 451927
7816 451927 448500 475555 462288 465137 509312 511973 483077 500263 487914 463212 460762 453644 459431
7803 459431 425981 383493 332140 352216 322239 325220 323829 338421 324385 346916 323886 364472
7791C64472p591k4166J6882R902j0857J8503P19n767k475j7601o80J4231j1426
7778C44146m2829J1913n9584j769Q646j644q325n2714K088J3127j021j0729j3467
7765A87838k524m726k8884J7162n807J3726p408j2629J1684j4950j2086m426J4041
7752A51011j1525p435K2931j4293j178k890J8557L774p072j7119m271K6807J2549
7739A69846k1089l2536N90J5266O842K2220l0976o300K02P382l256q952q007m673
7725A06559k0J2035J0366m4847L3761o708j6266J9745K5435k9773N3491l4310
7713A29468k3020M2364o050k2949j8884K2659P764o980L0977K3615M287K7488
7701B10739j8029p054L0820K1811p223j5724Q6k1880j1219J3165j4171k3301j0716
$$ plain form
7791 364472 356881 332715 349597 359499 348642 367145 367864 362097 359622 342021 341341 355572 344146
7778 344146 301317 313230 253646 251877 260523 258879 250554 197840 199928 213055 212034 201305 187838
7765 187838 185314 180588 151704 168866 163059 176785 169377 156748 168432 153482 141396 136970 151011
7752 151011 139486 132051 154982 140689 139511 136621 155178 158952 151880 134761 130490 157297 169846
7739 169846 148757 116221 116811 132077 138919 161139 130163 123863 124065 131447 128191 119239 111232 106559
7725 106559 106539 118574 128940 84093 117854 111146 94880 114625 140060 110287 163778 129468
7713 129468 106448 148812 142762 119813 100929 123588 131352 124372 155349 178964 183251 210739
7701 210739 192710 185656 216476 238287 231064 215340 215426 193546 182327 195492 181321 158020 147304
7688A47304l1006j797J5353j9313K0767M0709l3329p829K6721j281m031k8619
7676A23649K8802p911q805o833o120L5246O294j4689J2949k1030m9404M1684J8426
7663A52258k286L899m7089K0454J1114n169J2119j2166M55K6457l016R288Q843
7650A75161k7069K2919k3143l3680j945j1063L4284J9246j8974k7282k0396r146
7638G8912j068L3998k7689K9059k8619N589J6019k47n017N497j552k0740L83M2628
7624A27153k3548J2903K7509k700J794l4620j7490m526J9046m2j5397j8392K2246
7611I3936J4681j9163j0188j1329l912j770Q429k9842L0340R990j9304M5130j9919
7598H7079j9585j5793J2956j4872L866L7172j7699o444K3375j7229Q090j6212
$$ plain form
7688 147304 116298 114501 129854 110541 131308 172017 138688 130859 157580 156299 152268 123649
7676 123649 152451 144540 135735 128902 122782 158028 164322 149633 162582 141552 92148 133832 152258
7663 152258 149972 153871 106782 127236 138350 133181 145300 133134 133589 160046 157030 166318 175161
7650 175161 148092 171011 147868 114188 112243 101180 135464 154710 135736 108454 88058 78912
7638 78912 77844 111842 84153 113212 84593 90182 106201 105954 100937 106434 104882 84142 84525 127153
7624 127153 103605 116508 144017 141317 143111 108491 91001 86475 105521 105479 90082 71690 93936
7611 93936 108617 89454 79266 67937 64025 62255 70684 40842 71182 81172 61868 106998 87079
7598 87079 67494 51701 64657 49785 53651 90823 73124 66680 90055 72826 80916 64704
7586F4704K3944O199k6203K672k7891o641J4559J0013J9168j4312k1405n494J5590
7573E4903p687k2864j5892J7797K7118k7854J9945K3445j9271l580N850o0336
7561h426l306N2391k9580M653K7318J0823l3431J4478j6069q78J2723j1475l175
7548A6046k8422J0867j9527J2562K0976K184j6803L275j744N703J714J3758J6796
7535C7385j6762j474k5833r402M9433j700j6465J8570Q429j7478P594P508j9227
7522B0578r180J6578K5735l4335J4026L501n694j8036p028L0422o527n235q929
7509A5876L360q257j9030R832q03j3847k1034J3324J5508N2192k1558j0905m002
7496A0656O180J3451r33J805j8051M232j1200q379J1406n8P713l330K2931J5148
$$ plain form
7586 64704 88648 94847 68644 71316 43425 36784 51343 61356 80524 66212 44807 39313 54903
7573 54903 47216 24352 8460 26257 53375 25521 45466 68911 49640 46060 51910 -8426
7561 -8426 -11732 40659 11079 15732 43050 53873 20442 34920 18851 17973 30696 19221 16046
7548 16046 -12376 -1509 -21036 -8474 12502 14686 -2117 1158 -586 5117 6831 20589 37385
7535 37385 20623 19149 -6684 -16086 33347 31647 15182 33752 42181 24703 32297 39805 20578
7522 20578 11398 27976 53711 19376 33402 36903 31209 13173 6145 36567 30040 24805 15876
7509 15876 19236 10979 -8051 1781 978 -12869 -33903 -20579 -5071 47121 25563 14658 10656
7496 10656 16836 30287 29354 31159 13108 17340 6140 -2239 9167 9109 16822 13492 36423 51571
7482E1571o172K06j9472R260k3678j8959M3612M190L027k8425k618j0538Q185
7469A0189P107Q114j2340J297J0328n3667P2407p420k6289m141p523K718K3460
7456B4240j1182j7708l5157K6135L6832K0090k4746r603j0470n083J8969J8715
7444C1032k934k2707k7606K0063J127K0301J4588k5499k1683M845L1159k4507
7432a821K8620j4943K204k9273J7612R309O05J6738Q515Q182k919J3263m462k8834
7418B2796l8987J1132J5951n473M2774Q449j9746j5511n970k407p747r324O270
7405B207J9301R301q106o690L728m4557L0552r7l062M85R885J4007o520r64p701
7390A1769l3177O139K4980j3033J5752Q25J595k3725O510k0925K6708j0684N722
$$ plain form
7482 51571 45399 45605 26133 35393 11715 -7244 36368 40558 43585 15160 12542 2004 10189
7469 10189 17296 25410 13070 14367 24695 -28972 43435 36015 9726 5585 -1938 780 24240
7456 24240 13058 -4650 -39807 -13672 23160 43250 18504 8901 -1569 -6652 12317 31032
7444 31032 28098 5391 -22215 -2152 -1025 19276 33864 8365 -13318 -8473 22686 -1821
7432 -1821 26799 11856 14060 -15213 2399 11708 12313 29051 37566 45748 42829 56092 51630 22796
7418 22796 -16191 -5059 10892 5419 48193 56642 36896 21385 15415 13008 5261 -4063 2207
7405 2207 21508 30809 22703 16013 19741 -24816 5736 5639 2577 3062 12947 26954 20434 19470 11769
7390 11769 -21408 -15269 9711 -3322 12430 13255 14850 -8875 -2365 -23290 3418 -7266 -1544
7377a544J4324k1104L40j9896O83J1135l1551M4412J9838j8083j3951J0195Q203
7364C001O295j5718K9623j1107l3103L2043M017j7203l0229N4164r081j3080K0201
7351A9823j1396J0695k9981o924J6800l598J9761j5593n617J4570L1321l816k3069
7338A2976J7215K6661k8847l792p577Q573r115P219q022J8485k9775j0444P817
7325A374Q676R640l3748k3362K3391n494J9452L2313J4151N678m836m9337Q920
7312F818L712k0809J2803Q349l589j6001k8750M8644j4229r279n451N85J1215
7299e982j3877K6100k1175M764R237j5582K1340M743l4211M6783k8692P665j5144
7286a4031k4865L3252j2226k1264K9498N333l517K017O907L617j8955K5777J0782
$$ plain form
7377 -1544 12780 -8324 -7984 -27880 -27197 -16062 -47613 -3201 16637 -1446 -15397 -5202 3001
7364 3001 9296 -6422 23201 12094 -21009 11034 15051 -2152 -32381 21783 12702 -378 19823
7351 19823 8427 19122 -10859 -17783 -983 -4581 15180 -413 -6030 8540 39861 36045 12976
7338 12976 30191 56852 28005 24213 16636 25209 16094 23313 15291 33776 4001 -6443 1374
7325 1374 10050 19690 -14058 -37420 -14029 -19523 -71 32242 46393 52071 47235 -2102 6818
7312 6818 10530 -10279 2524 10873 7284 -8717 -37467 11177 -3052 -12331 -17782 -17197 -5982
7299 -5982 -19859 6241 -14934 -10170 -933 -16515 4825 9568 -24643 22140 -6552 1113 -14031
7286 -14031 -38896 -5644 -17870 -39134 -9636 -4303 -7820 -5803 1104 4721 -14234 11543 22325
7273B2325l0671k0687L793J2063K4553q816o167l13k504J2202J1144j5356J2919
7260A4485M924j499p571k4043K5855q061J8006j7026l6362J0299R903j0018P9
7247b1029k2936K9731q195l890K4727J229l3425K6219P142r707j0617J5681J6751
7234A1681j9973J5316q488K6398j1115J409j5834n266K2928k1352J3260j9201
7222a0237m643O008K6210J179J194j4544j4195P602p85K0562K2875l2150j3061
7209c985j294l715J0919K1132r369k4213K8656o553l0803Q319K0001o476j2660
7196a0041K4272p464j6868p733J1221K491J8954m012k0322O999k1996R962K8945
7183A4408j0368K4239J1505k1419k7079k3487K9613J7165k1412J0483k5812K1756
$$ plain form
7273 22325 -8346 -29033 -25240 -13177 11376 2560 -3607 -3920 -6424 5778 16922 1566 14485
7260 14485 19409 17910 10339 -13704 12151 4090 22096 5070 -31292 -20993 -11090 -21108 -21029
7247 -21029 -43965 -14234 -22429 -26319 -1592 -363 -33788 -7569 -427 -10134 -20751 -5070 11681
7234 11681 -8292 7024 -1464 24934 13819 15228 -606 -5872 17056 -4296 8964 -10237
7222 -10237 -14880 -8872 17338 18517 19711 5167 -9028 -1426 -2211 18351 41226 9076 -3985
7209 -3985 -5279 -8994 1925 23057 13688 -10525 18131 11578 -19225 -10906 9095 2619 -10041
7196 -10041 14231 6767 -10101 -17834 -6613 -4122 14832 10820 -9502 -2503 -24499 -14537 14408
7183 14408 4040 28279 39784 18365 -8714 -32201 -2588 14577 -6835 3648 -22164 -408
7171d08j2570n304K4676J7715j8663q996j06n649m205m653j274J5365N575m1199
7157c9696L8980J6670k6180j9378K5086L3138j1924k7689k052M0543M5282o5834
7145F946l1908l164J3789n47K1146O967l9j0437k4131k4727J1569J119L2531M272
7131C386j5593R003J0184J3738j5748k8027j222j9177K9270l926l217J9098L890
7118A659n400Q514J1000j2052M670n269k2826L8492k3380P392J92L626j5132J9325
7104A0811J0798l0813L896O465J502n328j3889M247j2499J0614J6177J6074k1615
7091c560K3424J0490k0393j2292j4639M9765k8549j4465M336J0617Q60L514p416
7078A692L7920q414j4861j9595J5728J5557m3697L5051m831j8055J1689m1159
$$ plain form
7171 -408 -12978 -18282 6394 24109 5446 -3550 -3656 -9305 -13510 -18163 -19437 -4072 1503 -39696
7157 -39696 -716 15954 -10226 -29604 -4518 28620 16696 -10993 -13045 27498 72780 6946
7145 6946 -24962 -28126 -14337 -14884 6262 13229 13190 2753 -21378 -46105 -34536 -33417 -886 3386
7131 3386 -12207 -3204 6980 20718 4970 -23057 -24279 -43456 -14186 -18112 -21329 -2231 1659
7118 1659 -3741 4773 15773 3721 8391 3122 -19704 18788 -4592 2800 2992 6618 -8514 10811
7104 10811 21609 -9204 -5308 1157 2659 -2669 -16558 -12311 -24810 -14196 1981 18055 -3560
7091 -3560 19864 30354 9961 -2331 -16970 32795 4246 -10219 -5883 4734 5594 9108 1692
7078 1692 39612 31198 16337 -3258 12470 28027 -15670 19381 14550 -3505 8184 -32975
7066c2975K5969K8342L658j883j9086J2878k4147J4420K0897o131k0013K4771
7054B6700Q335m0929j967J0828M566q070K1743J0943k1448j4249Q238K3535j1367
7041A6858j8123J6814k1255J4899j1624j6662R257L0544q099q751K5140j4958
7029A4040j7447K0192k4353O584j557j7528K9381j7690n496K7311L1473l271j7109
7016B4530K2701j3961P990j4350J0547L73k7760J3105l635l0313L1001J3803j0926
7003B3105l2274J5694J4514R348j5005r067N993J0934k3909J6870N388k15k161
6990A9215n655j1004k094Q07j462O477k3993J9930M3604k9126k5904m713J1822
6977b096P351M571O052r612J0303K6909j4146l2115K4533j4030L378q300K2118
$$ plain form
7066 -32975 -7006 21336 24994 23111 4025 16903 -7244 7176 28073 21942 1929 26700
7054 26700 35035 -5894 -7861 2967 7533 -537 21206 32149 10701 -3548 4690 28225 16858
7041 16858 -1265 15549 -5706 9193 -2431 -19093 -9836 20708 12609 3858 28998 14040
7029 14040 -3407 16785 -7568 -984 -2541 -20069 9312 -8378 -13874 13437 44910 41639 24530
7016 24530 47231 33270 41260 26910 37457 37830 10070 23175 19540 -10773 20228 34031 23105
7003 23105 -9169 6525 21039 30387 15382 6315 12308 23242 -667 16203 21591 21376 19215
6990 19215 13560 2556 462 1269 -193 6284 -17709 2221 45825 16699 -9205 -13918 -2096
6977 -2096 5255 9826 15878 6266 16569 43478 29332 -2783 21750 7720 11098 2798 24916
6964B4916j4933l432O906k0664P177K0018j7074j620L092j2820j89K5495L003
6951A9875j84M653r347l0510j019J7493K0426J6113j5077j1358J2236L2873j3052
6938D3122k1007J2160r876K643J678N977p822j5906J2595J7826q421l0718K6879
6925B9130J8890l0471j0851l34K5205K7141m2003j2997M0725N368o547k9428J1896
6912B5724q108k8554N495j6466K5559J9742k4941L7343o513m4437J3874J0845
6900I563j8643J621L028L9051J2398m735k0715j3835q658K816J1334K6507n882
6887C3850M970p531k585j7736M807l079j2525m894M0721j0322j2923r111Q29N580
6873A0051k0059K4057j1672j433O967R457P919P11m245K2122N766j6493k7867
$$ plain form
6964 24916 9983 6551 13457 -7207 -30 19988 2914 1294 4386 -8434 -8623 16872 19875
6951 19875 19691 24344 14997 -15513 -16532 961 21387 37500 22423 11065 23301 56174 43122
6938 43122 22115 34275 24399 27042 28720 34697 26875 10969 23564 41390 32969 2251 29130
6925 29130 48020 17549 6698 6364 31569 58710 16707 3710 44435 49803 43256 13828 25724
6912 25724 17616 -10938 -5443 -21909 3650 23392 -1549 35794 29281 -15156 -1282 9563
6900 9563 -9080 -7459 -4431 34620 47018 42283 21568 7733 -925 1891 13225 39732 33850
6887 33850 38820 31289 28704 10968 15775 12696 171 -4723 35998 25676 12753 3642 4471 10051
6873 10051 -10008 14049 2377 944 7911 17368 25287 25998 21753 43875 49641 33148 5281
6860E281M100K4115J625n31k3755k6913O105J6413m792R480K6413j5173R565Q313
6846D0246k6179K638J2634j8715K0588l1314Q449o251k1562J6847J8652q87J1548
6833B6694j2756o299J3678j1532j7891K9424o855Q791K4142j8528k9092J9404
6821A9180j9278K5688K1755l7805J5759K1264j9558k89l15K711J1998p088N691
6808C9713J869j6955L841J7183j3613J7851j3071j6962j0384K610J0753k0235
6796B600M4096p719l1970p707k839o925K4544K633k4255L8945K0514J3003j2316
6783E2604l3998K899J6364J4049K721k7793k1615q248K5229j1454r206K1863J2063
6770C5478l0122m579K5177L9224j7333j8636j0795m6823K7419M6591j4879J6741
$$ plain form
6860 5281 9381 33496 35121 34590 10835 -16078 -9973 6440 1648 11128 37541 22368 31933 40246
6846 40246 14067 16705 29339 10624 31212 -102 8347 2096 -19466 -2619 16033 15146 26694
6833 26694 13938 7639 21317 9785 -8106 21318 14463 23254 47396 28868 -224 19180
6821 19180 -98 25590 47345 9540 25299 46563 27005 26716 26401 29112 41110 34022 39713
6808 39713 41582 24627 28468 45651 32038 49889 36818 19856 9472 12082 22835 2600
6796 2600 46696 38977 7007 -700 -3539 -10464 14080 16713 -7542 31403 51917 64920 52604
6783 52604 18606 21505 37869 51918 54639 26846 5231 -3017 22212 10758 1552 23415 35478
6770 35478 5356 777 25954 65178 47845 29209 18414 -28409 -990 45601 30722 47463
6758D7463k3076j576j284j4533J4485J6273l721j479q95K409M128j6541j874J1952
6744C1731k3962k1506R772m81J0674K090p624J0617L804K1814k1483l346L3623
6731D5723j1368O218J0381j8562j0632K9321J466j4028m557j9168k0899L3171
6719B7066K3348j5572k4332k1886J5779Q877K2341q050m733J4943j4121J6751
6707D0411j2303l733L52O872q877q468q948K2845l981L069l250k1948N5808K0415
6693G8264l0887j485Q228k082j4255J3155k6912m2J6902k7656K5353J0275K702
6680E1560j1747K3032k2118q659J5569j8210M471K5970k8706K3017j1348l553
6668C9278L028p64l044j4045L1181J8129j1676j09m5708R551K0864N535j571k7038
$$ plain form
6758 47463 24387 22811 21527 6994 21479 37752 34031 32552 31657 34066 38194 21653 19779 31731
6744 31731 7769 -13737 -3965 -4446 6228 8318 694 11311 15115 36929 15446 12100 45723
6731 45723 34355 40573 50954 32392 21760 51081 52547 38519 33962 14794 -6105 27066
6719 27066 50414 34842 10510 -11376 4403 13280 35621 27571 22838 37781 23660 40411
6707 40411 28108 24375 24727 31599 22722 14254 5306 28151 24170 27239 23989 2041 57849 78264
6693 78264 47377 45892 54120 52038 37783 50938 24026 23984 40886 13230 38583 48858 51560
6680 51560 39813 62845 40727 32068 47637 29427 33898 59868 31162 54179 42831 39278
6668 39278 42306 41542 38498 24453 55634 73763 62087 61978 16270 25821 46685 52220 50649 23611
6654B3611l959K0228L6565n0828l517K2385J1830l2972j1206J2072M6101m585
6642F5725j5063j3487n121j4002J6032J9403K7534l3912o361J2213k267k64J8140
6629F8570j8800M764k3160J6752K9604k2801J4299Q430P887J315k5722p378J0609
6616F4369j6495K3316J5003n830j1456p34J0697o278k5725j940K7069j1598l002
6603E7396J0187j4880K1924N133j3866k4207O989L084j2448K7151j3636L9071
6591I1898K697r918M823k2156P080L421l178j3675N222P558q053k7668K0816J7912
6577G6779L3893k1878j9123q797L7895P62j664r888p093J7315O597Q613l6098
6564G7313J1264K0381j8137K3727l3807k4552L8206K7841k8702l15L413Q9J7803
$$ plain form
6654 23611 19652 39880 76445 25617 22100 44485 56315 23343 12137 24209 70310 65725
6642 65725 50662 37175 32054 18052 34084 53487 81021 47109 40748 52961 50694 50430 68570
6629 68570 49770 54534 31374 48126 77730 54929 69228 77658 85545 86860 61138 53760 64369
6616 64369 47874 71190 86193 80363 68907 68173 78870 72592 46867 44927 71996 60398 57396
6603 57396 67583 52703 74627 79760 65894 41687 48676 51760 39312 66463 52827 91898
6591 91898 94595 84677 89500 67344 74424 77845 74667 60992 66214 73772 65719 38051 58867 76779
6577 76779 110672 88794 69671 60874 98769 99531 97867 87979 80886 98201 104798 113411 77313
6564 77313 88577 108958 90821 114548 80741 56189 94395 122236 93534 93219 96632 96721 114524
6551A14524J1375J5988r384p191k619l904j5986Q764M5367J578k6031K4211m2336
6538A14356J5194o571L4224L976l496o69k1272K9110l700j093L567R015k9527
6525A43114M2018J6104k3206p411L320l5945K1711N105K958j6383M366l160L6327
6512A88918l9957k8992j5999L3236J2910K827j7042O930K2464O681k4564m6823
6500A00589K8999P546R478O224J2606k6992j7754J161p009j7341L0252K0450l3926
6487A14283K5592j205l4168M9329m4274j5438M205n763J7946j0694O20L4393q462
6474A26364N531L234k9206m2829J1182J6844J1163k5745L0763M380j3504M722
6462A02899K654l5166K8026p90j5287L1124K450P896P371j8886p176j2453L637
$$ plain form
6551 114524 125899 141887 132503 125312 122693 118789 102803 111567 156934 158512 132481 156692 114356
6538 114356 129550 122979 157203 161179 157683 157014 135742 164852 161152 160059 163626 172641 143114
6525 143114 185132 201236 178030 170619 173939 137994 159705 164810 167768 151385 155751 152591 188918
6512 188918 148961 119969 103970 137206 150116 152943 135901 142831 165295 171976 147412 100589
6500 100589 129588 137134 146612 152836 165442 138450 120696 121857 114848 97507 127759 148209 114283
6487 114283 139875 138670 104502 153831 109557 94119 98324 92561 110507 99813 100433 134826 126364
6474 126364 131895 135129 105923 63094 74276 91120 102283 76538 107301 111681 98177 102899
6462 102899 105553 70387 98413 97623 82336 113460 115910 123806 131177 112291 105115 92662 96299
6449I6299o542J5535J0544j852j5259l3294J6525J4315J99j231k4155J0456j0320
6436G1220j7940K3947j7269J0962J2148k3662j3820J7511k07J7485j2962K0537
6424H7950j124O330k317l0585M1300j2623J3070j8124q923K8254p458n47J4714
6411A09917j4009j5783K7111K2621r764k4998o097r15J412l514N714k4713J3477
6398H0459j947l2876J2746j8939K8358K1721j832j0818K7877K1689p667k6318
6386I2453k9282K9044J7760K430N9l791k0730J4339l537n614J2666O195k6492
6373H5500l389J999k915l885R800J0470J4409j3736J304J2117J306k1584K7115
6360A18511K416q975j3320l1135L1901k044l063j4409J6n249Q332K3695r145j0533
$$ plain form
6449 96299 89757 105292 115836 113984 98725 65431 81956 96271 96470 95239 71084 81540 71220
6436 71220 53280 77227 59958 70920 83068 59406 45586 63097 62890 80375 67413 87950
6424 87950 86826 93156 90839 60254 101554 88931 102001 83877 74954 103208 95750 95203 109917
6411 109917 95908 80125 107236 129857 120093 95095 88998 88083 89495 85981 91695 66982 80459
6398 80459 78512 45636 58382 39443 67801 89522 87690 76872 104749 126438 118771 92453
6386 92453 63171 92215 109975 112405 112464 108673 87943 102282 98745 93131 105797 111992 85500
6373 85500 82111 84110 81195 77310 87110 97580 111989 98253 99557 111674 112980 91396 118511
6360 118511 120927 111952 98632 67497 99398 97354 94291 79882 79898 74649 82981 106676 97531 86998
6346H6998o567J968K0175Q280j0900j3330J2782k0279J7332O368j1165m079R461
6333I7044K5553k0520J2169N234k0304o807j940N146K0365l410j267l806J9538
6320A26995O956j5979k3405l3986L6236K9177o988m858l5249L3596r481m00j1448
6307I1166J0158O055J9011L370k283j5088k0927K1142q247L5190k8040K0348K0317
6294A52172j1626k3335J049K033J4190J4229q742J4534j5613j5326Q465K7632
6282A59662l0837r778O149J4717K4942n925m398j8767r090R242K2309k2644L1518
6269A67100q962l0652K8377J4645J8071k0616l965J5211j8267l156J5471k0357
6257A52900j193L6269L493K450k37j6441j2899r656k393J9443J4491j9542r726
$$ plain form
6346 86998 80431 82399 102574 110854 99954 86624 99406 79127 96459 102827 91662 87583 97044
6333 97044 122597 102077 114246 119480 99176 92369 90429 95575 115940 112530 111263 107457 126995
6320 126995 133951 117972 94567 60581 96817 125994 119006 114148 78899 112495 103014 102614 91166
6307 91166 101324 107379 126390 129760 127477 112389 91462 112604 104357 139547 111507 131855 152172
6294 152172 140546 117211 118260 120293 134483 148712 139970 154504 138891 123565 132030 159662
6282 159662 128825 119047 125196 139913 164855 158930 154532 135765 126675 135917 158226 135582 167100
6269 167100 158138 127486 155863 170508 188579 167963 163998 179209 160942 157786 173257 152900
6257 152900 151707 187976 191469 193919 193682 177241 164342 154686 152293 171736 186227 166685 156959
6244A56959K9535L1034k0724j218J1461M451j4829J0727K3248O92J153J5958N758
6231B54205l862l5884M8131L1216q303n73J1802M593M6403J2849j0674L3023K2160
6218D05086L2455M7705j0005M3761L487J3733O535n1231J1831k947J4870K3856
6206E39136M4813J3766J9145j0411J3804n70J2181j2496k1613k2023j3179R448
6194E72001k6416J1030j07m485J2925N646Q437R514J5388l583J3111n9195m4188
6181E10078n8181j7338j1282m4481j1086L9968k9758k0706M4716o860l399K1937
6169D13608m2640j9831K3027j2668J3011l0029J3821K3154l4875R977k0616j0840
6157C25099L0347P548K2504J098n2256K2637r69r713l723j6703J5067J2875N1741
$$ plain form
6244 156959 186494 217528 196804 195586 207047 211498 196669 207396 230644 231336 232489 248447 254205
6231 254205 250343 214459 262590 293806 285503 284930 296732 301325 347728 360577 349903 382926 405086
6218 405086 437541 485246 475241 519002 522489 536222 542757 491526 503357 500410 515280 539136
6206 539136 583949 597715 616860 606449 620253 619683 631864 619368 597755 575732 562553 572001
6194 572001 545585 556615 556508 552023 564948 570594 579031 588545 603933 600350 613461 554266 510078
6181 510078 451897 434559 423277 378796 367710 407678 377920 357214 401930 395070 391671 413608
6169 413608 370968 351137 374164 361496 374507 344478 358299 381453 346578 356555 335939 325099
6157 325099 355446 362994 385498 386596 334340 356977 356008 346295 342572 325869 340936 353811 405552
6144D05552J5269p488r586j8028M0109j2813K5607R960l6713m718L7114J2681
6132D56946j0384k8733J4487J5373J1510K387J1521L1770K1462p499j9982o948
6120D91910J2834j4724K1503j0988N593M6805J3832L998J0949P371K0859k0746
6108E89196k0114K0412l2369N9051O651R728k7543K8994K758N4114l0657M0635
6096G00856J6085j9763K0651m341K2810j1583J5712m407J4526O85K7209K7532
6084H05972k9546J7634N092J9557J0567J6338K6345K1747K0035M707J2570L8190
6072I69208J9590l3927M8904J4226l707O4198n96o432M1306M6627K1081N7905
6060A238383J6289L0392L3022M9252O2396M3284J06193P9811N5681N0221N9576
$$ plain form
6144 405552 420821 413333 403747 385719 425828 413015 438622 448582 411869 407151 444265 456946
6132 456946 446562 417829 432316 447689 459199 461586 473107 504877 526339 518840 498858 491910
6120 491910 504744 490020 511523 500535 506128 552933 566765 570763 581712 589083 609942 589196
6108 589196 569082 589494 557125 616176 622827 632555 605012 634006 636764 690878 660221 700856
6096 700856 716941 697178 717829 713488 736298 724715 740427 736020 750546 751231 778440 805972
6084 805972 776426 794060 799152 818709 829276 845614 871959 893706 913741 918448 931018 969208
6072 969208 988798 954871 1003775 1018001 1014294 1078492 1077896 1071464 1112770 1159397 1180478 1238383
6060 1238383 1254672 1285064 1318086 1367338 1429734 1473018 1579211 1659022 1714703 1764924 1824500
6049A824500L0207J7776l727M756K060M4291Q9791O1512Q0100M9184R2273M3451
6037B336174K3403Q1602L5764M1713q973K2233j4080K3148P2170N3664L0254L1358
6025B728430J0934N0037R0853O9678Q4841N8373L1789M0704j3501L0568L3324
6014C216030K5413Q5971P8037R2490J36422J07710J40166J71764J43073J56881
6004D353957J12119J35220J68958J92007K06416K40877K41083K55807K41803L48951
5994F497198L41428L36493L79857L60737L81131L96297M44555M92061M94195N65508
5984A0689460N87890O43037O79337P07237P27840O89746P16666P40086Q04525
5975A6985824R35678J094153J323553J535706J789086K084039K411792K887033
$$ plain form
6049 1824500 1854707 1872483 1868756 1873512 1875572 1919863 2009654 2071166 2151266 2200450 2292723 2336174
6037 2336174 2359577 2441179 2476943 2518656 2509683 2531916 2517836 2540984 2613154 2666818 2697072 2728430
6025 2728430 2739364 2789401 2880254 2949932 3034773 3093146 3124935 3165639 3152138 3182706 3216030
6014 3216030 3241443 3327414 3405451 3497941 3634363 3742073 3882239 4054003 4197076 4353957
6004 4353957 4466076 4601296 4770254 4962261 5168677 5409554 5650637 5906444 6148247 6497198
5994 6497198 6838626 7175119 7554976 7915713 8296844 8693141 9137696 9629757 10123952 10689460
5984 10689460 11277350 11920387 12599724 13306961 14034801 14724547 15441213 16181299 16985824
5975 16985824 17921502 19015655 20339208 21874914 23664000 25748039 28159831 31046864
5967C1046864L360603M014761M982539O101758O438424M569514J462157k010226
5959E9966394l697918k768603q47089R56106K715429L617967K976201J803979
5951F4722466M70383R58776K532613L088241J536555j180880l652454m097344
5943F4378356k564779l24630N58924q2639j446334k752937k302866n07643J451709
5934E6407161L170980L485590J082090k724848o768074q223649p008429n261550
5926C4159271l915321l063600k432763k021535j732417j496210j287711j174559
5918A7035155r81553q74367q21450p86210p66012o71639n69971n00985m92460
5909A0570508m43099m16851l93800l40224l13428k56165k93341k77076k68868
$$ plain form
5967 31046864 34407467 38422228 43404767 49506525 55944949 60514463 61976620 59966394
5959 59966394 56268476 53499873 52652784 53608890 56324319 59942286 62918487 64722466
5951 64722466 65192849 66151625 68684238 71772479 73309034 72128154 68475700 64378356
5943 64378356 61813577 61488947 62047871 61965232 60518898 57765961 55463095 54955452 56407161
5934 56407161 59578141 63063731 64145821 61420973 54652899 46429250 39420821 34159271
5926 34159271 30243950 27180350 24747587 22726052 20993635 19497425 18209714 17035155
5918 17035155 16053602 15179235 14357785 13571575 12805563 12133924 11563953 11062968 10570508
5909 10570508 10127409 9710558 9316758 8976534 8663106 8406941 8113600 7836524 7567656
5900G567656k66153k77670j97076j86451k14942k19060j38530j15928j09272j27343
5890E715231q4042n3280k3233J6720J8124O098o9427j24498j25040j18823j03156
5879E054674m5722K410P384o307k1519r5227m4356l1890j2097k155q0051j43418
5867D581726r8979j22390j07998n6027j17119j00910q2817r7003r9159k1691k318
5856C675315j9623o8707j32019j89450k08182k01705j92108j46627j33665o9317
5846B313912p4467p5661r1574n5805q4120m3343n7656m911j1547j01399n0049
5835A663380k7894J0038l6794o6641l0354l5380k8238k5472l3114r726l3148k2123
5823A324534j076k8913k6201l0384M1440N243m3099j2479k7159o746k006j5238
$$ plain form
5900 7567656 7301503 7023833 6826757 6640306 6425364 6206304 6067774 5951846 5842574 5715231
5890 5715231 5631189 5577909 5554676 5571396 5589520 5595618 5526191 5401693 5276653 5157830 5054674
5879 5054674 5008952 5011362 5018746 5012439 4990920 4895693 4851337 4819447 4807350 4805195 4725144 4581726
5867 4581726 4482747 4360357 4252359 4196332 4079213 3978303 3895486 3798483 3699324 3677633 3675315
5856 3675315 3655692 3586985 3454966 3265516 3057334 2855629 2663521 2516894 2383229 2313912
5846 2313912 2239445 2163784 2072210 2016405 1932285 1888942 1831286 1826375 1814828 1713429 1663380
5835 1663380 1635486 1645524 1608730 1542089 1511735 1476355 1448117 1422645 1389531 1379805 1346657 1324534
5823 1324534 1323458 1294545 1268344 1237960 1279400 1284643 1241544 1229065 1201906 1195160 1193154 1177916
5811A177916o403Q660o316l3480M7959L5343K7181j3838l4039K5471l8912j0121
5799A179421j6258j2840o080J3137r253l9717l1623k2263R076K6928L0026l6055
5787A084499k3411l309k5965j977l703j0367l3026k7823k478r342r312L0702j6483
5774I48005k172m1417m7393l0245j2045p656k5885m0662j881j6122J8258j1714
5762G29071K701j1780j5515M921J3490k9387j3645k56L247L5335l2320j9993p753
5749F58116O764k7200N645j1101L8227k7928J9269R675j9174j4491J2976P324
5737F58102n278J3946J7717k9833L6267K388j0732J8185m679j399J2832j4434
5725F93082o058J7439J5288J4036p16J1562J6041k7496J7083J5004L4003J9641
$$ plain form
5811 1177916 1171513 1180173 1173857 1140377 1188336 1223679 1250860 1237022 1202983 1228454 1189542 1179421
5799 1179421 1163163 1150323 1144243 1157380 1148127 1108410 1076787 1054524 1063600 1090528 1120554 1084499
5787 1084499 1061088 1057779 1031814 1029837 1026134 1015767 982741 954918 952440 943098 933786 964488 948005
5774 948005 945833 904416 857023 826778 814733 807077 781192 740530 738649 722527 740785 729071
5762 729071 731772 719992 704477 709398 722888 693501 679856 679600 682847 718182 685862 665869 658116
5749 658116 664880 637680 643325 632224 670451 642523 661792 671467 652293 637802 650778 658102
5737 658102 652824 666770 684487 654654 690921 693309 682577 700762 696083 694684 707516 693082
5725 693082 687024 704463 719751 733787 733071 744633 760674 733178 750261 765265 799268 818909
5713H18909l1976N6553L2784K2784J0449L5479M3785O2044j4341L0192j772j9866
5701A045024M996J4231K7379k468O6073O849M4007J3189Q622K0623K5239q712
5689A265052n475O967K2559m663K475L3395J3178n078j038J0847J6551K1741L9197
5676A415708M5920K9104K821m5684J0357n1826K9388J9259l6795N0610Q745M7100
5664A524707P8150L7520K0318J04494P0746P4520R0983M0583K4676m869N83m873
5652B057538M0444K7561P0161O6353P1930O8848N9761K0155O4818O6174Q0860
5641B694603N4573K5710P374M3181N0233R675J6275J5036M2130Q1928J13250J57315
5629C311283J49956J37493Q9593J09991K7774Q8422Q4252J10287J37628J78719
$$ plain form
5713 818909 786933 843486 876270 899054 909503 944982 988767 1050811 1036470 1066662 1064890 1045024
5701 1045024 1050020 1064251 1091630 1089162 1155235 1162084 1206091 1219280 1227902 1248525 1273764 1265052
5689 1265052 1259577 1266544 1289103 1284440 1286915 1320310 1333488 1328410 1327372 1338219 1354770 1376511 1415708
5676 1415708 1461628 1490732 1493553 1447869 1458226 1406400 1435788 1455047 1418252 1468862 1477607 1524707
5664 1524707 1602857 1640377 1660695 1765189 1835935 1910455 2001438 2042021 2066697 2061828 2062411 2057538
5652 2057538 2097982 2125543 2195704 2262057 2333987 2402835 2462596 2482751 2547569 2613743 2694603
5641 2694603 2749176 2774886 2782260 2825441 2875674 2885349 2901624 2916660 2958790 3040718 3153968 3311283
5629 3311283 3461239 3598732 3688325 3798316 3826090 3914512 3998764 4109051 4246679 4425398
5619D425398J93326J30766J29020J02837R8226R5246J34500P6525Q6848J11570
5609E584262J66939J98535K33333K46019K88049L11356L37800L79961L45709K99255
5599H391218K32922J15069O6810N0193J50807K07310K37596K47005K27057K52467
5589A0178454L53319M60422M81432N38109N57151N68168O31035N92705N92701
5580A4953496O48574O79401P57825Q56296J052472J234569J430689J701280K020884
5571B5335486K388798K896388L451302L989555M980664O129230P249200O161139
5563F2581762L065215r91335m064829l947402k012140J72932K105089K902106
5555E9811398K069753P36400o75990j47072J741984L495957L466292J488548j465794
$$ plain form
5619 4425398 4618724 4749490 4878510 4981347 5079573 5174819 5309319 5385844 5472692 5584262
5609 5584262 5751201 5949736 6183069 6429088 6717137 7028493 7366293 7746254 8091963 8391218
5599 8391218 8624140 8739209 8806019 8856212 9007019 9214329 9451925 9698930 9925987 10178454
5589 10178454 10531773 10992195 11473627 12011736 12568887 13137055 13768090 14360795 14953496
5580 14953496 15602070 16281471 17039296 17895592 18948064 20182633 21613322 23314602 25335486
5571 25335486 27724284 30620672 34071974 38061529 43042193 49171423 56420623 62581762
5563 62581762 65646977 64655642 60590813 56643411 54631271 54804203 56909292 59811398
5555 59811398 61881151 62617551 61941561 61794489 63536473 67032430 70498722 71987270 70521476
5546G0521476l642181l530585j700094p11271j155401k303379l337285k627918
5538E1513362j110414N39201K113518L091006J790181j095458m638756o894171
5530D5308469o509100n102090l757473k920484k345884j953390j696322j516128
5522A9507598j289148j113772r72033q62903p43479p33842o97853o72721n48363
5513A1873484n17709m43788l78403m02373l72780l42942l44695l40797l06971
5504H423026l02849k86893k54400k71302l05201k32137k21273j86394j67336j51403
5494F043838j99041j35835j44696j39381j55705j55044r9056q6228p6671j08593
5484D743588m3271r0692n6236o3841o0061l7823o1467o3040q4445k3906l9523
$$ plain form
5546 70521476 66879295 63348710 61648616 60937345 59781944 57478565 54141280 51513362
5538 51513362 50402948 50942149 53055667 56146673 57936854 56841396 52202640 45308469
5530 45308469 38799369 33697279 29939806 27019322 24673438 22720048 21023726 19507598
5522 19507598 18218450 17104678 16132645 15269742 14526263 13792421 13094568 12421847 11873484
5513 11873484 11355775 10911987 10533584 10131211 9758431 9415489 9070794 8729997 8423026
5504 8423026 8120177 7833284 7578884 7307582 7002381 6770244 6548971 6362577 6195241 6043838
5494 6043838 5844797 5708962 5564266 5424885 5269180 5114136 5015080 4928852 4852181 4743588
5484 4743588 4700317 4609625 4553389 4489548 4429487 4391664 4330197 4267157 4182712 4158806 4119283
5473D119283j3370O0114L4158O8649J58770N4149N9726L9607l620q3419r8938
5462D395109o5121o4031J0561P7073O3218P6373o815l9139r7135j5308n921j9893
5450D308971o1008j09260j19048j10606p4330o7633j00551r3904o0089o1511k5329
5439C425702K3893J7902O5712j8177l1078p0557j60739j70824j83961j97443j68048
5428B532382j34393j29025j00135q8061o4873l0740n4476p7151l7500k6634k5220
5417A764174k6126m5594O325l4394n6481k1526M399l1637M525n2561k6065k5548
5405A459491o9550m8183k126l3570m1698k4347m310k6248j2397l2106j7822l0873
5393A116261j2692J6337o5k9912k0109j014J2757R824o1975j2392K1644O792k6360
$$ plain form
5473 4119283 4105913 4166027 4200185 4268834 4427604 4481753 4541479 4581086 4577466 4494047 4395109
5462 4395109 4329988 4265957 4276518 4353591 4416809 4493182 4486367 4447228 4350093 4334785 4328864 4308971
5450 4308971 4247963 4138703 4019655 3909049 3834719 3767086 3666535 3572631 3512542 3451031 3425702
5439 3425702 3449595 3467497 3533209 3515032 3483954 3413397 3252658 3081834 2897873 2700430 2532382
5428 2532382 2397989 2268964 2168829 2080768 2015895 1985155 1930679 1853528 1816028 1789394 1764174
5417 1764174 1738048 1692454 1698779 1664385 1607904 1586378 1590777 1559140 1563665 1511104 1485039 1459491
5405 1459491 1389941 1341758 1339632 1306062 1264364 1240017 1235707 1209459 1197062 1164956 1147134 1116261
5393 1116261 1103569 1119906 1119841 1089929 1069820 1068806 1081563 1091387 1029412 1017020 1038664 1045456 1019096
5380A019096O125l7128J0019o254M0355P026m841N174J5597k4664m0313O906l6904
5367I60194m2625J244k3100n166J52J2770j5299N107j3294k0101j0551J373k4568
5354H26136M906m2541J3283K248o594k0318L7030m9147P487q536p76l3839R071
5341G38410K2727k6837k1283P026J0910L7334J1726K923j0287M663j6467M957
5329G65802L5623M2097l2576J4948P175M9890N1463N7971J5490M5297K5113K7582
5317A105875M291j1991O316L9486K5006M6252L9707N7098O5230N4228Q2445J54481
5305A668424J66933J83916J94464J37615n91j39171k32622k22609j49381j19268
5295A487710r5308o2879m7572l7664j6208k5124L569K9n3389n1324j1620l0411
$$ plain form
5380 1019096 1025221 988093 998112 991858 1032213 1039239 1034398 1039572 1055169 1030505 990192 997098 960194
5367 960194 917569 918813 895713 890547 890699 903469 888170 893277 879983 859882 849331 850704 826136
5354 826136 831042 788501 801784 804032 797438 777120 814150 765003 772490 763954 763178 729339 738410
5341 738410 761137 734300 713017 720043 730953 768287 780013 782936 772649 777312 760845 765802
5329 765802 801425 843522 810946 825894 833069 882959 934422 992393 1007883 1053180 1078293 1105875
5317 1105875 1110166 1098175 1104491 1143977 1168983 1215235 1254942 1312040 1377270 1431498 1513943 1668424
5305 1668424 1835357 2019273 2213737 2351352 2350761 2211590 1978968 1756359 1606978 1487710
5295 1487710 1392402 1329523 1281951 1244287 1228079 1202955 1206524 1206553 1153164 1101840 1090220 1059809
5283A059809j3043n857j2695k5994N3338j776K6246L7053M2562K3461O2180Q090
5271A253374m0192m5320o5168j15442r175m3471j2754J8905j5720l2531k3455
5260H69051o088J2899n8315J874K8161j3761j625N584l703K2850k5715k8260M0999
5247H43951k8317j291L9786q538L0882o167J4j3923M1817r884j477r252J9499
5234H97100L0855L8647L607M4813k2861L0009J6236J2057K0397p921k872L5615
5222A095682Q07K3392J5131O662J090O613j0965O5883J7868L8075k917K6064M1904
5209A325289p155M8699N3271J8289Q2834J9831J05525Q7781N1764K5819K7303
5198A839250l3323j0789l7274j4879K375M1146L2198L9983j5289J6734M2085O0927
$$ plain form
5283 1059809 1046766 1040909 1028214 1002220 1055558 1053782 1080028 1117081 1159643 1183104 1245284 1253374
5271 1253374 1213182 1167862 1102694 987252 978077 934606 921852 940757 925037 892506 869051
5260 869051 862963 875862 817547 819421 847582 833821 832196 837780 834077 856927 831212 802952 843951
5247 843951 815634 814343 854129 845591 876473 870306 870320 856397 898214 888330 886853 877601 897100
5234 897100 927955 966602 970209 1015022 992161 1022170 1038406 1050463 1070860 1062939 1060067 1095682
5222 1095682 1096489 1119881 1135012 1141674 1142764 1149377 1138412 1204295 1222163 1260238 1257321 1283385 1325289
5209 1325289 1318134 1366833 1420104 1438393 1521227 1541058 1646583 1734364 1786128 1811947 1839250
5198 1839250 1805927 1795138 1757864 1742985 1745360 1786506 1818704 1858687 1843398 1860132 1902217 1963144
5186A963144N0824P1698N5857N4265J12820Q4939R3810J30825J13024J69748J38594
5175C039548J42254J00976L1602j1076j8811m4066m6170p8528l7641o6547o2804
5164B948737k006R072N183L3018M2258K3355O6820R4796J05921J01379J37750
5153C566283J53099J71359J84092J97921J36051J17997R4573O7600N0563L1363
5143D770901j5861q574n8340m9977n3152p2901p2145l4054M544K2246J8174P4855
5131D525716Q5101J18274J75510J91413J62909K47279K11613J89518K23997K59583
5121F390913K23502L21498K22526L21010K45788L11893L13916M32513M67859N75046
5111I826464L78501K47183J95661L42934K86020L92089M04036N29879N22042O56272
$$ plain form
5186 1963144 2013968 2085666 2141523 2195788 2308608 2393547 2487357 2618182 2731206 2900954 3039548
5175 3039548 3181802 3282778 3314380 3303304 3284493 3240427 3194257 3115729 3078088 3011541 2948737
5164 2948737 2946731 2955803 2960986 2994004 3036262 3059617 3126437 3221233 3327154 3428533 3566283
5153 3566283 3719382 3890741 4074833 4272754 4408805 4526802 4621375 4688975 4739538 4770901
5143 4770901 4755040 4746466 4688126 4638149 4584997 4512096 4439951 4405897 4410441 4432687 4450861 4525716
5131 4525716 4610817 4729091 4904601 5096014 5258923 5506202 5717815 5907333 6131330 6390913
5121 6390913 6614415 6935913 7158439 7479449 7725237 8037130 8351046 8783559 9251418 9826464
5111 9826464 10204965 10452148 10647809 10990743 11276763 11668852 12072888 12602767 13124809 13781081
5101A3781081N79181P79077P83083R08076Q52173J006971Q52150J010979R19973
5092B1472744J133223J147219J377739J314476J508314J468387J717458J675056
5084C2814616K011123J988458K466140K597682L367962L691987M883075N470226
5076E9291269O709144P744467J0029764J1775375J4786049J7228050K2689636
5069A50253754K8812777M0842853L7211245J4934758j2600617m3955427m5754868
5062A69744475l3800184k2541827j6798680j2329748r684431p400479o296419
5055F0892707n159519m647825l849530l151496k525862k578591k683206k508739
5047C3787939j960798j685562j391709j239693j016621q98992p27437o77982o46021
$$ plain form
5101 13781081 14360262 15139339 15922422 16830498 17682671 18689642 19541792 20552771 21472744
5092 21472744 22605967 23753186 25130925 26445401 27953715 29422102 31139560 32814616
5084 32814616 34825739 36814197 39280337 41878019 45245981 48937968 53821043 59291269
5076 59291269 66000413 73744880 83774644 95550019 110336068 127564118 150253754
5069 150253754 179066531 219909384 257120629 272055387 259454770 215499343 169744475
5062 169744475 135944291 113402464 96603784 84274036 74589605 67189126 60892707
5055 60892707 55733188 51085363 47235833 44084337 41558475 38979884 36296678 33787939
5047 33787939 31827141 30141579 28749870 27510177 26493556 25594564 24867127 24189145 23543124
5038B3543124o57679o68118o94405p87376j009122q64957p63974n98881n54488
5029A6944124m68166m74286m69980m26103m12275l87997l05988k32352j40683
5020A3626294k1436N9109K81445K83786J21561k41967o34084o81542m91977l49500
5010A1951689k25153j62908j05132r5308l8624n7499k1982r6543j20894k07165
5000A0820481k04395k49058k16105k53378j52612j80091j32532j51528q1556m8775
4990I150451O5623O845L5318j7123k321J5271J7951j335P3797Q4584J27138Q9970
4978I646169J32470J02024J17331p614L7806J6707J8391K7115J16568R4115J80415
4967A0481497J45103J92993J55983J69661J25725J74790J23951J72405J57182
$$ plain form
5038 23543124 22885445 22217327 21522922 20735546 19726424 18861467 18097493 17498612 16944124
5029 16944124 16475958 16001672 15531692 15105589 14693314 14305317 13999329 13766977 13626294
5020 13626294 13604858 13663967 13945412 14229198 14350759 14108792 13474708 12793166 12301189 11951689
5010 11951689 11726536 11563628 11458496 11363188 11324564 11267065 11245083 11148540 11027646 10820481
5000 10820481 10616086 10367028 10150923 9897545 9744933 9564842 9432310 9280782 9199226 9150451
4990 9150451 9216074 9222919 9258237 9241114 9238793 9254064 9272015 9270680 9344477 9429061 9556199 9646169
4978 9646169 9778639 9880663 9997994 9990380 10028186 10044893 10063284 10090399 10206967 10301082 10481497
4967 10481497 10626600 10819593 10975576 11145237 11270962 11445752 11569703 11742108 11899290
4958A1899290K11833K27070L07872M14880M97192O27035Q31344J083574J227745
4949A7327835N99958j59619j167486j412179j181733p93053o01965m32078l38595
4940A1841085k45919k59953j57290j96667k12172k27998j85354k28443j62470
4931I964819j47198j30127j24120r3510q7072r0529j09877j32291k29429k58921
4921H561745l05295k87759k87703l01581k68723k66584k21064j80749j72199j32646
4911F137442j05620j30915j21685q2864r8775k1608l4259k2066Q311r249j569
4900E517143n5108m8222j04387j56969k07906j78564j52566j91080k02091j63160
4890D057090j52325r4192r9883r4805r9493q2178k2061p1721j21539o6982j12031
$$ plain form
4958 11899290 12111123 12338193 12646065 13060945 13558137 14185172 15016516 16100090 17327835
4949 17327835 17927793 17768174 16600688 15188509 14006776 13213723 12611758 12179680 11841085
4940 11841085 11595166 11335213 11177923 10981256 10769084 10541086 10355732 10127289 9964819
4931 9964819 9817621 9687494 9563374 9469864 9382792 9292263 9182386 9050095 8820666 8561745
4921 8561745 8256450 7968691 7680988 7379407 7110684 6844100 6623036 6442287 6270088 6137442
4911 6137442 6031822 5900907 5779222 5696358 5597583 5575975 5541716 5519650 5527961 5518712 5517143
4900 5517143 5462035 5413813 5309426 5152457 4944551 4765987 4613421 4422341 4220250 4057090
4890 4057090 3904765 3810573 3710690 3615885 3516392 3434214 3412153 3340432 3218893 3151911 3039880
4879C039880j14221q0124m0223o9119p5952n5126l6520m6667n4007m5530k2626
4868B399765o9982k8206q034K7986n1106r187n9772k7977m7753j6783n3582l6983
4856B018386j7639k3036k3203j6904l5101j4605k6095J2105J2905K2437l2368
4845A876882L4367M968J1068j4098N1599K5053M5957L5553K1333L4603O1125L4615
4833B223025P4774R4629J70394J98613J75692N6412q4564k24490k42458j69039
4823B272988r0848q1064j04920o6675m1537p5122m7833n1726l9614n6853k6387
4812A590409n4888n3717j1137j8810k0382n3322k8100P637j2282j4941l5685J810
4800A296592n722m567j8370m4261k1834n294k6230P114M861l599k0246l8274p734
$$ plain form
4879 3039880 2925659 2845535 2805312 2736193 2660241 2605115 2568595 2521928 2467921 2422391 2399765
4868 2399765 2329783 2301577 2293543 2321529 2270423 2261236 2201464 2173487 2125734 2108951 2055369 2018386
4856 2018386 2000747 1977711 1954508 1937604 1902503 1887898 1861803 1873908 1886813 1909250 1876882
4845 1876882 1911249 1916217 1927285 1913187 1964786 1989839 2035796 2071349 2092682 2127285 2188410 2223025
4833 2223025 2297799 2392428 2562822 2761435 2937127 2993539 2908975 2684485 2442027 2272988
4823 2272988 2182140 2101076 1996156 1929481 1887944 1812822 1764989 1713263 1673649 1616796 1590409
4812 1590409 1535521 1481804 1470667 1451857 1431475 1378153 1350053 1357690 1345408 1330467 1294782 1296592
4800 1296592 1290870 1286303 1267933 1223672 1201838 1196544 1170314 1177428 1182289 1178690 1158444 1120170 1112436
4787A112436L5044n884j5605L210J215k0585J1093j1072J9715K4477k3363J2436
4775A143117K260o493l3662k1044Q750k4570J1653K3531m26k0738j2036j3535
4763A056807R9L3032j0240J4022K7248R825j8867L0181J6310j2224K3331k239
4751A167285k087L5410o76L4756j3291L4487K2257L8225M0446P4491O8831P5242
4739A575376N6361L326N2993N2621Q7541R3575N6704K3144j271N6419O2734O5364
4727B184887J6295p574r5370m8364m345l0497k8075m4203n1427n0948o3307k0826
4715A756246j0962l3842n2147l9633o3898n1832l5854J8472k0135k190J8745N210
4703A488180K0599M5195J261O7661L4653Q2317Q2880Q5590J12276J41439J65491
$$ plain form
4787 1112436 1147480 1141596 1125991 1129201 1130416 1109831 1120924 1109852 1129567 1154044 1130681 1143117
4775 1143117 1145377 1138884 1105222 1084178 1092928 1068358 1080011 1103542 1103116 1082378 1070342 1056807
4763 1056807 1056906 1089938 1079698 1093720 1120968 1130793 1111926 1142107 1158417 1146193 1169524 1167285
4751 1167285 1165198 1200608 1199932 1234688 1221397 1255884 1278141 1316366 1356812 1431303 1500134 1575376
4739 1575376 1631737 1635063 1688056 1740677 1828218 1921793 1978497 2001641 2000370 2056789 2119523 2184887
4727 2184887 2201182 2193608 2098238 2049874 2045529 2015032 1986957 1942754 1891327 1840379 1777072 1756246
4715 1756246 1745284 1711442 1659295 1619662 1555764 1503932 1468078 1486550 1466415 1464225 1482970 1488180
4703 1488180 1508779 1553974 1555235 1622896 1657549 1739866 1822746 1908336 2020612 2162051 2327542
4692B327542J93613K24816K61883K89392K72047J90636J24990K37j27623j92604
4682C564929k23822k47531j99363j49128j10905r1409l4489m3531n2326j9797
4672B392628O502J9759K3760K0699L5437L4225M5735M9226Q1187Q3519P3754J29386
4660B995817J30483J34118J56970J92972K26223K58898K79389L28597M24015M64132
4650E591614M93664O35541P24651P87518P34373N39495K43303m2495l41567m69472
4640H896625m90123m07039k71946j10430j5697M9959J38670L24108M97980O50924
4630I263031P97228P63741N43259J49450l15598o84191r57733j070566j031249
4621G457372p71266n96481n08109l28611k87342k87158k30233j83834j86985j97617
$$ plain form
4692 2327542 2521155 2745971 3007854 3297246 3569293 3759929 3884919 3885156 3757533 3564929
4682 3564929 3341107 3093576 2894213 2745085 2634180 2542771 2508282 2464751 2412425 2392628
4672 2392628 2399130 2418889 2442649 2463348 2498785 2533010 2578745 2627971 2709158 2792677 2866431 2995817
4660 2995817 3126300 3260418 3417388 3610360 3836583 4095481 4374870 4703467 5127482 5591614
4650 5591614 6085278 6720819 7445470 8232988 8967361 9506856 9750159 9707664 9366097 8896625
4640 8896625 8406502 7999463 7727517 7617087 7601390 7651349 7790019 8114127 8612107 9263031
4630 9263031 10060259 10824000 11367259 11516709 11201111 10516920 9559187 8488621 7457372
4621 7457372 6686106 6089625 5581516 5252905 4965563 4678405 4448172 4264338 4077353 3879736
4611C879736j81515j20525j26508j05354m3724p5648o0340n3148o2227n6971p4459
4600B919317q9956o8909k7575p2269l1420l9278p3849o1116q6964p3169o1188
4589B233624l1003n7429o3801j9632M4789m610L2227N6634L1749P0703J53703
4578B446954J34999J14128J13858L657p2428j73581j90376k21915j77877j21350
4568A856069j39288q3142q3261m1664n9614o8645l3350m4792n6943j7989l5047
4557A192334n2796l9895J9079l2431n6184k8647J9645p000q317k1238l499r22
4545I80129k3641j3245j2270k7574J0506k9392J938j1696P477K6331l2614J1047
4533H86996m501J834J609j9019l339Q740l6847k6687K4044K580L517J6650P969
$$ plain form
4611 3879736 3698221 3577696 3451188 3345834 3302110 3226462 3166122 3112974 3050747 2993776 2919317
4600 2919317 2829361 2760452 2732877 2660608 2629188 2589910 2516061 2454945 2367981 2294812 2233624
4589 2233624 2202621 2145192 2081391 2061759 2106548 2101938 2134165 2190799 2222548 2293251 2446954
4578 2446954 2581953 2696081 2809939 2813596 2741168 2567587 2377211 2155296 1977419 1856069
4568 1856069 1716781 1633639 1550378 1508714 1449100 1380455 1347105 1302313 1245370 1227381 1192334
4557 1192334 1139538 1099643 1118722 1086291 1030107 1001460 1021105 1014105 1005788 984550 981051 980129
4545 980129 956488 943243 930973 903399 913905 884513 886451 874755 882232 908563 875949 886996
4533 886996 882495 884329 885938 866919 863580 872320 835473 808786 832830 835410 838927 855577 863546
4520H63546m41K4318q334K570O882J6030O5551j0881l0362k3874L0781j3795J7313
4507I39304N0881j2452l989O777J5416O242l0396j2943K888Q037j3548k4957J5460
4494I46720J1458j7550R252J2846o762K5306M1993K7297L6331M1450R026O6857
4482A204224M3725K9415M1595P8518N3783J930N3685K8529N398k332K3206k1330
4470A540346L3141L2399K6192M4123L3570J781L0974M5031j8036O6801O4040N2941
4458A953303P8537R0997Q8484R5376N6831R5441M4108K2195K1802J503k0952M68
4446B528093L0016L1664O2196O3838N5519L4476N0356Q6701P4159L2281N5627
4435C104926K3337P4193M1647P9172R8470P0492M7055O9206L988k2987o7587n0508
$$ plain form
4520 863546 863105 887423 879089 881659 888541 904571 970122 959241 928879 905005 935786 921991 939304
4507 939304 990185 977733 973744 980521 995937 1002179 971783 958840 961728 969765 956217 931260 946720
4494 946720 958178 940628 949880 962726 955964 981270 1023263 1050560 1086891 1128341 1137367 1204224
4482 1204224 1247949 1277364 1318959 1397477 1451260 1453190 1506875 1535404 1540802 1538470 1561676 1540346
4470 1540346 1573487 1605886 1632078 1676201 1709771 1711552 1742526 1787557 1769521 1836322 1900362 1953303
4458 1953303 2031840 2122837 2211321 2306697 2363528 2458969 2503077 2525272 2547074 2548577 2527625 2528093
4446 2528093 2558109 2589773 2651969 2715807 2771326 2805802 2856158 2942859 3017018 3049299 3104926
4435 3104926 3128263 3202456 3244103 3323275 3421745 3492237 3539292 3608498 3612486 3589499 3521912 3471404
4423C471404p3283j6846l4735n403k039J8695L9682O5963O1122N2166K6072O6469
4411C669267L5667J5191M0120m5740K3609L0045K9239j3378k4092l8774j20614
4400C600540j55232j41269j06541j05868j12982p8582m5332j1226m5557j7017
4390B780934M5560l6781k8878K1132k0374q4705k3757J8166J18J8653o712K0133
4378B703489n1793p3188j19893q9527j20534j16059r7874p5660o4988m5860m2039
4367A806074n2922j3635p2040l7043k8263p720m5925L932m2542l2246j6575j8469
4355A442626j6437l4507J440l3626l3765p2851j9101k1616m4910k6381m0280j1633
4343A088959k4996l3376m4591M2l7541n0609J448l6851o700k1920n409k1877m159
$$ plain form
4423 3471404 3398121 3381275 3346540 3341137 3339098 3357793 3397475 3463438 3524560 3576726 3602798 3669267
4411 3669267 3704934 3720125 3760245 3714505 3738114 3768159 3797398 3784020 3759928 3721154 3600540
4400 3600540 3445308 3304039 3197498 3091630 2978648 2900066 2854734 2843508 2797951 2780934
4390 2780934 2826494 2789713 2760835 2781967 2761593 2676888 2653131 2671297 2671415 2690068 2683356 2703489
4378 2703489 2651696 2578508 2458615 2369088 2248554 2132495 2034621 1958961 1893973 1848113 1806074
4367 1806074 1753152 1739517 1667477 1630434 1602171 1594451 1548526 1552458 1509916 1477670 1461095 1442626
4355 1442626 1426189 1391682 1393122 1359496 1325731 1252880 1233779 1212163 1167253 1140872 1100592 1088959
4343 1088959 1063963 1030587 985996 986038 948497 897888 899336 862485 855785 833865 828456 806579 802420
4330H02420k6361N73n707k2730K6019P731j8413J2598j6657M4927r52q594j4965
4317G79889m437m1546p991Q104j4271m008J1639j3032j5372k7135J2311K8471
4305G12622m8565r091n802r638k2406L3957J2357j8764m040J8223P124Q550k7893
4292F46634n96j1458J2079N849j3014L092k6160q843m578P29K2526m3612m485
4279E78163J7402J9844J7992J54L589r834k4583j1329k865N653K6047J0651k1042
4266F09842L891K8405r91n358j5265k167K8922J6011q664J446k513O533J3105
4253F73197P96k7588j528J1309O422q649J919L8712J5881K2388p142J1087J1889
4240G48693m6280l219j4971K5570M8379K431l2224O529k0270k699J1116O317R527
$$ plain form
4330 802420 776059 776632 770925 748195 774214 781945 763532 776130 759473 804400 803448 794854 779889
4317 779889 775452 733906 725915 734019 719748 715740 727379 714347 698975 671840 684151 712622
4305 712622 664057 654966 649164 639526 617120 651077 663434 644670 640630 658853 665977 674527 646634
4292 646634 646038 634580 646659 652508 639494 642586 616426 607583 603005 603734 626260 582648 578163
4279 578163 595565 615409 633401 633555 637144 627310 602727 591398 588533 594186 620233 630884 609842
4266 609842 613733 642138 641147 635789 620524 618357 647279 663290 654626 656072 653559 660092 673197
4253 673197 673993 646405 644877 656186 662608 653959 655878 694590 710471 732859 725717 736804 748693
4240 748693 702413 699194 684223 709793 758172 760603 728379 734908 714638 711939 723055 729372 738899
4227G38899o003J5592j848k6430J0037m4100k5207Q88K864M032P129p544l9862
4214F28447j3307j7006j0443J7834j6660o84j5925l7934J7400L0174l2906r932
4202E39058l898J3849k3678j1892j3338k5770M1369k6268q200j2926j0602p916
4190D49788J2533o480k0014j190N532J2441J435k4373j7765q1p758R650O659l3763
4176C86614J9328j4270k7002K5609N196l9662k4511j1822K0912k5734N181K1127
4164C40966j6988j6953O502L5409j4243J1329k531l7950R361J6052k9930j7594
4152B83430J0087M684j7940j9851O8863J6319k5184J3592j5358k240m563k438
4140C09401j2382M26j721k1757R214J4382J751J6976k7111J6228n362J6869Q313
$$ plain form
4227 738899 732896 748488 746640 720210 730247 686147 660940 661828 664692 668724 675853 668309 628447
4214 628447 615140 598134 587691 605525 588865 588181 572256 534322 551722 581896 548990 539058
4202 539058 535160 549009 525331 513439 500101 474331 515700 489432 481232 468306 457704 449788
4190 449788 462321 455841 435827 434637 440169 452610 454045 429672 411907 411826 404068 413718 420377 386614
4176 386614 405942 391672 364670 390279 395475 355813 331302 319480 340392 314658 319839 340966
4164 340966 323978 307025 313527 348936 334693 346022 343491 305541 314902 330954 301024 283430
4152 283430 293517 298201 280261 260410 329273 345592 320408 334000 318642 316402 311839 309401
4140 309401 297019 297445 295724 273967 283181 297563 299314 316290 289179 305407 300045 316914 325227
4127C25227l7171Q671p065J439K0873J8921j8195k934J1066P91r384L0927l887
4114C39279k974J3515J0199n186J0579J6877l25l5429K1274j4141L4652J7630
4102D05950L866K2348r825j5840J7090j4718L7546K9291J2298l3183k538J0601
4090D62886j1397Q993o718M2773j9809K251j4004q488j3778J6381J7184j3520
4078D62754k3514M425Q692l2988L9044k2402k2102J2287j4733N561K223q892q255
4065D02100K4188J8111j689j2516J7545k8666l433L082J7092k5059m038o849M970
4052D04838K4283k0603K7547j6937j0480M0716P992k6339k549K568p317j6666
4040D07053J912m802k4705Q243P717j2739O037P12J6173p431j5552J2522l9125
$$ plain form
4127 325227 288056 296727 289662 291101 311974 330895 312700 309766 320832 321623 312239 343166 339279
4114 339279 336305 349820 360019 354833 365412 382289 381964 346535 367809 353668 388320 405950
4102 405950 409816 432164 422339 406499 423589 408871 446417 475708 488006 454823 452285 462886
4090 462886 451489 460482 453764 496537 476728 478979 464975 456487 442709 459090 476274 462754
4078 462754 439240 443665 452357 419369 458413 436011 413909 426196 411463 417024 419247 410355 402100
4065 402100 426288 444399 442710 430194 447739 419073 415640 418722 435814 410755 406717 399868 404838
4052 404838 429121 408518 436065 419128 408648 449364 457356 431017 428468 431036 423719 407053
4040 407053 408965 404163 379458 387701 395418 382679 388716 389428 405601 398170 382618 395140 356015
4027C56015r769M915j6500l6822K7675k9246J9487r67j4750r770L1556j171k1526
4014B99127o471r62J9080m3137P993k4977J5403P582J0715k0939J915K3965K674
4001B91968k7113k2986J5575r428n623L5707K1287k3459K7513l5882N647J0277
3989B83483m245J972J718k7932J9658P4j2817J8120J1109n473J497n937l088j5334
3975B62805J1531Q56K1413r932l9399J7805j6091k4787L3848j0700k932J0953
3963B55370K2543K4299l1380L231M7262j710l626k6226J5405J0124k2860K8322
3951C20754k0051J1213r977j421J0044J4936j1961J1400J0148K7244m4566J4679
3939C32442Q926K6139K0720j8640M077j1241k6207L6049j0061l4902j1757M854
$$ plain form
4027 356015 346246 351161 334661 297839 325514 296268 315755 314788 300038 290268 321824 320653 299127
4014 299127 292656 291694 310774 267637 275630 250653 266056 273638 284353 263414 265329 289294 291968
4001 291968 264855 241869 257444 248016 242393 278100 299387 275928 303441 267559 273206 283483
3989 283483 279238 281210 282928 254996 274654 274728 261911 280031 291140 285667 287164 281227 278139 262805
3975 262805 274336 275192 296605 286673 247274 265079 248988 224201 258049 247349 244417 255370
3963 255370 277913 302212 270832 274063 321325 319615 315989 289763 305168 315292 292432 320754
3951 320754 300703 311916 301939 300518 310562 325498 313537 324937 335085 362329 317763 332442
3939 332442 341368 367507 388227 369587 373664 362423 336216 372265 362204 327302 315545 320399
3927C20399J9884L726q592K789n006n971R53L1616K610m0982K2690l713Q756J2109
3913C61268J2388j8704K809O289j0906j5274O900J2125j4145K2473j562k3412
3901C40249K6487j02j1297j0594J7106j0848k07J7416K7003Q783m540L3044k7137
3888D05363j7886J951k7460J9259R913j7337J8513M4095r938j1143q166K655L0496
3875D40315N643n277o975J4158l0273L1968O358M213L7822j8174q75J7565j593
3862D94875L7965M4790q932K8547K5304J3021P161R246K9266k1595K1906O5934
3850G47488L0640j19J9286j5845M5329l807L62L3569K1724K3102L7474K4978L4208
3837I98389L6700K5366O4025K4965J5035O2907N4428P5392O3257P2121P4300J08984
$$ plain form
3927 320399 340283 344009 335417 338206 333200 327229 328182 359798 362408 321426 344116 340403 349159 361268
3913 361268 373656 354952 357761 364050 353144 337870 344770 356895 342750 365223 363661 340249
3901 340249 366736 366634 355337 344743 361849 351001 350794 368210 395213 403996 399456 432500 405363
3888 405363 387477 389428 361968 381227 391140 373803 392316 436411 426473 415330 407164 409819 440315
3875 440315 445958 440681 433706 447864 417591 449559 455917 460130 497952 479778 478903 496468 494875
3862 494875 532840 577630 568698 597245 622549 635570 642731 651977 681243 659648 681554 747488
3850 747488 778128 778009 797295 781450 826779 822972 823334 856903 878627 901729 939203 964181 998389
3837 998389 1035089 1060455 1124480 1149445 1164480 1227387 1281815 1357207 1420464 1492585 1566885 1675869
3825A675869Q3714Q9791J17978J43506J16156R8012J20236O9405L0970n4812j00259
3814B390566j00224j66795j47218p4215j11508p8354m6612J135J4437n441k5281
3803A650490n1906p6126o1314p7421p2709k5309l9541k6725m8421J9487P453l2143
3791A165815P081K7387N0816K2627L537q213J8078N2009J01225Q2778J15828j3104
3779A625864r4756j67564j36435n4384l9189r2026o0482l8861m2988q085j9399
3768H71695k0874j8509n14J9149o488m892L1369M6318K5278J4963L7511O5806
3756A060812O187l2915p3857j07704o1704m6286n4409m8526q247k4300j9881n428
3744E83742k2757k1423J5033o958j8374q360j8485k9277k7131p755j1018j6059
$$ plain form
3825 1675869 1759583 1849374 1967352 2110858 2227014 2325026 2445262 2514667 2545637 2490825 2390566
3814 2390566 2290342 2123547 1976329 1902114 1790606 1712252 1665640 1666775 1681212 1675771 1650490
3803 1650490 1598584 1522458 1461144 1383723 1311014 1285705 1246164 1219439 1171018 1190505 1197958 1165815
3791 1165815 1172896 1200283 1251099 1273726 1277263 1269050 1287128 1339137 1440362 1523140 1638968 1625864
3779 1625864 1531108 1363544 1227109 1172725 1133536 1041510 981028 942167 899179 891094 871695
3768 871695 850821 832312 831798 850947 844459 839567 870936 917254 942532 957495 995006 1060812
3756 1060812 1066999 1034084 960227 852523 790819 744533 690124 641598 633351 609051 589170 583742
3744 583742 560985 539562 554595 547637 529263 520903 502418 473141 446010 438255 427237 411178
3732D11178K036l8147r305K0644j9917L017J9219m5182q475o326K43J7912k6691
3719C20206O003l7420N6N866L4480j8450l425j0724j1799K1077J7991R014m163
3706C28712p546l9806k8923j2845R808m2469L5558n944l214M0850J2141N925o3979
3693B28268Q010R180Q771j3072p122o679m7390r298J0899J0530k106J5249q09
3680B04431k4379k6251J6857J5534L07P218m5153j4430J4680j2308N306k743J0329
3667A49398p25j0860k350J0919K6294k9011j2029n248j6421O152j610K6525j1890
3654A29144k4301O765k8452J0057r145K8295J7272j7620J1382k393K2614l868
3642A39750Q952j4852l063n201K4256L085j5534R098L044j4084J991j5670J4858
$$ plain form
3732 411178 413214 375067 365762 386406 366489 369506 388725 343543 335068 328742 328985 346897 320206
3719 320206 326209 288789 288845 294711 329191 310741 307316 296592 284793 305870 323861 332875 328712
3706 328712 321166 281360 252437 239592 249400 206931 242489 236545 233331 274181 286322 292247 228268
3693 228268 236278 245458 254229 241157 234035 227356 179966 170668 181567 192097 189991 205240 204431
3680 204431 180052 153801 170658 186192 186499 193717 148564 134134 148814 136506 141812 139069 149398
3667 149398 148673 137813 135463 146382 172676 143665 131636 126388 109967 116119 114509 141034 129144
3654 129144 104843 111608 83156 93213 84068 112363 129635 112015 123397 121004 143618 139750
3642 139750 148702 133850 130787 125586 149842 152927 137393 146491 149535 135451 137442 121772 136630
3629A36630J4750k5657K2417j0888K2259l0514K5929K716k3798N956l309N543
3617A42034M617K7140k8044j0336L001R848R280k620J1707l897O309L5710j0803
3604A93946j7597o457l087M689n747J9287J2723R9q228J3864K9672k8825J6817
3591B21156N229J6664Q205P982K1427j2799o875K3729J0314J6801P185k0427J2825
3578C11416j6863j8761J8331m503J3267K9791N205l5699L214J2774N3083n958
3566C65297J7271K9223k688j859O467l5695K52j5073p748K7040j5579l1511k4369
3553C11028J017R605K3724K480K1657j6918j3765L2828N819l975j6135O915q829
3540C55451R288m0508j8033O511J4118k6985J0371j7697l4876J5445j7658J5625
$$ plain form
3629 136630 151380 125723 148140 137252 159511 128997 154926 157642 133844 139800 136491 142034
3617 142034 146651 173791 145747 135411 138412 148260 157540 154920 166627 162730 169039 204749 193946
3604 193946 176349 169892 166805 171494 165747 185034 197757 197856 189628 203492 233164 204339 221156
3591 221156 226385 243049 251254 259236 280663 267864 260989 284718 295032 311833 319018 298591 311416
3578 311416 294553 275792 294123 289620 302887 332678 337883 302184 305398 318172 371255 365297
3566 365297 382568 411791 409103 407244 413711 378016 378268 363195 355447 382487 366908 335397 311028
3553 311028 312045 321650 345374 347854 369511 352593 338828 371656 377475 373500 357365 364280 355451
3540 355451 364739 324231 306198 312709 326827 299842 310213 292516 257640 273085 255427 271052
3528B71052Q492k6231N233l953l1314j5283l5855L7301j5523j9464R839P189k792
3515A88691j6625m375O21l6082J1153k3902J6611o445k8440J8467j3578k6335
3503G9761J8976K0682k8832O81j8177K7481j4950j3818J3551K6150n184m3477
3491F2844j1407K0880j1151m778L6390j2157j0003j8949J0751k4873K3252K6882
3479H7681M139l4475l0629K7055K2289k4744K1931l6869J8554j5853R613J875
3467E0567o913J9843q822j5919o666L0290J7699k2869O643K33j9818m146J2514
3454E2636j8578o696J1304o522p006K9272j9068L5421j8594l5214k8067K6934
3442A5822p760j3600J7709p925K3385p003L311R224K298L417k602l5029l363N215
$$ plain form
3528 271052 279544 253313 258546 254593 223279 207996 172141 209442 193919 174455 184294 191483 188691
3515 188691 172066 167691 168312 132230 143383 119481 136092 129647 101207 119674 106096 79761
3503 79761 98737 119419 90587 91268 73091 100572 85622 71804 85355 111505 106321 62844
3491 62844 51437 72317 61166 56388 92778 80621 70618 51669 62420 37547 60799 87681
3479 87681 91820 57345 26716 53771 76060 51316 73247 36378 54932 39079 48692 50567
3467 50567 43654 63497 54675 38756 32090 62380 80079 57210 63853 64086 44268 40122 52636
3454 52636 34058 27362 38666 32144 25138 54410 35342 70763 52169 16955 -11112 15822
3442 15822 8062 -5538 12171 4246 27631 20628 23939 33163 35461 38878 36276 1247 -2116 3099
3428C099O254J4461Q130j7482M238o88j439k881P806J3105j569k7304k4346N0020
3414C1404j0031j3429M1831N452O037j3808O584j5300J004k9209q304k5676J4550
3401h895R232M975k052l632j251K5670k364m43K436r262j1147j3599L1160j3747
3387G081L330q243k4498R169K8117M814p14J4044k4424J8687M347q979k5350J6371
3373A3752m436o515J0881j8310l097R655j1258J7844J7859m3257J0509N884J5300
3360A4811j5704k8455K9243o427L3573L620J79r392k1348q907J1805j061o245
3347d308K554J1805m599N893K507k483r709K7581n463k5534R708p530K872M1950
3333D5244j9451P374j732k227n627k6527k4924K2783M0710k0138k376M675J1165
$$ plain form
3428 3099 9353 23814 31944 14462 18700 18012 16573 13692 21498 34603 33034 5730 -18616 31404
3414 31404 21373 7944 49775 55227 61264 47456 54040 38740 39744 10535 2231 -23445 -8895
3401 -8895 337 5312 3260 -372 -1623 24047 21683 21240 23676 14414 3267 -10332 20828 7081
3387 7081 10411 2168 -22330 -13161 14956 19770 19056 33100 8676 27363 31710 22731 -2619 13752
3373 13752 9316 2801 13682 -4628 -7725 1930 -9328 8516 26375 -16882 -6373 -489 14811
3360 14811 -893 -29348 -105 -6532 27041 30661 30840 21448 100 -8807 2998 1937 -4308
3347 -4308 -1754 10051 5452 11345 13852 11369 1660 29241 23778 -1756 7952 422 3294 45244
3333 45244 25793 33167 31435 29208 23581 -2946 -27870 -5087 35623 15485 13109 17784 28949
3320B8949L0777j2564k9725J0534j0699M323j9986k2149O787K2249J2637k7126
3308e993o473J7570n622j945J6368O251m5556L2584K1088j2676J5939k2240N185
3295A4480J672P713k1496j811j5375J0517O2P331j588k4806K6678Q162K0733o255
3281B6017J3504q602k3652J8933j1011O548K332k6961J2994k1807k129J2902p755
3268h687O424K6287Q68j0722J532j6455j6383J5137J4037K752R896j1384j4785
3255a483j941Ok0251J5186K9448j000Q034j0574q772j7493J6991j2543m69j0282
3241a5143n920l151L1511k0636K1403j142J9342N11k3455J7171r829J3764j0170
3228A4256k5784J9690l874n896j1136l887J1956K1604j2058j476L9364J32k5847
$$ plain form
3320 28949 59726 47162 17437 27971 17272 21595 1609 -20540 -13753 8496 21133 -5993
3308 -5993 -12466 5104 -518 -2463 13905 20156 -25400 7184 28272 15596 31535 9295 14480
3295 14480 16152 23865 2369 558 -14817 -4300 -4238 3093 1505 -23301 3377 11539 32272 26017
3281 26017 39521 30919 7267 26200 15189 21737 24069 -2892 10102 -11705 -13834 -932 -8687
3268 -8687 -2263 24024 24892 14170 15702 -753 -17136 -1999 12038 14790 24686 13302 -1483
3255 -1483 -3424 -3418 -23669 -8483 20965 19965 27999 17425 8653 -8840 8151 -4392 -4861 -15143
3241 -15143 -21063 -24214 7297 -13339 8064 6922 26264 26775 3320 20491 10662 24426 14256
3228 14256 -11528 8162 4288 -1608 -12744 -16631 -4675 16929 4871 3395 42759 42891 17044
3215A7044j0544l356j0002J4878k79j2650Q533k847J7240j5900o514K2408k5966
3202g955L0972l3806o851L9498j5602j8228N673j7427P170J8509O044l275j3582
3189h860j2976k1449L1937n533K6102k6069M069N203L964j9898q801J1424J4410
3176f477J6821J3491k4647J6533R056j770j2515O730r803J1563L2225j8977j719
3163C0511r144j1719m957J1494j0823R401J4381r324k7937l228M004K3927j8454
3150a868j1977J8037j7637J469K538j1493J9788O214K34m705J8462j2066O938
3137A3934P357n669k9538M643J2265r234Q298k1886L7797P75k0023J2923O960
3124A8602m153j9097L9420n0875J7863R58P057l6J3718j7187L0619q876n795o312
$$ plain form
3215 17044 6500 3144 -6858 8020 7741 -4909 3624 777 18017 2117 -4397 18011 -7955
3202 -7955 23017 -10789 -17640 21858 6256 -11972 -6299 -23726 -16556 1953 7997 4722 -8860
3189 -8860 -21836 -43285 -11348 -16881 9221 -16848 -12779 -7576 -3612 -23510 -32311 -20887 -6477
3176 -6477 10344 23835 -812 15721 24777 23007 10492 17222 7419 18982 51207 32230 30511
3163 30511 21367 9648 4691 16185 5362 14763 29144 19820 -8117 -11345 -7341 16586 -1868
3150 -1868 -13845 4192 -13445 -11976 -9438 -20931 -1143 5071 5305 600 19062 6996 13934
3137 13934 21291 15622 -13916 -9273 2992 -6242 2056 -19830 17967 18742 -1281 11642 18602
3124 18602 14449 -4648 34772 -16103 1760 2718 9775 9739 23457 6270 36889 28013 22218 15906
3110A5906R882k4755L57J7948k4174l7884J9232J2357M97K9179O648l2416J6276
3097I053k2799k3892L4752k2503K0239j4768Q505J2273N493n020j6983n119J4162
3084f607m8016K4788L4804N056j7205k0687K6814l364l447J9962k9840J0968L0900
3071B4126j956j5911k7141O40J1051L0319k1558p44P903j7160M2576J1920k6884
3058A7181l480j582J3666j9460N027J2050K152J3014m842k1490j2153L0136k5642
3045D577l2836L0171q58J2406j5336L6850k141J803j5177J6097K7252n67j6101
3032D6140k056K0822n4779K926K6143M759J1495k0389m559j4759N1990R91j9450
3019D9274K1231l956r450j4772n76K3955L6558q89N4304k3190J3253k0143M350
$$ plain form
3110 15906 25788 1033 1390 19338 -4836 -42720 -23488 -11131 -10634 18545 25193 -7223 9053
3097 9053 -13746 -37638 -2886 -25389 -5150 -19918 -11413 860 6353 1333 -15650 -20769 -6607
3084 -6607 -54623 -29835 4969 10025 -7180 -27867 -1053 -4417 -7864 12098 -17742 -6774 24126
3071 24126 22170 6259 -20882 -20242 -9191 21128 -430 -1174 6729 -10431 32145 44065 17181
3058 17181 13701 12119 25785 6325 11352 23402 25554 38568 33726 12236 83 30219 4577
3045 4577 -28259 1912 1054 13460 -1876 34974 32833 34636 19459 35556 62808 62241 46140
3032 46140 44084 64906 10127 13053 39196 43955 55450 35061 30502 15743 67733 68724 49274
3019 49274 70505 66549 57099 42327 41751 65706 102264 101375 155679 132489 145742 125599 129949
3006A29949j0672j1917P741J1782K0957K6553L329L8823p00p236L9290L4723j091
2993B81531K4504N269K9484k551K993K1174L4203L9751L9437N421Q1399M2981
2981F05596L1787M7966M7752Q9577R3081Q5194J00078J15560J52228J91271K36054
2970A796144L00031L89958N32508P88129O31985J87877m04885q42978p21254n04858
2960B152657l08705k46657j74855j54425r5720p2039r2445p3662p2748q9469p4925
2949F97007l5785j4457n4232m5876j8650l4626m6130j3430m3528l545j1929j5120
2937C59699J8154n8620j0629J9469k6266p950k0568L00n3564K0261k6862l4203
2925A79221M890j1699K4777k0499J0107j5647o894k289N049j1305k870r526q850
$$ plain form
3006 129949 119277 107360 115101 126883 147840 174393 177722 216545 215845 208609 247899 282622 281531
2993 281531 306035 311304 340788 338237 341230 362404 396607 436358 475795 481216 562615 605596
2981 605596 637383 685349 733101 822678 915759 1000953 1101031 1216591 1368819 1560090 1796144
2970 1796144 2096175 2486133 3018641 3806770 4438755 4626632 4221747 3378769 2657515 2152657
2960 2152657 1843952 1597295 1422440 1268015 1172295 1100256 1007811 934149 861401 771932 697007
2949 697007 661222 646765 592533 546657 528007 493381 447251 433821 390293 386748 374819 359699
2937 359699 377853 319233 308604 328073 301807 293857 273289 273589 220025 240286 213424 179221
2925 179221 184111 172412 197189 176690 186797 171150 164256 161967 167016 155711 152841 143315 134465
2912A34465j8298M19J3523j4869N126l9399j9495K7173j015L815k2630J2344M146
2899H5305L1457k0297L5502P265l5509j5870l2339J281N835K1745k555K216m5646
2886C8390L1856O599l0155l603N296k7122M244J3325N399K4575j7502J8071L9165
2873A08538l9952J555j8889l0071K0299M265k097n873n08J6490J9905o587k9350
2860C7725j7530K170L7499j862p62O394l972l9456N4455j3708k0096j1828M091
2847C3120m1247j3289J6837p779K4898k310j0660K0684J8761K5553k521q610k5106
2834B8331J8287j098q257m032R817P710j5202Q421j8472m8489J5604K1218J6231
2821C0069K745P527K104l1646J3615j1553R911k922m8382J6357K2687J7383j2706
$$ plain form
2912 134465 116167 116586 130109 115240 120366 80967 61472 88645 87630 91445 68815 81159 85305
2899 85305 116762 96465 131967 139232 103723 87853 55514 56795 62630 84375 81820 84036 38390
2886 38390 70246 76845 46690 43087 48383 21261 25505 38830 44229 68804 51302 69373 108538
2873 108538 68586 70141 51252 21181 41480 45745 43648 37775 37267 53757 73662 67075 37725
2860 37725 20195 22365 59864 58002 57240 63634 59662 20206 74661 60953 40857 29029 33120
2847 33120 -8127 -21416 -4579 -12358 12540 10230 -430 20254 39015 64568 62047 53437 28331
2834 28331 46618 45520 37263 33231 43048 50758 35556 43977 25505 -22984 -7380 13838 30069
2821 30069 32814 40341 42445 10799 24414 12861 22772 19850 -28532 -12175 10512 27895 15189
2808A5189k6636L7419j4168J3263j1355O716o299j0370k4711K6744p99J5808o84
2795B0117l3147M1985j2338M878j850P125r560j2780k613r856M7271k8423J3723
2782B4532n16k860R185m2218o273R699K0640K0820K2528R297n1892Q04Q987l2809
2768a0076K6020k0478J3553J2643J1907J5610j127l954l4295Q975j543l9192R070
2755a2887N720j9067L8600K288L397m7159K2080J6516L4709k9992j0790K3559
2743B6974j8934l1381K3514J0394j3591K1050J0703m363j154m858K5061j7255
2731B6160r097q695K6194o195m426m611m0430J0865L7720k323p357J1179n598
2718B3386j7968p761Q932m469R6k0274J9154K8319K607k0510M524m261K3201P782
$$ plain form
2808 15189 -11447 25972 11804 25067 13712 20428 14129 3759 -20952 5792 4993 20801 20117
2795 20117 -13030 28955 16617 21495 19645 26770 17210 4430 1817 -8039 39232 10809 24532
2782 24532 24016 21156 30341 -11877 -18150 -8451 12189 33009 55537 64834 12942 13746 22733 -10076
2768 -10076 15944 -4534 9019 21662 33569 49179 48052 44098 9803 18778 17235 -21957 -12887
2755 -12887 -7167 -26234 12366 14654 18051 -29108 -7028 9488 44197 14205 3415 26974
2743 26974 8040 -23341 173 10567 -3024 18026 28729 24366 23212 18354 43415 26160
2731 26160 17063 8368 34562 28367 23941 19330 -21100 -10235 27485 25162 17805 28984 23386
2718 23386 5418 -2343 6589 2120 2216 -18058 1096 29415 32022 11512 16036 11775 34976 42758
2704D2758j4937n2262K0787L397k7261Q731J5130J810k4535q583R224M1359J2774
2691B8392j8718o066J4110k5943K3432M232R853P556m2274j1087K8493k1491k1718
2678c1229K0770J2126j1405j5662J4201r90O441L1362j9730j8193K3596j2823
2666a536r244L7054j1126j3402j0877J508J6653l6949K4623j1845j0652K8841
2654C048O732q859j844j6588J1126J0478J3415j7310J6944j6874k761j7839N525
2641a4807N631J1524K338r901N939J6528J2407m2930J5895Q600j0563P978R047
2628A7686l446j6149j0427J6806K3010o557j0809j9723J010n311N8593J5659k0729
2615C9613k7608J6683n447j1281l389j8017J4773L1158k3245j9373o774o646K6353
$$ plain form
2704 42758 27821 -24441 -3654 -257 -27518 -18787 -3657 -1847 -26382 -34965 -25741 15618 28392
2691 28392 9674 3608 17718 -8225 15207 19439 29292 36848 -5426 -16513 11980 -9511 -31229
2678 -31229 -10459 1667 -9738 -25400 -11199 -12189 -5748 25614 5884 -12309 11287 -1536
2666 -1536 -10780 26274 15148 1746 -9131 -7623 9030 -27919 -3296 -15141 -25793 3048
2654 3048 9780 921 -923 -17511 -6385 4093 17508 198 17142 268 -2493 -20332 -14807
2641 -14807 -9176 2348 4686 -5215 724 17252 29659 -13271 2624 11224 661 8639 17686
2628 17686 14240 -1909 -12336 4470 27480 20923 10114 -9609 -8599 -13910 44683 60342 39613
2615 39613 12005 28688 23241 11960 8571 -9446 5327 36485 13240 -6133 -12907 -19553 6800
2602F800o517j542p613j564N248k2709J8175J6254p804k4353o95J8132J975J4237
2588H024j8555J3562M3698k4430m6266N943J5055k6394K1715L5138l2591M106
2576i95R316J544j0820j1307J0783J7130j0952q558k0393J8619R977q548j2762
2563a6966j3065K9257k5010K9839Q159Q217n840j4835M7612j6569m5066k793K8773
2550A1713J4072j9230k9346J7053n408K4851O667J798k0214L796k1934N110M663
2537f409n526J0644p143K5147k0158J3199j2025j7632J9963k2669J8636k113n870
2524a1956j0752K6114l2545l925M1414J1785j3602R872m177k9612p11L009r260
2511b4346r20J3454O681K0127p094j6153J2096l8539o822J7324L2446R050l4792
$$ plain form
2602 6800 283 -1259 -8872 -10436 -5188 -27897 -9722 6532 -1272 -25625 -26320 -8188 -6213 8024
2588 8024 -10531 3031 46729 22299 -23967 -18024 -2969 -29363 -7648 27490 -5101 -995
2576 -995 8321 9865 -955 -12262 -1479 15651 4699 -3859 -24252 -5633 4344 -4204 -16966
2563 -16966 -30031 -774 -25784 4055 12214 20431 14591 -244 47368 30799 -14267 -17060 11713
2550 11713 25785 6555 -22791 -5738 -11146 13705 20372 22170 1956 5752 -16182 -11072 -6409
2537 -6409 -11935 -1291 -8434 16713 -3445 9754 -2271 -19903 60 -22609 -3973 -6086 -11956
2524 -11956 -22708 3406 -29139 -33064 8350 20135 6533 16405 12228 -17384 -18095 -15086 -24346
2511 -24346 -25266 -11812 -5131 14996 7902 -8251 3845 -34694 -41516 -24192 8254 17304 -17488
2498a7488K536j744l0187N806N240K3029R783O401K147j0240q506O244r362R748
2484f593J578k3553K7022k0735m111J4479K2325K0613j8425k2105J5878l7889
2472c1516J1382m907r247K2372J3946l126j0282j5038j3577K4928J8148j0746
2460g663L252r514n959K0796N999M086n102J4717Q50k4536l975P48J6921p31j3726
2445c837r289J6753J7148K1578k3796k3849K855j2934J4030m177k5639K0464J4550
2432C857l307p008p35p327j5894K6632J1558p830J3955j577l876j7797P362J065
2418i22r694N318l523J77J2171j0062P546J5234j5525q206L3973m2496n909M001
2404a7917m775J2779Q203K5154P270m273j3922Q477M153R379l6225J0279N918
$$ plain form
2498 -17488 -14952 -16696 -46883 -41077 -35837 -12808 -3025 3376 5523 -4717 -13223 -6979 -16341 -6593
2484 -6593 -5015 -28568 -1546 -22281 -26392 -11913 10412 31025 12600 -9505 6373 -31516
2472 -31516 -20134 -25041 -34288 -11916 2030 -1096 -11378 -26416 -39993 -15065 3083 -7663
2460 -7663 -4411 -13925 -19884 912 6911 10997 5895 20612 21462 -3074 -7049 -6301 10620 9889 -3837
2445 -3837 -13126 3627 20775 42353 18557 -5292 -2437 -15371 -1341 -5518 -31157 -10693 3857
2432 3857 550 -6458 -7193 -14520 -30414 -3782 7776 -54 13901 12324 8448 -9349 -1987 -922
2418 -922 -10616 -5298 -8821 -8644 3527 -6535 1011 16245 720 -7486 26487 -16009 -21918 -17917
2404 -17917 -22692 -9913 -1710 23444 30714 26441 12519 20996 25149 34528 -1697 8582 14500
2391A4500J0385R647m1338o132J9228k9100L0254J6317m891j6548k2470J4742
2379e406j672Q57K4783m3269J8114K9099l7157J507m064j2293P350J0808Q01J2018
2365A476r496J2128Q669K0782l4318l9872K7518L8350k9597j8213o038J0890O915
2352a0806j5887P955N346j1504l70R368K1266j0149j1736r001J4159K6740Q782
2339B4163k3338k0336k5953r236L5284r62L0006J2009l186k2433N824J5769j4787
2326B824j6191l704L093J2373J165N66k0868j7634O158M5851j7351k6420j9278
2313d9416N9392L76p102J0940n236k7653J2690o76p456L2347j4079M0O417j4987
2299d403K022K3264p022r166k3128O475J5871l711l2096K6757k6008J9461k122
$$ plain form
2391 14500 24885 34532 -6806 -12938 6290 -22810 7444 23761 18870 2322 -20148 -5406
2379 -5406 -7078 -6221 18562 -24707 -6593 22506 -14651 -13144 -17208 -29501 -22151 -11343 -10542 1476
2365 1476 -8020 4108 12777 33559 -759 -40631 -13113 25237 -4360 -22573 -28611 -17721 -10806
2352 -10806 -26693 -18738 -13392 -24896 -25266 -15898 5368 -4781 -16517 -25518 -11359 15381 24163
2339 24163 825 -19511 -45464 -54700 -19416 -20378 9628 21637 18451 -3982 1842 17611 2824
2326 2824 -13367 -17071 -13978 -1605 -440 126 -20742 -38376 -32218 13633 -3718 -30138 -49416
2313 -49416 9976 10352 3250 14190 8954 -18699 -6009 -6685 -14141 18206 4127 4167 10584 -4403
2299 -4403 -2381 20883 13861 4695 -18433 -11958 3913 202 -31894 -5137 -31145 -11684 -13806
2286a3806l32J9107J0215r346J904k4568L866J2995J4675J8246l2007j9808L9198
2273B0339M235J2260k5495j3062K9604l4817n092j284j5910J578L096J0879O646
2260g023j3884M7733k0946j2461L11J3341o686j4539n627K207L5390r157j6139
2247g480J2089L137j9017M112m5298M328M3464L3882J114m0184K1762J6582R080
2234C7571k6939K1136k1977o502J722J7126r919j8750J3748q034j0994J803L7378
2221B7369k4156j8570j1192K1671O624n664p730J6627J0959j5747o98J575j0903
2208i835J7850j8879r769j020O876P194M300J7141j2008j0820J255k3973L6352
2195D664K6049l448k9080l878J9547p755j1595l2987n203l94L619K0643L7636
$$ plain form
2286 -13806 -14138 4969 15184 5838 7742 -16826 -12960 35 14710 32956 949 -18859 20339
2273 20339 24574 36834 11339 -1723 27881 -6936 -12028 -13312 -29222 -27644 -24548 -13669 -7023
2260 -7023 -20907 26826 5880 -6581 -6270 7071 385 -14154 -19781 -17574 17816 8659 -7480
2247 -7480 4609 7746 -11271 -7159 -52457 -48129 -4665 29217 30331 -9853 11909 28491 37571
2234 37571 10632 31768 9791 3289 5011 22137 12218 -6532 7216 -818 -11812 -10009 27369
2221 27369 3213 -15357 -26549 -4878 1746 -3918 -11648 4979 15938 191 -507 1068 -9835
2208 -9835 8015 -10864 -20633 -21653 -14777 -7583 -3283 13858 1850 -8970 -7715 -31688 4664
2195 4664 30713 27265 -1815 -5693 13854 6099 -5496 -38483 -43686 -44080 -40461 -19818 17818
2182A7818l7558L9188m026n0680J0527J7658j3605K5778O3j4270q63R265L276
2169B571r027M434p417J4830j4108l1741L7211J5205o051j3326K6456k4151J1166
2156F052J0027k4106o940J5828N619r644Q050m4148K5078J3616o08M682J666k7228
2142b2056j301J8354K5739q123J4853k4892n1681J7994m83Q741J1095j7703J5236
2129a4227L0420k554j8216k810J6770K3107j4643p998j5074k1195J0293L9563
2117B3436k9762j0690J6412j6481K6841j5087M060j7049J5931k7127j1444L6540
2105d420m147J2416L661l1914j4430M4973J5404o967j7043j3077j7033J8500L2653
2092A8576P984l584m070j5164l956J4014l29l18J9011k8661j4652K0952j6874
$$ plain form
2182 17818 -19740 19448 15422 -35258 -24731 -7073 -20678 5100 5163 -9107 -9970 -705 2571
2169 2571 -6456 -2022 -9439 5391 -8717 -40458 -3247 11958 5907 -7419 19037 -5114 6052
2156 6052 16079 -8027 -14967 861 6480 -3164 4886 -39262 -14184 -568 -1176 3506 5172 -22056
2142 -22056 -23357 -5003 20736 12613 27466 2574 -49107 -31113 -31596 -22855 -11760 -29463 -14227
2129 -14227 16193 13639 -4577 -7387 9383 32490 17847 9849 -5225 -26420 -16127 23436
2117 23436 -6326 -17016 -604 -17085 9756 -5331 -1271 -18320 -2389 -29516 -40960 -4420
2105 -4420 -8567 3849 7510 -24404 -38834 6139 21543 14576 -2467 -15544 -32577 -14077 18576
2092 18576 26560 22976 18906 3742 -214 13800 13471 13153 32164 3503 -11149 9803 -7071
2079g071o376N776J5618j1345j093J701j1285J6581J1365j1510K131r24j784K991
2065D775J5887l183m5807J3549R304J651P489q365k1540J410K2996o330m264J1851
2051e77j0453N44M893o191n550k213L8099J3309j5173k5509J664J2962j4705J8174
2037I274m7527J2333k0939J0841J8189j300L0305j3133j0262Q339P502j4943k212
2024a3533O620m272K5034k9289j526K7853k4381k421K2510j6320l2731L5999K9804
2011B3347j3831N459j4925l5071K2560j5266K8042j7497j4256K0073k1415J6275
1999a6505N832k5277N418R292J0703o798l395j7121J9202L3038k7044K545j5087
1986b5197P252J3431P067J276j0443j0319J881k099j8497K7982J081R10j7094
$$ plain form
2079 -7071 -13447 -7671 7947 -3398 -4491 -2790 -14075 2506 13871 2361 4492 3568 1784 4775
2065 4775 20662 17479 -28328 -14779 -5475 -3824 3665 -4700 -26240 -24830 -1834 -8164 -12428 -577
2051 -577 -11030 -10486 -5593 -11784 -17334 -19547 18552 31861 16688 -8821 -7157 5805 -8900 9274
2037 9274 -38253 -25920 -46859 -36018 -17829 -19129 11176 -1957 -12219 -3880 3622 -11321 -13533
2024 -13533 -6913 -11185 13849 -15440 -16966 10887 -13494 -15915 6595 -9725 -42456 -6457 23347
2011 23347 9516 14975 50 -35021 -12461 -27727 315 -17182 -31438 -11365 -32780 -16505
1999 -16505 -10673 -35950 -30532 -21240 -10537 -17335 -20730 -37851 -18649 14389 -12655 -10110 -25197
1986 -25197 -17945 -4514 2553 3829 -6614 -16933 -15052 -17151 -35648 -7666 -6585 -5675 -22769
1973b2769M4685o740j5439l10n556o281L033L1926j1935k4903r618r454M2939
1960I578k0695r401O518P973j8258n177K0411m850J864j1072K2685K20M907j0962
1946f259r295K3545j879j3457m1J3142q878m573K0872J928P108J3030K1073m6370
1932I946k2506p631K0269J5901m1981l483J7966j7844O692m555L9038K3278k0033
1919A5057j8400L4271j0301l2619J3491j9469K5990j2060q872J359O879m766J9242
1906I802L20L169K8720j6994J4658n613j4699r330j0832j387k2213j0037K2357
1893a2079K0595j4081p689j108J2359M036J1799j5710j8207N218j568K7858K458
1880A3881n0605M5051K3309l1856k1546L303k0168N296L6801j2068k107k1372
$$ plain form
1973 -22769 21916 15176 -263 -573 -6129 -12410 -9377 22549 10614 -14289 -23907 -33361 9578
1960 9578 -11117 -20518 -14000 -6027 -24285 -29462 -9051 -13901 -12037 -23109 -424 -204 4703 -6259
1946 -6259 -15554 7991 6112 -7345 -7386 5756 -3122 -7695 13177 15105 22213 35243 56316 9946
1932 9946 -12560 -20191 78 15979 -26002 -29485 -11519 -29363 -22671 -27226 11812 35090 15057
1919 15057 -3343 30928 20627 -11992 1499 -17970 8020 -4040 -12912 -11553 -4674 -9440 9802
1906 9802 10122 13291 42011 25017 39675 34062 19363 10033 -799 -2186 -24399 -34436 -12079
1893 -12079 8516 -5565 -13254 -14362 -2003 2033 13832 -1878 -20085 -14867 -16435 11423 13881
1880 13881 -36724 8327 31636 -220 -21766 -18463 -38631 -33335 3466 -8602 -10709 -32081
1868c2081J5772J5681o855j7384L7737K5269m3102j9874J9093j3582K3491J20
1856D285j968j5845p757J3205J2036k859J2212p482j338Q485l6872J797j0177
1843c2278K5659J6398k5217l03j1256J106l133L0636L4186k6565J2483k855l0005
1830a1144J8349p681L908O710j1841k8466J9162K0820j0881O556K2O50J8333m3130
1816a8633j6674R496p723M0160j8092j9656K1089l111K0831O126k7060r856K8349
1803E246M710m226o709l9237M5283K1594l4803j0277J3465k781l6024L0673J2473
1790f13j7534J0196l415j4543M0159k0191j3923J9044r375n009r129L5192l8718
1777b7859j4203j2623R378P988J2074J2759K139O23J0855k091n59k1849j4217
$$ plain form
1868 -32081 -16309 -628 -7483 -24867 12870 38139 -4963 -24837 -5744 -19326 4165 4285
1856 4285 2317 -13528 -21285 -8080 3956 1097 13309 5827 4489 12974 -23898 -22101 -32278
1843 -32278 -6619 9779 -15438 -15741 -26997 -25891 -29024 1612 35798 9233 21716 18861 -11144
1830 -11144 7205 -476 3432 10142 -1699 -30165 -11003 9817 -1064 5492 5514 6164 24497 -18633
1816 -18633 -35307 -25811 -33534 6626 -11466 -31122 -10033 -13144 7687 13813 -13247 -23103 5246
1803 5246 9956 5730 -979 -40216 5067 26661 -8142 -18419 -4954 -7735 -43759 -13086 -613
1790 -613 -18147 -7951 -11366 -25909 14250 -5941 -19864 -820 -10195 -15204 -24333 10859 -27859
1777 -27859 -42062 -54685 -45307 -37319 -25245 -12486 -10347 -9724 1131 -960 -1519 -23368 -37585
1764c7585K5140q701o137K2750j4787J2613J1119N679n275r888j8534j0671J6215
1751a8062j7251K8104r282m449J5713P55R116p963j5844K4750J0318r465J950
1738H390n630m774j9535r973J5878J8293m829J79j5937L161k1823J1791J6746
1725h063k172q27L227k2598K005M3537J0308j7767k2830P074j1458J2248n715
1712a3031j6876K0589j4719L1022o791O958m359r171J2121k841J982j9509L1731
1699A7106l419k8919J3245j4702O544J0533l793R508N502M797k5994K608k4261
1686c1245k165K845L9145l0799J8634K2228j4364k8324K1598J8097k7120n498
1674a6968k3487M0418J0457Q241k787k1490j4102L9036n733j8550L336l0220Q637
$$ plain form
1764 -37585 -12445 -21146 -27283 -4533 -19320 -6707 4412 10091 4816 -5072 -23606 -34277 -18062
1751 -18062 -35313 -7209 -16491 -20940 -5227 -4472 4644 -3319 -19163 5587 15905 6440 8390
1738 8390 2760 -2014 -21549 -31522 -15644 2649 -2180 -2001 -17938 -14777 -36600 -24809 -8063
1725 -8063 -10235 -11062 -7835 -30433 -28428 15109 25417 7650 -15180 -8106 -19564 -7316 -13031
1712 -13031 -29907 -9318 -24037 6985 194 7152 2793 -6378 5743 2902 4884 -14625 17106
1699 17106 13687 -15232 -1987 -16689 -10145 388 -3405 6103 11605 16402 -9592 -6984 -31245
1686 -31245 -33410 -30565 8580 -22219 -3585 18643 4279 -24045 -2447 15650 -11470 -16968
1674 -16968 -40455 -37 10420 18661 15874 -5616 -19718 19318 13585 -4965 -1629 -31849 -23212
1661b3212m256J7086K3758m669m7620L0498M978m60r00k766L9793j1854r885k0807
1647a0316Q433J406l0165K2808r989k1584L1609J9319K4362r055o75j89k0058
1634E906O390R272r179J6842K185L967j5669k4818K9594q705l234K3911k0191
1621A6271j6422J0744L956k4545L979p057O438m244J6785k873j996K7074r635
1608A8475l058L743j6404n992j8815p867M299M2417k1892j3348K8777k5757K3446
1595H024k3512J1210o960N6265k4348k9224j104J7186j3776J4723J1485m79k3443
1582c953m0P991j5385P254n215K0200J1097K6626l7571k3100r234j4493K4871
1569a0952M0415n299q704j6210Q156k6318o046J2487j929o046q855O169L3173
$$ plain form
1661 -23212 -27468 -10382 13376 8707 -38913 -8415 -3437 -3897 -4797 -7563 32230 20376 10491 -10316
1647 -10316 -1883 -477 -30642 -7834 -17823 -39407 -7798 11521 35883 26828 26153 25964 5906
1634 5906 12296 21568 12389 29231 31416 35383 19714 -5104 24490 15785 12551 36462 16271
1621 16271 -151 10593 14549 -9996 -6017 -13074 -6636 -10880 5905 3032 1036 28110 18475
1608 18475 15417 19160 2756 -3236 -22051 -29918 -25619 16798 -5094 -18442 10335 -15422 8024
1595 8024 -15488 -4278 -11238 45027 20679 -8545 -9649 7537 -6239 8484 19969 19490 -3953
1582 -3953 -3993 3998 -11387 -4133 -9348 10852 21949 48575 11004 -12096 -21330 -35823 -10952
1569 -10952 29463 24164 15460 -750 7406 -18912 -24958 -12471 -14400 -20446 -29301 -23132 10041
1556A0041k0614J2414Q389l2549j3323Q954M883l4406n93K8345K9438k3210J3378
1543h853Q427j2955K809L360N090m453K952J751L5119q865r87k6118N340J240
1529C857k7362K2363K1715k6770Q049R49m5244K2418J9098j4146J9609j0805j8961
1516b5230q817M0925J3072l6791o859K1052j3233l161L5166R589N830q782l0628
$$ plain form
1556 10041 -10573 1841 10230 -22319 -35642 -26688 -21805 -56211 -56804 -28459 979 -22231 -8853
1543 -8853 -426 -13381 -10572 -7212 -2122 -6575 -3623 -1872 33247 24382 23395 -2723 2617 3857
1529 3857 -23505 -1142 20573 -6197 1852 2801 -42443 -20025 -927 -15073 4536 -6269 -25230
1516 -25230 -34047 6878 19950 -16841 -23700 -2648 -15881 -19042 16124 25713 31543 22761 -7867
$$ [...]
##END NTUPLES=NMR SPECTRUM
##END=
