##TITLE=1H_EC-3337(2)
 CDCl3
 8 sc, 
 6.12.2024
##JCAMPDX= 6.0         $$ Bruker NMR JCAMP-DX V2.0
##DATA TYPE= NMR SPECTRUM
##DATA CLASS= NTUPLES
##ORIGIN= UXNMR, Bruker Analytische Messtechnik GmbH
##OWNER= root
$$ XWIN-NMR		Version 3.5
$$ Fri Dec  6 14:00:27 2024 Russian Standard Time (UT+4h)  she@DPX200
##.OBSERVE FREQUENCY= 200.1315
##.OBSERVE NUCLEUS= ^1H
##.ACQUISITION MODE= SIMULTANEOUS
##.ACQUISITION SCHEME= undefined
##.AVERAGES= 8
##.DIGITISER RES= 18
##SPECTROMETER/DATA SYSTEM= spect
##.PULSE SEQUENCE= zg30
##.SOLVENT NAME= CDCl3
##.SHIFT REFERENCE= (INTERNAL, CDCl3, 0, 19.4592)
##AUDIT TRAIL= $$ (NUMBER, WHEN, WHO, WHERE, WHAT)
$$ ##TITLE= Audit trail, XWIN-NMR		Version 3.5
$$ ##JCAMPDX= 5.01
$$ ##ORIGIN= Bruker BioSpin GmbH
$$ ##OWNER= she
$$ F:/spectra/data/she/nmr/H-F/1/pdata/1/auditp.txt
$$ ##AUDIT TRAIL=  $$ (NUMBER, WHEN, WHO, WHERE, WHAT)
(   1,<2024-12-06 13:59:11.37 +0400>,<she>,<DPX200>,
      <created by zg, POWCHK disabled, PULCHK disabled
       configuration hash MD5:
       00 E9 B6 7A A2 85 ED C7 34 08 36 98 17 FE 4E 26
       data hash MD5: 16K
       C1 AD 58 6D F6 98 72 3C D4 4A F6 0E FC 8E 37 97>)
(   2,<2024-12-06 13:59:14.37 +0400>,<she>,<DPX200>,
      <Start of raw data processing
       efp BC_mod = 2 LB = 0.24 FT_mod = 6 PKNL = 1 PHC0 = -26716.93 PHC1 = 30.38744 SI = 16K 
       data hash MD5: 16K
       F3 F7 6F F7 A6 25 59 11 53 21 5F 8D D0 70 C5 31>)
(   3,<2024-12-06 13:59:34.46 +0400>,<she>,<DPX200>,
      <pk PHC0 = 10.68793 PHC1 = -15.8 
       data hash MD5: 16K
       D6 95 0C 91 8C 97 2B 87 C1 D6 AE 32 37 1F A9 34>)
(   4,<2024-12-06 13:59:38.60 +0400>,<she>,<DPX200>,
      <abs ABSG = 5 
       data hash MD5: 16K
       DD 22 F5 E6 30 F4 E3 85 C9 CF A6 AA 63 29 04 EA>)
$$ ##END=
$$ 
$$ hash MD5
$$ A7 90 36 52 03 16 50 03 92 DA 62 4F 60 9C 5A D2
##$RELAX= 
##$RELAX= 
##$RELAX= 
##$RELAX= 
##$RELAX= 
##$RELAX= 
$$ Bruker specific parameters
$$ --------------------------
##$DU= <F:/spectra>
##$EXPNO= 1
##$NAME= <H-F>
##$PROCNO= 1
##$TYPE= <nmr>
##$USER= <she>
##$AMP= (0..31)
100 100 100 100 100 100 100 100 100 100 100 100 100 100 100 100 100 100 
100 100 100 100 100 100 100 100 100 100 100 100 100 100 
##$AQSEQ= 0
##$AQ_mod= 1
##$AUNM= <au_zg>
##$AUTOPOS= <>
##$BF1= 200.13
##$BF2= 200.13
##$BF3= 200.13
##$BF4= 200.13
##$BF5= 200.13
##$BF6= 200.13
##$BF7= 200.13
##$BF8= 200.13
##$BYTORDA= 1
##$CFDGTYP= 0
##$CFRGTYP= 5
##$CHEMSTR= <none>
##$CNST= (0..31)
1 1 145 1 1 1 1 1 1 1 1 1 1 1 1 1 1 1 1 1 1 1 1 1 1 1 1 1 1 1 1 1 
##$CPDPRG= <>
##$CPDPRG1= <>
##$CPDPRG2= <>
##$CPDPRG3= <>
##$CPDPRG4= <mlev>
##$CPDPRG5= <mlev>
##$CPDPRG6= <mlev>
##$CPDPRG7= <mlev>
##$CPDPRG8= <mlev>
##$CPDPRGB= <>
##$CPDPRGT= <>
##$D= (0..31)
0 1.2 0 0 0 0 0 0 0 0.06 0 0.03 0 0 0 0 0.0002 0 0 0 0 0 0 0 0 0 0 0 0 
0 0 0 
##$DATE= 1733479150
##$DBL= (0..7)
120 120 120 120 120 120 120 120 
##$DBP= (0..7)
150 150 150 150 150 150 150 150 
##$DBP07= 0
##$DBPNAM0= <>
##$DBPNAM1= <>
##$DBPNAM2= <>
##$DBPNAM3= <>
##$DBPNAM4= <>
$$ [...]
##$SUBNAM3= <"">
##$SUBNAM4= <"">
##$SUBNAM5= <"">
##$SUBNAM6= <"">
##$SUBNAM7= <"">
##$SUBNAM8= <"">
##$SUBNAM9= <"">
##$SW= 24.0689530833862
##$SWIBOX= (0..15)
0 0 2 0 0 0 0 0 0 0 0 0 0 0 0 0 
##$SW_h= 4816.95568400771
##$TD= 16384
##$TD0= 1
##$TE= 0
##$TE2= 300
##$TE3= 300
##$TEG= 300
##$TL= (0..7)
0 120 120 120 120 120 120 120 
##$TP= (0..7)
150 150 150 150 150 150 150 150 
##$TP07= 0
##$TPNAME0= <>
##$TPNAME1= <>
##$TPNAME2= <>
##$TPNAME3= <>
##$TPNAME4= <>
##$TPNAME5= <>
##$TPNAME6= <>
##$TPNAME7= <>
##$TPOAL= (0..7)
0.5 0.5 0.5 0.5 0.5 0.5 0.5 0.5 
##$TPOFFS= (0..7)
0 0 0 0 0 0 0 0 
##$TUNHIN= 0
##$TUNHOUT= 0
##$TUNXOUT= 0
##$USERA1= <user>
##$USERA2= <user>
##$USERA3= <user>
##$USERA4= <user>
##$USERA5= <user>
##$V9= 5
##$VALIST= <valist>
##$VCLIST= <CCCCCCCCCCCCCCC>
##$VD= 0
##$VDLIST= <DDDDDDDDDDDDDDD>
##$VPLIST= <PPPPPPPPPPPPPPP>
##$VTLIST= <TTTTTTTTTTTTTTT>
##$WBST= 1024
##$WBSW= 4
##$XGAIN= (0..3)
0 0 0 0 
##$XL= 0
##$YL= 0
##$YMAX_a= 968514
##$YMIN_a= -558997
##$ZGOPTNS= <>
##$ZL1= 120
##$ZL2= 120
##$ZL3= 120
##$ZL4= 120
##$ABSF1= 19.71337
##$ABSF2= -4.355768
##$ABSG= 5
##$ABSL= 3
##$ALPHA= 0
##$AQORDER= 0
##$ASSFAC= 0
##$ASSFACI= 0
##$ASSFACX= 0
##$ASSWID= 0
##$AUNMP= <proc_1d>
##$AZFE= 0.1
##$AZFW= 0.1
##$BCFW= 0
##$BC_mod= 2
##$BYTORDP= 0
##$COROFFS= 0
##$CY= -3
##$DATMOD= 1
##$DC= 0
##$DFILT= <>
##$DTYPP= 0
##$F1P= 0
##$F2P= 0
##$FCOR= 1
##$FTSIZE= 16384
##$FT_mod= 6
##$GAMMA= 0
##$GB= 0
##$INTBC= 1
##$INTSCL= 2.524811e-10
##$ISEN= 128
##$LB= 0.24
##$LEV0= 0
##$LPBIN= 0
##$MAXI= 10000
##$MC2= 0
##$MEAN= 0
##$ME_mod= 0
##$MI= 1.114404
##$NCOEF= 0
##$NC_proc= -6
##$NLEV= 6
##$NOISF1= 3.799351
##$NOISF2= 2.8
##$NSP= 0
##$NTH_PI= 0
##$NZP= 0
##$OFFSET= 19.45921
##$PC= 1
##$PHC0= -26706.24
##$PHC1= 14.58744
##$PH_mod= 1
##$PKNL= yes
##$PPARMOD= 0
##$PSCAL= 0
##$PSIGN= 0
##$REVERSE= no
##$SF= 200.130014105853
##$SI= 16384
##$SIGF1= 3
##$SIGF2= 2
##$SINO= 5.538805
##$SIOLD= 16384
##$SREGLST= <1H.CDCl3>
##$SSB= 0
##$STSI= 16384
##$STSR= 0
##$SW_p= 4816.95568400771
##$SYMM= 0
##$S_DEV= 0
##$TDeff= 16384
##$TDoff= 0
##$TI= <>
##$TILT= no
##$TM1= 0
##$TM2= 0
##$TOPLEV= 0
##$USERP1= <user>
##$USERP2= <user>
##$USERP3= <user>
##$USERP4= <user>
##$USERP5= <user>
##$WDW= 1
##$XDIM= 16384
##$YMAX_p= 520530130
##$YMIN_p= -684964
$$ End of Bruker specific parameters
$$ ---------------------------------
##NTUPLES= NMR SPECTRUM
##VAR_NAME=  FREQUENCY,     SPECTRUM/REAL,   SPECTRUM/IMAG
##SYMBOL=    X,             R,               I
##VAR_TYPE=  INDEPENDENT,   DEPENDENT,       DEPENDENT
##VAR_FORM=  AFFN,          ASDF,            ASDF
##VAR_DIM=   16384,         16384,           16384
##UNITS=     HZ,            ARBITRARY UNITS, ARBITRARY UNITS
##FACTOR=    0.29402158847633, 1,            1
##FIRST=     3894.37186014396, 0,            0
##LAST=      -922.58382386375, 0,            0
##MIN=       -922.58382386375, -684964,      0
##MAX=       3894.37186014396, 520530130,    0
$$ Real data points
##PAGE= N=1
##DATA TABLE= (X++(R..R)), XYDATA
$$ [...]
$$ plain form
7610 1870895 1818284 1785411 1676172 1745424 1431318 1488410 1574804 1667938 1464567 1350209 1526089
7599 1526089 1484343 1193995 1245725 1165424 1263215 1370815 1470077 1678513 1539092 1409433
7589 1409433 1402115 1455120 1615580 1499921 1603330 1686946 1900207 1684710 1492603 1434073
7579 1434073 1188963 1587724 1432033 1399783 1409078 1325163 1443626 1776090 2083944 2077843 1887867
7568 1887867 1642868 1844230 1898608 1865215 1811465 1733650 1732106 1722149 1542999 1393588 1135072
7557 1135072 1032272 1140143 1184455 978348 950700 864197 890887 1167639 1161942 1082361 888409
7546 888409 1118979 1133144 917923 774483 729451 1044594 1025468 1094351 1008344 832919 980998
7535 980998 903499 856108 754698 728650 713998 726805 829926 645789 736101 704006 660545
$$ packed form
7610A870895n2611l2873j09239O9252l14106N7092Q6394R3134k03371j14358J75880
7599A526089m1746k90348N1730q0301R7791J07600R9262K08436j39421j29659
7589A409433p318N3005J60460j15659J03409Q3616K13261k15497j92107n8530
7579A434073k45110L98761j55691l2250R295q3915J18463L32464L07854o101j89976
7568A887867k44999K01362N4378l3393n3750p7815j544r957j79150j49411k58516
7557A135072j02800J07871M4312k06107k7648q6503K6690K76752n697p9581j93952
7546H88409K30570J4165k15221j43440m5032L15143j9126O8883q6007j75425J48079
7535I80998p7499m7391j01410k6048j4652J2807J03121j84137R0312l2095m3461
$$ plain form
7524 660545 608726 570693 556435 628115 891263 549546 494368 239019 443997 651110 835511
7513 835511 769872 572248 704194 672857 578937 439585 495991 651886 716970 902711 1072531
7502 1072531 1081190 1163704 1355184 1020629 1120708 1244254 1450012 1491108 1456691 1589195
7492 1589195 1541195 1521555 1476992 1491674 1235310 1321914 1397110 1666448 1631831 1774408 2026024
7481 2026024 2007764 1970815 1873100 1912604 1785522 1536863 1206438 1390849 1383379 1124797 1189496
7470 1189496 1052128 711584 519318 661313 729713 451876 352009 441697 114919 226904
7460 226904 343474 208404 356955 433025 321547 248543 241755 192267 151976 19874 27865
7449 27865 -195608 -119976 -30826 94344 240665 2546 -2135 61733 -130761 -93322 93491
$$ packed form
7524F60545n1819l8033j4258P1680K63148l41717n5178k55349K04978K07113J84401
7513H35511o5639j97624J31946l1337r3920j39352N6406J55895O5084J85741J69820
7502A072531Q659Q2514J91480l34555J00079J23546K05758M1096l4417J32504
7492A589195m8000j9640m4563J4682k56364Q6604P5196K69338l4617J42577K51616
7481B026024j8260l6949r7715L9504j27082k48659l30425J84411p470k58582O4699
7470A189496j37368l40544j92266J41995O8400k77837r9867Q9688l26778J11985
7460B26904J16570j35070J48551P6070j11478p3004o788m9488m0291j32102P991
7449B7865k23473P5632Q9150J25170J46321k38119m681O3868j92494L7439J86813
$$ plain form
7438 93491 147508 -128566 22844 153847 119899 259984 118922 151559 186707 -21866 -254381
7427 -254381 -284489 -154444 -15913 90692 -283727 -248148 -77756 -163286 48880 -155682
7417 -155682 -178118 -14131 26692 -77271 -92429 31707 39190 -71345 -48939 57880 76712
7406 76712 66467 185291 9935 -58632 -26854 -76341 -65275 -225126 -242779 -46694 -161764
7395 -161764 -199275 -127552 -29979 8880 -122576 -46051 -80023 -101099 -329501 -514953 -592165
7384 -592165 -289937 -432737 -458574 -424815 -474918 -414625 -441803 -163176 -161568 -102195 72941
7373 72941 -113388 -12284 -223779 -305504 -99562 8946 -26599 -123344 -54237 -6047 36743
7362 36743 -44468 -8426 -133580 -168311 -112677 16510 -200044 -173539 -62330 -25185 48276
$$ packed form
7438I3491N4017k76074J51410J31003l3948J40085j41062L2637L5148k08573k32515
7427b54381l0108J30045J38531J06605l74419L5579J70392q5530K12166k04562
7417a55682k2436J63987M0823j03963j5158J24136P483j10535K2406J06819J8832
7406G6712j0245J18824j75356o8567L1778m9487J1066j59851j7653J96085j15070
7395a61764l7511P1723R7573L8859j31456P6525l3972k1076k28402j85452p7212
7384e92165L02228j42800k5837L3759n0103O0293k7178K78627J608N9373J75136
7373G2941j86329J01104k11495q1725K05942J08508l5545r6745O9107M8190M2790
7362C6743q1211L6042j25154l4731N5634J29187k16554K6505J11209L7145P3461
$$ plain form
7351 48276 103648 -191186 44793 297982 -6308 -271500 55875 93364 -47879 -93066
7341 -93066 -140745 -23108 -27666 33763 -13938 -64911 21764 -241177 -284379 -127715 -177361
7330 -177361 -38860 -181920 -380138 -238880 -305870 -110595 -69816 -8488 -50952 -201496
7320 -201496 -57130 -153046 -220296 31856 -27080 12060 -194543 9406 -253566 -266117 -96661
7309 -96661 -103373 -157359 -195274 -211133 -262154 100033 -40880 -324480 -187777 104908 -83772
7298 -83772 -215960 -345579 -118351 -41187 58298 -36731 -53997 -263983 -207144 -296549 -181446
7287 -181446 -583077 -504191 -312687 -357398 -18277 -28974 -69472 -184876 -81869 -123640 -216088
7276 -216088 -199196 -249444 -220476 -257629 -186951 -20458 92671 76925 -212281 -125492 -251154
$$ packed form
7351D8276N5372k94834K35979K53189l04290k65192L27375L7489j41243m5187
7341i3066m7679J17637m558O1429m7701n0973Q6675k62941m3202J56664m9646
7330a77361J38501j43060j98218J41258o6990J95275M0779O1328m2464j50544
7320b01496J44366r5916o7250K52152n8936L9140k06603K03949k62972j2551J69456
7309i6661o712n3986l7915j5859n1021L62187j40913k83600J36703K92685j88680
7298h3772j32188j29619K27228P7164R9485r5029j7266k09986N6839q9405J15103
7287a81446m01631P8886J91504m4711L39121j0697m0498j15404J03007m1771r2448
7276b16088J6892n0248K8968l7153P0678J66493J13129j5746k89206Q6789j25662
$$ plain form
7265 -251154 -424471 -265823 -264358 -160892 -188925 -284140 -96150 -135337 -206491 117651 -338039
7254 -338039 -350979 181412 165867 -337661 -295514 -60677 -102465 -115598 -148282 77459 -332967
7243 -332967 -292746 56261 -93915 -211585 -258822 72041 41220 -252857 -286141 -138402
7233 -138402 -8295 65835 -64421 -99640 -130242 -162852 151894 68139 -39412 67282 37859
7222 37859 -135099 -181179 -73014 -115705 -162732 -117109 196716 193615 -69474 -32465 54755
7211 54755 362857 407576 294561 -7003 100438 80827 26068 -13276 -102787 -1757 30496
7200 30496 -23797 240999 275438 221705 99175 16201 61919 203177 144393 356067 255599
7189 255599 60232 142837 155738 229762 62465 91433 -4914 177990 258323 434041 307268
$$ packed form
7265b51154j73317J58648J465J03466k8033r5215J87990l9187p1154L24142m55690
7254c38039j2940N32391j5545n03528M2147K34837m1788j3133l2684K25741m10426
7243c32967M0221L49007j50176j17670m7237L30863l0821k94077l3284J47739
7233a38402J30107P4130j30256l5219l0602l2610L14746q3755j07551J06694k9423
7222C7859j72958m6080J08165m2691m7027M5623L13825l101k63089L7009Q7220
7211E4755L08102M4719j13015l01564J07441j9611n4759l9344q9511J01030L2253
7200C0496n4293K64796L4439n3733j22530q2974M5718J41258n8784K11674j00468
7189B55599j95367Q2605J2901P4024j67297K8968r6347J82904Q0333J75718j26773
$$ plain form
7178 307268 54 254741 514568 133073 10268 225369 359877 126919 197898 248837
7168 248837 81189 228281 165973 257535 146899 274376 510338 135298 348321 270123
7158 270123 140320 219345 573992 518047 386405 298325 151644 454921 214455 8516
7148 8516 -70261 -73956 241778 227738 115633 236078 95236 72367 -15856 -94934 113110
7137 113110 99734 187365 350316 122339 113382 -163234 -109970 146440 163890 214756 23479
7126 23479 282922 149635 152214 79975 245714 142689 -186587 -144494 -166185 -219043 26717
7115 26717 88042 24661 -5930 -22429 19970 4034 -11229 -193165 -267243 -122096 282564
7104 282564 235005 -36059 86732 16049 26777 211440 58181 157317 60442 -63268 -128958
$$ packed form
7178C07268l07214K54687K59827l81495j22805K15101J34508k32958P0979N0939
7168B48837j67648J47092o2308R1562j10636J27477K35962l75040K13023p8198
7158B70123j29803P9025L54647n5945j31642q8080j46681L03277k40466k05939
7148H516p8777l695L15734j4040j12105J20445j40842k2869q8223p9078K08044
7137A13110j3376Q7631J62951k27977q957k76616N3264K56410J7450N0866j91277
7126B3479K59443j33287K579p2239J65739j03025l29276M2093k1691n2858K45760
7115B6717O1325o3381l0591j6499M2399j5936j5263j81936p4078J45147M04660
7104B82564m7559k71064J22791p0683J0728J84663j53259R9136r6875j23710o5690
$$ plain form
7093 -128958 -79662 -60903 -14994 69712 -115750 102148 149752 20185 98109 14576 280196
7082 280196 15838 -71392 -297447 -96666 54208 203684 288347 400611 307658 -62117
7072 -62117 -273269 -126387 -84185 85535 95608 164920 -45613 -255638 -147054 -228947 -60059
7061 -60059 32626 110967 -47101 -136845 133258 135146 -77829 -116297 -41517 5838 38416
7050 38416 46536 136910 286831 -73800 -22521 53023 52199 -64045 188948 334425 464943
7039 464943 347332 134150 234988 314472 183944 8887 -60721 196002 176905 239816
7029 239816 299648 265071 289093 308937 416979 143818 177766 259530 108197 -15863 -101108
7018 -101108 -181771 96491 115159 53651 164842 31338 52929 87091 -169552 -100929 90654
$$ packed form
7093a28958M9296J8759M5909Q4706j85462K17898M7604j29567P7924q3533K65620
7082B80196k64358q7230k26055K00781J50874J49476Q4663J12264r2953l69775
7072f2117k11152J46882M2202J69720J0073O9312k10533k10025J08584q1893J68888
7061f0059R2685P8341j58068q9744K70103J888k12975l8468P4780M7355L2578
7050C8416Q120R0374J49921l60631N1279P5544q24j16244K52993J45477J30518
7039D64943j17611k13182J00838P9484j30528j75057o9608K56723j9097O2911
7029B39816N9832l4577K4022J9844J08042k73161L3948Q1764j51333j24060q5245
7018a01108q0663K78262J8668o1508J11191j33504K1591L4162k56643O8623J91583
$$ plain form
7007 90654 317549 154319 118845 246333 349707 -79162 -74905 -31911 257581 283825 259489
6996 259489 273371 245230 149733 -8258 196150 257854 482527 319023 409890 309252 141897
6985 141897 179925 389923 526105 405147 209246 325168 466345 360872 319571 490891
6975 490891 425385 597814 569761 115352 418297 591568 682884 629347 722566 875263 615996
6964 615996 502124 491680 554027 573042 606766 556175 604336 418465 573800 658448 773583
6953 773583 638987 461937 552099 783751 758183 701597 737621 602549 457292 613182
6943 613182 428770 548761 823166 828715 643071 652636 487830 337446 408036 635584 563529
6932 563529 589088 407828 204008 196544 387815 358373 644849 366370 229270 394156
$$ packed form
7007I0654K26895j63230l5474J27488J03374m28869M257M2994K89492K6244k4336
6996B59489J3882k8141r5497j57991K04408O1704K24673j63504R0867j00638j67355
6985A41897L8028K09998J36182j20958j95901J15922J41177j05473m1301J71320
6975D90891o5506J72429k8053m54409L02945J73271R1316n3537R3219J52697k59267
6964F15996j13872j0444O2347J9015L3724n0591M8161j85871J55335Q4648J15135
6953G73583j34596j77050R0162K31652k5568n6586L6024j35072j45257J55890
6943F13182j84412J19991K74405N549j85644R565j64806j50384P0590K27548p2055
6932E63529K5559j81260k03820p464J91271k9442K86476k78479j37100J64886
$$ plain form
6922 394156 572691 490582 387735 591083 533421 465496 494982 682467 484608 346272
6912 346272 289368 420549 327620 211520 359122 272201 386078 245232 314340 435121
6902 435121 188634 61540 129855 178291 176521 184822 39739 7661 -39048 -27548 -77766
6891 -77766 107920 62830 268506 221428 -44708 50966 121297 64675 114403 24812 230996
6880 230996 101071 147279 29747 94820 74513 342186 142014 198745 215011 119859 144212
6869 144212 -47244 168311 409721 142970 199539 -6766 -153252 -423148 -404240 -128971
6859 -128971 -84387 -38674 213689 45033 176257 130156 -28178 74282 -100324 127445
6849 127445 138680 -79848 -31374 103965 250237 270068 193929 196842 9209 -8829 67060
$$ packed form
6922C94156J78535q2109j02847K03348n7662o7925K9486J87485j97859j38336
6912C46272n6904J31181r2929j16100J47602q6921J13877j40846O9108J20781
6902D35121k46487j27094O8315M8436j770Q301j45083l2078m6709J1500n0218
6891g7766J85686m5090K05676m7078k66136R5674P0331n6622M9728q9591K06184
6880B30996j29925M6208j17532O5073k0307K67673k00172N6731J6266r5152K4353
6869A44212j91456K15555K41410k66751N6569k06305j46486k69896J8908K75269
6859a28971M4584M5713K52363j68656J31224m6101j58334J02460j74606K27769
6849A27445J1235k18528M8474J35339J46272J9831p6139K913j87633j8038P5889
$$ plain form
6838 67060 157814 122117 -55819 8121 226503 244014 28783 -15430 62642 30907 215861
6827 215861 159672 8803 -26771 167411 84986 -74762 16567 -123066 7481 257730
6817 257730 75269 57319 105395 165549 154553 90760 87833 114465 269715 378601 333923
6806 333923 119003 48738 -125350 -112679 48054 -211621 -83459 -102763 -120128 -21835 34906
6795 34906 6583 87101 113950 -87267 -11192 39964 -11199 115711 124791 61486 130225 247583
6783 247583 189810 303118 315864 255002 218108 155188 196489 -6388 215478 270514 77531
6772 77531 4930 -18872 209617 169994 273043 209146 169947 152306 5944 -98493 296483
6761 296483 130067 20750 134882 276486 108288 346412 302737 382996 -24908 -135056
$$ packed form
6838F7060R0754l5697j77936O3940K18382J7511k15231m4213P8072l1735J84954
6827B15861n6189j50869l5574J94182q2425j59748R1329j39633J30547K50249
6817B57730j82461j7950M8076O0154j0996o3793k927K6632J55250J08886m4678
6806C33923k14920p0265j74088J2671J60733k59675J28162j9304j7365R8293N6741
6795C4906k8323Q0518K6849k01217P6075N1156n1163J26910R080o3305O8739J17358
6783B47583n7773J13308J2746o0862l6894o2920M1301k02877K21866N5036j92983
6772G7531p2601k3802K28489l9623J03049o3897l9199j7641j46362j04437L94976
6761B96483j66416j09317J14132J41604j68198K38124m3675Q0259m07904j10148
$$ plain form
6751 -135056 2298 92647 342017 151277 36436 7257 107005 -18606 250528 40355
6741 40355 -99440 -44067 196024 329625 260503 357580 417329 246789 268328 166073 90849
6730 90849 -116875 -4679 -1325 22958 285764 171084 201278 254619 265751 149543 301988
6719 301988 410972 387806 180381 277486 370771 450718 402652 401462 461269 250894 430529
6708 430529 273607 223832 321324 459522 395348 300074 116227 353115 260818 251066 185453
6697 185453 528806 561373 428884 359735 360994 389015 384790 238547 178061 312834 267084
6686 267084 292536 95647 162150 67303 108995 210242 200446 365811 348880 80328 280207
6675 280207 250495 168773 69158 342872 300292 312244 268192 149429 211851 349680 459697
$$ packed form
6751a35056J37354R0349K49370j90740j14841k9179R9748j25611K69134k10173
6741D0355j39795N5373K40091J33601o9122R7077N9749j70540K1539j02255p5224
6730I0849k07724J12196L354K4283K62806j14680L0194N3341J1132j16208J52445
6719C01988J08984k3166k07425R7105R3285P9947m8066j190N9807k10375J79635
6708D30529j56922m9775R7492J38198o4174r5274j83847K36888r2297r752o5613
6697A85453L43353L2567j32489o9149J259K8021m225j46243o0486J34773m5750
6686B67084K5452j96889O6503r4847M1692J01247r796J65365j6931k68552J99879
6675B80207k9712q1722r9615K73714m2580J1952m4052j18763O2422J37829J10017
$$ plain form
6664 459697 433659 241489 424935 385673 468769 528881 491928 403788 269503 417560 432935
6653 432935 482379 331691 371589 521989 306589 282384 399710 124928 444734 465063
6643 465063 327275 180889 460557 457532 240703 115314 250167 342350 467782 756428
6633 756428 711463 648995 655688 560681 469821 440270 411329 367706 274678 679325 409598
6622 409598 434543 384943 231137 308937 292997 326475 371790 425802 521602 537170 467574
6611 467574 368685 289763 162360 245519 508422 627571 746765 406855 247369 312811
6601 312811 154821 302737 320265 438552 292676 104424 371230 324759 514899 275624
6591 275624 466910 413008 329804 339271 268908 160714 -61524 69363 155343 267892 117955
$$ packed form
6664D59697k6038j92170J83446l9262Q3096O0112l6953q8140j34285J48057J5375
6653D32935M9444j50688L9898J50400k15400k4205J17326k74782L19806K0329
6643D65063j37788j46386K79668l025k16829j25389J34853R2183J25432K88646
6633G56428m4965o2468O693r5007r0860k9551k8941m3623r3028M04647k69727
6622D09598K4945m9600j53806P7800j5940L3478M5315N4012R5800J5568o9596
6611D67574r8889p8922j27403Q3159K62903J19149J19194l39910j59486O5442
6601C12811j57990J47916J7528J18287j45876j88252K66806m6471J90140k39275
6591B75624J91286n3902q3204R467p0363j08194k22238J30887Q5980J12549j49937
$$ plain form
6580 117955 144330 63881 3914 314236 214128 243399 352517 83635 252109 493824
6570 493824 436160 425298 133459 215586 197121 172307 449768 252747 -48701 232330 287232
6559 287232 232809 8327 -48956 129298 406054 611625 529928 478092 166343 74159 521617
6548 521617 417008 525862 219150 78603 456517 94805 228407 189704 429132 403106
6538 403106 191679 307986 425639 486000 567158 509963 402831 371598 405322 646463 431287
6527 431287 535365 549479 456370 543265 482596 431360 496297 439742 379524 552804 541724
6516 541724 303918 316620 561345 374933 401583 523197 394323 379020 99412 234984
6506 234984 519995 466355 423749 235773 404021 530495 526426 368973 403380 446423 333820
$$ packed form
6580A17955K6375q0449n9967L10322j00108K9271J09118k68882J68474K41715
6570D93824n7664j0862k91839Q2127j8465k4814K77461j97021l01448K81031N4902
6559B87232n4423k24482n7283J78254K76756K05571q1697n1836l11749r2184M47458
6548E21617j04609J08854l06712j40547L77914l61712J33602l8703K39428k6026
6538D03106k11427J16307J17653O0361Q1158n7195j07132l1233L3724K41141k15176
6527D31287J04078J4114r3109Q6895o0669n1236O4937n6555o0218J73280j1080
6516E41724k37806J2702K44725j86412K6650J21614j28874j5303k79608J35572
6506B34984K85011n3640m2606j87976J68248J26474m069j57453L4407M3043j12603
$$ plain form
6495 333820 503884 537360 505022 359448 188547 392556 583724 648407 716926 829102
6485 829102 656567 494796 272018 735040 322836 198339 524167 280267 322461 811258
6475 811258 807022 571841 397127 572245 583230 360356 413975 541263 418662 543093
6465 543093 485713 506311 568928 467921 412547 406674 529979 445967 420169 326173 383696
6454 383696 515985 605917 458774 647619 586306 451318 341872 536748 359257 325320
6444 325320 665054 743155 589361 468841 604590 456099 523471 775432 684416 747418
6434 747418 653460 590561 586184 759674 704597 504250 559393 568164 609060 598751 691343 575441
6422 575441 675587 683344 756513 934022 484876 693973 734533 588744 838392 787036 894733
$$ packed form
6495C33820J70064L3476l2338j45574j70901K04009J91168O4683O8519J12176
6485H29102j72535j61771k22778M63022m12204j24497L25828k43900M2194M88797
6475H11258m236k35181j74714J75118J0985k22874N3619J27288j22601J24431
6465E43093n7380K0598O2617j01007n5374n873J23305q4012k5798r3996N7523
6454C83696J32289Q9932j47143J88845o1313j34988j09446J94876j77491l3937
6444C25320L39734P8101j53794j20520J35749j48491O7372K51961r1016O3002
6434G47418r3958o2899m377J73490n5077k00347N5143Q771M0896j0309R2592j15902
6422E75441J00146P757P3169J77509m49146K09097M0560j45789K49648n1356J07697
$$ plain form
6411 894733 756777 765622 886715 923527 966071 919640 1189353 947620 882356 964388 1087633
6400 1087633 894104 789194 750987 1092683 998246 894012 874538 724725 776129 904778
6390 904778 1078807 1160897 1179683 934234 974081 1121028 900720 787635 863556 969940
6380 969940 1076873 1197182 1184054 1103003 1138020 1367556 1292080 1386525 1281187 1177616 1540216
6369 1540216 1443565 1407028 1592562 1408745 1256157 1510095 1511160 1522219 1710018 1908855
6359 1908855 1642282 1988327 1932389 1808096 1742535 1958913 2094885 2124119 2141914 2091654
6349 2091654 2145582 2051395 2329544 2081351 2244941 2254715 2190915 2389891 2367174 2708171 2694388
6338 2694388 2835695 2431025 2377243 2291378 2263043 2694381 2666478 2622012 2849400 2967208
$$ packed form
6411H94733j37956Q845J21093L6812M2544m6431K69713k41733o5264Q2032J23245
6400A087633j93529j04910l8207L41696r4437j04234j9474j49813N1404J28649
6390I04778J74029Q2090J8786k45449L9847J46947k20308j13085P5921J06384
6380I69940J06933J20309j3128q1051L5017K29536p5476R4445j05338j03571L62600
6369A540216r6651l6537J85534j83817j52588K53938J065J1059J87799J98837
6359A908855k66573L46045n5938j24293o5561K16378J35972K9234J7795n0260
6349B091654N3928r4187K78149k48193J63590R774o3800J98976k2717L40997j3783
6338B694388J41307m04670n3782q5865k8335M31338k7903m4466K27388J17808
$$ plain form
6328 2967208 2858832 2874841 3035260 3047800 2744659 2836436 2819697 3019333 3117148 3092640 3325027
6317 3325027 3097746 3250069 3294148 3245572 3663996 3890337 3890647 4072852 3985948 3801681 3901957
6306 3901957 4081726 4158831 4043015 4217848 4220813 4258755 4457346 4719623 4890330 4916930
6296 4916930 4942778 4917293 5030509 5169463 5403839 5313535 5368939 5231896 5582696 5448997
6286 5448997 5572309 5481412 5213030 5274113 5541741 5413111 5307227 5424747 5291452 5212159
6276 5212159 4749428 4818711 4572637 4741276 4682282 4591838 4647663 4371545 4247107 4208755
6266 4208755 4137142 4175138 4045790 3865573 3614739 3491791 3554577 3591425 3583005 3764188 3740965
6255 3740965 3517028 3574901 3863724 3766152 3512691 3206111 3348077 3365698 3240132 3223946
$$ packed form
6328B967208j08376J6009J60419J2540l03141R1777j6739J99636R7815k4508K32387
6317C325027k27281J52323M4079m8576M18424K26341L10J82205q6904j84267J00276
6306C901957J79769P7105j15816J74833K965L7942J98591K62277J70707K6600
6296D916930K5848k5485J13216J38954K34376r0304N5404j37043L50800j33699
6286E448997J23312r0897k68382O1083K67628j28630j05884J17520j33295p9293
6276E212159m62731O9283k46074J68639n8994r0444N5825k76118j24438l8352
6266D208755p1613L7996j29348j80217k50834j22948O2786L6848q420J81183k3223
6255C740965k23937N7873K88823r7572k53461l06580J41966J7621j25566j6186
$$ plain form
6245 3223946 3295347 3168545 3365858 3449991 3481634 3418185 3404753 3243897 3200029 3320667 3564204
6234 3564204 3688343 3478621 3623782 3847873 3615040 3579413 3459108 3623080 3766110 3907997
6224 3907997 3827980 3596476 3689353 3799827 3861377 4085994 3948485 3838052 3896926 3845123
6214 3845123 3861670 4015207 4146451 4060388 4181674 4287826 4584986 4673664 4743674 4904866
6204 4904866 5178578 5119780 5177250 5280864 5578390 5923210 6133345 6102124 6654501 7036416
6194 7036416 6993946 7422362 7819870 8609927 9139227 9893645 10491059 10705949 10835955 10674741
6184 10674741 10244013 9823340 9919074 10071774 10415052 10664870 11116313 11482339 12064758 12433037
6174 12433037 12815699 13228739 13716678 14265142 14320029 14130986 14153692 13991868 13937163 13377909
$$ packed form
6245C223946P1401j26802J97313Q4133L1643o3449j3432j60856m3868J20638K43537
6234C564204J24139k09722J45161K24091k32833l5627j20305J63972J43030J41887
6224C907997q0017k31504R2877J10474O1550K24617j37509j10433N8874n1803
6214C845123J6547J53537J31244q6063J21286J06152K97160Q8678P0010J61192
6204D904866K73712n8798N7470J03614K97526L44820K10135l1221N52377L81915
6194G036416m2470M28416L97508P90057N29300P54418N97414K14890J30006j61214
6184A0674741m30728m20673R5734J52700L43278K49818M51443L66026N82419L68279
6174A2433037L82662M13040M87939N48464N4887j89043K2706j61824n4705n59254
$$ plain form
6164 13377909 12727522 12723385 12661843 12965162 13323539 13639289 13746621 14329174 14782501 14572504
6154 14572504 14600171 14202742 13930203 13828360 14159961 14095375 14436309 14322218 14397278 14509571
6144 14509571 14449822 15084342 15519327 15730666 16164478 16779526 17465429 17903255 18559265 19478443
6134 19478443 20130734 21109272 22340026 23492988 24713816 25723763 26855532 27821069 28738365
6125 28738365 29845363 30975938 32154713 33453227 35351792 37574106 39688341 42209646
6117 42209646 44564753 47032868 49169331 50965732 53149456 55485250 57877243 61418647
6109 61418647 66247681 72057355 78859848 86559434 96264097 108774336 121231885 127985888
6101 127985888 130320582 128128657 123157095 117406179 113543795 114009003 118131712 123700131
$$ packed form
6164A3377909o50387m137o1542L03319L58377L15750J07332N82553M53327k09997
6154A4572504K7667l97429k72539j01843L31601o4586L40934j14091P5060J12293
6144A4509571n9749O34520M34985K11339M33812O15048O85903M37826O56010R19178
6134A9478443O52291R78538J230754J152962J220828J009947J131769R65537R17296
6125B8738365J106998J130575J178775J298514J898565K222314K114235K521305
6117D2209646K355107K468115K136463J796401K183724K335794K391993L541404
6109F1418647M829034N809674O802493P699586R704663J2510239J2457549O754003
6101A27985888K334694k191925m971562n750916l862384M65208M122709N568419
$$ plain form
6093 123700131 127335502 130510510 133472034 137420036 143091690 148107768 149702341 147209426
6085 147209426 141279971 133898610 127126461 124287806 122403135 119075385 115864517 111700776
6077 111700776 108123744 106370428 108657678 115170969 122129654 122776904 118357993 109318762
6069 109318762 96877892 82746366 70578092 61740268 55113516 50080950 45906926 42445169
6061 42445169 39280455 36548408 34221811 32110066 30017865 28516958 27319870 26384960
6053 26384960 25240120 24539479 23807562 23267737 22675123 22231135 21930251 21538188 20943307
6044 20943307 20555236 20273947 20068483 20075589 19797765 19581675 19244478 18976729 18742642 18514336
6034 18514336 18504192 18549381 18153784 18195953 18230506 18147622 18395193 18661850 18724106 18927932
$$ packed form
6093A23700131L635371L175008K961524L948002N671654N016078J594573k492915
6085A47209426n929455p381361o772149k838655j884671l327750l210868m163741
6077A11700776l577032j753316K287250O513291O958685O47250m418911r039231
6069A09318762j2440870j4131526j2168274q837824o626752n032566m174024l461757
6061D2445169l164714k732047k326597k111745k092201j500907j197088r34910
6053B6384960j144840p00641p31917n39825n92614m43988l00884l92063n94881
6044B0943307l88071k81289k05464P106k77824k16090l37197k67749k34087k28306
6034A8514336j0144M5189l95597M2169L4553q2884K47571K66657O2256K03826
$$ plain form
6024 18927932 19081148 19198474 19435753 19778056 20136544 20754692 20849398 21165059 21759390 22427466
6014 22427466 22985881 23724682 24590035 25333947 26303827 28013547 29393928 31283829 33416759
6005 33416759 36536602 39674423 42057993 43494502 43755138 42984489 41833690 41136067 41478560
5996 41478560 43213716 45608732 48385152 50521266 52999792 55445254 58103942 60992214
5988 60992214 63205256 63266378 61860959 58931496 55935629 53839915 53087951 52264328 51636388
5979 51636388 50574507 49963360 49897086 51376352 54150051 57953421 61707530 64432424 66570337
5970 66570337 67768347 67030941 64989649 61110693 55842009 50279116 45090584 40745187
5962 40745187 37142970 34713692 32513339 31344155 30346107 30080299 29728506 29879499 30507742
$$ packed form
6024A8927932J53216J17326K37279L42303L58488O18148R4706L15661N94331O68076
6014B2427466N58415P38801Q65353P43912R69880J709720J380381J889901K132930
6005C3416759L119843L137821K383570J436509K60636p70649j150799o97623L42493
5996D1478560J735156K395016K776420K136114K478526K445462K658688K888272
5988F0992214K213042O1122j405419k929463k995867k095714p51964q23623o27940
5979E1636388j061881o11147o6274J479266K773699L803370L754109K724894K137913
5970F6570337J198010p37406k041292l878956n268684n562893n188532m345397
5962D0745187l602217k429278k200353j169184r98048k65808l51793J50993O28243
$$ plain form
5953 30507742 31730602 33205295 34935376 35900350 36018769 34961873 32380947 29732213
5945 29732213 26822318 24462776 22588485 21104306 19907512 18556218 17606583 16928601
5937 16928601 16264684 15973844 15118022 14366609 13805066 13190241 12699600 12222483 11660195
5928 11660195 11353081 10640264 10281022 10191021 9831054 9745574 9576415 9272963 9053828 8763802
5918 8763802 8523797 8367378 8484678 8549691 8181953 8014253 7979115 7744131 7608122 7577236
5908 7577236 7501500 7331585 7207628 7035128 6644511 6341637 6137189 6288234 6382477 6166976
5898 6166976 6092244 5899786 5642325 5560723 5827245 5605554 5770871 5782248 5562118 5341758
5888 5341758 5250019 5185508 5043143 4792764 4579983 4898164 4934521 4961131 4957586 4894848 4835343
$$ packed form
5953C0507742J222860J474693J730081R64974J18419j056896k580926k648734
5945B9732213k909895k359542j874291j484179j196794j351294r49635o77982
5937A6928601o63917k90840q55822p51413n61543o14825m90641m77117n62288
5928A1660195l07114p12817l59242r0001l59967q5480j69159l03452k19135k90026
5918H763802k40005j56419J17300O5013l67738j67700l5138k34984j36009l0886
5908G577236p5736j69915j23957j72500l90617l02874k04448J51045R4243k15501
5898F166976p4732j92458k57461q1602K66522k21691J65317J1377k20130k20360
5888E341758r1739o4511j42365k50379k12781L18181L6357K6610l545o2738n9505
$$ plain form
5877 4835343 4950786 4808627 4698492 4773879 4758540 4808942 4672627 4790268 4698759 4426871
5867 4426871 4309608 4111913 3836157 4003673 4314859 4474321 4622282 4609078 4804896 4732939
5857 4732939 4339794 4513435 4385532 4533907 4291741 4397909 4730044 4605901 4824721 4759916
5847 4759916 5011938 4981471 5045456 5290033 5121624 5124769 5254346 5330670 5371575 5214293 5218987
5836 5218987 5361389 5609939 5291105 5505271 5490559 5762826 5682661 5733419 5875257 5768986
5826 5768986 5734027 5714649 6100417 6020972 6007738 6155199 6479562 6537539 6736888 7286718
5816 7286718 7378876 7399267 7113907 7337276 7496028 7441861 7429585 7869227 8252243 8462661
5806 8462661 8657053 9104459 9737165 10398318 10842101 11359005 11672506 11816050 11757220 11459620
$$ packed form
5877D835343J15443j42159j10135P5387j5339N0402j36315J17641r1509k71888
5867D426871j17263j97695k75756J67516L11186J59462J47961j3204J95818p1957
5857D732939l93145J73641j27903J48375k42166J06168L32135j24143K18820o4805
5847D759916K52022l0467O3985K44577j68409L145J29577P6324M0905j57282M694
5836E218987J42402K48550l18834K14166j4712K72267q0165N0758J41838j06271
5826E768986l4959j9378L85768p9445j3234J47461L24363N7977J99349N49830
5816G286718R2158K0391k85360K23369J58752n4167j2276M39642L83016K10418
5806H462661J94392M47406O32706O61153M43783N16904L13501J43544n8830k97600
$$ plain form
5796 11459620 11291540 11241693 11492383 11622025 11874503 12357417 12535768 12926235 13058919 13525699
5786 13525699 13980517 14415892 14625741 14887679 14771808 14529880 14672264 14280313 13791827
5777 13791827 13570368 13185906 13077471 12891279 13078154 13430423 13979002 14431813 14821220
5768 14821220 14858698 14653718 14842226 15215943 15652721 15796649 16067986 16308382 16400477 16312411
5758 16312411 16983998 17254566 17043394 16786229 16569245 16093168 16059170 16422091 16651498 17302526
5748 17302526 17727879 18139913 18818466 18990116 19344866 20069927 20587185 21058004 21177183
5739 21177183 21069541 21231784 21257882 21541509 21834637 22178616 22615020 23167435 23473090 24257835
5729 24257835 25099024 26000278 26908995 27787431 28626266 29563556 29940480 30199846 30826016
$$ packed form
5796A1459620j68080m9847K50690J29642K52478M82914J78351L90467J32684M66780
5786A3525699M54818M35375K09849K61938j15871k41928J42384l91951m88486
5777A3791827k21459l84462j08435j86192J86875L52269N48579M52811L89407
5768A4821220L7478k04980J88508L73717M36778J43928K71337K40396R2095q8066
5758A6312411O71587K70568k11172k57165k16984m76077l3998L62921K29407O51028
5748A7302526M25353M12034O78553J71650L54750P25061N17258M70819J19179
5739B1177183j07642J62243K6098K83627K93128L43979M36404N52415L05655P84745
5729B4257835Q41189R01254R08717Q78436Q38835R37290L76924K59366O26170
$$ plain form
5720 30826016 31933282 32738046 33959870 35459285 36615761 37980530 40031430 41708032
5712 41708032 44046758 46587051 49105339 51903910 54803321 57904548 61032286 64586184
5704 64586184 68611413 73124014 78870394 85465997 93178110 101685533 112267800 125257991
5696 125257991 139685208 148907529 153281708 153991443 148941623 142352131 138565394 140488094
5688 140488094 146087716 152289415 155944448 159151753 160591627 161586308 165334003 172780390
5680 172780390 179371940 182637342 182468253 178236749 171709937 166510850 161244320 154872052
5672 154872052 149762617 143821820 138873222 136502656 137679712 141989811 147959918 149633343
5664 149633343 147191392 141437729 130898945 119351333 111156276 106766122 103981544 100820126
$$ packed form
5720C0826016J107266Q04764J221824J499415J156476J364769K050900J676602
5712D1708032K338726K540293K518288K798571K899411L101227L127738L553898
5704F4586184M025229M512601N746380O595603P712113Q507423J0582267J2990191
5696A25257991J4427217R222321M374179P09735n049820o589492l786737J922700
5688A40488094N599622O201699L655033L207305J439874R94681L747695P446387
5680A72780390O591550L265402j69089m231504o526812n199087n266530o372268
5672A54872052n109435n940797m948598k370566J177056M310099N970107J673425
5664A49633343k441951n753663j0538784j1547612q195057m390154k784578l161418
$$ plain form
5656 100820126 95688262 89134077 81722087 74402479 68261985 63232123 58940854 55481382
5648 55481382 52424542 49967808 48139688 46906112 45797153 45317204 45381103 46005821 46492028
5639 46492028 47091452 46925895 45558244 43408530 40325348 37054703 34459321 31818478
5631 31818478 30374520 28997103 27698555 26808562 25953302 25187486 24853705 24620654 24179195
5622 24179195 23983053 24405374 24656615 24956890 25284273 25259279 24826904 23788258 22844373
5613 22844373 22110968 21491379 20685691 19917949 19337353 19148757 19051748 18993001 19216858 19542018
5603 19542018 19989926 20345462 20466272 20972387 21144944 21016179 20674384 20285407 19600580
5594 19600580 19105170 18346695 17300156 16709506 16058341 15633556 15696599 15668972 15566167 15819681
$$ packed form
5656A00820126n131864o554185p411990p319608o140494n029862m291269l459472
5648E5481382l056840k456734j828120j233576j108959m79949O3899O24718M86207
5639D6492028N99424j65557j367651k149714l083182l270645k595382k640843
5631C1818478j443958j377417j298548q89993q55260p65816l33781k33051m41459
5622B4179195j96142M22321K51241L00275L27383k4994m32375j038646r43885
5613B2844373p33405o19589q05688p67742n80596j88596r7009n8747K23857L25160
5603A9542018M47908L55536J20810N06115J72557j28765l41795l88977o84827
5594A9600580m95410p58475j046539n90650o51165m24785O3043k7627j02805K53514
$$ plain form
5584 15819681 16181540 16590864 16772450 16705996 16823019 16936945 17097366 17006778 16960412 16844826
5574 16844826 16700505 16374438 16425737 16544061 16488528 16724685 17110674 17723616 18080554 18643883
5564 18643883 19187269 20258799 21024906 21803285 22805705 24077889 25391749 27149795 29532270
5555 29532270 32073571 35488310 39022710 41077015 41615453 41060937 38973400 37301236
5547 37301236 36441086 36960449 38367383 39999958 41151377 41857413 42067890 42136699 42912046
5538 42912046 44533327 45716320 45622449 44935295 43103773 41336400 40535568 39892140 39270852
5529 39270852 38551044 37034510 36005729 35651680 35907740 36889105 37724203 37849123 36660837
5520 36660837 33975352 30277807 26595020 23829211 21271568 19634113 18420638 17425923
$$ packed form
5584A5819681L61859M09324J81586o6454J17023J13926J60421r0588m6366j15586
5574A6844826j44321l26067N1299J18324n5533K36157L85989O12942L56938N63329
5564A8643883N43386J071530P66107P78379J002420J272184J313860J758046K382475
5555B9532270K541301L414739L534400K054305N38438n54516k087537j672164
5547C7301236q60150N19363J406934J632575J151419P06036K10477O8809P75347
5538D2912046J621281J182993r3871o87154j831522j767373q00832o43428o21288
5529C9270852p19808j516534j028781l54049K56060R81365Q35098J24920j188286
5520C6660837k685485l697545l682787k765809k557643j637455j213475r94715
$$ plain form
5512 17425923 16808225 16235929 15567238 14996917 14109210 13397263 12651432 12030128 11299498
5503 11299498 10633948 10137785 9920838 9697370 9186624 8805693 8438897 8379353 8084818 7838022
5493 7838022 7557763 7499437 7383227 7083055 6826943 6605946 6480525 6366701 6354937 6148520
5483 6148520 6289169 6286562 5824760 5796819 5842589 5785713 5771223 5591888 5374273 5447321 5435152
5472 5435152 5338888 5120510 5099018 5185172 5160708 5212020 5268824 5139058 5227082 5200894 5191961
5461 5191961 5397465 5319666 5086478 5207386 5470392 5333583 5509265 5766520 5640525 5825007
5451 5825007 5919523 6071684 6017942 6055684 6235074 6493444 6634482 6422132 6507764 6396373
5441 6396373 6747103 6737840 6983902 7482294 7797451 8031943 7835780 7676488 7533235 7195357
$$ packed form
5512A7425923o17698n72296o68691n70321q87707p11947p45831o21304p30630
5503A1299498o65550m96163k16947k23468n10746l80931l66796n9544k94535k46796
5493G838022k80259n8326j16210l00172k56112k20997j25421j13824j1764k06417
5483F148520J40649k607m61802k7941M5770n6876j4490j79335k17615P3048j2169
5472E435152r6264k18378k1492Q6154k4464N1312N6804j29766Q8024k6188q933
5461E191961K05504p7799k33188J20908K63006j36809J75682K57255j25995J84482
5451E825007R4516J52161n3742L7742J79390K58370J41038k12350Q5632j11391
5441F396373L50730r263K46062M98392L15157K34492j96163j59292j43253l37878
$$ plain form
5431 7195357 6681012 6248524 5931008 5970820 5843841 5861427 5740635 5635533 5576872 5816373
5421 5816373 5770459 5571448 5639462 5559772 5315766 5336494 5576893 5634385 5641335 5664400 5671048
5410 5671048 5806254 5857423 5639965 5727074 6020584 5696995 5620234 6088658 6438957 6474458
5400 6474458 6476441 6574705 7044186 7315328 7620958 8090075 8994437 9434531 10215849 10964598
5390 10964598 11546516 11455563 11457347 11211145 10478052 9868324 9517343 9245524 9159960 9064927
5380 9064927 9259678 9502635 9654317 9773142 10269450 10462939 10822559 11653967 12598331 13650975
5370 13650975 14771501 16631650 18590860 21059668 22687244 23038538 22316658 20953918
5362 20953918 19050306 17009206 15568286 14316908 13568316 12909009 12669137 12525885 12532804
$$ packed form
5431G195357n14345m32488l17516L9812j26979J7586j20792j05102n8661K39501
5421E816373m5914j99011O8014p9690k44006K0728K40399N7492O950K3065O648
5410E671048J35206N1169k17458Q7109K93510l23589p6761M68424L50299L5501
5400F474458J983R8264M69481K71142L05630M69117R04362M40094P81318P48749
5390A0964598N81918r0953J784k46202p33093o09728l50981k71819q5564r5033
5380I064927J94751K42957J51682J18825M96308J93489L59620Q31408R44364J052644
5370A3650975J120526J860149J959210K468808J627576L51294p21880j362740
5362B0953918j903612k041100j440920j251378p48592o59307k39872j43252O919
$$ plain form
5353 12532804 12615536 12792715 13075228 13247574 13786890 14619469 15821808 16929313 18647254
5344 18647254 20769406 23181986 25265072 26125290 25504069 24221564 22286518 20171591
5336 20171591 18527799 16716992 15852679 15213243 14465540 13932629 13318701 13043425 12707144
5327 12707144 12778159 12649174 12786591 13234008 13334131 13693901 14235145 14732907 15892902
5318 15892902 16838168 17849161 18557607 18488534 18039464 17886466 17485868 16682052 16061012
5309 16061012 15916947 15505759 15180105 14629196 14119132 13877430 13695813 13346107 12977707
5300 12977707 12541896 12591854 12363926 12028116 11843526 12238422 12099441 12443503 12549362 13152129
5290 13152129 13574218 13860403 14102784 14458581 14552392 14526698 14616687 14656674 14493859 14490952
$$ packed form
5353A2532804Q2732J77179K82513J72346N39316Q32579J202339J107505J717941
5344A8647254K122152K412580K083086Q60218o21221j282505j935046k114927
5336B0171591j643792j810807q64313o39436p47703n32911o13928k75276l36281
5327A2707144P1015j28985J37417M47417J00123L59770N41244M97762J159995
5318A5892902R45266J010993P08446o9073m49070j52998m00598q03816o21040
5309A6061012j44065m11188l25654n50909n10064k41702j81617l49706l68400
5300A2977707m35811M9958k27928l35810j84590L94896j38981L44062J05859O02767
5290A3152129M22089K86185K42381L55797R3811k5694Q9989L9987j62815k907
$$ plain form
5280 14490952 14544590 14404899 14198484 14328636 14234146 14157186 13990018 13821452 13696073 13872120
5270 13872120 14117603 14749062 15095393 15538154 15645652 16101856 16581179 17076779 17505292
5261 17505292 17959279 18376528 19242839 19623040 19959030 20460517 20717688 21066330 21559977
5252 21559977 22030720 22615337 23328270 24182597 24899607 25899474 27189728 28647447 29634744
5243 29634744 30505642 31538904 32580118 33750777 35352128 37415000 39539059 41581617
5235 41581617 42895291 44459380 46126465 47637420 49533681 51603019 53752295 56149199
5227 56149199 58744909 61550061 64528222 68227378 72117124 76543135 81319982 86657250
5219 86657250 92174936 99194230 107321548 117990067 129129810 137858797 145255273 151957248
$$ packed form
5280A4490952N3638j39691k06415J30152r4490p6960j67168j68566j25379J76047
5270A3872120K45483O31459L46331M42761J07498M56204M79323M95600M28513
5261A7505292M53987M17249Q66311L80201L35990N01487K57171L48642M93647
5252B1559977M70743N84617P12933Q54327P17010R99867J290254J457719R87297
5243B9634744Q70898J033262J041214J170659J601351K062872K124059K042558
5235D1581617J313674J564089J667085J510955J896261K069338K149276K396904
5227E6149199K595710K805152K978161L699156L889746M426011M776847N337268
5219H6657250N517686P019294Q127318J0668519J1139743Q728987P396476O701975
$$ plain form
5211 151957248 157537952 164031457 173638958 188889352 208805979 236135741 271231859
5204 271231859 320174290 386313153 475103349 519879487 520530130 485478875 416416021
5197 416416021 331891413 261087660 216775453 183051339 159772923 139842013 125222818
5190 125222818 112431823 103202673 94386679 88269775 81606052 76501896 71774263 68443504
5182 68443504 64982800 62384979 59931866 58241363 56394332 55481197 53921279 52610733
5174 52610733 51165484 49634205 47405304 45719903 44457591 43855389 43048167 43133837 43251277
5165 43251277 44524213 44788743 45419939 45235119 44815428 44081297 43297676 42941130 43669729
5156 43669729 44733977 47586259 48679400 48159620 46123285 41725394 37433384 34380605
$$ packed form
5211A51957248N580704O493505R607501J5250394J9916627K7329762L5096118
5204B71231859M8942431O6138863Q8790196M4776138O50643l5051255o9062854
5197D16416021q4524608p0803753m4312207l3724114k3278416j9930910j4619195
5190A25222818j2790995r229150q815994o116904o663723n104156m727633l330759
5182F8443504l460704k597821k453113j690503j847031r13135j559918j310546
5174E2610733j445249j531279k228901j685401j262312o02202q07222Q5670J17440
5165D3251277J272936K64530O31196j84820m19691p34131p83621l56546P28599
5156D3669729J064248K852282J093141n19780k036335m397891m292010l052779
$$ plain form
5148 34380605 32027163 30134789 28604960 27602914 26602864 25631504 24947704 24177032 23469005
5139 23469005 22800889 22208564 21732743 21394917 20990972 20666816 20466461 20069390 19732885
5130 19732885 19208624 19132614 18878291 18510195 18524715 18442262 18255461 18216643 18153929 18144996 18196803
5119 18196803 18251411 18542074 19131743 19351680 19426044 19115151 18830517 18437657 17958108 17629065
5109 17629065 17262242 16764623 16373222 16234607 16343312 16234411 16141134 16406430 15917634 15920141
5099 15920141 16182976 16280946 16296459 16274176 16035922 15988339 16326410 16751497 17168393 17611209
5089 17611209 17906347 18064711 18348927 18521308 18601122 18717184 18973597 19261219 19567676 19993917
5079 19993917 20419507 20425367 20744760 21292318 21694814 21914877 22351880 22715320 23149198 23589913
$$ packed form
5148C4380605k353442j892374j529829j002046j000050r71360o83800p70672p08027
5139B3469005o68116n92325m75821l37826m03945l24156k00355l97071l36505
5130A9732885n24261p6010k54323l68096J4520q2453j86801l8818o2714q933N1807
5119A8196803N4608K90663N89669K19937P4364l10893k84634l92860m79549l29043
5109A7629065l66823m97619l91401j38615J08705j08901r3277K65296m88796K507
5099A5920141K62835R7970J5513k2283k38254m7583L38071M25087M16896M42816
5089A7611209K95138J58364K84216J72381P9814J16062K56413K87622L06457M26241
5079A9993917M25590N860L19393N47558M02496K20063M37003L63440M33878M40715
$$ plain form
5069 23589913 24038080 24900904 25606601 26470592 27405842 28097948 29121131 29639222 30045369
5060 30045369 30909646 32043693 33190674 34561584 36245681 37505107 38950056 40692002
5052 40692002 42731677 45302034 48869203 53220159 59210761 66536944 71309946 72487574
5044 72487574 70489149 67031633 62532147 57234776 53908755 51683784 50840335 50541239
5036 50541239 50255046 50223458 51114521 51800556 53318648 54975160 57487291 60025688 63208567
5027 63208567 66768604 71465836 77015765 84567333 93557878 106041755 121777300 144351040
5019 144351040 158673713 160710406 153301427 136445404 115364159 98408284 88332634
5012 88332634 80978111 76385337 72652560 70096567 68125743 67289165 67183478 67497071 67744698
$$ packed form
5069B3589913M48167Q62824P05697Q63991R35250O92106J023183N18091M06147
5060C0045369Q64277J134047J146981J370910J684097J259426J444949J741946
5052D0692002K039675K570357L567169M350956N990602P326183M773002J177628
5044G2487574j998425l457516m499486n297371l326021k224971q43449k99096
5036E0541239k86193l1588Q91063O86035J518092J656512K512131K538397L182879
5027F3208567L560037M697232N549929P551568Q990545J2483877J5735545K2573740
5019A44351040J4322673K036693p408979j6856023k1081245j6955875j0075650
5012H8332634p354523m592774l732777k555993j970824q36578j05687L13593K47627
$$ plain form
5003 67744698 68649852 69348004 70529233 71909080 73646809 75488005 77598866 79762682
4995 79762682 81862306 83425502 84999559 86573797 88662006 90394473 92484452 94570545
4987 94570545 97794851 101144759 105730436 111137190 116750662 123308275 131270742 139955973
4979 139955973 149327007 159080314 168956107 178247589 186382094 192781404 197586704 200706512
4971 200706512 202653822 204104463 205325853 207007875 209626929 213718616 218730003 224936655
4963 224936655 231107467 236409828 240957168 245918733 251743362 259082240 268093605 277436880
4955 277436880 286352963 293220337 296948093 295728546 289970361 279985915 267183579 253952992
4947 253952992 242100123 232211123 225003561 220467345 217025488 213465487 208598739 203196793
$$ packed form
5003F7744698R05154O98152J181229J379847J737729J841196K110861K163816
4995G9762682K099624J563196J574057J574238K088209J732467K089979K086093
4987I4570545L224306L349908M585677N406754N613472O557613P962467Q685231
4979A39955973R371034R753307R875793R291482Q134505O399310M805300L119808
4971B00706512J947310J450641J221390J682022K619054M091687N011387O206652
4963B24936655O170812N302361M547340M961565N824629P338878R011365R343275
4955B77436880Q916083O867374L727756j219547n758185r984446j2802336j3230587
4947B53952992j1852869r889000p207562m536216l441857l560001m866748n401946
$$ plain form
4939 203196793 197727569 192843414 188834385 185312781 181830285 178248115 173241213 167440674
4931 167440674 160174834 151388091 141387243 130684124 120093616 110106274 101474762 94011471
4923 94011471 88254204 82404961 77672025 73214579 69711267 66822583 63824632 61368119
4915 61368119 59082779 56941594 55088360 53344640 52038547 51260388 50776782 50322380 50832599
4906 50832599 51148649 50555262 49274091 47183626 44670618 42251755 40291206 38830712
4898 38830712 37667153 36765457 35713794 34865051 33843515 33230885 32522609 31607372 31253890
4889 31253890 30489646 30024368 29471351 29079937 29033426 28932438 28626258 28256128 27823882 27849430
4879 27849430 27537932 27443950 27164925 27026974 27082099 27108937 27381206 27389572 27190294 27798656
$$ packed form
4939B03196793n469224m884155m009029l521604l482496l582170n006902n800539
4931A67440674p265840q786743j0000848j0703119j0590508r987342q631512p463291
4923I4011471n757267n849243m732936m457446l503312k888684k997951k456513
4915F1368119k285340k141185j853234j743720j306093p78159m83606m54402N10219
4906E0832599L16050n93387j281171k090465k513008k418863j960549j460494
4898C8830712j163559r01696j051663q48743j021536o12630p08276r15237l53482
4889C1253890p64244m65278n53017l91414m6511j00988l06180l70130m32246K5548
4879B7849430l11498r3982k79025j37951N5125K6838K72269Q366j99278O08362
$$ plain form
4869 27798656 28110586 28344999 28850871 29662401 30573729 31589989 33086669 34862319 36529805
4860 36529805 38125374 39521650 40675897 41716319 43028372 43956059 44562083 45094227 45128503
4851 45128503 44378105 42834363 41341748 39626251 37976964 36439783 35839637 35369655 35181285
4842 35181285 35274436 35738008 36089294 36816139 37327841 37944338 38695652 39082341 39859742 40490970
4832 40490970 41329856 42141449 42979645 43781002 44797597 46522411 47771734 49152922 50808002
4823 50808002 52618525 54241870 56036603 58053559 59975575 62430687 64795331 67668342
4815 67668342 70486173 73566235 77176628 81129342 85281230 89344494 94081275 99245041
4807 99245041 104945568 111637163 119380028 128472068 138949948 151217865 165639086 182711345
$$ packed form
4869B7798656L11930K34413N05872Q11530R11328J016260J496680J775650J667486
4860C6529805J595569J396276J154247J040422J312053R27687O06024N32144L4276
4851D5128503p50398j543742j492615j715497j649287j537181o00146m69982j88370
4842C5181285R3151M63572L51286P26845N11702O16497P51314L86689P77401O31228
4832D0490970Q38886Q11593Q38196Q01357J016595J724814J249323J381188J655080
4823E0808002J810523J623345J794733K016956J922016K455112K364644K873011
4815F7668342K817831L080062L610393L952714M151888M063264M736781N163766
4807I9245041N700527O691595P742865R092040J0477880J2267917J4421221J7072259
$$ plain form
4799 182711345 202261901 226233493 255258991 289823498 329751882 375829196 422853194
4792 422853194 464252220 493272660 501509964 485654625 447913906 394997867 336259528
4785 336259528 282002863 236864713 201805230 176058914 156559859 140908191 128061945
4778 128061945 117123380 107720689 99785711 92920987 87124381 81777127 77879245 74396029
4770 74396029 71585221 69871767 68667452 67414864 66743574 66572561 66438732 66855667 66602489
4761 66602489 65887027 64371234 61976498 59146125 55701874 52331787 49606276 47279605
4753 47279605 45446714 44060817 43145464 42461974 41949070 41232556 40647126 39592928 38745659
4744 38745659 37631971 36608677 35501191 34131926 33273571 32373523 31689528 30987562 30489337
$$ packed form
4799A82711345J9550556K3971592K9025498L4564507L9928384M6077314M7023998
4792D22853194M1399026K9020440Q237304j5855339l7740719n2916039n8738339
4785C36259528n4256665m5138150l5059483k5746316j9499055j5651668j2846246
4778A28061945j0938565r402691p934978o864724n796606n347254l897882l483216
4770G4396029k810808j713454j204315j252588o71290j71013j33829M16935k53178
4761F6602489p15462j515793k394736k830373l444251l370087k725511k326671
4753D7279605j832891j385897r15353o83490n12904p16514n85430j054198q47269
4744C8745659j113688j023294j107486j369265q58355r00048o83995p01966m98225
$$ plain form
4735 30489337 29856253 29106012 28646026 28335499 27976473 27427275 27098334 27073482 26590504 26334244
4725 26334244 26432532 26220760 26253348 26183069 26295964 26187426 26375723 26502660 26710001 27049112
4715 27049112 27030048 27563937 28110283 28644827 29551207 30493721 31342549 32331843 33434480
4706 33434480 34548362 35584415 36579968 37764292 38751446 39847714 41060989 42257544
4698 42257544 43167825 43948646 44414331 45184086 46389499 48307734 51210649 53818686 55762056
4689 55762056 56803829 55653242 52861410 48282447 43091985 38182485 33994446 30815325
4681 30815325 28444125 26611607 25037836 23806476 22871786 21945873 20881578 20082876 19308521
4672 19308521 19054715 18357308 17935597 17713160 17237281 17162199 16966073 17009665 16738363 16441090
$$ packed form
4735C0489337o33084p50241m59986l10527l59026n49198l28941k4852m82978k56260
4725B6334244R8288k11772L2588p0279J12895j08538J88297J26937K07341L39111
4715B7049112j9064N33889N46346N34544R06380R42514Q48828R89294J102637
4706C3434480J113882J036053R95553J184324R87154J096268J213275J196555
4698D2257544R10281P80821M65685P69755J205413J918235K902915K608037J943370
4689E5762056J041773j150587k791832m578963n190462m909500m188039l179121
4681C0815325k371200j832518j573771j231360r34690r25913j064295p98702p74355
4672A9308521k53806o97407m21711k22437m75879p5082j96126M3592k71302k97273
$$ plain form
4662 16441090 16331073 16130288 15821260 15838413 15795857 15609298 15961518 15825218 15794417 15586935
4652 15586935 15341848 15249708 15351169 15270222 15254971 15211020 15224092 15506746 15522438 15426639 15757918
4641 15757918 15836586 15827730 15938167 16213280 16236540 16321720 16625713 16957058 17264828 17186448
4631 17186448 17468772 17486415 17481662 17297287 17157745 16911863 16700022 16628232 16471822 16668739
4621 16668739 16457983 16646776 16779235 16978355 17245485 17106218 17398582 17617388 17733296
4612 17733296 17954065 18320147 18690692 19228283 19488763 19712225 20282403 20536697 20555903 20691544
4602 20691544 20400207 20504209 20402838 20400296 20837178 20547781 20926905 21377217 21844477 22006221
4592 22006221 22303946 22431569 22808226 23432597 23716272 23599588 23988747 24184949 24077348
$$ packed form
4662A6441090j10017k00785l09028J7153m2556j86559L52220j36300l0801k07482
4652A5586935k45087r2140J01461q0947j5251m3951J3072K82654J5692r5799L31279
4641A5757918P8668q856J10437K75113K3260Q5180L03993L31345L07770p8380
4631A7186448K82324J7643m753j84375j39542k45882k11841p1790j56410J96917
4621A6668739k10756J88793J32459J99120K67130j39267K92364K18806J15908
4612A7733296K20769L66082L70545N37591K60480K23462N70178K54294J9206J35641
4602B0691544k91337J04002j01371k542M36882k89397L79124M50312M67260J61744
4592B2006221K97725J27623L76657O24371K83675j16684L89159J96202j07601
$$ plain form
4583 24077348 23730360 23857971 23837966 23719312 23547607 23002647 22747584 22312454 22068611 21501863
4573 21501863 20818564 20349127 19917011 19361226 18954540 18450339 18339387 18108063 18076306 17952786
4563 17952786 18033371 17972955 17941914 17867673 17900903 17776676 17920362 17886897 17758530 17719224 17620093
4552 17620093 17488391 17350063 17346490 17435587 17114252 17272083 17123655 17186768 17364492 17559357
4542 17559357 17863263 18033383 18179436 18406428 18505574 18328679 18611584 18787804 19142983 19023947
4532 19023947 18842439 18784057 18658780 18569137 18789621 18779546 18808560 18791992 18857769 18917316 18876215
4521 18876215 19173333 19472125 19612779 19933844 20079171 20400169 20524964 20827012 21051413
4512 21051413 21506761 21949729 22386933 22982571 23249729 23498659 24036365 24448613 24574604
$$ packed form
4583B4077348l46988J27611k0005j18654j71705n44960k55063m35130k43843n66748
4573B1501863o83299m69437m32116n55785m06686n04201j10952k31324l1757j23520
4563A7952786Q0585o0416l1041p4241L3230j24227J43686l3465j28367l9306r9131
4552A7620093j31702j38328l573Q9097l21335J57831j48428O3113J77724J94865
4542A7559357L03906J70120J46053K26992R9146j76895K82905J76220L55179j19036
4532A9023947j81508n8382j25277q9643K20484j0075K9014j6568O5777N9547m1101
4521A8876215K97118K98792J40654L21065J45327L20998J24795L02048K24401
4512B1051413M55348M42968M37204N95638K67158K48930N37706M12248J25991
$$ plain form
4503 24574604 25082165 25669188 25812268 26342057 26987215 27584759 28159678 28606210 29357658
4494 29357658 29773697 30188340 31019136 31594367 31954990 32332861 32756723 33205526 33775805
4485 33775805 34421513 34886097 35068340 35187848 35661129 36252439 37195612 37795172 38715202
4476 38715202 39869773 41311744 42572454 43872229 45049052 46465286 48193764 49582231
4468 49582231 51023933 52702602 54632042 56488360 58474222 60511737 62879622 64781449
4460 64781449 66862948 68494776 70332371 72268681 74428070 76624429 78563469 80301818
4452 80301818 81649706 83420713 85323804 87087968 88783784 90595569 92535437 94529673
4444 94529673 96556645 99357439 102242878 104991526 107979103 111188386 114213832 117835160
$$ packed form
4503B4574604N07561N87023J43080N29789O45158N97544N74919M46532P51448
4494B9357658M16039M14643Q30796N75231L60623L77871M23862M48803N70279
4485C3775805O45708M64584J82243J19508M73281N91310R43173N99560R20030
4476C8715202J154571J441971J260710J299775J176823J416234J728478J388467
4468D9582231J441702J678669J929440J856318J985862K037515K367885J901827
4460F4781449K081499J631828J837595J936310K159389K196359J939040J738349
4452H0301818J347888J771007J903091J764164J695816J811785J939868J994236
4444I4529673K026972K800794K885439K748648K987577L209283L025446L621328
$$ plain form
4436 117835160 122212573 127436016 132894456 137922375 142255857 146604744 150756646 154637153
4428 154637153 158525193 162610336 166998395 171786806 176689653 181843444 187052743 192595491
4420 192595491 198873224 206557565 214634815 222392482 228932930 232786790 234976074 236134400
4412 236134400 236468462 237492719 239594157 242680748 245334734 247319269 248600655 248670283
4404 248670283 248313904 246898081 244129990 239846367 235022884 230292408 227060649 224919079
4396 224919079 223256137 219971768 214487393 206722570 197415491 188492459 180417232 173948788
4388 173948788 168474471 163497810 158777730 153776615 148569677 143360111 138669992 134147271
4380 134147271 129787299 125632957 121728426 117281720 113065001 108856691 104869029 100834800
$$ packed form
4436A17835160M377413N223443N458440N027919M333482M348887M151902L880507
4428A54637153L888040M085143M388059M788411M902847N153791N209299N542748
4420A92595491O277733P684341Q077250P757667O540448L853860K189284J158326
4412B36134400L34062J024257K101438L086591K653986J984535J281386O9628
4404B48670283l56379j415823k768091m283623m823483m730476l231759k141570
4396B24919079j662942l284369n484375p764823r307079q923032q075227o468444
4388A73948788n474317m976661m720080n001115n206938n209566m690119m522721
4380A34147271m359972m154342l904531m446706m216719m208310l987662m034229
$$ plain form
4372 100834800 97537675 93969581 90409180 87161471 83949798 80845858 78181447 75655122
4364 75655122 73342193 71236061 69270166 67636798 66023253 64540822 63451528 61966863
4356 61966863 60387448 58925053 57116625 55799505 53942958 52389074 50907868 49435834
4348 49435834 47676905 45973806 44208714 43099589 41695491 40125269 39220222 38639419
4340 38639419 37641547 36926515 35937925 35096616 33940435 33381724 33067028 32116252 31338472
4331 31338472 30729089 30323976 30040378 29649574 29302688 29007378 28664142 28447523 27997381
4322 27997381 27706649 27587375 27112242 26692658 26601575 26576022 26470016 26537623 26321063 26193752
4312 26193752 26175046 26275652 26645843 26626999 26730154 26693119 26664088 26977837 27127702 26843177
$$ packed form
4372A00834800l297125l568094l560401l247709l211673l103940k664411k526325
4364G5655122k312929k106132j965895j633368j613545j482431j089294j484665
4356F1966863j579415j462395j808428j317120j856547j553884j481206j472034
4348D9435834j758929j703099j765092j109125j404098j570222r05047n80803
4340C8639419r97872p15032r88590q41309j156181n58711l14696r50776p77780
4331C1338472o09383m05113k83598l90804l46886k95310l43236k16619m50142
4322B7997381k90732j19274m75133m19584r1083k5553j06006O7607k16560j27311
4312B6193752j8706J00606L70191j8844J03155l7035k9031L13749J49865k84525
$$ plain form
4302 26843177 26831193 26727776 26698947 26649733 26479364 25897959 25284718 24561913 24399753 24027291
4292 24027291 23759792 23530453 23137509 23086963 23206885 22883563 23253255 23113726 22922146 23085886
4282 23085886 23257428 23150412 23138642 23436741 23582470 23773402 24061403 24296889 24365841 24785645
4272 24785645 24967277 25089783 25065853 24910832 24879187 24903193 24742909 24562276 24023826 23993815
4262 23993815 23604800 23415369 23347181 23336273 23278032 23218520 23460467 23465528 23373160 23614614 23511926
4251 23511926 23259540 23070998 23038361 22741326 22500830 21934811 21589949 21547565 21348371 20834578
4241 20834578 20600809 20679909 20165512 19808383 19611161 19651775 19487792 19115500 19006362 19083948
4231 19083948 18925943 18605975 18521821 18394313 18108973 18174623 18123077 18134846 18131223 18032477 17901506
$$ packed form
4302B6843177j1984j03417k8829m9214j70369n81405o13241p22805j62160l72462
4292B4027291k67499k29339l92944n0546J19922l23322L69692j39529j91580J63740
4282B3085886J71542j07016j1770K98099J45729J90932K88001K35486O8952M19804
4272B4785645J81632J22506k3930j55021l1645K4006j60284j80633n38450l0011
4262B3993815l89015j89431o8188j0908n8241n9512K41947N061r2368K41454j02688
4251B3511926k52386j88542l2637k97035k40496n66019l44862m2384j99194n13793
4241B0834578k33769P9100n14397l57129j97222M0614j63983l72292j09138P7586
4231A9083948j58005l19968q4154j27508k85340O5650n1546J1769l623r8746j30971
$$ plain form
4220 17901506 17687741 18007796 17768799 17617375 17772082 17810157 17660016 17474535 17580181 17800308
4210 17800308 17693948 17849304 17865829 17651713 17723689 17960861 17882839 18034366 17961780 17917624
4200 17917624 18132038 17986252 17926848 17845439 17775395 17686055 17659576 17764419 17719468 17574257
4190 17574257 17324531 17125282 16790674 16901549 16831490 16737067 16859353 16769122 16591896 16487732
4180 16487732 16838565 16899286 16954495 16809827 16764530 16556958 16459498 16655955 16574240 16371394
4170 16371394 16242031 16517944 16557510 16350133 16302856 16221733 16344126 16142522 16046154 15896841
4160 15896841 15850674 15807136 15948343 15959395 16076936 15918151 15871605 15971792 15963524 15740181
4150 15740181 15989702 15885273 16057255 15917288 15950643 15901901 15785045 15650189 15915828 15838922
$$ packed form
4220A7901506k13765L20055k38997j51424J54707L8075j50141j85481J05646K20127
4210A7800308j06360J55356J6525k14116P1976K37172p8022J51527p2586m4156
4200A7917624K14414j45786n9404q1409p0044q9340k6479J04843m4951j45211
4190A7574257k49726j99249l34608J10875p0059r4423J22286r0231j77226j04164
4180A6487732L50833O0721N5209j44668m5297k07572r7460J96457q1715k02846
4170A6371394j29363K75913L9566k07377m7277q1123J22393k01604r6368j49313
4160A5896841m6167m3538J41207J1052J17541j58785m6546J00187q268k23343
4150A5740181K49521j04429J71982j39967L3355m8742j16856j34856K65639p6906
$$ plain form
4140 15838922 15665983 15803003 16083673 16291116 16248083 16550595 16716819 16582471 16511479 16539529
4130 16539529 16610482 16875129 16838330 16936293 17124812 17229156 17308411 17438135 17496944 17685505
4120 17685505 18062523 18405538 18976703 19065301 19150115 19341350 19150119 18899429 18597215 18500005
4110 18500005 18509358 18767190 19009836 19119880 19039189 19058942 19184330 19416157 19506327 19614553
4100 19614553 20030627 20118222 20052685 20689265 21071242 21575755 22417082 23116536 23140261 23190659
4090 23190659 23045959 22890181 22763866 22637048 22466642 22502494 22808588 22836140 22543777 22721904
4080 22721904 23075739 23182635 23530538 23640245 23783566 24118795 24612762 24987159 25430611
4071 25430611 25562957 26042481 26873562 27106522 27428255 27174235 27409455 27529518 27475522 28084896
$$ packed form
4140A5838922j72939J37020K80670K07443m3033L02512J66224j34348p0992K8050
4130A6539529P0953K64647l6799R7963J88519J04344P9255J29724N8809J88561
4120A7685505L77018L43015N71165Q8598Q4814J91235j91231k50690l02214r7210
4110A8500005R353K57832K42646J10044q0691J9753J25388K31827R0170J08226
4100A9614553M16074Q7595o5537O36580L81977N04513Q41327O99454K3725N0398
4090B3190659j44700j55778j26315j26818j70406L5852L06094K7552k92363J78127
4080B2721904L53835J06896L47903J09707J43321L35229M93967L74397M43452
4071B5430611J32346M79524Q31081K32960L21733k54020K35220J20063n3996O09374
$$ plain form
4061 28084896 28459729 28766858 29200815 29625364 29933109 30074354 30384753 30751654 30972008
4052 30972008 31264659 31638301 31870705 32204219 32828987 33331426 33784111 34557690 35109041
4043 35109041 36061745 36615394 37539635 38375180 39188848 39984839 40906293 41949648 43162247
4034 43162247 44239740 45562388 46500085 47648197 48902569 49883166 50870200 52037901 53208729
4025 53208729 54429490 55739508 57010502 58693165 60287870 61676577 63079948 64938596
4017 64938596 66706903 68489487 70259824 72584218 74854279 77209104 79768653 82815160
4009 82815160 85617399 88562071 91900378 95583829 99543002 103963637 108950000 114374016
4001 114374016 120546179 127301201 134435362 142237584 150100564 157885032 165552294 171446046
$$ packed form
4061B8084896L74833L07129M33957M24549L07745J41245L10399L66901K20354
4052C0972008K92651L73642K32404L33514O24768N02439M52685P73579N51351
4043C5109041R52704N53649R24241Q35545Q13668P95991R21454J043355J212599
4034D3162247J077493J322648R37697J148112J254372R80597R87034J167701J170828
4025E3208729J220761J310018J270994J682663J594705J388707J403371J858648
4017F4938596J768307J782584J770337K324394K270061K354825K559549L046507
4009H2815160K802239K944672L338307L683451L959173M420635M986363N424016
4001A14374016O172163O755022P134161P802222P862980P784468P667262N893752
$$ plain form
3993 171446046 175387156 176526753 174202405 168896662 161779380 153710673 146083913 139375813
3985 139375813 133610366 128620312 124180293 120471604 117874816 115862302 114575969 114394695
3977 114394695 114012141 112977870 111062933 108229192 105022635 101775899 98359429 95431060
3969 95431060 92074884 89516997 87105941 85044399 83032800 81529287 80324608 79076236
3961 79076236 78030394 77558325 76826738 76812037 77165057 78399990 80669270 83852864 87168218
3952 87168218 88746944 88489221 85591168 80767749 74759862 69654179 65268073 61652716
3944 61652716 58710492 56238665 54358406 52624030 51248111 50153511 49480016 48892146
3936 48892146 48481158 48102434 48167985 48269694 48392591 49191050 50372374 51931095 52719884
$$ packed form
3993A71446046L941110J139597k324348n305743p117282q068707p626760o708100
3985A39375813n765447m990054m440019l708689k596788k012514j286333j81274
3977A14394695l82554j034271j914937k833741l206557l246736l416470k928369
3969I5431060l356176k557887k411056k061542k011599j503513j204679j248372
3961G9076236j045842m72069p31587j4701L53020J234933K269280L183594L315354
3952H7168218J578726k57723k898053m823419o007887n105683m386106l615357
3944F1652716k942224k471827j880259j734376j375919j094600o73495n87870
3936D8892146m10988l78724O5551J01709J22897P98459J181324J558721P88789
$$ plain form
3927 52719884 52633056 51030266 48487344 45807049 42971712 40684622 39174081 37461271
3919 37461271 36003511 35181783 34099113 33102583 32502158 31799597 31173682 30563385 29758601
3910 29758601 29492633 29010092 28509071 28293839 27641394 27405580 27071453 26769219 26492738
3901 26492738 26123261 25856982 25519811 25236830 24709577 24455474 24073576 24016869 23750622 23248550
3891 23248550 23382699 23297229 22750804 22443809 22362805 21739941 21680707 21536625 21172541 21120747
3881 21120747 20685120 20539611 20399225 20375258 20193891 19888462 19802141 19710214 19560323 19527143
3871 19527143 19287621 19174158 18920785 18734007 18651594 18503450 18387144 18169153 17997528 17800036
3861 17800036 17796657 17658605 17195159 16955953 16859923 16776712 16746960 16684152 16650069 16380963 16222356
$$ packed form
3927E2719884q6828j602790k542922k680295k835337k287090j510541j712810
3919C7461271j457760q21728j082670r96530o00425p02561o25915o10297q04784
3910B9758601k65968m82541n01021k15232o52445k35814l34127l02234k76481
3901B6492738l69477k66279l37171k82981n27253k54103l81898n6707k66247n02072
3891B3248550J34149q5470n46425l06995q1004o22864n9234j44082l64084n1794
3881B1120747m35627j45509j40386k3967j81367l05429q6321r1927j49891l3180
3871A9527143k39522j13463k53373j86778q2413j48144j16306k17991j71625j97492
3861A7800036l379j38052m63446k39206r6030q3211k9752o2808l4083k69106j58607
$$ plain form
3850 16222356 16093852 15893549 15869621 15683855 15624676 15668616 15648813 15569988 15238383 15190559
3840 15190559 14925333 14863125 14747327 14559069 14364134 14270068 14189698 14551091 14387945 14352679
3830 14352679 13974735 14057017 14020368 13821475 13789005 13897914 13962784 14010785 14192057 14169893
3820 14169893 14450826 14333642 14220413 14380000 14707244 14800526 14934917 14972305 15188960 15388922
3810 15388922 15379603 15599865 15795549 15991898 16464506 16667768 17071808 17381904 17794806 18281306
3800 18281306 18694781 19152512 19485246 19657618 19830739 19751249 19692510 19749530 19952489 20437418
3790 20437418 20886084 21095424 21298293 21648472 21771040 22213219 22131871 22377373 22881599 23585099
3780 23585099 24088002 24490696 25007750 25821246 26894356 27917283 28964900 29579292 29925537
$$ packed form
3850A6222356j28504k00303k3928j85766n9179M3940j9803p8825l31605m7824
3840A5190559k65226o2208j15798j88258j94935r4066q0370L61393j63146l5266
3830A4352679l77944Q2282l6649j98893l2470J08909O4870M8001J81272k2164
3820A4169893K80933j17184j13229J59587L27244R3282J34391L7388K16655J99962
3810A5388922r319K20262J95684J96349M72608K03262M04040L10096M12902M86500
3800A8281306M13475M57731L32734J72372J73121p9490n8739N7020K02959M84929
3790B0437418M48666K09340K02869L50179J22568M42179q1348K45502N04226P03500
3780B3585099N02903M02694N17054Q13496J073110J022927J047617O14392L46245
$$ plain form
3771 29925537 29946944 30361581 30889835 31748033 32430777 33605368 34759976 35705370 36780929
3762 36780929 37385971 38035274 38610037 39394258 40296208 40923063 41602311 42175176 42640058
3753 42640058 43182205 44152285 45086196 45906134 46994458 48363313 49362788 50872944 52605369
3744 52605369 54248640 56152471 58553419 60965968 63450646 65654098 67451298 68618195
3736 68618195 68381278 67399340 65413398 63519848 61756227 60141158 59569772 59140092 58975272
3727 58975272 59632155 60491572 61313443 62391064 63844437 65390321 66724694 67895863 68958597
3718 68958597 69691690 70025880 69693980 68413480 66528837 64476323 62037908 59688874 57385620
3709 57385620 55334795 53706349 52479237 51482305 50854015 50448631 50109670 49774374 49377304
$$ packed form
3771B9925537K1407M14637N28254Q58198O82744J174591J154608R45394J075559
3762C6780929O05042O49303N74763P84221R01950O26855O79248N72865M64882
3753D2640058N42147R70080R33911Q19938J088324J368855R99475J510156J732425
3744E2605369J643271J903831K400948K412549K484678K203452J797200J166897
3736F8618195k36917r81938j985942j893550j763621j615069n71386m29680j64820
3727E8975272O56883Q59417Q21871J077621J453373J545884J334373J171169J062734
3718F8958597P33093L34190l31900j280500j884643k052514k438415k349034k303254
3709E7385620k050825j628446j227112r96932o28290m05384l38961l35296l97070
$$ plain form
3700 49377304 49414067 48823682 47491290 46291282 44794588 42996716 41001684 38971221 36983566
3691 36983566 34940662 33058910 31615848 30340164 29319420 28153840 26882025 26105920
3683 26105920 25484919 24363983 23697836 23556818 22819622 22009290 21203046 20627996 20041328
3674 20041328 18991316 18348803 17764867 17019673 16800589 16013757 15245449 15220644 14605007
3665 14605007 14257641 13787992 13400705 12957248 12745276 12278158 11850780 11644328 11517955
3656 11517955 11318666 10988119 10819054 10382839 10295478 9897175 9733271 9751504 9430960 9198105
3646 9198105 8839462 8592810 8645705 8451208 8146138 7693584 7472580 7231932 7128937 7006642
3636 7006642 7034637 6597736 6463183 6366303 6345840 6200860 6057221 5941176 5800594 5607093
$$ packed form
3700D9377304L6763n90385j332392j200008j496694j797872j995032k030463j987655
3691C6983566k042904j881752j443062j275684j020744j165580j271815p76105
3683B6105920o21001j120936o66147j41018p37196q10332q06244n75050n86668
3674B0041328j050012o42513n83936p45194k19084p86832p68308k4805o15637
3665A4605007l47366m69649l87287m43457k11972m67118m27378k06452j26373
3656A1517955j99289l30547j69065m36215q7361l98303j63904J8233l20544k32855
3646I198105l58643k46652N2895j94497l05070m52554k21004k40648j02995j22295
3636G006642K7995m36901j34553r6880k0463j44980j43639j16045j40582j93501
$$ plain form
3626 5607093 5219802 5504760 5341249 5047542 5233637 4957113 4930220 4667465 4573118 4530039
3616 4530039 4459026 4047528 4031683 3983253 3885941 3948551 4062655 3880752 3561989 3661507 3433824
3605 3433824 3408697 3360093 3287184 3191192 2794921 2766979 3002351 2906282 2720403 2760530 2655349
3594 2655349 2716975 2572156 2449933 2468645 2364295 2371104 2239866 2341390 2442031 2432284 2465353
3583 2465353 2507671 2319616 2420388 2602181 2407012 2076011 2068024 2072098 1927831 1990210 2077567
3572 2077567 2137136 2143894 1913444 2005439 2307332 2244228 1694387 1949696 2068033 2089813 1818957
3561 1818957 1706064 1623332 1828643 1786132 1758478 1943610 1824481 1892095 1618892 1524853
3551 1524853 1787418 1835051 1708089 1493235 1527925 1696938 1580654 1287852 1364836 1428426
$$ packed form
3626E607093l87291K84958j63511k93707J86095k76524k6893k62755r4347m3079
3616D530039p1013m11498j5845m8430r7312O2610J14104j81903l18763R9518k27683
3605C433824k5127m8604p2909r5992l96271k7942K35372r6069j85879M0127j05181
3594B655349O1626j44819j22223J8712j04350O809j31238J01524J00641r747L3069
3583B465353M2318j88055J00772J81793j95169l31001p987M074j44267O2379Q7357
3572B077567N9569O758k30450R1995L01893o3104n49841K55309J18337K1780k70856
3561A818957j12893q2732K05311m2511k7654J85132j19129O7614k73203r4039
3551A524853K62565M7633j26962k14854L4690J69013j16284k92802P6984O3590
$$ plain form
3541 1428426 1247763 1327425 1491194 1509745 1428710 1391268 1558238 1348855 1392421 1369208 1366666
3530 1366666 1500125 1439383 1304539 1133617 1200103 1353581 1459435 1335896 1300564 1350701
3520 1350701 1394388 1586577 1351677 1245972 1062882 1043152 1031770 1170136 1476292 1313751
3510 1313751 1171327 1189257 1276349 1355321 1134976 1129098 1069170 1065765 929018 1087887 1003953
3499 1003953 875051 1039497 1167343 929896 814353 798376 857004 822041 708918 829835
3489 829835 686049 882630 799887 657775 632028 868146 794637 786703 799624 885432 702947
3478 702947 463054 542528 634254 552503 549597 368171 764857 626613 957659 832173 386140
3467 386140 179583 317913 424542 156335 479729 508745 538095 523553 541893 492851 612003
$$ packed form
3541A428426j80663P9662J63769J8551q1035l7442J66970k09383M3566k3213k542
3530A366666J33459o0742j34844j70922O6486J53478J05854j23539l5332N0137
3520A350701M3687J92189k34900j05705j83090j9730j1382J38366L06156j62541
3510A313751j42424J7930Q7092P8972k20345n878n9928l405j36747J58869q3934
3499A003953j28902J64446J27846k37447j15543j5977N8628l4963j13123J20917
3489H29835j43786J96581q2743j42112k5747K36118p3509p934J2921Q5808j82485
3478G02947k39893P9474R1726q1751k906j81426L96686j38244L31046j25486m46033
3467C86140k06557J38330J06629k68207L23394K9016K9350j4542J8340m9042J19152
$$ plain form
3456 612003 479960 381734 514243 577630 342888 56226 186822 190257 266384 301550 151345
3445 151345 303024 412260 586017 707918 571223 526488 443552 187727 368560 170970
3435 170970 -112195 177887 15076 98637 163727 251861 -24701 106696 232030 131501
3425 131501 477008 501646 158623 137358 69744 241048 352690 71981 123162 163599 243208
3414 243208 158863 74809 393965 184222 11136 -6733 29137 -105591 -23309 125959 291003
3403 291003 225963 25264 -54704 106141 67218 30538 282661 181447 305867 263578 105521
3392 105521 113262 -103051 13332 148436 150762 124255 28273 -72787 -48617 47908 -78824
3381 -78824 -36809 -322368 -93337 -50426 -270794 -151009 -90708 -131143 -297602 -207307 -203869
$$ packed form
3456F12003j32043r8226J32509O3387k34742k86662J30596L435P6127L5166j50205
3445A51345J51679J09236J73757J21901j36695m4735q2936k55825J80833j97590
3435A70970k83165K90082j62811Q3561O5090Q8134k76562J31397J25334j00529
3425A31501L45507K4638l43023k1265o7614J71304J11642k80709N1181M0437P9609
3414B43208q4345q4054L19156k09743j73086j7869L5870j34728Q2282J49268J65044
3403B91003o5040k00699p9968J60845l8923l6680K52123j01214J24420m2289j58057
3392A05521P741k16313J16383J35104K326k6507r5982j01060K4170R6525j26732
3381g8824M2015k85559K29031M2911k20368J19785O0301m0435j66459R0295L438
$$ plain form
3370 -203869 -193543 -165996 -307189 -98112 -114827 -103014 -208813 76844 -171310 -206064 -251273
3359 -251273 -131122 -109853 -323336 -405495 -229234 68438 2985 132412 -93648 -187336
3349 -187336 -213599 -160140 -95769 -12953 -75642 -439445 -286143 -204612 -257417 22013 -27623
3338 -27623 -31578 -144885 -116911 2537 -186760 -420943 -379764 -449977 -344825 -257010 -283881
3327 -283881 -15463 -73376 -288503 -274557 -244093 -498812 -284185 -174868 -247922 -89260
3317 -89260 -153534 -183240 -276021 -479651 -417974 -363747 -298258 -322691 -307509 -351211 -294438 -207833
3305 -207833 -197649 -62894 -156947 -352044 -301930 -25553 -238493 -390599 -78845 -105004
3295 -105004 -68569 -343329 -482165 -253599 -264560 -168523 -40978 -20348 -124142 -276933
$$ packed form
3370b03869J0326K7547j41193K09077j6715J1813j05799K85657k48154l4754m5209
3359b51273J20151K1269k13483q2159J76261K97672o5453J29427k26060r3688
3349a87336k6263N3459O4371Q2816o2689l63803J53302Q1531n2805K79430m9636
3338b7623l955j13307K7974J19448j89297k34183M1179p0213J05152Q7815k6871
3327b83881K68418n7913k15127J3946L0464k54719K14627J09317p3054J58662
3317h9260o4274k9706r2781k03630O1677N4227O5489k4433J5182m3702N6773Q6605
3305b07833J0184J34755r4053j95097N0114K76377k12940j52106L11754k6159
3295a05004L6435k74760j38836K28566j0961R6037J27545K0630j03794j52791
$$ plain form
3285 -276933 -341134 -280076 -343410 -288061 -308458 -298751 -304987 -372092 -378187 -389928 -458589 -373083
3273 -373083 -173343 -395597 -246578 -295313 -331813 -259239 -321224 -211448 -305756 -319299 -211295
3262 -211295 -21096 -53920 -127066 -157288 -148855 48416 -4851 -170117 -304604 -149966 -45009
3251 -45009 -162930 -296148 -329331 -30344 14383 -185180 -59931 -328740 -650220 -117623
3241 -117623 -35709 -143723 157753 -38787 -267815 -122077 -97756 -219095 -248969 -291634
3231 -291634 -217061 -114535 45418 -184226 -197231 -180897 -28406 3393 -11302 -37554 185802
3220 185802 -37066 -193233 -135718 -80586 198661 -63959 -109536 8120 -9680 109977
3210 109977 -10375 21283 145733 148941 199451 119023 102069 -43003 162775 26172 73366
$$ packed form
3285b76933o4201O1058o3334N5349k0397R707o236o7105o095j1741o8661Q5506
3273c73083J99740k22254J49019m8735l6500P2574o1985J09776r4308j3543J08004
3262b11295J90199l2824p3146l0222Q433J97271n3267j65266j34487J54638J04957
3251d5009j17921j33218l3183K98987M4727j99563J25249k68809l21480N32597
3241a17623Q1914j08014L01476j96540k29028J45738K4321j21339k9874m2665
3231b91634P4573J02526J59953k29644j3005J6334J52491L1799j4695k6252K23356
3220A85802k22868j56167N7515N5132K79247k62620m5577J17656j7800J19657
3210A09977j20352L1658J24450L208N0510q0428j6954j45072K05778j36603M7194
$$ plain form
3199 73366 213631 127615 274703 264271 265540 417921 152210 205472 278440 591348 709263
3188 709263 654562 508711 559434 831954 1085102 1033737 994623 1212061 974230 714795
3178 714795 1127113 1291887 1231223 1602202 1640644 1628677 1662617 1887932 1787698 1845719 2155023
3167 2155023 2312304 2294772 2538779 2777373 3017571 3185468 3267618 3769369 4004402 4101818
3157 4101818 4213130 4704173 4989370 5294113 5783361 6497985 6992331 7789312 8182188 8941618
3147 8941618 9628755 10779883 12284873 14329324 16714648 20090430 23993109 30605531
3139 30605531 35644028 35901275 32575607 26147538 19961054 15668636 13251313 11124503
3131 11124503 9747354 8723501 7804964 7113869 6591332 5836627 5436940 4795864 4387585
$$ packed form
3199G3366J40265q6016J47088j0432J269J52381k65711N3262P2968L12908J17915
3188G09263n4701j45851N0723K72520K53148n1365l9114K17438k37831k59435
3178G14795M12318J64774o0664L70979L8442j1967L3940K25315j00234N8021L09304
3167B155023J57281j7532K44007K38594K40198J67897Q2150N01751K35033R7416
3157D101818J11312M91043K85197L04743M89248P14624M94346P96981L92876P59430
3147H941618O87137J151128J504990K044451K385324L375782L902679O612422
3139C0605531N038497K57247l325668o428069o186484m292418k417323k126810
3131A1124503j377149j023853r18537o91095n22537p54705l99687o41076m08279
$$ plain form
3122 4387585 4221052 3852828 3590213 3333784 2968052 2753412 2501262 2478250 2440177 2234990
3112 2234990 2219822 2339858 2084604 1938026 1710603 1701060 1654406 1388330 1255618 1280150
3102 1280150 1287891 1175484 1065160 1117254 1106594 782350 710484 637868 602377 917216 1068758
3091 1068758 969111 687474 739166 671545 490878 587048 705140 486932 445292 358433 408530
3080 408530 175451 280418 463287 516718 483158 163212 90881 193878 288180 167848
3070 167848 134551 294845 344623 293266 315189 172239 256784 165295 99518 54803 -115152
3059 -115152 -103749 -102694 -50594 -129907 47629 -36190 -9416 -56885 150663 -55793 -56017 -32339
3047 -32339 -167157 -156179 -223175 -24104 141209 -116918 -184801 31136 -83065 -57735 66153
$$ packed form
3122D387585j66533l68224k62615k56429l65732k14640k52150k3012l8073k05187
3112B234990j5168J20036k55254j46578k27423r543m6654k66076j32712K4532
3102A280150P741j12407j10324N2094j0660l24244p1866p2616l5491L14839J51542
3091A068758r9647k81637N1692o7621j80667R6170J18092k18208m1640q6859N0097
3080D08530k33079J04967J82869N3431l3560l19946p2331J02997R4302j20332
3070A67848l3297J60294M9778n1357K1923j42950Q4545r1489o5777m4715j69955
3059a15152J1403J055N2100p9313J77536q3819K6774m7469K07548k06456k24K3678
3047c2339j34818J0978o6996J99071J65313k58127o7883K15937j14201K5330J23888
$$ plain form
3036 66153 -188382 158204 63631 -110229 -138538 -298650 -188666 14810 -19463 -97569 -28530
3025 -28530 -37338 -22490 -17482 -42910 -282049 -46013 -43763 -236818 -327135 -122065 13105
3014 13105 -72955 27770 -76132 -47819 -74760 -159156 -173227 -454092 -239030 -11672 -148186
3003 -148186 -181664 -296519 -234274 -230051 -265743 -454291 -566323 -368105 -231151 -193283 -161207
2992 -161207 -139427 -201261 -225933 -507881 -473704 -378469 -156160 -234890 -279353 -65834 -96822
2981 -96822 -232459 -126666 -126164 -305989 -411152 -307378 -307613 -207461 -263098 -457006 -361494
2970 -361494 -245511 -282393 -177994 -229572 -107551 -201837 -288459 -237458 5227 -245873 -262697
2959 -262697 -143262 -270487 -333090 -430741 -260315 -354469 -409569 -125898 -80026 -300278 -275971
$$ packed form
3036F6153k54535L46586r4573j73860k8309j60112J09984K03476l4273p8106O9039
3025b8530q808J4848N008k5428k39139K36036K250j93055r0317K05070J35170
3014A3105q6060J00725j03902K8313k6941q4396j4071k80865K15062K27358j36514
3003a48186l3478j14855O2245M223l5692j88548j12032J98218J36954L7868L2076
2992a61207K1780o1834k4672k81948L4177R5235K22309p8730m4463K13519l0988
2981i6822j35637J05793N02j79825j05163J03774k35J00152n5637j93908R5512
2970c61494J15983l6882J04399n1578J22021r4286q6622N1001K42685k51100j6824
2959b62697J19435j27225o2603r7651J70426r4154n5100K83671M5872k20252K4307
$$ plain form
2948 -275971 -127423 -235003 -395561 -363321 -184716 -251686 -216101 -239245 -27469 -80171 -119858
2937 -119858 -170899 -103656 -216111 -9389 50819 -231032 -188183 -239074 -250406 -415996 -310822
2926 -310822 -281404 -331745 -458013 -428219 -284880 -258193 -96594 -140274 103681 -38698 -288951
2915 -288951 -161903 -237144 -254644 -326065 -273894 -360486 -345793 -318820 -386689 -365594 -3714
2904 -3714 -85063 -130771 -209992 -121939 -140124 -322618 -599882 -127661 -132268 -309019 -316250 -462997
2892 -462997 -257017 -331793 -197274 -279032 -175777 -27626 -249560 -509090 -487678 -469055
2882 -469055 -145088 27209 -144656 -256728 -256953 -171095 -244518 -188893 -57821 -138198 -166633
2871 -166633 -239471 -104790 -144585 -227633 -114149 -62460 -203388 -290149 -167620 -16819 -57773
$$ packed form
2948b75971J48548j07580j60558L2240J78605o6970L5585k3144K11776n2702l9687
2937a19858n1041O7243j12455K06722O0208k81851M2849n0891j1332j65590J05174
2926c10822K9418n0341j26268K9794J43339K6687J61599m3680K43955j42379k50253
2915b88951J27048p5241j7500p1421N2171q6592J4693K6973o7869K1095L61880
2904c714q1349m5708p9221Q8053j8185j82494k77264M72221m607j76751p231j46747
2892d62997K05980p4776J34519q1758J03255J48151k21934k59530K1412J8623
2882d69055L23967J72297j71865j12072k25Q5858p3423N5625J31072q0377k8435
2871a66633p2838J34681l9795q3048J13484N1689j40928q6761J22529J50801m0954
$$ plain form
2860 -57773 -303376 -323426 -322990 -208265 -282383 -387285 -148366 -126495 -9695 -76717 -179927
2849 -179927 -115983 -340073 -418355 -255378 -24348 -211930 -156921 -17551 -220495 -303761
2839 -303761 -214981 -309733 -252846 -216504 -450472 -148435 -233482 -515677 -283635 -270876 -281455
2828 -281455 -268214 -259593 -404096 -319516 -460781 -300842 -370371 -360549 -179757 -167239 -58192
2817 -58192 18353 -85743 -271050 -353700 -251907 -177585 -459914 -391031 -400842 -139023 12940
2806 12940 -103365 -234110 -462451 -239188 -481396 -233474 -311898 -163778 134848 -88827
2796 -88827 -172987 60644 -232588 -267225 -357740 -374432 -335014 -349345 -219356 -297856 -366355
2785 -366355 -355561 -224597 -68419 50473 -49266 -455331 -421760 -359750 -190302 -141896 -337486
$$ packed form
2860e7773k45603k0050M36J14725p4118j04902K38919K1871J16800o7022j03210
2849a79927O3944k24090p8282J62977K31030j87582N5009J39370k02944q3266
2839c03761Q8780r4752N6887L6342k33968L02037q5047k82195K32042J2759j0579
2828b81455J3241Q621j44503Q4580j41265J59939o9529R822J80792J2518J09047
2817e8192P6545j04096j85307q2650J01793P4322k82329O8883r811K61819J51963
2806A2940j16305j30745k28341K23263k42208K47922p8424J48120K98626k23675
2796h8827q4160K33631k93232l4637r0515j6692L9418j4331J29989p8500o8499
2785c66355J0794J30964J56178J18892r9739m06065L3571O2010J69448M8406j95590
$$ plain form
2774 -337486 -273184 -543887 -321167 -73448 -103151 -384599 -429114 -684964 -360384 -244692
2764 -244692 -233723 -207560 -62115 -164883 -404833 -369845 -23620 -142386 -162085 -298844
2754 -298844 -232619 -195328 -306593 -269564 -206788 -348009 -341859 -128310 184330 178601 -280288
2743 -280288 -154685 -138067 -276040 -192841 -153126 -407912 -361559 -257275 -171893 -69507 -118458
2732 -118458 -371779 -290782 -227505 -382302 -256988 -311083 -388198 -56395 -67260 -299025 -150401
2721 -150401 -139551 -315355 -324390 23821 -118334 -169882 -182667 -310754 -197335 -288567 -207057
2710 -207057 -294771 -503720 -476707 -356908 -147536 -45964 -87898 -239407 -389486 -591604
2700 -591604 -405304 -177653 -44784 -69251 -247755 -174392 -81061 -318487 -262642 -62534
$$ packed form
2774c37486O4302k70703K22720K47719k9703k81448m4515k55850L24580J15692
2764b44692J0969K6163J45445j02768k39950L4988L46225j18766j9699j36759
2754b98844O6225L7291j11265L7029O2776j41221O150K13549L12640n729m58889
2743b80288J25603J6618j37973Q3199L9715k54786M6353J04284Q5382J02386m8951
2732a18458k53321Q0997O3277j54797J25314n4095p7115L31803j0865k31765J48624
2721a50401J0850j75804r035L48211j42155n1548j2785j28087J13419r1232Q1510
2710b07057q7714k08949K7013J19799K09372J01572m1934j51509j50079k02118
2700e91604J86300K27651J32869k4467j78504P3363R3331k37426N5845K00108
$$ plain form
2690 -62534 -137037 -117306 77592 31371 -198436 -64509 -100156 -169966 -128148 -157813 -195627
2679 -195627 -180469 -72792 -254045 -285304 -259390 -9271 -105313 -319518 -340 -146086
2669 -146086 -191734 -279161 -248320 -22492 -221811 -264715 -172179 -323488 -209176 -299200 -194410
2658 -194410 38035 -53329 -117429 -110076 -292747 -398537 -287483 28251 92941 -226499 -323760
2647 -323760 -205784 -321457 -433952 -213161 -168691 -279896 -46833 -359123 -206276 -107001
2637 -107001 -327675 -377556 -383268 -406829 -120855 -5273 -131034 -154115 -55372 -21242 -123205
2626 -123205 -241907 -25102 -85130 -339098 -155594 45409 -156166 -234594 -284828 -425210
2616 -425210 -407203 -291541 -186754 -180657 36808 -276112 -70765 -137507 -160785 -150311 -280488
$$ packed form
2690f2534p4503J9731J94898m6221k29807J33927l5647o9810M1818k9665l7814
2679a95627J5158J07677j81253l1259K5914K50119r6042k14205L19178j45746
2669a46086m5648q7427L0841K25828j99319m2904R2536j51309J14312r0024J04790
2658a94410K32445r1364o4100P353j82671j05790J11054L15734O4690l19440r7261
2647c23760J17976j15673j12495K20791M4470j11205K33063l12290J52847R9275
2637a07001k20674m9881n712k3561K85974J15582j25761k3081R8743L4130j01963
2626a23205j18702K16805o0028k53968J83504K01003k01575p8428n0234j40382
2616d25210J8007J15662J04787O097K17465l12920K05347o6742k3278J0474j30177
$$ plain form
2605 -280488 -89903 -91778 -149654 -301027 -160320 -40366 119370 94185 -144622 -46803 50121
2594 50121 -803 -109333 -171583 -371027 -46071 -64230 -216545 -306211 -148920 -308763 -112075
2583 -112075 572 -241148 -85327 -272682 -212897 -51583 -46873 -46592 -232839 -276931 14023
2572 14023 301572 29638 -61842 -360402 -382803 -331716 -27886 59043 -29839 -179708 -59356
2561 -59356 -256128 -187562 -212705 -288160 -56533 -29472 18309 -247852 -297568 -301203 -175726
2550 -175726 -195085 -196520 -210342 -182383 -297004 -191613 -593647 -603966 -307448 -100861 -201439
2539 -201439 -250004 6613 278832 40269 -57679 116413 -135001 -142914 -24355 -102039 20933
2528 20933 -310032 -18954 6544 -109058 -321582 -115645 -47253 156375 -9810 -131317
$$ packed form
2605b80488J90585j875n7876j51373J40707J19954J59736k5185k38807R7819R6924
2594E0121n0924j08530o2250j99444L24956j8159j52315q9666J57291j59843J96688
2583a12075J12647k41720J55821j87355N9785J61314M710K81j86247m4092K90954
2572A4023K87549k71934r1480k98560k2401N1087L03830Q6929q8882j49869J20352
2561e9356j96772O8566k5143p5455K31627K7061M7781k66161m9716l635J25477
2550a75726j9359j435j3822K7959j14621J05391m02034j0319K96518K06587j00578
2539b01439m8565K56617K72219k38563r7948J74092k51414p913J18559p7684J22972
2528B0933l30965K91078K5498j15602k12524K05937O8392K03628j66185j21507
$$ plain form
2518 -131317 -225715 -125589 -157424 -300728 -118703 -181155 -8792 -278852 -292267 -328553 -308947
2507 -308947 -145162 -75443 88945 -36016 152513 -102973 -271024 -362442 -378491 -182479
2497 -182479 -255615 -316705 -27532 -305829 -301982 -126276 -354657 2632 -77103 105655 -48125
2486 -48125 -158315 -93074 13705 67728 -71625 -220053 -158184 -362917 -80328 45675
2476 45675 -58093 -230342 -116586 -1544 207409 129227 271164 -7409 -149576 -277594
2466 -277594 -263369 -279254 20945 145183 -64543 14453 -299966 -291833 -10674 79499 -84586
2455 -84586 -278203 10531 -23869 -184137 -116828 -272820 -154681 29917 17990 105362 59156
2444 59156 -78829 85347 127496 -80347 -121667 36846 -12162 49411 -40483 293424 32956
$$ packed form
2518a31317r4398J00126l1835j43304J82025o2452J72363k70060j3415l6286J9606
2507c08947J63785O9719J64388j24961J88529k55486j68051r1418j6049J96012
2497a82479p3136o1090K89173k78297L847J75706k28381L57289p9735J82758j53780
2486d8125j10190O5241J06779N4023j39353j48428O1869k04733K82589J26003
2476D5675j03768j72249J13756J15042K08953p8182J41937k78573j42167j28018
2466b77594J4225j5885L00199J24238k09726P8996l14419Q133K81159R0173j64085
2455h4586j93617K88734l4400j60268O7309j55992J18139J84598j1927Q7372m6206
2444E9156j37985J64176M2149k07843m1320J58513m9008O1573q9894L33907k60468
$$ plain form
2433 32956 -106253 -39254 158464 130291 48754 -165021 114802 -19505 -329233 -392533 -61609
2422 -61609 28355 -149761 -266402 -206013 -54664 -2023 188586 90861 -5593 -167699 -177264
2411 -177264 -204117 -14709 -44304 23777 98600 32897 -220475 -236047 -176795 45881 172344
2400 172344 9196 -188124 -118415 145052 10785 -443669 -108567 -115891 53530 87308
2390 87308 -211380 -127606 -122726 122463 -58090 -136534 -410316 -275387 -314382 -245737 -326823
2379 -326823 -134725 167012 24130 97640 150788 188715 -51403 135300 -127261 -257113
2369 -257113 -136492 62866 46936 -91691 -87545 -25401 -61991 -159518 -269523 -127902 -73702
2358 -73702 18029 245389 37612 -35704 -62635 -28127 74551 44895 -51836 -181424 -178429
$$ packed form
2433C2956j39209O6999J97718k8173q1537k13775K79823j34307l09728o3300L30924
2422f1609Q9964j78116j16641O0389J51349N2641J90609r7725r6454j62106r565
2411a77264k6853J89408k9595O8081P4823o5703k53372j5572N9252K22676J26463
2400A72344j63148j97320O9709K63467j34267m54454L35102p324J69421L3778
2390H7308k98688Q3774M880K45189j80553p8444k73782J34929l8995O8645q1086
2379c26823J92098L01737j42882P3510N3148L7927k40118J86703k62561j29852
2369b57113J20621J99358j5930j38627M146O2144l6590r7527j10005J41621N4200
2358g3702R1731K27360k07777p3316k6931L4508J02678k9656r6731j29588K995
$$ plain form
2347 -178429 -164438 100891 -26987 -18062 -207416 -234237 -276239 130678 39239 -86763 167390
2336 167390 99615 48782 140934 -1025 -191664 -228435 -242994 166230 74098 -153267 -19448
2325 -19448 -52094 -65254 57444 88232 55372 34022 42348 -59100 282421 -11738 -226203
2314 -226203 -297894 -248546 -124544 -173958 115290 -113248 -66631 47902 -46460 -30122 56295
2303 56295 267203 160668 5214 -411855 -169740 157639 25396 -306906 -108702 36810
2293 36810 74994 -118585 -123667 58995 226420 161224 68676 -83796 -143966 -193155 -114324
2282 -114324 -36361 -37012 -150849 -44629 29047 252915 204827 198107 -196853 -40249 35563
2271 35563 -115071 40801 -94409 -79383 -174898 -51397 29041 -69590 -140026 -123091 -44146
$$ packed form
2347a78429J3991K65329j27878Q925j89354k6821m2002M06917r1439j26002K54153
2336A67390o7775n0833R2152j41959j90639l6771j4559M09224r2132k27365J33819
2325a9448l2646j3160J22698L0788l2860k1350Q326j01448L41521k94159k14465
2314b26203p1691M9348J24002m9414K89248k28538M6617J14533r4362J6338Q6417
2303E6295K10908j06535j55454m17069K42115L27379j32243l32302J98204J45512
2293C6810L8184j93579n082J82662J67425o5196r2548j52472o0170m9189P8831
2282a14324P7963o51j13837J06220P3676K23868m8088o720l94960J56604P5812
2271C5563j50634J55872j35210J5026r5515J23501Q0438r8631p0436J6935P8945
$$ plain form
2260 -44146 -233943 -127782 -41216 -70649 -97441 24924 -27262 171264 219244 -58427 103868
2249 103868 122807 257870 153981 -102417 -54018 -36717 -125035 32852 81305 61220 -2300
2238 -2300 186345 45547 155108 -117602 -143858 26547 9321 -16263 -24356 -88486 59379
2227 59379 61366 179081 -14289 56126 57881 -66425 -85501 48971 -23116 -2835 -193180
2216 -193180 -104941 -125827 -54412 61517 83184 149807 -11676 153192 40418 44136 39424
2205 39424 -84486 -270128 -84195 -72597 -170225 -61929 -49894 -99261 -136112 -327396 -177108
2194 -177108 -86990 -83982 -132809 -84491 157857 -29936 -310315 -9545 -96241 -164284 104302
2183 104302 67410 41177 -90179 -246260 -269316 77281 -67473 -37598 79672 -15302 -135092
$$ packed form
2260d4146j89797J06161Q6566k9433k6792J22365n2186J98526M7980k77671J62295
2249A03868J8939J35063j03889k56398M8399J7301q8318J57887M8453k0085o3520
2238b300J88645j40798J09561k72710k6256J70405j7226k5584q093o4130J47865
2227E9379J987J17715j93370P0415J755j24306j9076J34472p2087K0281j90345
2216a93180Q8239k0886P1415J15929K1667O6623j61483J64868j12774L718m712
2205C9424j23910j85642J85933J1598r7628J08296J2035m9367l6851j91284J50288
2194a77108R0118L008m8827M8318K42348j87793k80379L00770q6696o8043K68586
2183A04302l6892k6233j31356j56081k3056L46597j44754K9875J17270r4974j19790
$$ plain form
2172 -135092 -113125 168202 135959 195182 99422 -151621 -129626 -116147 -225738 -221628 -297237
2161 -297237 -155552 -156464 -29816 -7658 -82502 -78945 -276 142700 9253 -116176 -111837
2150 -111837 -37014 -155277 -74719 -59773 -159654 -42631 -113787 -130079 131299 278727 -90483
2139 -90483 -295790 -38456 147053 168099 -5152 -251186 -126732 -78363 -317152 -162188
2129 -162188 -100565 133306 102317 9867 -207968 -144533 -74125 -204265 32769 124923 57805
2118 57805 230315 235442 3047 36025 -49186 103432 46317 -7165 -196290 -57672 -54313
2107 -54313 39662 -33851 42225 223899 213960 144243 52904 -127018 -1701 135265 -246324
2096 -246324 26436 -18579 -6662 226836 148013 139885 94174 -74261 195049 155487 -85470
$$ packed form
2172a35092K1967K81327l2243N9223r5760k51043K1995J3479j09591M110p5609
2161b97237J41685r12J26648K2158p4844L557P8669J42976j33447j25429M339
2150a11837P4823j18263Q0558J4946r9881J17023p1156j6292K61378J47428l69210
2139i0483k05307K57334J85509K1046j73251k46034J24454M8369k38789J54964
2129a62188O1623K33871l0989r2450k17835O3435P0408j30140K37034R2154o7118
2118E7805J72510N127k32395L2978q5211J52618n7115n3482j89125J38618L359
2107e4313R3975p3513P6076J81674r939o9717r1339j79922J25317J36966l81589
2096b46324K72760m5015J1917K33498p8823q128m5711j68435K69310l9562k40957
$$ plain form
2085 -85470 -185760 -103271 115664 -79058 -1316 90489 7499 -101506 -54677 -184021 -302315
2074 -302315 74667 64605 112425 178468 67525 -22799 173381 336513 199326 -65123
2064 -65123 -40809 90477 -16704 67736 142185 99274 -253412 -126200 77873 -96714 75251
2053 75251 -69396 -189053 -100437 -49157 -23417 44345 151426 117241 -18028 12921 -125254
2042 -125254 6525 -44743 -33891 62555 -6752 -13428 -89123 42120 -31629 203021 69340
2031 69340 -118241 114124 363829 117277 192562 45449 -209957 -196511 24484 130143
2021 130143 230385 473 -144261 -51488 102094 203771 113777 146392 21607 105777
2011 105777 -46841 -40491 -188803 10558 -79386 -88847 -174056 -180258 -147513 17206 105584
$$ packed form
2085h5470j00290Q2489K18935j94722P7742R1805q2990j09005M6829j29344j18294
2074c02315L76982j0062M7820O6043j10943r0324J96180J63132j37187k64449
2064f5123K4314J31286j07181Q4440P4449m2911l52686J27212K04073j74587J71965
2053G5251j44647j19657Q8616N1280K5740O7762J07081l4185j35269L0949j38175
2042a25254J31779n1268J0852R6446o9307o676p5695J31243p3749K34650j33681
2031F9340j87581K32365K49705k46552P5285j47113k55406J3446K20995J05659
2021A30143J00242k29912j44734R2773J53582J01677q9994L2615j24785Q4170
2011A05777j52618O350j48312J99361q9944r461q5209o202L2745J64719Q8378
$$ plain form
2000 105584 9237 33460 -27899 73392 57838 -49947 -95167 -206979 -310657 -162869 -238231
1989 -238231 -200124 -182658 -135338 7563 183153 136771 96657 123572 -165417 -70831 90400
1978 90400 72716 171936 23072 183375 59882 94568 69381 242208 157276 86361 108005
1967 108005 -8752 206192 212197 118298 -69885 166637 77810 126938 313744 103812 140365
1956 140365 108445 -214693 -185636 -114720 -33986 49284 143583 363113 -90756 104153 173492
1945 173492 174148 244139 74281 -133294 -187036 166819 -66394 27917 128639 16953 77258
1934 77258 122 -143565 -65701 -56316 -30968 -151064 -18585 -118260 32831 -10642 -239721
1923 -239721 -94976 -131273 -248965 -222626 -167798 -63025 -22698 24815 164798 106150 146271
$$ packed form
2000A05584r6347K4223o1359J01291j5554j07785m5220j11812j03678J47788p5362
1989b38231L8107J7466M7320J42901J75590m6382m0114K6915k88989R4586J61231
1978I0400j7684R9220j48864J60303j23493L4686k5187J72827q4932p0915K1644
1967A08005j16757K14944O005r3899j88183K36522q8827M9128J86806k09932L6553
1956A40365l1920l23138K9057P0916Q0734Q3270R4299K19530m53869J94909O9339
1945A73492O56O9991j69858k07575n3742L53855k33213R4311J00722j11686O0305
1934G7258p7136j43687P7864R385K5348j20096J32479r9675J51091m3473k29079
1923b39721J44745l6297j17692K6339N4828J04773M0327M7513J39983n8648M0121
$$ plain form
1912 146271 -46513 89007 -72934 -457398 -91126 -342 77414 285595 -65654 25308
1902 25308 -162064 51274 -147785 -144750 -19317 21356 -39124 -81536 31424 -50426 15433
1891 15433 65766 330430 302483 179910 -114921 57656 61807 -35509 136566 294360 228386
$$ packed form
1912A46271j92784J35520j61941l84464L66272R0784P7756K08181l51249R0962
1902B5308j87372K13338j99059L035J25433M0673o0480m2412J12960q1850O5859
1891A5433N0333K64664k7947j22573k94831J72577M151r7316J72075J57794o5974
$$ [...]
##END NTUPLES=NMR SPECTRUM
##END=
