##TITLE=1H_EC-3337(1)
 CDCl3
 8 sc, 
 6.12.2024
##JCAMPDX= 6.0         $$ Bruker NMR JCAMP-DX V2.0
##DATA TYPE= NMR SPECTRUM
##DATA CLASS= NTUPLES
##ORIGIN= UXNMR, Bruker Analytische Messtechnik GmbH
##OWNER= root
$$ XWIN-NMR		Version 3.5
$$ Fri Dec  6 14:06:01 2024 Russian Standard Time (UT+4h)  she@DPX200
##.OBSERVE FREQUENCY= 200.1315
##.OBSERVE NUCLEUS= ^1H
##.ACQUISITION MODE= SIMULTANEOUS
##.ACQUISITION SCHEME= undefined
##.AVERAGES= 8
##.DIGITISER RES= 18
##SPECTROMETER/DATA SYSTEM= spect
##.PULSE SEQUENCE= zg30
##.SOLVENT NAME= CDCl3
##.SHIFT REFERENCE= (INTERNAL, CDCl3, 0, 19.4342)
##AUDIT TRAIL= $$ (NUMBER, WHEN, WHO, WHERE, WHAT)
$$ ##TITLE= Audit trail, XWIN-NMR		Version 3.5
$$ ##JCAMPDX= 5.01
$$ ##ORIGIN= Bruker BioSpin GmbH
$$ ##OWNER= she
$$ F:/spectra/data/she/nmr/H-F/1/pdata/1/auditp.txt
$$ ##AUDIT TRAIL=  $$ (NUMBER, WHEN, WHO, WHERE, WHAT)
(   1,<2024-12-06 14:04:44.57 +0400>,<she>,<DPX200>,
      <created by zg, POWCHK disabled, PULCHK disabled
       configuration hash MD5:
       00 E9 B6 7A A2 85 ED C7 34 08 36 98 17 FE 4E 26
       data hash MD5: 16K
       C9 28 9A 1D 9A F5 56 EC EA 65 A9 CD CF 8E 6B FB>)
(   2,<2024-12-06 14:04:47.81 +0400>,<she>,<DPX200>,
      <Start of raw data processing
       efp BC_mod = 2 LB = 0.24 FT_mod = 6 PKNL = 1 PHC0 = -26706.24 PHC1 = 14.58744 SI = 16K 
       data hash MD5: 16K
       24 EE 37 BE 27 5E 95 B3 C6 A6 2C 4D 0E 42 D7 71>)
(   3,<2024-12-06 14:05:10.90 +0400>,<she>,<DPX200>,
      <pk PHC0 = -157.8277 PHC1 = 0 
       data hash MD5: 16K
       10 84 06 3F 34 C6 14 5A D9 F4 47 1C B6 2E 90 03>)
(   4,<2024-12-06 14:05:14.62 +0400>,<she>,<DPX200>,
      <abs ABSG = 5 
       data hash MD5: 16K
       7F A6 45 BE 71 2F BC 03 62 DD B5 72 2F FB F7 38>)
$$ ##END=
$$ 
$$ hash MD5
$$ 46 25 8E 7E 74 2D 6D 77 4E 47 17 81 80 C4 74 53
##$RELAX= 
##$RELAX= 
##$RELAX= 
##$RELAX= 
##$RELAX= 
##$RELAX= 
$$ Bruker specific parameters
$$ --------------------------
##$DU= <F:/spectra>
##$EXPNO= 1
##$NAME= <H-F>
##$PROCNO= 1
##$TYPE= <nmr>
##$USER= <she>
##$AMP= (0..31)
100 100 100 100 100 100 100 100 100 100 100 100 100 100 100 100 100 100 
100 100 100 100 100 100 100 100 100 100 100 100 100 100 
##$AQSEQ= 0
##$AQ_mod= 1
##$AUNM= <au_zg>
##$AUTOPOS= <>
##$BF1= 200.13
##$BF2= 200.13
##$BF3= 200.13
##$BF4= 200.13
##$BF5= 200.13
##$BF6= 200.13
##$BF7= 200.13
##$BF8= 200.13
##$BYTORDA= 1
##$CFDGTYP= 0
##$CFRGTYP= 5
##$CHEMSTR= <none>
##$CNST= (0..31)
1 1 145 1 1 1 1 1 1 1 1 1 1 1 1 1 1 1 1 1 1 1 1 1 1 1 1 1 1 1 1 1 
##$CPDPRG= <>
##$CPDPRG1= <>
##$CPDPRG2= <>
##$CPDPRG3= <>
##$CPDPRG4= <mlev>
##$CPDPRG5= <mlev>
##$CPDPRG6= <mlev>
##$CPDPRG7= <mlev>
##$CPDPRG8= <mlev>
##$CPDPRGB= <>
##$CPDPRGT= <>
##$D= (0..31)
0 1.2 0 0 0 0 0 0 0 0.06 0 0.03 0 0 0 0 0.0002 0 0 0 0 0 0 0 0 0 0 0 0 
0 0 0 
##$DATE= 1733479484
##$DBL= (0..7)
120 120 120 120 120 120 120 120 
##$DBP= (0..7)
150 150 150 150 150 150 150 150 
##$DBP07= 0
##$DBPNAM0= <>
##$DBPNAM1= <>
##$DBPNAM2= <>
##$DBPNAM3= <>
##$DBPNAM4= <>
$$ [...]
##$SUBNAM3= <"">
##$SUBNAM4= <"">
##$SUBNAM5= <"">
##$SUBNAM6= <"">
##$SUBNAM7= <"">
##$SUBNAM8= <"">
##$SUBNAM9= <"">
##$SW= 24.0689530833862
##$SWIBOX= (0..15)
0 0 2 0 0 0 0 0 0 0 0 0 0 0 0 0 
##$SW_h= 4816.95568400771
##$TD= 16384
##$TD0= 1
##$TE= 0
##$TE2= 300
##$TE3= 300
##$TEG= 300
##$TL= (0..7)
0 120 120 120 120 120 120 120 
##$TP= (0..7)
150 150 150 150 150 150 150 150 
##$TP07= 0
##$TPNAME0= <>
##$TPNAME1= <>
##$TPNAME2= <>
##$TPNAME3= <>
##$TPNAME4= <>
##$TPNAME5= <>
##$TPNAME6= <>
##$TPNAME7= <>
##$TPOAL= (0..7)
0.5 0.5 0.5 0.5 0.5 0.5 0.5 0.5 
##$TPOFFS= (0..7)
0 0 0 0 0 0 0 0 
##$TUNHIN= 0
##$TUNHOUT= 0
##$TUNXOUT= 0
##$USERA1= <user>
##$USERA2= <user>
##$USERA3= <user>
##$USERA4= <user>
##$USERA5= <user>
##$V9= 5
##$VALIST= <valist>
##$VCLIST= <CCCCCCCCCCCCCCC>
##$VD= 0
##$VDLIST= <DDDDDDDDDDDDDDD>
##$VPLIST= <PPPPPPPPPPPPPPP>
##$VTLIST= <TTTTTTTTTTTTTTT>
##$WBST= 1024
##$WBSW= 4
##$XGAIN= (0..3)
0 0 0 0 
##$XL= 0
##$YL= 0
##$YMAX_a= 280473
##$YMIN_a= -365726
##$ZGOPTNS= <>
##$ZL1= 120
##$ZL2= 120
##$ZL3= 120
##$ZL4= 120
##$ABSF1= 19.45921
##$ABSF2= -4.609922
##$ABSG= 5
##$ABSL= 3
##$ALPHA= 0
##$AQORDER= 0
##$ASSFAC= 0
##$ASSFACI= 0
##$ASSFACX= 0
##$ASSWID= 0
##$AUNMP= <proc_1d>
##$AZFE= 0.1
##$AZFW= 0.1
##$BCFW= 0
##$BC_mod= 2
##$BYTORDP= 0
##$COROFFS= 0
##$CY= -3
##$DATMOD= 1
##$DC= 0
##$DFILT= <>
##$DTYPP= 0
##$F1P= 0
##$F2P= 0
##$FCOR= 1
##$FTSIZE= 16384
##$FT_mod= 6
##$GAMMA= 0
##$GB= 0
##$INTBC= 1
##$INTSCL= 2.524811e-10
##$ISEN= 128
##$LB= 0.24
##$LEV0= 0
##$LPBIN= 0
##$MAXI= 10000
##$MC2= 0
##$MEAN= 0
##$ME_mod= 0
##$MI= 1.114404
##$NCOEF= 0
##$NC_proc= -6
##$NLEV= 6
##$NOISF1= 3.799351
##$NOISF2= 2.8
##$NSP= 0
##$NTH_PI= 0
##$NZP= 0
##$OFFSET= 19.43424
##$PC= 1
##$PHC0= -26864.07
##$PHC1= 14.58744
##$PH_mod= 1
##$PKNL= yes
##$PPARMOD= 0
##$PSCAL= 0
##$PSIGN= 0
##$REVERSE= no
##$SF= 200.130019103522
##$SI= 16384
##$SIGF1= 3
##$SIGF2= 2
##$SINO= 5.538805
##$SIOLD= 16384
##$SREGLST= <1H.CDCl3>
##$SSB= 0
##$STSI= 16384
##$STSR= 0
##$SW_p= 4816.95568400771
##$SYMM= 0
##$S_DEV= 0
##$TDeff= 16384
##$TDoff= 0
##$TI= <>
##$TILT= no
##$TM1= 0
##$TM2= 0
##$TOPLEV= 0
##$USERP1= <user>
##$USERP2= <user>
##$USERP3= <user>
##$USERP4= <user>
##$USERP5= <user>
##$WDW= 1
##$XDIM= 16384
##$YMAX_p= 310966295
##$YMIN_p= -116506
$$ End of Bruker specific parameters
$$ ---------------------------------
##NTUPLES= NMR SPECTRUM
##VAR_NAME=  FREQUENCY,     SPECTRUM/REAL,   SPECTRUM/IMAG
##SYMBOL=    X,             R,               I
##VAR_TYPE=  INDEPENDENT,   DEPENDENT,       DEPENDENT
##VAR_FORM=  AFFN,          ASDF,            ASDF
##VAR_DIM=   16384,         16384,           16384
##UNITS=     HZ,            ARBITRARY UNITS, ARBITRARY UNITS
##FACTOR=    0.29402158847633, 1,            1
##FIRST=     3889.3748907441, 0,             0
##LAST=      -927.580793263613, 0,           0
##MIN=       -927.580793263613, -116506,     0
##MAX=       3889.3748907441, 310966295,     0
$$ Real data points
##PAGE= N=1
##DATA TABLE= (X++(R..R)), XYDATA
$$ [...]
9619 -40416 -16323 -4306 -12371 -37250 -21521 12125 -34496 -28270 624 37440 -46390 -10758
9607 -10758 -25734 -71222 -67707 -8763 -12932 -46015 -54078 -24975 -9618 21547 -33106 -58961
9595 -58961 -2339 -9669 -10095 -28899 -17706 35660 28462 992 -35114 -39119 36142 579 4208
9582 4208 -12443 5828 22131 -25722 -61137 9987 27867 3500 51438 27588 -25960 17699
9570 17699 61457 66795 33920 14541 -3873 -31154 -38917 -30983 -1024 3521 -35520 -1820 -35498
9557 -35498 -25050 -43759 -43937 -75411 -5217 -26228 -46730 -35886 -679 -12695 -6389 -28793
9545 -28793 5552 -19678 -16140 11830 -28660 5452 -22816 -64140 -56401 -53082 -29025 -10757
9533 -10757 62943 30204 25946 19094 29338 52574 7748 -506 -93012 -31532 -8789 13705
9521 13705 2167 -10323 8614 30813 17417 -25458 -45976 -35738 -49717 -33592 -23056 -3585
9509 -3585 -16267 -31909 14711 26026 14576 -1989 -3117 -27960 -25642 -5384 9638 14330 -25410
9496 -25410 -2383 10360 48518 29706 -14362 -37802 -27543 -33888 7725 37920 41004 38468
9484 38468 -24523 -41666 -57330 -57802 -76502 -27700 -44665 -56093 -60004 -60062 -26927 -11431 -9312
9471 -9312 -33626 -3083 -38699 14286 -11766 -25021 21208 -22012 4036 7026 -8021 -6144
9459 -6144 -70598 -37586 29789 78737 22231 -41564 -34411 2461 -14118 -45883 -10076 21640
9447 21640 -12912 -31872 -38609 14379 -23295 -45943 7851 -68370 -61346 -11368 23683 11157
9435 11157 5994 -16911 -19684 20805 3179 -27605 -8737 32907 25275 42993 32320 26829 -30452
9422 -30452 -29942 -22320 -6087 -82366 -83367 -39767 -42871 -24329 -24178 4569 1846 -32877 -30894 -19606
9408 -19606 -38036 -11739 -77967 -63322 -32700 7492 4101 30147 -8887 -66042 -67985 30355
9396 30355 4224 -22986 9963 -8992 -33024 -54246 -4063 7479 7866 37930 5076 19224
9384 19224 29620 50697 38894 -9347 -29177 -4821 -1858 46825 33847 1322 -22020 3580
9372 3580 18801 -36195 27803 -22268 -30732 -8261 -432 11523 36448 31033 28932 21011 42998
9359 42998 -4988 12973 4415 -8767 17004 9653 -12026 -7598 1223 -17227 -51738 -36897 -32066
9346 -32066 -27484 -35589 -1775 -11681 -62072 -12701 -26379 -9254 -25008 4628 53687 27984
9334 27984 40060 52295 30754 -31391 -89035 -47951 -66877 -55706 37 -23921 -20212 12205
9322 12205 -40551 -9511 37841 -17553 -46956 -51194 6156 37715 45025 27965 -9498 31225
9310 31225 -21942 -23284 -23020 -55224 -38333 -30354 6337 7636 11186 -12196 28194 -3576 -9330
9297 -9330 -8322 941 23128 -937 -20225 -19024 -26465 -65079 -18513 39918 24204 -8162 21160
9284 21160 25750 3799 45746 9997 -9931 7419 48929 100889 71410 19159 -19603 -12537
9272 -12537 -4785 26743 -24421 -47368 -19869 -10455 -11550 3229 11049 -9561 27083 40312 -43614
9259 -43614 -85180 -113472 -51610 -26261 -6576 18199 -3153 -25806 -27442 17420 -14130 -47993
9247 -47993 -38204 -21148 -21860 -1953 23650 -3316 -10210 -16001 -10369 -60942 -46681 -50496 -15200
9234 -15200 19916 1484 -16143 -9462 -16949 5898 -36291 -40790 -13757 -7326 -46004 -49353 -57444
9221 -57444 -56915 5929 -52023 -19115 -2855 40127 -1912 -17305 37536 -19883 -75375 -50133
9209 -50133 -5968 -10094 11955 -6130 -53598 -38327 -9759 -1686 29795 3933 -8291 -18142
9197 -18142 -35974 45050 5427 55751 18777 -60861 -32607 -25947 34398 61951 35037 53112
9185 53112 12273 -3670 23497 11135 -24581 -45543 -24990 -14928 -15992 6163 -1423 21648
9173 21648 1122 -27294 -20298 -15891 27654 -1866 -39538 -36718 -2980 1412 -2206 -14 -6842
9160 -6842 -224 4930 22438 -8464 -28723 8692 46842 10982 -2896 50617 45393 16107 3349
9147 3349 25417 17709 -17634 45050 52244 -2729 21577 19303 -32072 19468 23122 -12243 -863
9134 -863 52228 12928 -18550 -36984 -24683 2084 43562 17528 29698 14052 -7826 12320
9122 12320 -4505 -17481 41501 33789 -15243 9563 13922 16236 -4027 -13051 -47040 -11155 33744
9109 33744 32158 -935 7633 40063 -2960 -24596 5816 -25945 -52798 -12056 3585 -45518
9097 -45518 -132 11549 4684 -8488 32097 33648 33340 -8091 -11019 -5618 -12767 14825 45586
9084 45586 28027 -17549 7566 33371 23713 -39503 15576 -37075 -19543 11229 3848 28408
9072 28408 -16446 -30140 -46776 -48621 -47762 -17251 -34247 -2317 -18004 -9347 -4932 19096 6080
9059 6080 -33742 -2436 -28956 -13359 23533 -10038 43643 45793 18986 -2223 -680 -17773
9047 -17773 -13730 -3982 -2693 -16034 -49187 15339 16772 49073 13390 18307 7297 -25957 17744
9034 17744 -2492 12655 254 9733 2182 28511 27238 -3288 -34284 -21717 -3523 12910
9022 12910 2485 24383 15276 -13403 -17423 -3201 -17755 -21312 53884 26782 24149 19124 61462
9009 61462 15876 -5244 88173 72777 2403 -16106 -18461 -28999 -42340 6836 -17825 -20408
8997 -20408 -37110 -52628 486 55602 31456 30700 14413 -1429 -3008 -41114 -21378 5633
8985 5633 1443 -19751 31680 14014 -26964 -22295 52878 59094 8571 -7495 12043 21224 -24406
8972 -24406 29938 28220 36674 65177 57731 14280 13927 -23840 2896 -11183 -22568 5655 3897
8959 3897 26374 13890 31629 -6824 -11858 16648 16595 -14231 -33332 -6971 6637 490 19890
8946 19890 10939 -40227 -56794 -35801 529 39840 -504 20637 25015 29346 39332 -895 -18567
8933 -18567 45100 10001 -2594 26095 11497 4189 35142 13890 22299 46652 33472 30118
8921 30118 46146 59924 86263 40202 29684 28234 49088 39837 -792 37542 1116 63278
8909 63278 56072 29275 -13187 -7126 -6378 1527 59300 32448 2416 2468 16380 -4165 -40315
8896 -40315 9828 16550 -6689 -15403 -30192 -71950 12300 15462 -5049 37747 65558 4953
8884 4953 -8286 48846 46429 7896 34376 33636 22995 17602 1687 36641 83155 46736 28503
8871 28503 -6217 17867 31909 -5194 -23809 -19501 5302 11285 7868 24509 56128 25643
8859 25643 41405 56358 16364 -7389 35443 26358 37063 72880 63037 15630 10259 28302
8847 28302 26210 49150 45159 -2704 -17176 37332 54580 4410 25487 -21997 234 20105
8835 20105 26683 39636 44810 22917 -26608 10478 11137 16647 42552 54002 60489 17496 -5440
8822 -5440 17503 4431 -31815 36630 -16469 3982 2933 33638 69043 64529 76557 74804 14395
8809 14395 68000 78464 21486 45176 37269 24838 35210 69789 32005 23888 65843 27400
8797 27400 71195 80133 70655 95683 71944 49099 7082 45362 15994 49763 101928 94834
8785 94834 94224 71569 97942 91250 48637 47478 76434 48138 14708 30456 52654 34482 4979
8772 4979 32760 43145 5962 28515 88990 75807 69918 66786 85566 33223 46382 17157
8760 17157 51269 25471 63176 33621 29199 69127 31768 145618 97509 71785 67559 47390
8748 47390 43354 54517 53453 21435 33405 35487 110073 123037 25301 36478 47729 32539
8736 32539 87224 52395 75551 95145 35551 65999 121843 115167 111769 60844 34166 85893
8724 85893 72727 115271 99314 104884 153727 90874 81033 84215 93442 95199 109712 92241 101234
8711 101234 101395 172715 143052 163264 157104 123986 116640 74112 92240 66644 67331 71110 86674
8698 86674 83226 67187 104120 96065 102993 107498 105901 115047 51690 128329 108829 107231 78948
8685 78948 108715 64941 40632 106640 115392 140264 114102 151590 149534 117451 153829 167665
8673 167665 127352 126058 132477 122911 106284 83087 83336 72999 137526 121623 108315 124975 83628
8660 83628 93574 114335 115201 81954 94681 115413 135147 102251 61729 118199 88954 100593
8648 100593 152577 99161 97043 178351 200410 193237 182221 237837 231097 214703 252481 225933
8636 225933 204232 215207 250860 258040 232340 259590 221281 210168 198173 160205 178965 139739
8624 139739 215066 226111 162497 172677 194028 231827 245780 249506 254554 268321 265560 219661
8612 219661 218002 227517 251053 234516 235585 188809 252752 278129 230548 192578 163055 203682
8600 203682 161173 172981 155410 181164 146273 115818 123943 156383 160194 186585 196876 161853
8588 161853 161289 184880 179572 168974 137079 147533 174376 113224 140479 131736 127275 125131 157250
8575 157250 141652 151362 150785 189830 155961 122715 57246 29873 101858 193532 177082 185538
8563 185538 160537 158064 166847 168630 167446 115751 201678 209917 189229 165179 178935 183278 192915
8550 192915 198139 157105 151699 187135 150998 145731 196092 225164 214545 167267 144263 137143
8538 137143 117304 123353 127400 157018 161409 215212 227292 225078 206445 220128 229883 285919 271932
8525 271932 256197 259681 242375 276534 307596 360781 379592 378832 342483 346883 399147 460773
8513 460773 475979 423374 399044 457134 461400 429295 421847 338679 316373 328840 322660 305545
8501 305545 280395 305722 264278 269260 289576 274453 279848 279728 301038 309619 253872 282291 274309
8488 274309 235249 249480 258462 317989 434471 375322 330329 346818 365745 350864 327804 306103
8476 306103 307435 300164 324200 337330 267364 255135 251787 264868 307135 283994 267087 288292
8464 288292 246237 305600 312820 273570 299719 336807 335230 326739 286842 260723 296965 308507
8452 308507 302310 311060 317118 342437 358742 313131 267564 277347 322220 295142 277600 286860 265228
8439 265228 311521 295469 301291 348996 352432 316979 281147 325701 290087 320591 332210 351557
8427 351557 326360 322122 323676 299965 340591 265486 344765 345033 308542 361076 373467 417893
8415 417893 398949 372254 385990 345679 373434 389436 376167 347367 330923 360747 391610 373518
8403 373518 391611 407491 446822 465409 450955 481658 505701 475606 458217 512535 490250 469822
8391 469822 456508 408018 413682 430291 459237 467484 500826 525941 513611 499509 542061 545611
8379 545611 548034 570965 584435 609817 576458 576218 595465 625563 653239 672607 640705 676455
8367 676455 749527 696773 729687 755263 780463 799248 730893 751219 748728 781396 780089 780181 757907
8354 757907 740637 748917 760270 775179 773056 833700 833141 857178 854232 903558 919247 913761 885822
8341 885822 884511 898081 888841 949309 921366 913379 958085 934419 917721 942397 924178 865486
8329 865486 854113 899742 950036 978115 942417 998307 948453 970148 1032417 1090698 1042596 1098718
8317 1098718 1130421 1141137 1155077 1197136 1265057 1239943 1249585 1269643 1259889 1305238 1386178 1401978
8305 1401978 1427242 1472261 1494827 1527600 1568490 1631506 1622329 1662079 1719748 1786611 1857397 1888255
8293 1888255 1974985 2006211 2040916 2036502 2115647 2220881 2281836 2353278 2424900 2443883 2512892
8282 2512892 2569943 2644706 2741973 2818566 2902583 2963698 3059641 3150605 3271416 3402258 3487213
8271 3487213 3615998 3685930 3848561 3920572 4037134 4188759 4320797 4440521 4555341 4766541
8261 4766541 4898174 5103824 5259721 5403951 5645417 5804637 6017730 6236540 6422413 6654872
8251 6654872 6895187 7147329 7428055 7649298 7943594 8217978 8472420 8643886 8871043 9115139
8241 9115139 9275445 9428450 9526000 9665003 9734002 9836756 9861395 9862299 9801771 9740949 9641810
8230 9641810 9468237 9343139 9188586 8931048 8695580 8455025 8249371 8059078 7816851 7547472
8220 7547472 7335288 7144969 6929050 6758356 6553583 6327688 6096798 5892884 5763033 5595564
8210 5595564 5500413 5300854 5143122 5010602 4894098 4842993 4801828 4791160 4776413 4709196 4712403
8199 4712403 4627005 4574524 4512053 4437496 4297146 4176857 3780532 3365688 3974747 3946887
8189 3946887 3773600 3626945 3482851 3382803 3290830 3211503 3105989 3079811 2987002 2889665
8179 2889665 2798240 2806093 2707452 2687231 2640988 2559370 2492200 2504465 2423938 2392893 2319561 2305871
8167 2305871 2275173 2227802 2261736 2236583 2278452 2287257 2277656 2300844 2353982 2316313 2346362 2381290
8155 2381290 2362801 2312272 2248821 2284198 2221245 2164655 2207546 2214503 2250419 2247230 2308661 2313457
8143 2313457 2304288 2304411 2377779 2386562 2395071 2451046 2450998 2502197 2548726 2640308 2659459 2726179 2763768
8130 2763768 2823994 2933737 2990477 3131053 3195710 3264346 3364649 3368359 3501222 3531481 3585399
8119 3585399 3712006 3799748 3927964 4033406 4115214 4278441 4411494 4528691 4668724 4765832
8109 4765832 4865254 4961767 5056790 5167310 5324412 5504365 5620005 5738626 5915384 6175708
8099 6175708 6420394 6695719 7049181 7438078 7887770 8474656 9130031 9855987 10619402 11538462
8089 11538462 12632525 13932709 15425286 17059435 18750176 20495207 22145170 23670564
8081 23670564 25014684 25900280 26423194 26563400 26197661 25577248 24596088 23146044 21618054
8072 21618054 19966798 18216468 16624811 15168493 13933852 12967277 12267692 11857317 11668377
8063 11668377 11708197 11926677 12132972 12196452 11952630 10945469 9715252 8794362 8124010
8054 8124010 7605694 7132220 6791500 6579514 6337507 6147525 5977823 5855183 5723590 5567380
8044 5567380 5420990 5339116 5287646 5190674 5105741 5063641 5079362 5122352 5093334 5131124 5208876
8033 5208876 5273456 5474901 5603355 5842236 6009024 6172379 6229714 6248752 6180710 6088822
8023 6088822 6009165 6030370 6037796 6059131 6222256 6413581 6682724 7008822 7340720 7803864
8013 7803864 8364536 9086373 10002106 11095481 12447830 13916895 15326412 16340594 16688313
8004 16688313 16343280 15456917 14278760 13007137 11902754 11110638 10468998 9939552 9397154
7995 9397154 8884377 8564644 8352057 8238806 8248622 8261992 8438361 8722015 9122815 9636096
7985 9636096 10265389 11157659 12379903 13902821 15826791 17770876 19534916 20638702 20611186
7976 20611186 19453149 17469346 14972699 12616984 10681584 9198097 8149287 7388892
7968 7388892 6798554 6277445 5839906 5472557 5125776 4861174 4563683 4306017 4085934 3937060
7958 3937060 3715735 3542334 3420150 3303464 3245994 3199261 3166144 3083504 3005473 2955133 2904927
7947 2904927 2819196 2701289 2595935 2488299 2440707 2405212 2386843 2368845 2315719 2285642 2289708
7936 2289708 2263133 2242533 2239938 2285842 2280313 2304372 2309565 2324365 2313018 2293001 2361548 2372663
7924 2372663 2366226 2391745 2476096 2505606 2518775 2604931 2651332 2640723 2711042 2769715 2857064 2946371
7912 2946371 3053708 3165754 3298718 3452367 3631974 3861145 4039598 4282082 4566124 4814111
7902 4814111 4984054 5142731 5463806 5395983 5370353 5472012 5523106 5618546 5655932 5705451 5850031
7891 5850031 5975719 6181103 6480805 6867620 7316787 7909178 8688288 9569609 10669847
7882 10669847 11967771 13295969 14619745 15705398 16489943 16902795 17026282 16941308 16732575
7873 16732575 16297549 15440961 14274945 12960714 11660071 10472242 9492697 8680689 8041020
7864 8041020 7690232 7376740 7173491 7053448 7030202 7127113 7223773 7478985 7909477 8428548
7854 8428548 9029572 9720830 10366913 10839233 11126844 11188025 11042312 10865983 10586049 10125642
7844 10125642 9496703 8706447 7785583 6884557 6063209 5371316 4846649 4364741 3998976
7835 3998976 3704844 3482456 3286858 3142399 2965057 2826945 2657879 2503663 2395644 2256289
7825 2256289 2178753 2097932 2077808 1932790 1857176 1860451 1852662 1808828 1790544 1767421 1728175 1706376
7813 1706376 1566357 1526059 1466155 1409451 1376388 1301911 1319866 1313873 1225750 1121334 1131221
7802 1131221 1061458 1017009 1036498 1016583 983286 982315 1005344 955406 964711 913837 881110 872973
7790 872973 876348 820676 806422 823910 758713 716331 695237 683881 657634 650614 642401 651845
7778 651845 654740 672725 645593 633764 604460 580689 533564 577198 589120 637171 610051 551982
7766 551982 526699 535841 537171 563551 532281 562594 590377 583040 568892 543645 573689 577363
7754 577363 571916 557932 579694 599575 605303 593244 609092 681503 700204 744330 850658 956570
7742 956570 980292 1025677 1084642 1079333 1020121 936453 875037 789614 738641 703665 675799 605866
7730 605866 601595 600086 524848 512753 548928 543726 485774 480434 493731 489844 517044 561575 576797
7717 576797 646184 680965 727579 786405 825730 858671 870003 858565 823308 747809 695670 582647
7705 582647 564700 521167 476707 452605 435636 407986 365402 334076 294056 317761 334661 331112
7693 331112 308706 330053 279556 286622 298498 281727 258913 286389 251818 278996 245195 283416
7681 283416 243243 234880 278801 307770 280466 260905 235912 262962 296972 284080 281732 287705
7669 287705 300249 283840 246954 229674 254084 273880 272238 250115 252704 277299 265791 281688
7657 281688 298952 314308 347901 333951 287407 298462 326850 312501 288001 260541 201412 253959
7645 253959 276800 292080 272120 264939 268938 265949 270232 276998 261239 257391 271188 248524 287521
7632 287521 215127 236361 243623 242508 288374 281475 254555 290645 237352 216789 264937 235536
7620 235536 226781 247485 294027 232520 195650 218920 304336 269038 251273 250139 228258 262978
7608 262978 253370 281697 327487 308893 312742 331718 277483 244086 236804 207484 215160 249285
7596 249285 266698 291698 239039 256391 234994 223293 249352 259258 288624 301168 257680 249651
7584 249651 270364 294622 235856 248243 223623 258192 309053 290843 269648 239436 183294 234375
7572 234375 190565 192194 147667 194332 182342 195011 201656 169219 229604 180888 159539 143971
7560 143971 133036 154731 139385 172967 173467 142685 124663 92720 138825 125475 101272 90452
7548 90452 124367 133312 130419 76404 109326 148235 185904 133253 130457 157634 148622 138105 96421
7535 96421 131312 206053 194851 230412 280048 238094 227561 269972 270060 251785 278274 337683
7523 337683 327644 310668 319328 385449 404774 419731 381379 349028 367805 336170 333456 355576
7511 355576 310649 300882 310414 284754 295631 276814 269743 247946 253742 242656 250108 312134 308446
7498 308446 291628 204399 238840 223522 157896 145258 125780 148239 162933 120410 68220 126306
7486 126306 62873 61378 93636 95875 121206 124530 86316 80883 35685 44591 42283 37791 37376
7473 37376 15968 12270 -46268 -40394 -24815 -4027 -28559 -45311 263 21228 11467 32665
7461 32665 -15434 16656 14927 31391 21053 -45381 2594 52031 37874 48390 1027 -17747
7449 -17747 -60217 -8463 20619 -693 -25858 -99325 -44012 -7115 34539 3364 -16610 25427
7437 25427 8347 -35537 -36668 -20979 -56933 -86113 -48092 -34135 -42774 -27659 -32420 -41788 -28502
7424 -28502 -36856 -41063 -68316 -46216 24163 58999 23307 -37214 -17297 31316 24405 -7142
7412 -7142 -19547 -47689 -4775 27839 -50228 -30029 -29012 -69362 -91541 -37070 -52412 -19941
7400 -19941 -34158 -26343 27651 1239 -8022 2795 5629 -40071 -34505 -16430 -7222 -47146 -70853
7387 -70853 -64827 31991 5055 -72211 -35463 -50224 -58934 -29852 -36396 -38786 884 -14075 9412
7374 9412 724 -1253 -57434 -26546 -48731 -43358 -31112 -23412 -17971 -48820 -24152 -10152 -91286
7361 -91286 -58326 -45054 -36604 -89119 -61942 -23073 -42736 -18823 -47641 -35546 -59754 -67140
7349 -67140 -56055 -88324 -85309 -73270 -44349 22378 27177 30539 -61022 -32722 -6383 -26991
7337 -26991 -16387 -21630 -62586 843 -88723 -74461 -46923 -30049 -30503 -55447 -18389 -8474 -15493
7324 -15493 -2689 -55729 -61541 -58961 -24168 -11277 -18048 -8705 -46194 -45106 -2254 5267 -49341
7311 -49341 -85793 -49002 -51147 -68162 -42792 -31382 -75530 -91793 -59731 -77137 -10532 -31342
7299 -31342 -45935 -4820 -58738 5090 -36458 -30023 14883 -9016 -6196 -68948 -54330 -11081
7287 -11081 3215 13706 19480 -5008 -33542 -4999 -25391 -10293 20222 -26817 -86268 -44052
7275 -44052 -17195 -65384 -15875 -6706 7352 -53337 -25518 2035 17623 19425 -32272 -26784
7263 -26784 -29236 -44088 -89980 -12604 25132 -41560 -33989 -62558 -32304 -21816 -60288 -17983
7251 -17983 -40599 -38262 7642 7193 -5429 -68077 -77318 -68473 -29493 -11251 -17924 2358 23467
7238 23467 45158 40993 -25609 -7235 -47255 17607 -20924 -29812 23623 -20631 -51650 -60309
7226 -60309 -9847 22077 27052 6275 -9520 -14981 7941 41823 58670 74338 66903 -2351
7214 -2351 25696 9225 -34903 -46681 -29102 -16354 7071 59675 59821 84859 3951 -8258
7202 -8258 1267 43209 52506 57529 66887 21608 -13453 1348 52462 46953 77545 72184 54088
7189 54088 781 64186 87361 67059 42938 54458 38362 18310 59994 29350 7876 -5339
7177 -5339 -17509 -12850 -2579 42924 47002 28738 34671 94266 46039 48504 24149 17998 23623
7164 23623 -15390 39390 93752 43062 2191 22080 72735 -1627 -701 26951 -31603 -29111
7152 -29111 -1406 47407 28760 7063 33027 22232 -6177 -5011 29249 1695 3967 36181
7140 36181 -9992 -54550 -27927 5281 72 5776 -10143 26212 5431 -17128 13737 -35226
7128 -35226 -37597 12418 -21527 13573 -25682 -24077 -48088 -46635 -43423 -27898 33904 -21295 -15770
7115 -15770 -11993 -17050 42065 18935 -3385 -24813 -19011 -39256 -23911 -914 4450 -18919 -40238
7102 -40238 -15597 -16163 -22173 0 -37327 -23142 13357 11021 -70275 -4002 -20587 -36523 -18157
7089 -18157 2804 -1780 2996 -37530 -76538 -34813 -52891 -19025 -44628 -39597 -38170 -44435 -41400
7076 -41400 -21437 -39950 9739 -2305 -40728 -3668 -34750 -55277 -11094 -27659 -29944 -28059
7064 -28059 -21334 -46528 -66086 -53135 -33757 -87396 -41486 -36623 -36784 -37905 -26634 -44484 -7804
7051 -7804 -35699 -95836 -56024 8088 3709 8463 24077 22413 -14991 -27719 -20745 -16573 -26005
7038 -26005 -54122 -103658 -78295 -19177 -28642 -3159 -3075 -20517 -19405 16387 -23020 -29626 -7914
7025 -7914 29244 22858 16597 36938 9274 -697 -13489 -7845 31957 42446 7513 9503 -58117
7012 -58117 -14598 64526 53199 9693 -36710 27372 53933 36597 48582 74344 50521 39406
7000 39406 53751 43517 68521 54221 62022 57261 41036 43180 31822 40318 15818 28820 106747
6987 106747 104735 62117 53009 106363 88319 83566 84578 46776 115077 54823 56506 100866 77687
6974 77687 77710 77847 95520 95956 119224 112688 83809 65018 33700 67932 89613 79823 78075 137020
6960 137020 87155 92954 111946 117117 78960 38477 63594 125285 73006 86953 62803 98876
6948 98876 95188 81454 118096 103244 93691 99435 72671 61371 41873 28847 69695 41452
6936 41452 85513 98609 104269 82847 67048 27545 54022 53403 38538 108760 130622 108160
6924 108160 28647 51594 69686 63017 45348 93768 68276 62905 82286 16858 28369 73922
6912 73922 27013 37202 36872 15193 56901 32234 18912 64227 84236 18748 24781 32389 45172
6899 45172 90788 56865 17261 29442 -26624 -82 -23040 -48160 -30991 4305 -5496 -18446
6887 -18446 -17437 -22588 -28772 -16628 66754 26808 -52513 -21721 -42638 -28602 -20749 -47745 -20227
6874 -20227 37989 35116 34427 -29013 -60955 -80123 -72972 -3696 -32008 -45833 -50297 -74721 -35166
6861 -35166 -4937 -39208 -22861 -8506 8467 42841 -19826 731 -34745 -10233 -5293 -56100
6849 -56100 -61103 14121 -14267 -38947 -9621 -50059 -67127 -56889 -30101 -63354 -52787 -40439
6837 -40439 -84153 -51001 -34381 -34542 5440 -21741 -65225 -42424 -28036 15916 -44553 -51774
6825 -51774 -33629 -18480 -70217 -82917 -79230 -42826 -21467 -39148 -6997 -627 -11662 -103924
6813 -103924 -38658 5287 -56049 -56795 -18052 -4631 -29796 -56289 3118 -54583 -41075 -64172
6801 -64172 -15503 -32050 -12900 -9009 -16399 -9418 -31985 -49776 -49301 -67639 -15391 -64966 3451
6788 3451 30935 1593 -60060 -77993 -78549 -96237 -72216 -74307 -27416 -5631 -12462 10529 -38334
6775 -38334 -77318 -26425 -25988 -56681 -80348 -55252 -50773 -69665 -48189 -1510 -48570 -35122
6763 -35122 -16610 -1330 32432 -30786 -31305 -38896 -50995 -21197 -7674 -14585 -17866 -38094 -38075
6750 -38075 -2810 -35031 7377 -31701 -48043 -87109 -72315 -43053 -66406 -62802 -45348 -80489
6738 -80489 -13405 -35765 -19919 1343 -310 -17924 -32159 -46292 -53940 -10108 790 14020
6726 14020 -26828 -70081 -62191 -73881 5311 25085 -709 -673 -27820 -50340 -48654 -21611 -44175
6713 -44175 -27815 -54739 -84450 -85592 -76529 -1622 -19636 -31580 -93496 -80168 -45657 -5748
6701 -5748 -13001 -31235 -61202 -111165 -73271 -37639 -69443 -85266 -41526 -22480 -51599 -54867
6689 -54867 -14886 -36226 -17013 11575 -22164 -67609 17225 2894 -30430 -35160 -42901 -26116
6677 -26116 12085 18655 -1607 24741 9650 -17568 -38667 6861 60344 11646 7383 -23645
6665 -23645 -32932 -63006 -63383 10043 16243 -21110 -9584 -69932 -80440 -30828 -58694 -56681 -28763
6652 -28763 -25578 17469 -15602 -44161 -40595 -65807 -72281 -52298 -53228 -1971 -1829 -31985 -11552
6639 -11552 -4899 -20688 15731 -42510 -56436 -37702 -21118 -65853 -49835 -1478 -23784 -40450
6627 -40450 -36964 -10196 -78365 -63671 -37699 -45517 8288 -20133 -25833 -3400 -36162 -48735
6615 -48735 -1101 16890 5976 -69698 -53183 -9435 26260 48263 32159 -40593 -105103 -76509
6603 -76509 -16033 5566 -9626 19389 -19443 -43615 -28706 15138 13345 -1321 17620 29230
6591 29230 -65469 -38679 -79168 -33668 -29429 -30903 22622 -1990 -39984 -59370 -87964 -63866
6579 -63866 -35009 -43521 -12723 3248 -10841 -1271 -2360 -13565 -22653 -24361 15608 -6850 -19405
6566 -19405 1436 -12063 -63659 -61657 -21531 -11000 -9730 -50895 -46838 -45034 -29717 -38283 6566
6553 6566 -24868 -41848 -30151 -45266 -72791 -35942 16954 -25613 16124 24438 -10780 -8272
6541 -8272 -11009 -6350 -53359 -40176 -60852 -39598 -54151 -25068 -17542 -40308 -45755 -19914 -43829
6528 -43829 -91165 -61606 -47135 -22110 -50233 -69525 -65619 -40938 -12845 6574 -22932 -26758
6516 -26758 -30265 6185 -63029 -16252 -102 -2382 31780 2480 -30588 14737 -4512 -1837
6504 -1837 -9324 -76235 -49229 -23023 -30998 -56846 -48066 -24049 -21251 -17661 -49730 -50271 -24167
6491 -24167 -31740 -53797 -8751 -1561 -34580 -28747 -13538 25932 20568 -12848 91 10695 -125
6478 -125 152 7399 -21799 -62109 -62385 -44918 -46687 18090 19233 11092 -23223 -67170 -30432 11282
6464 11282 62035 33209 -4200 20425 -42045 -106320 -23615 -15413 18178 25048 -24239 -47699
6452 -47699 -5686 -8740 -30288 19679 -22147 -12062 8412 -19787 -62528 -15546 -7559 -30384
6440 -30384 -68752 -38201 -30832 -71721 -5901 30636 32077 18566 34619 17841 -48769 -46107
6428 -46107 -16789 -28275 17188 -8661 -39171 -36256 -37559 -9855 -13003 -56262 -21915 -28024 -51307
6415 -51307 -31492 -27733 -34178 -19757 -30674 -27203 9603 -7802 -3504 -26446 -3369 5693 3393
6402 3393 -1974 20386 -38109 -67456 -22375 -2358 3843 27 145 -19745 1637 3440 -5935
6389 -5935 -32930 -32865 -48405 -35246 -4619 23022 36217 -4405 -33410 -45544 8159 35555 85552
6376 85552 25021 -16142 16136 60380 32058 25928 40768 -4944 14425 18260 -7407 -37253
6364 -37253 -54978 -33020 -26467 -10555 19526 -4144 21791 25280 55600 30374 15255 26643
6352 26643 58302 40971 14338 -40007 14584 40818 29394 21747 17658 -2146 -20298 -14603
6340 -14603 5353 9048 8712 -14099 34198 15104 -10184 19077 17785 84812 100650 103391 61766
6327 61766 39267 20844 31971 25017 94831 33552 -26612 55261 53309 87991 47699 20607
6315 20607 50414 32631 20514 10461 -13796 65887 57412 55399 42201 52693 26087 33733
6303 33733 11979 62003 76152 71966 67566 60029 48596 71563 15670 -14091 120573 72277
6291 72277 119213 95157 60297 31413 88431 90236 88021 78973 89123 47510 47629 64179 88091
6278 88091 138926 157140 141939 200854 168935 166919 159519 154347 189994 207971 190183 163270
6266 163270 150606 180211 171606 177712 170196 203877 227647 250505 254758 253777 291833 308699 317418
6253 317418 289148 361812 348944 339188 339109 387586 420568 461714 477689 516579 536681 544212 512197
6240 512197 556081 616703 652387 660584 631192 679017 659042 637531 627488 569207 564166 592694
6228 592694 602576 532154 509515 485965 434051 450452 461999 441214 419407 384616 360185 373643
6216 373643 426006 390302 363599 371551 369391 381935 371831 378845 308689 286299 322859 321334
6204 321334 302339 326294 358610 366280 376321 341715 328915 390163 369749 354056 325319 305240
6192 305240 305335 283492 246969 269843 332269 306019 271689 321618 299857 318230 404359 417397
6180 417397 457253 495512 459007 474527 449370 425371 396149 371167 391676 317122 325096 348285
6168 348285 375071 386361 395608 407484 368573 344616 402711 425876 466326 469725 421885 428375
6156 428375 425608 366397 384790 375889 367228 362304 286902 325959 332908 291248 317789 369133 326804
6143 326804 335307 327278 303444 345800 334658 351080 380805 399894 425723 408298 390337 391262
6131 391262 366177 423442 509032 520386 493775 529414 542104 507937 435003 438355 453854 500716
6119 500716 518230 533138 536038 560906 567557 555695 598301 641014 669103 585446 540163 536808
6107 536808 593611 593949 580888 562721 495736 493125 552862 555202 581031 603331 613974 598050
6095 598050 578737 521453 467237 427144 365634 404199 437150 448326 395215 397090 406754 402673
6083 402673 385447 421881 438300 426707 511807 486817 497452 470713 442965 412790 434882 501413
6071 501413 519216 412875 401365 492543 518373 550721 544650 583127 534525 524750 551255 588462
6059 588462 569316 641596 639340 638361 731646 763218 782888 780317 787753 795542 751292 706841 778248
6046 778248 796118 827384 850054 881031 921383 930601 907994 998086 1005170 1065699 1116215 1100074
6034 1100074 1161381 1194285 1241367 1314650 1302643 1413257 1462858 1462531 1477608 1510940 1552668 1542766
6022 1542766 1609195 1720904 1831310 1870670 2005499 2142551 2253662 2424078 2639524 2760391
6012 2760391 3012468 3316349 3649585 4021757 4273098 4477464 4608980 4617190 4602929 4733509
6002 4733509 4932576 5178569 5481997 5744021 5897105 5917676 5865279 5834796 5838746 5857925 5843529
5991 5843529 5809273 5718691 5649348 5655510 5720764 5880630 6056056 6265614 6442043 6717875 7098654
5980 7098654 7409531 7517819 7382191 6960351 6404625 5755058 5134543 4655331 4245613 3933581
5970 3933581 3743151 3576903 3475926 3372979 3461445 3448542 3505706 3575041 3694064 3755703
5960 3755703 3694259 3507854 3297541 3066390 2731705 2464801 2270893 2105861 1948366 1847701
5950 1847701 1763583 1660432 1525355 1480341 1414853 1390832 1339737 1286867 1241997 1193016 1125700
5939 1125700 1163575 1081169 956097 929323 950404 927604 879200 829161 827564 777237 729962
5928 729962 748469 724130 707589 757206 717121 674090 586883 585617 590140 549017 548578 590169
5916 590169 555543 556259 543478 567201 526722 534212 496643 510314 510708 483565 510263 542669 511883
5903 511883 483305 481754 458409 466187 491073 481137 421221 446074 465842 423460 408311 444847
5891 444847 446840 409810 417040 422769 399743 459896 414366 379214 359730 354315 366068 315079
5879 315079 276293 303170 331435 322900 297827 337765 334239 323083 312698 271420 320055 329678
5867 329678 262619 286577 302750 287950 253231 256310 285960 322982 280335 282356 257902 337888
5855 337888 321652 326984 295480 319270 266152 302674 305508 265950 238698 224706 277262 226314
5843 226314 198499 239337 274803 234484 251188 192694 234191 246882 248967 281169 289006 254224
5831 254224 266618 269273 323119 301029 268979 246708 234355 293931 351752 364132 317562 269410
5819 269410 271328 252593 238131 307565 346098 344103 359612 351741 319881 366593 378662 373257
5807 373257 375251 391482 369225 340396 355720 366075 359907 416250 427903 398554 420279 444931
5795 444931 510715 557804 518825 535769 577734 560581 562172 556399 538224 498965 534517 491585
5783 491585 476478 558344 556067 544597 516590 530631 531832 593599 642987 719093 739972 772541
5771 772541 817635 807076 833578 800921 719506 709567 698145 656198 697785 706536 696079 705986
5759 705986 697556 742928 775969 802112 817973 850044 829325 891145 914684 877699 933023 953503
5747 953503 955684 994531 1045156 1034406 1021805 1065484 1108129 1126645 1180573 1243135 1305951 1316845
5735 1316845 1357032 1466576 1535323 1575946 1684044 1751865 1891970 1975398 2042829 2051019 2105885
5724 2105885 2156845 2135548 2154219 2218138 2259564 2368482 2418200 2476248 2605073 2761004 2833485
5713 2833485 2971985 2995075 3068199 3136402 3280154 3472906 3629418 3768430 3821518 3835662
5703 3835662 3730660 3601148 3585962 3596024 3611486 3598501 3665224 3727609 3769363 3811912 3881752
5692 3881752 4012914 4044634 4198912 4422023 4629507 4765533 4950672 5035424 4936840 4712257
5682 4712257 4466158 4192724 3977695 3855497 3792733 3811987 3829671 3836388 3834515 3906138 4046728
5671 4046728 4209263 4485319 4716530 5030461 5297188 5357880 5174039 4760583 4237744 3749746
5661 3749746 3396028 3094565 2870087 2737507 2621045 2534709 2513409 2501150 2450106 2527857
5651 2527857 2602019 2713532 2723892 2826453 2827414 2741140 2615187 2423257 2152797 1916533 1810392
5640 1810392 1689450 1594539 1518376 1460440 1375163 1311062 1235239 1175176 1206344 1187974 1165884
5629 1165884 1184948 1194363 1196391 1237601 1195303 1129272 1185407 1125180 1045935 1064751 1024549 1040416
5617 1040416 1017998 989460 1008190 986727 1056455 1035328 1027318 1103885 1157603 1103804 1071565 1070790
5605 1070790 1080028 1072532 1019169 1031370 1067286 1021702 918926 914253 888985 847350 917905 903951
5593 903951 941669 973716 937094 977172 1008911 1002876 983555 1010571 1035081 1049849 1030868 1063571
5581 1063571 1081521 1059433 1136459 1176192 1174037 1208167 1268683 1266379 1345893 1371073 1387594 1368679
5569 1368679 1441875 1470144 1483986 1593705 1698499 1800849 1870845 1966116 2132322 2322181
5559 2322181 2528848 2766947 3066022 3403849 3632505 3785531 3880103 3920390 3693785 3590871
5549 3590871 3527171 3523128 3616865 3693021 3822890 3901091 3957617 4013212 4052857 4123642 4200817
5538 4200817 4234903 4252153 4061276 3890972 3772639 3621655 3492123 3402664 3263243 3075117
5528 3075117 3061328 3103097 3225839 3277402 3263139 3110560 2891884 2588185 2265188 1976353
5518 1976353 1752407 1579149 1463822 1357650 1274492 1262333 1155460 1123587 1083513 976207
5508 976207 913798 899658 904923 860456 799362 800274 742006 650294 634864 657109 668039 655856
5496 655856 635623 573507 556640 593203 522197 530559 475120 445358 464808 489474 439536 485133
5484 485133 486290 401476 368503 383761 367709 388965 431532 385821 412361 380347 390899 362900
5472 362900 341954 366672 336776 318665 285815 313115 325564 313802 321727 314868 355412 397101
5460 397101 360948 356206 320466 327594 299937 310890 318731 354532 289183 373901 382881 365133
5448 365133 315018 289743 306512 319397 406035 379967 324446 335437 319434 354515 396473 353320
5436 353320 350222 375168 385939 378554 422812 449634 451123 417042 442363 409354 406746 355298
5424 355298 409669 410766 366166 395054 462307 431489 448211 441726 492858 499025 500242 516770
5412 516770 556599 617841 658919 734257 770158 836662 923497 909203 897440 875627 870287 843336
5400 843336 788638 766902 752211 695096 665202 688443 726980 718032 760581 831454 831419 934242
5388 934242 1038254 1073925 1139943 1266647 1430102 1683557 1818515 1979054 1999053 1838259
5378 1838259 1705090 1516441 1374325 1188892 1091602 1040543 1014206 962797 976722 920344 890376
5367 890376 929934 978421 1021702 1077056 1166413 1226106 1372318 1515517 1655229 1869838 1951209
5356 1951209 2012663 1966261 1754212 1568029 1343060 1212632 1089008 960067 929552 885144
5346 885144 871246 842039 769104 770661 823984 798608 778054 782214 783958 843955 888115 912000
5334 912000 1039633 1078864 1066846 1032537 1020049 931511 881466 910412 781611 797187 794385
5323 794385 808926 754703 703902 656328 633583 583298 613246 614832 630494 642822 606885 597819
5311 597819 606774 652472 644516 630977 622574 666095 667689 674000 716014 706632 749916 812157 811051
5298 811051 807827 834656 762360 770991 693937 641851 630628 667839 655889 611042 610149 602207 621716
5285 621716 578068 619466 664903 653571 636950 646589 598265 610232 674093 668320 674108 719614
5273 719614 768609 770900 757508 727328 691574 634722 652433 687346 625195 597269 583879 613758
5261 613758 609705 620060 671659 732386 689919 616436 660048 645378 655297 639802 612959 656869
5249 656869 670910 671132 687365 748098 723461 752553 722337 709681 715687 748660 806832 793003
5237 793003 832845 857738 906716 909377 937184 1006883 1038912 1075417 1125199 1237286 1356568
5226 1356568 1479803 1673576 1850676 2019735 2163561 2264567 2113941 1841437 1644205 1527001
5216 1527001 1423854 1337437 1330453 1301637 1307237 1324255 1341747 1393731 1371012 1393158 1339948 1290215
5204 1290215 1225721 1193023 1159868 1156723 1139305 1146536 1184271 1172578 1134491 1147459 1184730 1189064
5192 1189064 1182586 1197204 1214700 1241301 1264008 1258034 1268904 1292592 1346775 1386646 1420808 1438482
5180 1438482 1439721 1485386 1565797 1559783 1603384 1691383 1792784 1830987 1920612 1960435 1889226 1808033
5168 1808033 1719604 1630282 1613692 1543529 1498780 1438295 1404784 1430457 1426564 1377794 1437110 1400808
5156 1400808 1362972 1408206 1397658 1380820 1405084 1419853 1422222 1441340 1413051 1437438 1458813 1450684
5144 1450684 1492155 1521041 1527068 1509290 1592983 1578083 1587481 1630173 1671007 1676739 1655704 1683826
5132 1683826 1728080 1752218 1745374 1802006 1839425 1890349 1935998 2009189 2153334 2250681 2350955
5121 2350955 2483487 2545475 2516418 2424998 2285734 2179575 2098801 2122918 2062027 2019590 2038815
5110 2038815 2012284 2025009 1992651 2000151 1979626 2001604 2027496 1997768 2042472 2063414 2075354 2114019
5098 2114019 2137827 2186533 2225920 2250892 2285411 2278792 2305631 2375633 2470887 2509495 2517863 2575622
5086 2575622 2663062 2674000 2666582 2748654 2791693 2898300 2956470 3108410 3194272 3232544 3290662
5075 3290662 3366483 3509926 3529992 3609392 3746294 3847611 3919080 4045012 4242970 4378979
5065 4378979 4520878 4693140 4877336 5087245 5395152 5878987 6422158 7009093 7475381 7759042
5055 7759042 7694458 7211308 6693878 6306291 6020232 5886747 5848791 5783457 5780689 5890931
5045 5890931 6087842 6135480 6269974 6426211 6595206 6832718 7093495 7310929 7630144 7920308
5035 7920308 8305125 8732722 9248439 9826458 10511582 11294887 12327849 13548568 15104427
5026 15104427 16986608 18911580 20425112 21215671 20769699 18792726 16873738 15623222
5018 15623222 14748251 14248290 13951955 13768705 13758921 13879399 14076267 14327571 14552795 14836478
5008 14836478 15193324 15563221 16044117 16537406 17062602 17662891 18371150 19144969 20028247
4999 20028247 21013709 22094407 23320310 24639294 26086456 27617768 29231997 30914673
4991 30914673 32676684 34501460 36302873 37934717 39219328 40184245 40902536 41666115 42493924
4982 42493924 43419243 44387975 45399548 46438488 47512412 48774862 50105340 51567220
4974 51567220 53144076 54608481 56167158 57923674 60042586 62429106 64529721 65774968
4966 65774968 65564934 63652512 60621212 57622518 55141081 53185677 51582290 50048906
4958 50048906 48417058 46845920 45482802 44352536 43328683 42373783 41276082 40062926
4950 40062926 38908081 37894643 36908557 35858978 34632428 32977082 30912187 28530464
4942 28530464 26371339 24421221 22704535 21166016 19778184 18490147 17394081 16405794
4934 16405794 15540706 14770655 14034150 13450284 12849905 12297136 11799544 11296959 10870193
4925 10870193 10481351 10133937 9798603 9523221 9194763 8950112 8701839 8404249 8155691
4916 8155691 8027266 7875714 7721990 7616047 7506608 7457952 7329436 7168315 6909852 6579752
4906 6579752 6232680 6001116 5864556 5729051 5584794 5448532 5310841 5156040 5097470 5028115
4896 5028115 5004256 4891558 4801678 4788168 4763547 4726149 4668167 4674695 4669533 4644369 4669731 4658035
4884 4658035 4747799 4806403 4871163 4966847 5010039 5102182 5231647 5294797 5382324 5418400 5391887
4873 5391887 5413175 5397303 5444367 5432859 5518862 5587984 5637894 5743024 5782529 5861846 6044243
4862 6044243 6217604 6370107 6560119 6708818 6859019 6981987 7114794 7209865 7309394 7388937
4852 7388937 7569714 7714718 7875256 8069255 8270406 8554221 8875629 9206452 9507967 9853494
4842 9853494 10172712 10639411 10965310 11326534 11733429 12139557 12489352 12933057 13368704 13868164
4832 13868164 14414349 15043070 15770008 16560248 17480147 18527967 19647864 20946712 22402340
4823 22402340 24059695 26031334 28385660 31112663 34321593 38008993 42333301 47342957
4815 47342957 53317274 60436646 68821406 78165699 87610954 96010456 101179370 102038235
4807 102038235 98197697 90051434 79450782 67975805 57327868 48595868 41857868 36717641
4799 36717641 32780969 29657756 27103015 25046553 23152014 21524740 20026342 18714712
4791 18714712 17612725 16568859 15715104 14881213 14162510 13496183 12827494 12230527 11758285
4782 11758285 11341523 11018653 10703966 10405547 10288814 10122189 9920956 9804106 9713258 9588382
4772 9588382 9467251 9352820 9255651 9053233 8903859 8588190 8239009 7888098 7473389 7094751
4762 7094751 6740471 6465417 6250987 6011951 5922157 5809077 5664067 5578159 5453754 5342050
4752 5342050 5287740 5195112 5069378 4959068 4860963 4819223 4714573 4589789 4511554 4450586 4384320
4741 4384320 4351356 4309943 4232175 4273327 4243266 4192861 4216910 4260261 4249551 4245928 4219075 4209740
4729 4209740 4264097 4228580 4219607 4236856 4287569 4294992 4340907 4360949 4402465 4448818 4475883 4512162
4717 4512162 4512669 4582437 4641771 4716488 4847325 4974256 5082065 5350540 5636326 5940593 6317931
4706 6317931 6692459 6857507 6884052 6745462 6323652 5901450 5436948 4933752 4504241 4244462
4696 4244462 4023857 3829261 3705024 3642644 3496166 3378349 3336721 3255220 3137328 3049104
4686 3049104 3003403 2935341 2894487 2803868 2721419 2655046 2680971 2644051 2585325 2616708 2608199 2603353
4674 2603353 2630362 2620293 2620801 2601081 2584871 2583070 2561460 2477522 2470565 2470892 2508152 2539137 2524278
4661 2524278 2490755 2455838 2528023 2541092 2437646 2442100 2444097 2464658 2467878 2471854 2477863 2423198
4649 2423198 2437919 2426552 2430375 2443686 2485220 2515834 2455368 2462873 2492756 2463670 2487614 2453166
4637 2453166 2477660 2469560 2502766 2514937 2496028 2504013 2531677 2567946 2677030 2654524 2632751 2696175
4625 2696175 2761875 2819630 2837380 2884317 2982226 3037713 3010902 3048092 3063165 3092118 3179303
4614 3179303 3234176 3289318 3343143 3396762 3446687 3501464 3522228 3540480 3581691 3619079 3738816
4603 3738816 3813842 3851727 3926815 3916453 3954917 3977659 3983574 3983885 3949967 3906468 3880643 3822682
4591 3822682 3756082 3661183 3572053 3479858 3419176 3377699 3331233 3341522 3388158 3355677 3286553
4580 3286553 3322291 3260258 3309456 3320448 3274461 3230876 3229530 3249220 3233080 3275588 3287874 3328341
4568 3328341 3331912 3343692 3339986 3397088 3443121 3456724 3526037 3566875 3606581 3659006 3712697 3730434
4556 3730434 3700080 3741932 3767169 3728329 3752875 3799928 3880254 3856279 3887900 3934647 4000769
4545 4000769 4007416 4015065 4050436 4103209 4110901 4116940 4209779 4251999 4341073 4392405 4433988 4525114
4533 4525114 4608888 4680884 4736832 4798132 4855704 4983039 5011723 5096042 5172345 5244578 5328651
4522 5328651 5365024 5456828 5575803 5584485 5681467 5774453 5848985 5937120 5961080 6146696 6301889
4511 6301889 6416546 6516949 6656344 6789665 6935302 7032226 7100939 7182813 7311990 7427518
4501 7427518 7565390 7718748 7874298 8003506 8099485 8258708 8481117 8776259 9037922 9302896
4491 9302896 9503521 9763130 10071579 10358108 10743880 11037404 11403607 11773714 12105471 12477082
4481 12477082 12915714 13375705 13803349 14145184 14521936 14846392 15244684 15534890 15955320
4472 15955320 16365489 16676390 16991749 17317995 17761542 18153267 18639680 19060980 19577703
4463 19577703 20161314 20672576 21236546 21875767 22569086 23249832 23981779 24717551 25441906
4454 25441906 26223463 27085729 28101944 29210144 30303966 31295774 32226510 33079858 33978722
4445 33978722 34874685 35904595 37017550 38282248 39666602 41096321 42557397 43944435
4437 43944435 45308480 46896698 48525076 50141449 51504942 52527888 53141697 53479532
4429 53479532 53952475 54483760 55153732 55829130 56356588 56719300 56873650 56806313 56641781 56480881
4419 56480881 56088610 55372813 54509682 53544057 52706555 51916515 51289517 50582327 49574214
4410 49574214 48245175 46505359 44706675 43041525 41562754 40219211 38965206 37732823
4402 37732823 36560898 35375032 34290096 33256721 32277036 31346264 30375267 29406896 28461507
4393 28461507 27494593 26586178 25819282 25058813 24346274 23724887 23036468 22335724 21603010
4384 21603010 20969417 20377629 19852904 19373921 18951356 18560341 18182143 17902962 17597413
4375 17597413 17345443 17073766 16839330 16610285 16360052 16095426 15899560 15597798 15262168
4366 15262168 14976052 14735718 14463515 14221202 13979604 13774232 13580297 13373470 13204564
4357 13204564 13065595 12915687 12758946 12685952 12626705 12540855 12469799 12445858 12441328 12397352 12367014
4346 12367014 12319943 12327308 12282489 12339929 12343215 12359202 12424947 12410778 12432173 12456947 12478113 12523834
4334 12523834 12529100 12555222 12607497 12652311 12640582 12725680 12821838 12796705 12851516 12878411 12946693
4323 12946693 13016897 13056853 13104379 13161874 13192829 13194468 13229829 13317301 13253256 13275434 13335396
4312 13335396 13316206 13295609 13306736 13280694 13315438 13271601 13246606 13194047 13224907 13189186 13229280
4301 13229280 13217019 13256651 13346514 13346584 13407757 13447427 13480777 13549638 13605446 13589264 13627290 13741197
4289 13741197 13749532 13734399 13776383 13802537 13806785 13725932 13735764 13745676 13787910 13704548 13658200 13647579
4277 13647579 13615512 13589907 13482695 13468042 13421852 13363654 13288681 13272384 13288591 13248642 13269203
4266 13269203 13296173 13293309 13267615 13286612 13284701 13310418 13291554 13236235 13196206 13224303 13234845 13242099
4254 13242099 13239420 13338456 13319502 13345505 13345820 13357363 13432106 13526779 13601996 13634275 13686649 13790800
4242 13790800 13903598 13968850 14028689 14128603 14280883 14432652 14632833 14748203 14914770 15061821
4232 15061821 15186746 15373354 15521582 15760365 15953369 16112020 16329828 16532880 16848291
4223 16848291 17043770 17249115 17401625 17553267 17597445 17571447 17509412 17368758 17285778 17188230
4213 17188230 17045316 16962895 16950034 16806795 16800127 16752552 16710323 16640772 16547884 16487039 16499412
4202 16499412 16501923 16475230 16474417 16525112 16559774 16558618 16605372 16618208 16676789 16691739 16766417 16895733
4190 16895733 16946779 17009661 17068718 17047666 17121740 17146743 17119691 17094667 17051669 17033652 17061235
4179 17061235 17084872 17097379 17123655 17130969 17204591 17285870 17353015 17413975 17458694 17590813 17653981
4168 17653981 17743175 17792375 17818508 17897007 17950145 17972608 17952643 17941426 17973482 17972389 18001229
4157 18001229 18093816 18134460 18202844 18226276 18253312 18353490 18468510 18526317 18584120 18717286 18826847
4146 18826847 18963477 19101877 19203830 19294985 19396442 19540494 19585544 19668714 19780028 19896198
4136 19896198 20045790 20132699 20234111 20345146 20502848 20672265 20861128 20986805 21132192 21302762
4126 21302762 21447968 21641464 21819910 21994213 22218583 22446198 22622165 22862866 23114095
4117 23114095 23367173 23614231 23863248 24161863 24470539 24788773 25139794 25484008 25810200
4108 25810200 26186769 26507076 26859494 27232264 27550104 27826475 28124579 28491229 28869098
4099 28869098 29168723 29574185 29978802 30378668 30780229 31216230 31699937 32176897 32679468
4090 32679468 33139630 33588965 34177678 34764352 35258950 35804212 36421211 37013756 37660054
4081 37660054 38380703 39047239 39788583 40521209 41367202 42151561 42973759 43851467 44764780
4072 44764780 45699374 46681026 47686753 48727608 49825358 50978496 52153741 53383341
4064 53383341 54655127 56062409 57355710 58700028 60123886 61457422 62972117 64498655
4056 64498655 66069301 67727607 69393164 71148921 73012589 74942103 76871573 78873146
4048 78873146 80986211 83067524 85226123 87408997 89564165 91801841 94092528 96465827
4040 96465827 98910176 101379477 103970684 106695611 109576168 112507033 115768586 119183604
4032 119183604 122730033 126640704 130876534 135465998 140475677 145920339 151947674 158630432
4024 158630432 165855290 173799135 182574157 192211084 202672923 214021928 226275119 239227125
4016 239227125 252717724 266444020 279889412 292228327 302332002 308943874 310966295
4009 310966295 307726546 299656551 287797722 273932153 259794526 246445775 234366040
4002 234366040 223650504 214150844 205810326 198425079 191861873 186052595 180746702 175937578
3994 175937578 171610287 167610289 163926316 160413801 156899560 153428650 149850279 146262857
3986 146262857 142646110 139131785 135587436 132048945 128572138 125123573 121702267 118432631
3978 118432631 115183368 112088127 109083790 106200930 103457994 100851204 98390301 96165332
3970 96165332 94111511 92232634 90502657 88713288 86794132 84763231 82688528 80650608
3962 80650608 78636567 76677602 74895041 73320783 71806480 70411516 69121548 67862369
3954 67862369 66728823 65615243 64577929 63560193 62663337 61753353 60878252 60059755 59295662
3945 59295662 58583829 57911578 57252841 56510997 55700771 54817125 53969476 53122217 52229675
3936 52229675 51418731 50701999 50007098 49373798 48716916 48047541 47464715 46782995 46262047
3927 46262047 45669267 45136457 44566809 44027120 43550458 43050193 42572578 42078085 41595093
3918 41595093 41174123 40803442 40411656 40027674 39670291 39365633 39050587 38715021 38364997
3909 38364997 38111539 37839512 37470786 37166344 36871639 36608592 36322114 36075934 35860001
3900 35860001 35690753 35488874 35220365 34999580 34769083 34578857 34411241 34264852 34072994
3891 34072994 33856018 33656260 33411732 33156918 32944505 32656187 32430792 32158939 31857350
3882 31857350 31523031 31276163 31059249 30807245 30529668 30276453 30023729 29788283 29546607
3873 29546607 29335688 29072328 28864767 28707083 28508098 28333455 28089992 27874072 27755713
3864 27755713 27547838 27291372 27037399 26828045 26537567 26260327 25992289 25647167 25370761
3855 25370761 25121665 24909451 24659689 24448452 24232034 24073831 23980382 23845891 23749503 23676041
3845 23676041 23594803 23500314 23495501 23516679 23500767 23561698 23565089 23535588 23547512 23556148 23624790 23636409
3833 23636409 23643220 23722822 23813999 23929443 24062747 24183142 24360065 24585627 24781821 25023205
3823 25023205 25253380 25463244 25715301 25974488 26259733 26584869 26915697 27292168 27676654
3814 27676654 28131316 28565629 28944298 29316124 29721903 30107406 30491976 30911798 31351436
3805 31351436 31759148 32164734 32594505 33108439 33653982 34126650 34694795 35341428 36017466
3796 36017466 36826263 37649729 38604871 39588698 40639951 41870652 43124318 44438893 45733250
3787 45733250 47041580 48485500 49934124 51552155 53219694 55060224 56890203 58711248
3779 58711248 60621374 62436131 64128535 65776621 67225584 68590223 69892421 71175714
3771 71175714 72516624 73893809 75434916 77160571 79082144 81253078 83748526 86469008
3763 86469008 89520024 92905365 96595570 100374134 104362857 108376788 112184786 115422507
3755 115422507 117539058 118254550 117487047 115543001 112967411 110373644 108353991 106943448
3747 106943448 106288011 106450888 107257139 108592063 110393839 112563588 115052554 117565192
3739 117565192 120071847 122367151 124352512 125774216 126359851 125884037 124437450 122015021
3731 122015021 118710422 114920125 110869073 106876397 103245384 100271485 97888108 96074343
3723 96074343 94772657 93941035 93379872 92972374 92501354 91788725 90787648 89262793 87136389
3714 87136389 84563393 81464035 78013422 74367486 70732423 67213195 64016927 61054686
3706 61054686 58363708 56034998 53890570 51954168 50170615 48533955 47014070 45592000
3698 45592000 44257212 43072736 41877946 40647623 39383371 38078924 36750864 35456581
3690 35456581 34249983 33062085 31995870 30982362 30036018 29159434 28279670 27473828 26640090
3681 26640090 25908856 25195646 24429027 23730576 23110385 22566425 22011316 21552512 21098059
3672 21098059 20665584 20248547 19863478 19453374 19070157 18638089 18237072 17828030 17370047
3663 17370047 16947719 16483643 16134832 15709098 15348481 14954606 14545408 14179663 13911347
3654 13911347 13600896 13299610 13048809 12823329 12606935 12394556 12172909 11985039 11734662
3645 11734662 11487499 11287687 10971456 10723929 10476888 10190001 10019780 9783310 9553758
3636 9553758 9326735 9075665 8944668 8783044 8562818 8421662 8250644 8062684 7904097 7731860
3626 7731860 7587688 7469778 7353041 7207853 7059878 6922718 6824739 6680567 6554659 6472300
3616 6472300 6343909 6213200 6156072 6098707 5999592 5887159 5803690 5697494 5570715 5500984
3606 5500984 5457094 5360948 5341483 5281667 5221076 5157284 5125320 5077356 5049251 4948382 4867060
3595 4867060 4850757 4809568 4772228 4688070 4567466 4573404 4496890 4439449 4417856 4392926 4331120
3584 4331120 4312694 4246462 4182148 4097591 4099522 4066926 3968527 4008740 3960860 3885412 3856140 3835579
3572 3835579 3776240 3787720 3739767 3754463 3725957 3686514 3685156 3652701 3616561 3594587 3552610 3479117
3560 3479117 3450932 3424278 3421778 3411363 3347430 3380046 3393812 3336571 3272963 3272836 3317862 3326311
3548 3326311 3333563 3282430 3232446 3180907 3199860 3247951 3190059 3228333 3216510 3128775 3108622 3046589
3536 3046589 3035302 3054469 3017396 3016809 2957326 2928865 2920220 2910314 2923443 2975905 2923069 2836944
3524 2836944 2870334 2930143 2868641 2850353 2780009 2728337 2688726 2677732 2616704 2558483 2567316 2589215
3512 2589215 2573272 2514328 2475786 2471367 2479518 2413329 2426393 2412485 2400732 2330223 2294808 2303286
3500 2303286 2285663 2239250 2141485 2123581 2098908 2059647 2052366 1965947 2002132 2004486 1963201 1900141
3488 1900141 1859567 1898785 1855987 1841306 1866337 1816494 1762421 1737013 1682344 1680634 1702882 1663290
3476 1663290 1671432 1690306 1703163 1639844 1678024 1678160 1633266 1617754 1652176 1628108 1601420 1590274
3464 1590274 1521345 1504440 1468628 1436306 1453394 1406414 1437856 1410679 1341586 1396681 1386721 1383359
3452 1383359 1362434 1319273 1293059 1295550 1278319 1241469 1243770 1226901 1205598 1208730 1196783 1205973
3440 1205973 1194627 1194054 1203696 1195277 1123626 1103990 1107346 1139454 1127357 1144083 1080939 1087620 1024451
3427 1024451 1011648 1066007 1012148 977419 974906 974260 966037 940642 949523 933348 932993 872661 875497
3414 875497 841923 790021 802772 791374 808656 765155 752484 725329 710922 698859 699461 717006
3402 717006 691441 645281 644020 655600 663748 638460 609956 594253 672241 647789 669391 631124
3390 631124 581877 597224 618683 558015 540746 551697 516141 543167 505698 526069 505927 469793
3378 469793 498345 465357 513589 507754 462711 429924 436547 449671 430464 380497 359697 417787
3366 417787 415723 385406 373382 346837 325469 382246 377534 397903 398018 392378 374018 344681 341912
3353 341912 343708 346763 378950 322424 310096 343429 344356 320468 291673 311000 342804 314428
3341 314428 238949 242843 223548 187551 197548 216681 209915 192732 224079 145342 186158 203699
3329 203699 236956 249108 221916 190558 185093 209615 247355 214123 205608 187252 150855 188254
3317 188254 234233 214303 158324 159131 136002 147622 162447 172464 151947 163934 141120 140848
3305 140848 174102 199164 165922 159975 108162 137122 119862 135293 108785 130863 161264 157812
3293 157812 113746 98854 66162 139632 151281 113171 116835 143658 106126 98912 151562 102576
3281 102576 71753 78274 115912 148463 95575 91263 120457 159120 203636 132223 119363 84595
3269 84595 108348 100366 100202 75966 91567 129181 104067 112961 123161 91282 77168 65880 48356
3256 48356 99003 89918 125638 121034 104693 129062 69717 76062 114818 80376 107910 93625
3244 93625 60081 65305 78348 45285 120148 99327 26500 63322 74893 49692 66988 92281
3232 92281 86688 34611 9093 66153 84377 103024 96844 140993 119192 111459 170171 157861
3220 157861 184299 150461 127741 196050 174792 146872 157787 180417 147241 162581 217544 266377
3208 266377 273372 252402 244086 217734 238240 253126 232077 254737 228636 276332 283554 313113
3196 313113 247841 262701 342952 332951 327882 313064 335161 370688 405040 425852 417379 438941
3184 438941 433716 448688 498457 543940 538069 563115 600959 664169 712295 774126 835510 822942
3172 822942 876542 1014393 1039138 1136786 1271876 1382008 1499279 1676920 1860380 2046040
3162 2046040 2326344 2672576 3080673 3669655 4362131 4983106 5365975 5418295 4816677 3987860
3152 3987860 3271592 2673327 2215793 1895843 1722807 1518268 1379142 1323659 1274444 1123207
3142 1123207 1050153 939359 888686 819643 739965 738158 672511 627389 612107 538018 551728
3131 551728 452547 435327 460347 473556 444746 373273 315172 337179 387657 362486 312740 261178
3119 261178 309725 291089 322574 271755 229936 194424 151880 169507 166595 169292 190196 222891
3107 222891 150049 120468 148204 123542 100465 92490 126634 127641 99924 144055 130386 81434
3095 81434 51448 56734 130369 60291 32784 99285 24397 -26787 13431 45342 44980 97633
3083 97633 110833 90033 82568 69939 48862 92607 81796 84821 58138 32997 15429 32775
3071 32775 -20632 32800 40059 -37088 42198 41312 31951 20497 10907 -9247 -29871 12474 49062
3058 49062 68440 80105 86505 14714 42248 67143 70863 17367 51385 51123 34378 -7263 9351
3045 9351 13167 -9202 9980 18247 14330 45810 25236 7638 21306 -27448 3742 18907 35197
3032 35197 -5788 -17364 6365 29314 10924 -50240 -30031 -23777 -7071 18520 72568 18741
3020 18741 -24248 24942 11736 47525 43544 -17157 10429 22261 -36029 -47791 -32366 10240
3008 10240 -7174 19717 33715 -27357 -43350 -54417 -8883 -64212 -58153 21293 -4413 29187
2996 29187 17592 18475 -31640 -28627 -462 16459 -30040 10096 11697 -5929 -1399 -34356 -47202
2983 -47202 16899 -17795 -34273 -11997 36863 9584 -35094 -42371 -41220 -36330 -20663 -49601
2971 -49601 -51280 -23912 10523 59239 36273 8740 11442 4996 9884 15440 55112 57452 -38302
2958 -38302 -21763 -29635 -22462 9190 30238 47711 -7523 52794 47067 29399 27762 8921 32947
2945 32947 54911 39317 36380 -2529 -33953 -35848 -13263 -24586 -50298 -27694 3669 -44014
2933 -44014 -49359 -29482 8485 -11037 -1642 45985 26222 -4801 13986 32314 -19604 -11947
2921 -11947 -13556 -23393 -37084 -52628 -63195 -31235 -31405 -39891 -25782 3551 1557 -41623 -28830
2908 -28830 -3225 -6975 -35228 -80813 -34154 -58917 -30797 -52847 -13764 -23137 -80329 -59040
2896 -59040 -68620 -59521 -34858 -62062 -40330 -7436 878 -13956 -20440 -26534 -14175 -52385 -23796
2883 -23796 -26107 -55480 -82425 -61595 -8415 13176 -38023 -100255 -61272 -91954 -53603 -86438
2871 -86438 -62288 -456 -11581 -57072 -89338 -61564 -49812 -85221 -84925 -60724 -31413 -3597
2859 -3597 -8797 -15672 -3896 4318 12407 -15116 -62206 1709 -22487 -76951 -106862 -79630 -39906
2846 -39906 -70086 -55671 -46505 -38278 13355 -16859 -51284 -55164 -88305 -63745 -76502 -27471
2834 -27471 -12502 -64635 -46988 -65224 -62590 8882 8458 -1299 -30073 13396 35312 68767 93508
2821 93508 -36431 -67200 -114977 -63655 -48228 -48713 -60289 -11271 -25674 -49233 -35263 -23963
2809 -23963 7664 -43881 -113920 -12563 -26617 -69821 -63757 -58856 -355 -62982 -83665 -30923
2797 -30923 -2911 -56975 -54083 -93627 -70764 -31016 -42154 -32640 -11949 3393 -18588 29733
2785 29733 -18726 -64332 -28860 -19720 -69067 -48421 -10692 -26811 4824 -42158 -72965 -40304
2773 -40304 -63479 -46145 -8129 -39017 28766 -46333 -65191 -32446 -16671 -30752 -20715 -19319
2761 -19319 -35564 -35862 -37091 -2962 29180 9790 -32465 -41306 -64399 -79439 -30737 -5968 18602
2748 18602 -1996 -43168 -8669 -36588 -69567 -42092 -31090 -60575 -9305 13852 -3813 -5938
2736 -5938 -15481 -28857 -34764 -13673 -45153 -45699 -38601 -58356 -47784 -51217 -67423 -62678 -94257
2723 -94257 -61761 10348 -34866 -91768 -57995 -24869 -29281 -20248 6290 -49639 -60321 -29208
2711 -29208 25951 11539 -49231 -684 2866 -45056 -34388 -12500 -28263 -72451 -52427 -51055
2699 -51055 -50405 -22206 -22644 -39874 -48391 -76792 -53520 -37451 -18855 14302 -22857 -30378 -14822
2686 -14822 34641 -5133 -39253 26309 28566 -12201 -36787 -34301 19663 1933 -29087 -29725 -44223
2673 -44223 -17543 -16835 -32571 37551 -24935 -69709 -15332 -26321 -51610 -36031 2264 -8375
2661 -8375 -10884 -16840 -29239 -44178 -53667 -90034 -83468 -39278 -29931 -13545 -39535 -35856 -54372
2648 -54372 -20587 -13297 -17745 -44801 -21931 -14205 30858 -25076 -26169 12171 6057 -37738 -43211
2635 -43211 -10838 -8721 -17996 -79704 -60459 -73629 -8992 -894 -10852 -35038 -54818 -87141 -42815
2622 -42815 -28844 -14250 1327 -28344 -13771 -35662 -33818 -2463 9712 69378 6076 -24498
2610 -24498 -6935 -36813 -61427 -65171 -41548 16144 -2402 -31172 -33771 24289 17159 -35530
2598 -35530 -24681 -7059 -21955 -17268 -2468 -14785 -10641 -21192 28529 -17662 -35088 43435
2586 43435 49317 -51213 -59326 -57089 -17809 -27980 22007 -37952 -60912 -8675 -54641 -48531
2574 -48531 -35244 -5299 42915 35156 -6500 -25473 -40111 -24753 -49598 -45090 -46090 -36766 -3358
2561 -3358 25225 5487 6026 29966 -36057 -40386 -41979 -35826 -66174 -93106 -40512 -16466 -38056
2548 -38056 -44555 -2364 -1217 8849 -31482 -20877 -22224 -31903 -8905 11832 8717 -15938 29622
2535 29622 -11122 -13106 32255 27551 1282 15415 -28126 -31266 -78686 -46790 -42066 -16080 -31867
2522 -31867 -17599 -38912 -86952 -52527 -56855 -11570 -433 -29473 -54555 -26327 26472 20703
2510 20703 -26694 13835 61289 15838 -29269 12754 -16040 -10637 22057 46642 25899 -3193
2498 -3193 -2547 4919 -40372 -43417 -48903 -12838 -45660 -24082 -7957 4709 -32699 -40202 -19749
2485 -19749 7150 15281 -35955 -28450 5624 -7739 -43976 -6747 -8749 -31532 8842 18493 -9380
2472 -9380 -19237 -51371 -67181 -62455 -21166 -27807 -53406 -21719 -27674 -66948 -43045 -48636 -23426
2459 -23426 -25540 -15331 -24716 -15325 -2544 -11153 -6996 -41193 -23535 -7530 -23967 -39520 -28702
2446 -28702 -1506 -8633 -9370 31135 28064 39769 73495 4871 -32032 -81984 -55633 -20693 -31708
2433 -31708 -10691 -14312 -17621 -8968 9328 43071 31773 -80600 -77760 -37240 -4719 -39785
2421 -39785 -69715 -67406 -32158 2085 -40532 -84982 6499 -16428 8810 -20679 -15883 35764
2409 35764 -32752 -69708 -63816 10492 -34623 -56443 8090 8490 -45480 2881 -5719 -48186 -54614
2396 -54614 -70086 -3105 8039 -31806 -39944 -28 -13165 -9667 -6080 24649 -5077 -8272 -4170
2383 -4170 -35217 -18914 -24341 -36675 -55423 -19255 -25695 -5157 -51419 -58823 -17694 -46075 -57576
2370 -57576 -9989 -19130 -16311 6066 25204 10190 56108 26271 -12386 -21697 -65039 -38192
2358 -38192 4756 -21361 -63214 -57524 8543 -9464 -11446 -4092 -15798 10936 16589 6307 4537
2345 4537 7018 30414 6850 45164 10417 -13370 -23582 -53198 -34459 -75997 -47323 -47613 -40326
2332 -40326 1884 44482 13084 -18121 47850 34262 13851 -28297 -1321 -15005 -36168 -32396
2320 -32396 -37111 -27154 -70065 -8420 -14258 -30520 -1263 -37142 -8256 5202 -13890 -16915 -4599
2307 -4599 38008 -5013 22025 -11604 -24556 -8818 -32500 -20445 -36045 -53352 -59128 -30099
2295 -30099 1596 -4693 18500 -9771 -36722 -43380 -52969 -68851 -76054 -48710 13223 -40579 4000
2282 4000 24274 6046 -45485 -35692 -944 47990 -27368 -15586 -12073 -23124 -23411 -23266 -24978
2269 -24978 -5781 -12526 -47051 -27529 -63618 23348 7903 13521 11672 26301 -34107 897
2257 897 -3229 4196 -23253 7926 16551 -20595 2258 -21970 -10551 -52352 -83301 -42014 -15149
2244 -15149 8825 -2618 15885 -38449 -61227 -54852 -756 22211 8218 7558 -6608 6050
2232 6050 20891 -5854 -35792 -3551 3247 18912 -39990 -44858 -4183 19446 8422 -22193
2220 -22193 28508 23121 -7739 -12583 -16498 4321 -20615 -1407 -37512 -32119 1923 -13231 1006
2207 1006 -4378 5844 -31539 -38005 -3390 25375 36990 22862 29886 46474 40974 21302 -346
2194 -346 -3721 -9872 -12920 -8320 -1893 1759 -7519 -46479 -26525 30918 -843 3845 17288 16522
2180 16522 1610 4377 -13824 -50973 -2936 22798 10419 -20636 13569 20348 -21706 -44746
2168 -44746 -20269 -51596 -37601 -12647 -3901 24824 55010 19056 27368 -12157 -4200 -20898
2156 -20898 -31704 25506 4865 37087 18592 -8228 -5693 -11490 -76272 -27984 -2370 -7299
2144 -7299 -22095 41105 -16142 43490 32918 10405 -19729 9946 -19474 -56914 -29859 -26418
2132 -26418 -64809 -53282 -42481 -30826 -15433 -72260 -6169 21785 8442 -47786 4565 7501
2120 7501 11028 52260 5869 -22639 1582 5071 25684 38376 9930 -13043 -6116 25703 58684
2107 58684 49629 -21058 -46723 -37939 -4352 -4916 5473 9480 65414 33027 -38522 7501 14152
2094 14152 30610 -26474 1768 53399 4598 38949 -5558 -6174 3760 12614 20504 9985 -2293
2081 -2293 38495 26926 -11909 -12074 -35551 1157 767 -5387 -10404 -43784 -49472 -25383 -15953 -10489
2067 -10489 -37033 -28838 31381 20260 -25880 -3023 8033 -16240 2993 32363 32498 62805
2055 62805 -16641 3304 3678 20885 -11293 -12061 -19250 27511 -3972 -49470 -63244 -610 34017
2042 34017 19146 8385 4879 -2226 -14322 -5067 -37604 -69799 445 -14336 -58586 -40047
2030 -40047 -23719 -1273 36830 34630 39809 17408 79353 73135 53612 41500 29434 47104
2018 47104 57022 40266 -6166 -7378 -12100 -29441 -42033 -10826 -34256 -24399 -76911 -100874 -86828
2005 -86828 -67890 -58145 -14615 -22734 -8016 34267 -49727 474 -21570 -55242 -9489 13970
1993 13970 43332 37710 24343 22070 68474 11160 2232 12994 14334 -9006 16620 -4285 24530
1980 24530 35268 113951 -12945 -38462 3540 3771 -18196 16838 20428 -15785 811 28866
1968 28866 41284 1054 24646 189 -44475 -53161 -27615 -17119 -13229 -64252 -46656 24196
1956 24196 11026 5867 -629 -6154 52991 40652 30634 46076 36248 15894 32364 44356 4021
1943 4021 33427 24216 -1352 -46862 14985 11736 -15267 -30489 -29240 -6405 3776 6098 -1697
1930 -1697 5998 -25511 -33058 -30597 1930 46363 62576 8706 -34457 6828 12253 3755 1968
1917 1968 4904 17382 -4456 44919 43640 18650 -10968 55427 -7639 53622 22524 -46458
1905 -46458 -3053 -14842 -15184 -51554 -53731 -61019 17147 -36610 -5028 16910 -45933 -45708 -45234
1892 -45234 -6231 1309 -6419 11090 -59025 -8189 32811 40070 17396 20816 68493 28414 -862
1879 -862 -44016 -7005 -51809 -6578 -23605 -9917 18178 9724 32342 10591 3526 26739 -11310
1866 -11310 610 -16333 -21248 -16263 27160 9419 -7322 -20392 -58818 -5205 5656 4748 11350
1853 11350 29602 2844 -41288 -11129 41746 598 -63573 -32852 -23812 -12584 -22961 9508
1841 9508 37389 25673 -22034 -7217 38690 1208 -24421 -22490 33951 20702 35646 1797
1829 1797 -38298 -3092 10562 5729 -6658 -10319 -20924 16438 14177 4677 974 -3749 -36426
1816 -36426 -5672 -8819 -44260 -60637 -33038 25675 349 -9865 -26526 3267 -26918 -2196
1804 -2196 -8158 13163 33688 9685 -8988 -25758 -9698 44893 5969 3974 4373 14846 -1923
1791 -1923 -41911 -29530 4885 30402 6433 -16346 741 10631 12445 -16065 9652 -6732
1779 -6732 19402 10331 -26893 -13762 -47388 -3302 54930 42760 44347 27655 22701 18124 -26853
1766 -26853 -20549 3694 22395 10433 -17214 -16511 -18376 -24956 651 -29610 -6853 27398 7711
1753 7711 9328 47196 -20483 -25732 19858 -12461 -26379 2884 -4439 -15322 14200 -30204 -73624
1740 -73624 -29337 -24399 -5337 30596 27805 4432 17536 21151 22005 -7124 -9620 29848 29638
1727 29638 39970 50508 76668 41503 11251 24933 13549 20237 19333 -53777 -27971 49243
1715 49243 36258 6814 2381 46758 44379 8349 17342 17432 11333 -18304 -20065 -9082 -12539 -2251
1701 -2251 -25125 -44556 -78980 -69958 -27122 -6039 -5501 35064 55604 27238 18987 27152 -29071
1688 -29071 -31257 10170 37485 11768 -54801 8851 11651 21851 -12076 -5661 56042 61348 -880
1675 -880 23712 5537 3881 50633 -5445 25035 -10072 -9603 -8572 -8430 -17828 1291 -779 3088
1661 3088 -18693 -33315 -18133 -15131 -57479 11566 -16356 -24430 -13405 7719 -28493 -15829
1649 -15829 47356 22757 7404 16495 17859 11615 6128 -46330 -35769 517 -15175 -47704 48417
1636 48417 16763 16776 16270 -28635 -38944 -44938 7034 52466 38995 14363 62689 43342 22819
1623 22819 31278 -21486 42552 17325 12941 7875 -15939 -35402 -13987 -36162 -15311 22974
1611 22974 -11374 -39962 -27750 22765 22484 -20105 -18049 -29967 -16543 -30079 -33684 -20102 940
1598 940 41922 29709 40368 58236 17821 23671 15624 -6456 -3854 -20644 -16442 60788 64672
1585 64672 -16038 -27004 -963 -10130 -63067 -41880 52650 28972 1292 -3071 -11229 41886
1573 41886 62432 53140 32965 33699 -18106 -19818 46953 42040 -5841 34485 -13723 -714 -24491
1560 -24491 -35018 -34373 -12814 16951 -1100 -5841 -26582 -26728 -46756 21464 -4603 4582 41669
1547 41669 5066 43523 51973 37833 4072 -947 -14362 8208 3573 -31293 23204 62410
1535 62410 35909 42901 29813 2293 10703 -11344 -27127 -22204 -18643 -16192 -5351 -52925 8584
1522 8584 26761 -12901 -9026 30965 -5461 -33344 -9673 7294 15434 4850 16848 39832
1510 39832 79323 75428 35065 42332 28992 -4981 -28213 -17822 -8650 -22207 -26116 -20861 -24704
1497 -24704 -45601 5383 33712 24633 6488 -5320 -6194 -27251 -35288 -10208 -842 -17062 17720
1484 17720 11843 -48051 813 -15023 -9719 14083 7083 -24898 -54146 1652 15121 -69952
1472 -69952 -34449 22957 19839 25885 1228 -42046 -16330 -25210 -13661 -579 55949 24256
1460 24256 20792 24343 1558 28383 -113 4389 41907 -59935 -35552 10278 9517 19484 -33035
1447 -33035 -13297 -65542 -42915 -20212 -25721 21475 -5778 14193 33879 35606 3564 1882
1435 1882 -29573 -38695 31167 15069 -29853 -14019 31620 3999 17264 -1542 -24339 -8786
1423 -8786 5243 58724 81209 29288 -620 10540 19233 -8887 51177 43902 72866 82457 5381
1410 5381 -26199 58623 76734 -3998 -25355 -61572 -27701 12083 -4635 14032 11605 -30893
1398 -30893 -51134 48294 59983 35802 -6914 -4158 -42937 -1660 12977 4584 -54139 -66585
1386 -66585 -46187 8694 -13161 13079 78953 59598 964 -181 55281 24763 57524 28531
1374 28531 85982 46014 72192 55008 -9318 11880 20223 6505 9750 -21848 -20926 784 -6373
1361 -6373 -27254 6415 13707 38983 56901 -22367 -21518 7509 13547 6199 -18001 -28339 -23926
1348 -23926 28111 -6287 -42633 5578 -28441 -8888 35382 1938 13151 31506 -14064 -11789
1336 -11789 5170 -713 -15125 30604 67489 101901 58675 24066 20476 -19741 -1043 16384
1324 16384 47997 47643 10089 -14203 170 -16577 18445 69975 206 -20075 27532 -18004
1312 -18004 -38411 15423 -1217 -27957 -46129 -24080 -12125 8347 13249 38843 1939 13658
1300 13658 21046 -42817 8698 40182 20657 -40094 -782 29110 1830 23497 11132 12648
1288 12648 27793 4783 28537 19136 11919 38389 17549 64921 90605 -2612 -7030 -6304 689
1275 689 -43589 -29998 37417 -25565 -57209 2473 -5711 60878 59277 28707 57953 46397 -716
1262 -716 -23102 24871 22534 8848 709 244 71462 67547 7390 7967 71941 12631 -27089 -7334
1248 -7334 -4737 -16088 -13209 15992 12098 35056 -13852 -26499 -41601 -36550 -26514 24468 3000
1235 3000 1924 -42710 -39773 1733 -18060 -35823 -29969 1943 24925 3991 20767 56108 -10426
1222 -10426 2724 14272 10001 -21574 -11307 -2660 15387 -7277 -36321 12724 13419 14736 -7562
1209 -7562 -53191 -14227 5335 -14265 21550 37348 36213 46670 22283 36203 49448 1983
1197 1983 14163 -3270 -24428 -213 17657 3990 1971 -40624 -51151 -39760 -1595 13707
1185 13707 -30845 -42933 -32399 4066 -36938 -37312 51461 65142 42950 37250 -16664 -13706 -18860
1172 -18860 -45717 -24855 14939 38050 23261 -12922 7640 744 -19543 -25932 26468 -6484
1160 -6484 3543 13636 -33192 -9822 -23656 -23668 11558 27623 -8432 17214 -14483 -19140 27834
1147 27834 5417 -26909 -6587 32622 19147 -17438 4744 -4720 -1737 -24037 -10067 5220
1135 5220 -32496 -47777 -7198 24275 -13184 17328 -3995 -30468 4901 11446 30025 8912
1123 8912 -19206 32163 -7152 2429 31784 25881 22132 -43895 5991 -3975 -29145 -51209 -47044
1110 -47044 -39348 -25823 -35751 -38133 -12722 -30566 29712 -18484 -17995 22848 47694 33793 16923
1097 16923 39968 9383 -33923 -30449 12633 6527 20627 29252 49691 -13392 -15310 -41193 4752
1084 4752 -26430 -113088 -88785 -61221 -28854 149 -50014 -34772 -2614 -84349 -42748 10114
1072 10114 7582 -24829 -27605 -42463 -23110 -32838 -81129 -17405 -3982 -40539 -20658 10749
1060 10749 20743 -460 24829 8562 -8260 -44457 41314 63602 35445 12498 -9276 -25122
1048 -25122 46804 15581 -6257 16858 7777 11291 -11650 -66 -43281 -58854 -53913 -22578
1036 -22578 -20158 -11188 -28965 -17542 9515 -42632 7778 82640 41729 755 30729 18754
1024 18754 -11632 13505 -62713 -34415 -6727 6752 -16304 6255 29441 3541 21771 50770
1012 50770 29715 25654 33511 68137 76842 74761 75433 12600 23428 19520 -22449 -17106 44267
999 44267 31837 -40185 -67414 -10476 37543 -10108 70333 24795 -10925 31425 24839 52632
987 52632 -736 36732 31138 -33239 -38456 -20061 -5838 35386 24844 -41821 -23813 -470
975 -470 -19515 -20005 169 51257 8927 3253 29665 29471 16436 611 14436 -17150 12877
962 12877 42841 7889 24184 3970 -20550 -46669 -5200 9686 -2918 -12222 9920 -3556
950 -3556 29543 -9795 8920 79693 -22352 2563 39111 16264 21394 -9326 14636 55210
938 55210 61110 40779 13572 49128 57449 15084 6160 65239 30493 42675 34446 -982 338
925 338 -64276 -45929 15996 18266 27856 44130 15810 13171 17596 -19840 53441 41153 4542
912 4542 16081 15429 4951 1577 39524 25702 31647 38360 59281 32297 30459 6012 5235 -19739
898 -19739 27610 49335 8013 -5149 8272 728 30260 34502 1044 58152 62946 45127 -2121
885 -2121 41439 10615 47957 46450 -12780 53182 57850 48119 39975 33964 60758 46188 -1568
872 -1568 -452 36229 41292 4831 8322 15661 17770 -9934 -46893 -50895 28786 30166 -14716 11776
858 11776 -39703 -35308 6615 607 24842 -24732 -38914 -10960 14781 20866 12943 18677 -18922
845 -18922 -14217 21520 26228 9438 13797 79 7303 36070 9852 9874 -11029 260 37628
832 37628 -15009 31596 1617 -9592 10163 35760 16387 12553 7779 -18231 -18182 -10807 -41903
819 -41903 -38744 -15044 32608 34401 22826 3520 9403 6073 53558 41258 29118 -12812 -30818
806 -30818 -29590 -24746 2878 -29092 -4886 -37409 -30781 -24988 -40415 -8834 20571 26491 -4769
793 -4769 11209 51651 30555 43235 -14863 -23277 -26509 -9296 12306 19954 31750 7459 11298
780 11298 21840 7883 -1778 1046 -41287 -8801 3781 -718 -6543 51671 18097 -3273 -10072
767 -10072 -36756 24126 10495 11234 15440 22262 -9959 21472 -5069 30492 19339 16231 12976
754 12976 -24761 -24152 24735 8638 22864 -38665 -42904 -5177 -28126 -70851 -11659 -13986 -15597
741 -15597 -20909 -32761 36576 23607 70010 108801 46995 -3965 26044 18828 -17891 -19961 48036
728 48036 54433 -20186 -8587 4536 -25832 -31954 -70155 -49586 63734 54785 18134 15118 -3121
715 -3121 62812 -15487 -18628 -64821 -20442 20364 41076 -8164 -2987 33880 27376 -25380 -85704
702 -85704 -37443 -43583 -79274 -41400 44299 22121 5131 -52835 -30013 -10935 -46995 -34838
690 -34838 54474 33473 -23584 -84178 -37339 -5003 2406 -22738 -9443 12254 -6269 -34365
678 -34365 -61329 -44805 -61853 -34559 37587 35870 -4587 -14820 3775 6421 13319 13955 -22874
665 -22874 11816 37870 28808 38124 43753 -31912 -10529 2833 18584 38311 -47467 -38285 -2385
652 -2385 2462 36793 280 -25155 7956 9073 18491 -12755 29461 8521 31484 48519 18138
639 18138 49940 -35642 -20984 19344 -4225 -20671 19713 5485 -21444 -31056 -28266 -16238
627 -16238 7057 -19267 38079 18734 -11433 739 -13074 8407 37078 -5420 23610 34780
615 34780 -9228 22124 1253 21689 5630 -52361 -33800 34805 3951 -22295 -20113 -9683
603 -9683 12153 10752 -43468 -28276 15228 15851 -31175 -22908 -17295 19508 33666 4895 22595
590 22595 -11635 -11323 44661 -2526 -22315 28890 -12477 41820 -5030 -31378 -35783 27667 48367
577 48367 26507 -6585 -7787 -29500 -63 5773 -43905 6119 -36063 -74997 -10586 8957
565 8957 11443 36832 23690 32896 22442 31292 -1211 -28471 -59853 16812 6103 -47113 -71007
552 -71007 -32903 -1670 2641 -29651 -79658 -48087 -20620 -9233 -24331 37362 13951 75319
540 75319 104934 22964 34218 22755 5325 -35083 -1100 11556 2681 -11540 -39803 -1070
528 -1070 -54 10194 14495 18030 -7015 -24821 -53959 5814 21030 16680 -6486 18091 25638
515 25638 49003 43584 -35358 11238 -19400 -19882 -25738 -20 48471 21158 28202 42892 9809
502 9809 38050 73306 22126 -7991 24376 -28401 -34169 8076 35715 8889 -8667 36750
490 36750 -2725 -23073 43924 -1352 -14148 41835 21920 -1148 16226 3597 10287 -30566
478 -30566 -23621 -19365 -65212 -64652 -41807 -35866 -4617 31340 -20067 -42232 16054 23286 38920
465 38920 -17030 -54777 -59642 -9364 25322 -25642 -83485 13614 1363 -3374 30190 43410
453 43410 13826 1123 36458 14229 2611 -14140 1276 -45456 0 -19281 12817 2390
441 2390 5801 -48965 -47552 -25445 17741 32108 31189 -9757 -59602 -23840 -17060 -36688 -75764
428 -75764 -4452 16339 22707 3551 -17881 -47068 -14131 29835 9138 26152 32229 6322
416 6322 -64217 2339 20459 778 -13115 -24644 40693 -1667 -15955 -34649 -45942 -9715
404 -9715 15309 2206 9884 -29840 16560 15010 -19895 -9733 38846 6991 -30995 -1643 -16739
391 -16739 18567 8850 14112 -26177 -35135 -103430 -47814 -22208 -23925 -19520 -48788 -51591 -49690
378 -49690 -94222 -75727 -61812 -58859 -49307 -10948 624 5678 -274 56473 93931 42745 -26928
365 -26928 -50127 -36771 19066 24737 -38279 -44125 -44774 -56732 722 27776 -25746 6185 -27528
352 -27528 -42632 13033 40948 2954 15727 4142 -2572 -56500 -50127 -45129 -46240 20401 32493
339 32493 -24037 -11244 12936 43678 27869 1 -8735 -25804 33750 -8905 -16092 380
327 380 10449 -11705 -7411 -6651 -43090 5324 2165 -60576 -57790 -33547 35606 -478 -51265
314 -51265 -34121 -44307 -5310 11650 32041 -9473 -70390 -71175 -21146 -16367 6117 8271 -91
301 -91 -34896 -29467 18344 -4656 -24783 -33261 -37537 -25678 -35308 -20187 -4752 -18749 -71593
288 -71593 -34163 -51779 -8458 -13503 -25307 3618 -7 -4174 21934 6683 -6270 -4099 7929
275 7929 -24966 -51290 -35033 28903 -25747 -23836 22259 -2999 6242 6698 14955 -45716 -24987
262 -24987 -22229 -11355 -35833 -20807 -37226 -14156 6474 -19902 -40592 -27479 -29457 -3171
250 -3171 7060 -14336 -18305 -38935 -52242 -33230 41565 34012 22992 23325 -16443 -24338 -57668
237 -57668 -25370 -220 -21970 -60298 -54332 -47322 -14772 -27624 -6647 -16988 12375 31864
225 31864 -10174 -73889 -45026 -22506 -25954 15523 26009 7560 27844 17831 10719 43903
213 43903 35279 47421 23894 -22517 13837 -7320 -36718 -56867 -23195 -19140 -21729 -68095 -64089
200 -64089 -15680 -15342 -9539 -11597 -23444 -18004 -13917 1330 21909 7513 39529 -13239 -12471 -8170
186 -8170 -33168 1935 -24938 -47870 14022 -44720 -74229 -86594 6107 -518 -54239 -12844
174 -12844 -49173 -69885 -23010 -10626 -32099 -4260 23843 13969 34797 -38292 -55726 9356
162 9356 -9642 -70265 -45913 -52383 -37702 -3409 42503 10470 -45023 -32360 -20572 -18612 -33196
149 -33196 -51360 -22225 -23966 8211 -49965 -25909 4799 5742 27018 -37052 -33628 -49860 -26904
136 -26904 -31353 -48844 -35821 -27086 12765 15806 -7133 19556 170 -27493 -28587 -1572 39014
123 39014 69450 20493 -4956 -19635 -9890 3156 -1499 -3390 -17912 19761 20517 -8880 -6788
110 -6788 8455 24303 2875 -3635 -8509 -27611 -17326 27899 774 -15394 -48423 -52648 -33416
97 -33416 -20550 11006 -7198 5072 -4769 -30441 -31621 -24350 -54523 -45318 -46136 -14189 -1479
84 -1479 -40962 -33860 -17553 -6024 -31880 -31996 -13265 -32619 16647 44240 11366 6206 -11309
71 -11309 -10916 -16991 -34186 -24594 -23380 -37830 -35999 -26561 -20813 4254 -15527 -39950 -13735 6360
57 6360 -15335 -34214 -21298 -7863 17224 -15586 -83765 -69011 -30151 -26594 -10375 -3550 15250
44 15250 -2387 -15185 22800 -9076 -25299 -19301 -44226 -20656 -12940 -13917 24563 38969 14973
31 14973 -24233 -39856 -13552 -2431 -20435 -40235 3662 -23790 -2299 -21874 -5086 3324
19 3324 896 6854 -30670 -24504 -52940 -43420 -35319 1 7810 -17837 -19099 9031 18025 -48601
5 -48601 -30863 -38909 347 966 -15216
0 -15216
$$ Imaginary data points
##PAGE= N=2
##DATA TABLE= (X++(I..I)), XYDATA
16383 -1092070 -1086827 -1079924 -1080620 -1048155 -1019571 -981953 -971364 -1031087 -982248 -950855 -934283 -939580
16371 -939580 -946899 -901764 -873956 -872231 -851010 -820970 -815004 -822822 -827043 -825051 -751340 -731220 -700607
16358 -700607 -727334 -682354 -653235 -691102 -660042 -617097 -591912 -608153 -579397 -533160 -534549 -535901
16346 -535901 -555118 -508094 -448361 -435194 -453976 -458068 -413721 -388651 -390506 -356749 -350712 -368490
16334 -368490 -342280 -354978 -315095 -305000 -280894 -265232 -301154 -237475 -191879 -189099 -216744 -220274
16322 -220274 -168279 -159065 -146508 -96963 -93107 -90441 -104199 -69774 -25878 -10137 9160 -29176
16310 -29176 -33205 7475 41493 19070 23418 18040 67757 84545 106845 116674 157921 164510 183447
16297 183447 133945 128436 134844 192306 248314 243874 258862 238539 323236 306613 338909 312484
16285 312484 320034 332016 338783 393119 395868 390082 389906 390589 403139 446510 439838 455410 431023
16272 431023 442953 469437 476275 504696 507564 517428 494548 526254 555307 562385 545143 577738
16260 577738 605722 612222 639334 621611 621981 638816 660508 647163 671493 723953 712874 710442
16248 710442 709170 750087 779799 752354 708418 730285 765162 766124 779767 797569 808716 813214
16236 813214 822838 815577 844524 829465 866678 859544 828152 884323 901190 888324 904821 917680
16224 917680 884349 936559 907900 904885 912764 955415 951775 949738 999017 1033702 991623 955869
16212 955869 958950 981336 971338 981369 1014825 997955 1005152 1018094 1024292 1063227 1077680 1072615
16200 1072615 1109006 1117056 1078534 1091110 1146522 1068872 1079437 1051836 1097224 1133669 1134913 1149338
16188 1149338 1166780 1168831 1205849 1136850 1114426 1171681 1151343 1130295 1189932 1216138 1201670
16177 1201670 1225550 1245414 1216253 1234150 1242922 1201434 1180681 1243898 1229851 1197980 1261362
16166 1261362 1306225 1238571 1250434 1227733 1291451 1320898 1251919 1253674 1261991 1252027 1247694 1298984
16154 1298984 1304652 1308953 1287785 1338112 1329549 1326139 1346193 1305397 1356268 1317163 1300740 1315199
16142 1315199 1341650 1331986 1352837 1396843 1371062 1416489 1356367 1316175 1318298 1330952 1366438 1397285
16130 1397285 1412556 1395061 1397632 1397839 1407723 1401946 1401212 1411028 1442608 1408961 1384551 1452284 1445476
16117 1445476 1442965 1425523 1397374 1405408 1410062 1384921 1387249 1429442 1422993 1380401 1386602 1364125
16105 1364125 1397725 1434954 1434669 1411612 1409899 1414308 1468415 1445510 1466616 1422799 1454751 1461024
16093 1461024 1462793 1404665 1454818 1439855 1409827 1421020 1417071 1437438 1449564 1438497 1372627 1437462
16081 1437462 1478617 1474216 1464353 1508951 1510450 1530969 1495366 1502055 1463324 1453726 1458878 1462063 1466773
16068 1466773 1458337 1480035 1445280 1419475 1451605 1479773 1446617 1483463 1464454 1457555 1504548 1565218
16056 1565218 1543733 1485379 1523126 1511997 1503691 1511303 1500446 1555881 1472434 1493355 1516126 1503897
16044 1503897 1499534 1529257 1511499 1478698 1524450 1503981 1461782 1465068 1468445 1486317 1477641 1454314
16032 1454314 1471404 1485462 1491215 1459105 1469031 1493505 1492505 1520392 1535239 1482688 1479421 1488825
16020 1488825 1489836 1522230 1504615 1488897 1539487 1487838 1493005 1508661 1478074 1448899 1496555 1490616
16008 1490616 1456694 1475573 1519158 1516735 1489482 1487460 1534991 1489900 1522519 1495030 1475086 1520178
15996 1520178 1544980 1530909 1503831 1504848 1480873 1543413 1529196 1505689 1498410 1559237 1524142 1486521
15984 1486521 1470294 1491143 1486537 1474568 1496384 1481036 1516418 1474399 1489801 1535297 1524197
15973 1524197 1506671 1544208 1559262 1622750 1601890 1509865 1447590 1475661 1548528 1536762 1529921
15962 1529921 1530977 1496714 1535633 1551343 1500624 1446873 1474863 1540044 1546945 1494660 1493200 1483209
15950 1483209 1458513 1470064 1521706 1524419 1516724 1548248 1551423 1532056 1477386 1491980 1549271 1488127
15938 1488127 1516448 1521675 1558073 1505122 1466650 1453795 1501290 1486697 1476753 1481875 1489272 1518785
15926 1518785 1519978 1517609 1528113 1528137 1518418 1517220 1470941 1502017 1514793 1594570 1550696 1527132 1504642
15913 1504642 1545584 1523643 1518673 1496412 1481310 1499989 1514944 1491053 1477768 1446461 1480439
15902 1480439 1489194 1500362 1495386 1491200 1512891 1490840 1484711 1513156 1539624 1511489 1497101 1512421
15890 1512421 1529883 1553510 1544278 1551977 1585947 1552246 1506338 1508753 1496538 1491637 1513776 1492902
15878 1492902 1509858 1468082 1478270 1493011 1482030 1543061 1547265 1508447 1520282 1509340 1577350
15867 1577350 1524248 1541649 1554949 1527539 1521334 1489973 1492488 1471290 1532660 1589152 1559790 1508572
15855 1508572 1518241 1528584 1532798 1516248 1479626 1516334 1559872 1499794 1548432 1521458 1536015 1518385
15843 1518385 1513104 1530537 1560905 1573159 1522638 1543945 1537991 1525116 1527014 1483174 1511805 1503640
15831 1503640 1543809 1573088 1592613 1557273 1538436 1498889 1480129 1491107 1559894 1589302 1526980
15820 1526980 1534869 1557425 1528602 1473666 1516710 1535122 1530347 1482897 1478898 1518916 1538893 1530055
15808 1530055 1516808 1509073 1483208 1549971 1550911 1520459 1508436 1506208 1549632 1541068 1553608 1571593
15796 1571593 1575651 1528002 1535865 1512945 1525609 1519098 1531976 1510885 1491519 1509456 1509608 1495691
15784 1495691 1504857 1548198 1542314 1558316 1508958 1516196 1552204 1551748 1517735 1486822 1530388 1556652
15772 1556652 1585134 1527394 1519851 1512755 1558353 1581645 1533379 1511951 1506673 1537592 1513561 1543829
15760 1543829 1513675 1512212 1545815 1545844 1525411 1551571 1583210 1538510 1546079 1556198 1557424 1584432
15748 1584432 1570180 1624875 1605079 1529104 1608237 1580715 1575369 1527777 1505578 1553503 1519665
15737 1519665 1492673 1535855 1568551 1520964 1527576 1557448 1524299 1559134 1512944 1529662 1608763
15726 1608763 1575493 1549827 1540120 1543553 1547277 1562967 1596634 1584079 1561545 1556172 1577320 1549855
15714 1549855 1538083 1518654 1503983 1526847 1513561 1543644 1517682 1514804 1522661 1548177 1543104 1526971
15702 1526971 1559141 1601223 1574852 1542244 1552348 1528205 1474133 1537749 1585719 1542588 1531685
15691 1531685 1519575 1575632 1590667 1606455 1553398 1510719 1520604 1547748 1538979 1542597 1546733 1548104
15679 1548104 1527199 1510310 1563172 1594577 1570777 1518119 1509275 1529323 1535592 1499397 1540574 1575959
15667 1575959 1551967 1576191 1555873 1583198 1558534 1550847 1513570 1538311 1507698 1514309 1587321 1575976
15655 1575976 1573029 1538165 1550333 1549154 1560438 1556675 1554557 1579825 1572114 1546302 1537897 1555571
15643 1555571 1548459 1542949 1577355 1545265 1520571 1538909 1544154 1566851 1578817 1570909 1577655 1622007
15631 1622007 1592716 1540290 1575787 1582130 1581186 1554793 1535503 1549617 1573880 1568688 1596926 1579624
15619 1579624 1601079 1576423 1625869 1621537 1563110 1508336 1542835 1566350 1558028 1491682 1490132 1582950
15607 1582950 1599616 1553854 1563741 1603198 1559874 1527148 1570259 1554600 1577469 1597047 1570223
15596 1570223 1589090 1558721 1558623 1567071 1559175 1554898 1604445 1592200 1559539 1575785 1608665 1531860
15584 1531860 1603754 1597486 1548574 1559520 1558348 1604582 1599781 1625817 1573175 1555088 1557203 1596110
15572 1596110 1549524 1544894 1566265 1542549 1573926 1575001 1607415 1623696 1583188 1565985 1580914 1602897
15560 1602897 1587294 1596768 1606921 1588365 1575282 1542234 1590509 1570217 1575059 1540820 1556773 1608127
15548 1608127 1596494 1586387 1578777 1567034 1579461 1612579 1585784 1544549 1570142 1563297 1611652 1610359
15536 1610359 1619038 1633674 1574627 1604924 1562251 1551486 1574106 1551895 1542174 1583548 1566229 1574789
15524 1574789 1582277 1568935 1533875 1553679 1612119 1575863 1494737 1538519 1538618 1502539 1533919 1608224
15512 1608224 1581675 1582711 1590520 1608625 1568163 1535905 1560904 1613149 1618120 1591617 1565206 1539937
15500 1539937 1559364 1603321 1645173 1615185 1595447 1562132 1600596 1567782 1587224 1570831 1552425
15489 1552425 1559650 1573083 1554332 1551092 1542348 1521482 1572519 1536558 1552344 1569644 1559758 1564908
15477 1564908 1541311 1607034 1599051 1571813 1580158 1566710 1577790 1596487 1565335 1546397 1584541 1583042
15465 1583042 1577951 1576329 1548784 1547473 1583313 1600435 1576872 1595264 1576879 1580853 1574640 1596237
15453 1596237 1601566 1617059 1620614 1630690 1603085 1598818 1555357 1537595 1601507 1633236 1593858 1602706
15441 1602706 1626007 1582280 1549727 1618869 1601364 1621063 1629075 1616951 1588072 1598834 1645465
15430 1645465 1567749 1582159 1605808 1631532 1578977 1602068 1644595 1640014 1607518 1588191 1593361 1596600
15418 1596600 1582067 1598492 1611078 1617621 1612412 1621126 1632892 1590437 1568386 1557826 1566216 1581564
15406 1581564 1547119 1575120 1563930 1571581 1587585 1580926 1598954 1565975 1574651 1619831 1613308 1566484
15394 1566484 1570033 1576275 1556139 1560831 1606640 1565509 1564530 1559428 1555439 1519247 1556674 1584614 1588363
15381 1588363 1579073 1604371 1597826 1576995 1593371 1576322 1613105 1608927 1629128 1625885 1629001 1601955
15369 1601955 1563007 1585957 1591279 1558829 1584181 1560165 1583840 1581790 1589986 1586168 1597322 1586347
15357 1586347 1599483 1604184 1654846 1657274 1583528 1586226 1592916 1647093 1615522 1592275 1559479 1573147
15345 1573147 1604026 1613315 1580069 1559985 1593255 1659140 1677245 1607617 1555418 1570441 1597582
15334 1597582 1604090 1600823 1559428 1580014 1555047 1585384 1579656 1610636 1595552 1609905 1605253 1601395
15322 1601395 1576763 1574026 1624263 1621607 1618768 1583072 1633940 1574562 1619623 1651254 1633120 1600856
15310 1600856 1626100 1602784 1555330 1606246 1553211 1578294 1585760 1566616 1578460 1584801 1618962 1627877
15298 1627877 1629870 1614866 1549854 1605843 1652076 1656597 1630205 1621162 1640555 1632820 1569926 1633907
15286 1633907 1643935 1649639 1623594 1594043 1588452 1641557 1662552 1655069 1601174 1595798 1624208 1616726
15274 1616726 1583776 1641357 1652754 1592314 1615954 1585695 1615506 1649432 1615641 1601903 1614387
15263 1614387 1610066 1635250 1584743 1575851 1579263 1602626 1601713 1593011 1613027 1593845 1570346 1607779
15251 1607779 1626166 1600958 1574591 1607823 1610944 1608651 1642109 1610226 1602073 1592295 1574393 1645297
15239 1645297 1618709 1644145 1623454 1665069 1621140 1610473 1589660 1601608 1652973 1636913 1593839
15228 1593839 1602692 1607309 1609026 1657490 1615814 1619558 1644205 1594123 1573461 1587124 1603818 1591652
15216 1591652 1578233 1620710 1616546 1648142 1615424 1577909 1620296 1649829 1668158 1645498 1635601 1613489
15204 1613489 1661250 1666996 1622150 1620963 1604340 1614914 1630961 1622068 1597552 1635660 1614614 1587176
15192 1587176 1600162 1629253 1673504 1665133 1653688 1649105 1633492 1619205 1570904 1601742 1637972 1629075
15180 1629075 1618510 1618493 1614982 1609307 1611716 1601006 1602787 1579871 1588568 1603650 1616243 1618953 1629802
15167 1629802 1625669 1586191 1584998 1636656 1672211 1634624 1661178 1666952 1592704 1618621 1632286 1632644
15155 1632644 1609101 1615467 1611614 1663976 1594646 1613191 1644604 1607627 1602166 1586109 1576409 1624343
15143 1624343 1643072 1617174 1611695 1634161 1655003 1611164 1633850 1612675 1593506 1559117 1599954
15132 1599954 1612849 1642761 1673957 1664160 1665908 1623358 1612722 1662619 1637675 1639571 1676043 1649904
15120 1649904 1644541 1673949 1652368 1603974 1655144 1656566 1649019 1640644 1656959 1681384 1649514 1594991
15108 1594991 1607700 1627703 1687657 1694264 1642954 1646313 1650194 1654915 1631751 1648811 1658603 1655622
15096 1655622 1617410 1636296 1641604 1651908 1610766 1587492 1561042 1633852 1644087 1626440 1641385
15085 1641385 1652568 1706990 1701440 1714944 1704759 1657639 1694021 1666724 1661545 1632134 1610885 1616115
15073 1616115 1638464 1654620 1612159 1624353 1639470 1586266 1576971 1662078 1670638 1604332 1637828 1608718
15061 1608718 1649326 1633398 1603810 1581559 1602450 1630169 1616648 1653499 1696923 1655314 1633264
15050 1633264 1621986 1662807 1653243 1648290 1632791 1630042 1621771 1578047 1616477 1679998 1657838 1627491
15038 1627491 1690455 1653480 1616558 1648747 1643493 1676395 1678793 1589124 1605854 1667918 1636767 1652572
15026 1652572 1648715 1620108 1621970 1603542 1651351 1620523 1610530 1670402 1660389 1684635 1647660 1579519
15014 1579519 1683058 1675931 1626652 1601012 1624891 1605078 1631976 1650080 1689161 1663859 1653486
15003 1653486 1630661 1619814 1619330 1621893 1618884 1643734 1668903 1698722 1675070 1664025 1609257 1659910
14991 1659910 1660123 1660126 1664361 1700319 1714166 1692774 1626356 1616362 1662635 1651824 1666023 1697841 1690524
14978 1690524 1653163 1648519 1702229 1658569 1628596 1677053 1712402 1691629 1641484 1639292 1690751 1665103
14966 1665103 1652148 1636160 1590727 1615066 1624701 1650126 1667214 1668523 1603994 1664951 1689255 1686821
14954 1686821 1628982 1639097 1680709 1688455 1652424 1686002 1682333 1643536 1647729 1666127 1638807 1651680
14942 1651680 1660134 1657817 1622209 1618525 1630898 1670839 1633212 1581190 1631486 1623673 1613874 1663044
14930 1663044 1675586 1666786 1706858 1673182 1696764 1706757 1698197 1660782 1700978 1690577 1699662 1711123
14918 1711123 1664540 1638106 1653526 1653389 1656219 1658919 1658146 1713303 1687936 1720063 1730305 1703084
14906 1703084 1664896 1690515 1649692 1624370 1609312 1582496 1687119 1693558 1670142 1659941 1706269
14895 1706269 1714356 1704097 1707707 1666974 1702306 1695220 1648723 1631489 1634342 1656312 1602922 1676091
14883 1676091 1697185 1677780 1686684 1655091 1649618 1654030 1667090 1650834 1702239 1709858 1676804 1666506
14871 1666506 1677354 1654898 1644418 1598307 1633177 1644697 1646303 1670940 1709309 1683595 1723815
14860 1723815 1690833 1689571 1675010 1698845 1738653 1723370 1732089 1675292 1671514 1703838 1666566 1661414
14848 1661414 1679969 1704416 1733675 1680288 1717776 1710272 1720529 1687697 1673796 1639791 1674302
14837 1674302 1703883 1670665 1693652 1720736 1625747 1617187 1648890 1687162 1693585 1679247 1688010 1686669
14825 1686669 1661394 1650564 1700485 1675224 1662508 1718053 1686793 1675722 1672769 1657252 1675645
14814 1675645 1707010 1666847 1639083 1660094 1641683 1693814 1680990 1730015 1662826 1676312 1711233
14803 1711233 1696471 1713674 1722130 1672298 1711568 1699610 1704144 1706738 1701231 1697660 1726135 1720628
14791 1720628 1707448 1692859 1650664 1672374 1691937 1682370 1653817 1638335 1672577 1690105 1648252
14780 1648252 1689379 1686916 1672333 1700749 1724626 1717281 1721429 1693528 1725190 1729263 1675371 1698985
14768 1698985 1707229 1698809 1723612 1721016 1687923 1685157 1732626 1689674 1711750 1723670 1696712 1701667
14756 1701667 1693372 1687500 1715676 1713325 1709751 1708685 1718232 1754282 1715699 1652544 1683821 1718982
14744 1718982 1717891 1722227 1724867 1651419 1644730 1676369 1680363 1702391 1734215 1690007 1645520 1695565
14732 1695565 1726477 1687701 1671277 1682872 1736265 1728035 1691732 1690731 1690846 1694514 1708740 1703385
14720 1703385 1712053 1742450 1698648 1651723 1714115 1670141 1669229 1707404 1696211 1736395 1802853 1740360
14708 1740360 1696916 1683313 1699503 1705413 1698722 1718471 1734796 1708067 1681167 1762310 1759330 1707631
14696 1707631 1714318 1667412 1643173 1675855 1662111 1705592 1653068 1650333 1634239 1685932 1734786 1708592
14684 1708592 1737688 1742994 1689685 1692154 1724931 1731826 1691527 1730388 1700814 1734645 1764187 1756116
14672 1756116 1733204 1790807 1764308 1739651 1738779 1715988 1703141 1672643 1715139 1717318 1699855 1706933
14660 1706933 1694480 1693928 1699228 1741011 1726915 1706175 1705154 1690166 1671807 1645280 1722992 1738591
14648 1738591 1703225 1688006 1680764 1644221 1696328 1725470 1698507 1697401 1715580 1663674 1653418 1614909
14636 1614909 1644765 1685222 1684653 1720483 1754143 1755328 1745913 1758485 1735071 1693850 1723480 1704523
14624 1704523 1665001 1690723 1697536 1703450 1724238 1700226 1683362 1707449 1740486 1719469 1720666 1713413
14612 1713413 1720689 1702703 1695284 1740471 1706388 1651358 1694361 1737967 1693638 1639331 1658966 1726055
14600 1726055 1740014 1717594 1715639 1734243 1738404 1720049 1684899 1705185 1703048 1719501 1717911 1665405
14588 1665405 1688674 1706530 1685365 1701927 1736236 1702686 1679169 1696818 1691419 1711319 1694439
$$ [...]
##END NTUPLES=NMR SPECTRUM
##END=
