##TITLE=1H_EC-3336(3)X2
 CDCl3
 8 sc, 
 25.11.2024
##JCAMPDX= 6.0         $$ Bruker NMR JCAMP-DX V2.0
##DATA TYPE= NMR SPECTRUM
##DATA CLASS= NTUPLES
##ORIGIN= UXNMR, Bruker Analytische Messtechnik GmbH
##OWNER= root
$$ XWIN-NMR		Version 3.5
$$ Mon Nov 25 14:30:31 2024 Russian Standard Time (UT+4h)  she@DPX200
##.OBSERVE FREQUENCY= 200.1315
##.OBSERVE NUCLEUS= ^1H
##.ACQUISITION MODE= SIMULTANEOUS
##.ACQUISITION SCHEME= undefined
##.AVERAGES= 8
##.DIGITISER RES= 18
##SPECTROMETER/DATA SYSTEM= spect
##.PULSE SEQUENCE= zg30
##.SOLVENT NAME= CDCl3
##.SHIFT REFERENCE= (INTERNAL, CDCl3, 0, 19.515)
##AUDIT TRAIL= $$ (NUMBER, WHEN, WHO, WHERE, WHAT)
$$ ##TITLE= Audit trail, XWIN-NMR		Version 3.5
$$ ##JCAMPDX= 5.01
$$ ##ORIGIN= Bruker BioSpin GmbH
$$ ##OWNER= she
$$ F:/spectra/data/she/nmr/H-F/1/pdata/1/auditp.txt
$$ ##AUDIT TRAIL=  $$ (NUMBER, WHEN, WHO, WHERE, WHAT)
(   1,<2024-11-25 14:28:54.40 +0400>,<she>,<DPX200>,
      <created by zg, POWCHK disabled, PULCHK disabled
       configuration hash MD5:
       00 E9 B6 7A A2 85 ED C7 34 08 36 98 17 FE 4E 26
       data hash MD5: 16K
       BF E8 23 03 9E C5 B7 BA F0 A0 90 AF 11 BD AC A8>)
(   2,<2024-11-25 14:28:57.53 +0400>,<she>,<DPX200>,
      <Start of raw data processing
       efp BC_mod = 2 LB = 0.24 FT_mod = 6 PKNL = 1 PHC0 = -26708.16 PHC1 = 16.38744 SI = 16K 
       data hash MD5: 16K
       3C 2B 75 1D DC 62 89 16 75 B7 4E BD 71 CB 86 52>)
(   3,<2024-11-25 14:29:18.39 +0400>,<she>,<DPX200>,
      <pk PHC0 = -0.8439866 PHC1 = 1.2 
       data hash MD5: 16K
       33 C2 1F 10 8B BB CF 59 9A 3D D4 82 4D 78 8D AD>)
(   4,<2024-11-25 14:29:22.46 +0400>,<she>,<DPX200>,
      <abs ABSG = 5 
       data hash MD5: 16K
       9B 8A AA 9D 1E F7 0A B4 85 3B 69 0E AE 11 B9 62>)
$$ ##END=
$$ 
$$ hash MD5
$$ 5D 84 BA B7 25 B4 0B 28 25 F6 89 6F 26 B8 36 8B
##$RELAX= 
##$RELAX= 
##$RELAX= 
##$RELAX= 
##$RELAX= 
##$RELAX= 
$$ Bruker specific parameters
$$ --------------------------
##$DU= <F:/spectra>
##$EXPNO= 1
##$NAME= <H-F>
##$PROCNO= 1
##$TYPE= <nmr>
##$USER= <she>
##$AMP= (0..31)
100 100 100 100 100 100 100 100 100 100 100 100 100 100 100 100 100 100 
100 100 100 100 100 100 100 100 100 100 100 100 100 100 
##$AQSEQ= 0
##$AQ_mod= 1
##$AUNM= <au_zg>
##$AUTOPOS= <>
##$BF1= 200.13
##$BF2= 200.13
##$BF3= 200.13
##$BF4= 200.13
##$BF5= 200.13
##$BF6= 200.13
##$BF7= 200.13
##$BF8= 200.13
##$BYTORDA= 1
##$CFDGTYP= 0
##$CFRGTYP= 5
##$CHEMSTR= <none>
##$CNST= (0..31)
1 1 145 1 1 1 1 1 1 1 1 1 1 1 1 1 1 1 1 1 1 1 1 1 1 1 1 1 1 1 1 1 
##$CPDPRG= <>
##$CPDPRG1= <>
##$CPDPRG2= <>
##$CPDPRG3= <>
##$CPDPRG4= <mlev>
##$CPDPRG5= <mlev>
##$CPDPRG6= <mlev>
##$CPDPRG7= <mlev>
##$CPDPRG8= <mlev>
##$CPDPRGB= <>
##$CPDPRGT= <>
##$D= (0..31)
0 1.2 0 0 0 0 0 0 0 0.06 0 0.03 0 0 0 0 0.0002 0 0 0 0 0 0 0 0 0 0 0 0 
0 0 0 
##$DATE= 1732530533
##$DBL= (0..7)
120 120 120 120 120 120 120 120 
##$DBP= (0..7)
150 150 150 150 150 150 150 150 
##$DBP07= 0
##$DBPNAM0= <>
##$DBPNAM1= <>
##$DBPNAM2= <>
##$DBPNAM3= <>
##$DBPNAM4= <>
$$ [...]
##$SUBNAM3= <"">
##$SUBNAM4= <"">
##$SUBNAM5= <"">
##$SUBNAM6= <"">
##$SUBNAM7= <"">
##$SUBNAM8= <"">
##$SUBNAM9= <"">
##$SW= 24.0689530833862
##$SWIBOX= (0..15)
0 0 2 0 0 0 0 0 0 0 0 0 0 0 0 0 
##$SW_h= 4816.95568400771
##$TD= 16384
##$TD0= 1
##$TE= 0
##$TE2= 300
##$TE3= 300
##$TEG= 300
##$TL= (0..7)
0 120 120 120 120 120 120 120 
##$TP= (0..7)
150 150 150 150 150 150 150 150 
##$TP07= 0
##$TPNAME0= <>
##$TPNAME1= <>
##$TPNAME2= <>
##$TPNAME3= <>
##$TPNAME4= <>
##$TPNAME5= <>
##$TPNAME6= <>
##$TPNAME7= <>
##$TPOAL= (0..7)
0.5 0.5 0.5 0.5 0.5 0.5 0.5 0.5 
##$TPOFFS= (0..7)
0 0 0 0 0 0 0 0 
##$TUNHIN= 0
##$TUNHOUT= 0
##$TUNXOUT= 0
##$USERA1= <user>
##$USERA2= <user>
##$USERA3= <user>
##$USERA4= <user>
##$USERA5= <user>
##$V9= 5
##$VALIST= <valist>
##$VCLIST= <CCCCCCCCCCCCCCC>
##$VD= 0
##$VDLIST= <DDDDDDDDDDDDDDD>
##$VPLIST= <PPPPPPPPPPPPPPP>
##$VTLIST= <TTTTTTTTTTTTTTT>
##$WBST= 1024
##$WBSW= 4
##$XGAIN= (0..3)
0 0 0 0 
##$XL= 0
##$YL= 0
##$YMAX_a= 608886
##$YMIN_a= -307699
##$ZGOPTNS= <>
##$ZL1= 120
##$ZL2= 120
##$ZL3= 120
##$ZL4= 120
##$ABSF1= 19.51357
##$ABSF2= -4.555563
##$ABSG= 5
##$ABSL= 3
##$ALPHA= 0
##$AQORDER= 0
##$ASSFAC= 0
##$ASSFACI= 0
##$ASSFACX= 0
##$ASSWID= 0
##$AUNMP= <proc_1d>
##$AZFE= 0.1
##$AZFW= 0.1
##$BCFW= 0
##$BC_mod= 2
##$BYTORDP= 0
##$COROFFS= 0
##$CY= -3
##$DATMOD= 1
##$DC= 0
##$DFILT= <>
##$DTYPP= 0
##$F1P= 0
##$F2P= 0
##$FCOR= 1
##$FTSIZE= 16384
##$FT_mod= 6
##$GAMMA= 0
##$GB= 0
##$INTBC= 1
##$INTSCL= 2.524811e-10
##$ISEN= 128
##$LB= 0.24
##$LEV0= 0
##$LPBIN= 0
##$MAXI= 10000
##$MC2= 0
##$MEAN= 0
##$ME_mod= 0
##$MI= 1.114404
##$NCOEF= 0
##$NC_proc= -7
##$NLEV= 6
##$NOISF1= 3.799351
##$NOISF2= 2.8
##$NSP= 0
##$NTH_PI= 0
##$NZP= 0
##$OFFSET= 19.51504
##$PC= 1
##$PHC0= -26709
##$PHC1= 17.58744
##$PH_mod= 1
##$PKNL= yes
##$PPARMOD= 0
##$PSCAL= 0
##$PSIGN= 0
##$REVERSE= no
##$SF= 200.130002933941
##$SI= 16384
##$SIGF1= 3
##$SIGF2= 2
##$SINO= 5.538805
##$SIOLD= 16384
##$SREGLST= <1H.CDCl3>
##$SSB= 0
##$STSI= 16384
##$STSR= 0
##$SW_p= 4816.95568400771
##$SYMM= 0
##$S_DEV= 0
##$TDeff= 16384
##$TDoff= 0
##$TI= <>
##$TILT= no
##$TM1= 0
##$TM2= 0
##$TOPLEV= 0
##$USERP1= <user>
##$USERP2= <user>
##$USERP3= <user>
##$USERP4= <user>
##$USERP5= <user>
##$WDW= 1
##$XDIM= 16384
##$YMAX_p= 289847702
##$YMIN_p= -1148509
$$ End of Bruker specific parameters
$$ ---------------------------------
##NTUPLES= NMR SPECTRUM
##VAR_NAME=  FREQUENCY,     SPECTRUM/REAL,   SPECTRUM/IMAG
##SYMBOL=    X,             R,               I
##VAR_TYPE=  INDEPENDENT,   DEPENDENT,       DEPENDENT
##VAR_FORM=  AFFN,          ASDF,            ASDF
##VAR_DIM=   16384,         16384,           16384
##UNITS=     HZ,            ARBITRARY UNITS, ARBITRARY UNITS
##FACTOR=    0.29402158847633, 1,            1
##FIRST=     3905.54490117764, 0,            0
##LAST=      -911.410782830074, 0,           0
##MIN=       -911.410782830074, -1148509,    0
##MAX=       3905.54490117764, 289847702,    0
$$ Real data points
##PAGE= N=1
##DATA TABLE= (X++(R..R)), XYDATA
$$ [...]
10628 -293043 -358772 -347390 -245227 -363330 -244296 -598089 -274346 -214134 -254966 -51919
10618 -51919 -261617 -344068 -269913 -95897 -81690 -145103 -151704 68179 -137982 -118812 -98741
10607 -98741 -19873 -77729 -92710 -270786 -101991 147952 -170915 -321670 14770 -30166
10597 -30166 -237548 -34333 -286263 -306759 -125581 -107556 -113791 70920 38097 160346 92282
10586 92282 -217769 -88353 -18588 225559 -58901 -317350 -189139 -131237 -82999 -6417
10576 -6417 6403 190125 -64532 -152296 -130382 3498 78972 -75218 165665 61336 -133899
10565 -133899 -124522 -215672 -55454 -337703 -305220 -42572 -277254 -345753 -106036 -432453
10555 -432453 -264781 -191868 -139307 -150449 -170917 59581 150129 -95108 39436 173815
10545 173815 47569 46603 -20863 -146252 -244002 -284516 -75803 -219048 41368 -107619 5175
10534 5175 21119 25837 -107122 -216665 -78151 -240632 47898 -100842 22326 249019
10524 249019 252698 -124015 -242570 17510 -152913 -170961 174032 250531 -43451 -191353
10514 -191353 -84314 -315795 -234534 -225544 436107 67054 -64010 -348433 -126158 -44280
10504 -44280 154816 119488 189942 48298 181257 51717 118909 -6368 -205858 -307868
10494 -307868 -257718 195477 -57930 -148652 -65307 373673 175481 182068 106177 29659 214896
10483 214896 63753 -68920 -229997 -210013 -96657 161047 -41023 54962 277119 213356
10473 213356 163984 74877 -268154 -256337 137945 166935 321914 269494 334469 -99376 206648
10462 206648 49394 61778 366962 206361 176929 245758 268171 263303 140347 323634 289139
10451 289139 266618 349806 67051 15051 -40341 45285 225644 271104 389607 246200 234004
10440 234004 361920 419836 455687 382569 628279 454365 209633 420533 497790 575395
10430 575395 501365 575586 532654 643002 657586 477841 518019 500192 685488 353889 425899
10419 425899 198281 179530 205524 323847 268758 266120 358215 60782 161962 376606 329028
10408 329028 419923 470237 177132 336896 380281 163511 341476 394405 284358 157761
10398 157761 261720 171790 14910 225212 36810 -26484 206132 550651 402751 171911
10388 171911 131354 94957 7532 147091 276756 141174 83153 -25838 -103599 140201
10378 140201 -19364 185480 -32208 -28960 -64823 -100041 145401 407055 109711 -139099
10368 -139099 14302 -218500 111427 128843 -99112 -97593 -98225 -99096 -33261 -245367 51476
10357 51476 273652 138012 235226 102759 -4806 -266054 -243927 -256388 -311749 -413422
10347 -413422 -159853 141550 74562 92789 278963 439154 204838 320620 328639 358569
10337 358569 -37266 -244074 -365642 -496516 -67475 44473 27206 -134937 -172671 -286553
10327 -286553 -173891 -213197 -264447 -327724 -174123 172225 194814 244886 -146767 -166332 -134555
10316 -134555 -153214 -44721 -11776 57836 -261184 -213947 -190006 -436374 -504407 -123223 198340
10305 198340 -51748 30231 -140118 17734 195969 57126 -333238 -367746 -150732 -351370
10295 -351370 -103472 -222331 -146017 -286763 -220641 -227203 -75129 -528243 -731745 -246857
10285 -246857 -33989 -101843 -170898 -255955 -51528 -373414 -464325 -137035 -412495 -661023
10275 -661023 -386523 40133 106068 175061 20525 96842 -39278 -243858 11800 -135373
10265 -135373 -327649 -47061 -167191 -146555 -31009 81090 36720 -61493 -167432 -95731
10255 -95731 -412810 -322781 -87776 -46271 -294752 -24202 89294 -146405 -133088 -22686
10245 -22686 -89204 -142439 -225342 -167896 -242336 -120551 56448 -68227 -111786 21837 -186232
10234 -186232 -343126 -241862 -29521 -213907 -76902 161845 151181 149546 13807 -89600
10224 -89600 -121364 -69569 -180659 -105552 -220415 -208980 -188344 83435 -120592 -142481 -149201
10213 -149201 -63410 -136312 -450273 -469982 -625165 -199697 -287854 -391799 -162146 39354
10203 39354 -17024 61158 146316 183090 253051 392486 144026 69089 137507 100973 -21834
10192 -21834 -32251 231470 -41253 -174232 92843 -129330 -242562 -331374 -58247 -86587
10182 -86587 -80023 251029 3012 -112423 100655 199635 -202829 -299284 112522 107922 -45568
10171 -45568 336035 413818 145290 -224581 -321839 -116981 -29418 -176000 -209302 -164665 -196224
10160 -196224 -309308 -202857 -40435 69317 43810 -241695 -57725 20642 122441 61210
10150 61210 179563 111066 -284367 -152452 -221136 140548 -208548 -130763 -106479 -45227 137376
10139 137376 22228 181492 289096 121025 7705 -182796 -101324 -127501 -128792 -139447
10129 -139447 -238246 -187234 -70302 106499 -37144 -151435 113727 76410 -339432 -348680
10119 -348680 -279717 -95300 122929 -153730 -274281 -179258 -177017 49195 146790 81484 55851
10108 55851 -68183 -305521 -74770 -79072 -192697 -123840 -40916 188313 33153 159300
10098 159300 149201 196414 -86172 -18108 -14644 -392572 -553016 -259962 -264954 -215624 -69343
10087 -69343 -238226 -329405 103463 128999 -47736 153249 143648 -140564 -244827 -29233
10077 -29233 -41039 -100003 36658 -312246 -230952 267141 103752 58678 173494 -101025
10067 -101025 52629 -92957 -38935 -75888 -337721 -128037 -339465 -40427 -19470 -356588
10057 -356588 -188775 -149347 -432602 -322827 -353724 -350319 -178891 -51042 -175680 -140680
10047 -140680 51587 381471 132299 175424 176474 -240723 -138303 195556 78044 53890
10037 53890 102123 -131833 -274382 -149073 -149466 -248905 52767 -3454 -165072 -328079 -318416
10026 -318416 -208527 -192619 70899 -72893 76205 76435 -344832 -183029 16251 -190011
10016 -190011 -131360 -214992 -227781 -453368 -280889 -60885 -210043 -214789 -116219 -311497 -306789
10005 -306789 -271480 -250177 -34441 162136 -114955 48665 -182350 -308799 -403834 -149460
9995 -149460 -180736 -162195 -263702 -82108 225666 92314 65300 -161435 -2368 248876
9985 248876 313723 230212 255005 2861 -137424 -225642 -215179 -150966 -280960 33953 90089
9974 90089 -191575 -245058 7479 96104 -61244 -82970 -521753 -213156 21975 61539 37456
9963 37456 127576 34592 -121853 -195458 168013 339720 131975 63227 89529 52265 75680
9952 75680 170206 -5092 113538 217924 -194174 -204947 -318762 -414733 -232369 22929
9942 22929 -96260 -64497 41857 112998 -172377 -567316 -371898 143420 276438 378229
9932 378229 36047 -129594 -10218 -27338 -137258 -225735 -51738 -81384 -113010 -69649 -185151
9921 -185151 -318599 -327885 -314588 -58186 4523 -208482 -158345 13669 95737 -36858 -241449
9910 -241449 -336307 -179516 15863 57712 27062 -89950 2099 -202673 -84848 -153834 216310
9899 216310 15462 62383 -144406 -263349 190746 455723 9036 -166450 -66954 -219577
9889 -219577 -190252 -95167 -1664 -28606 412890 321512 -197030 -435012 -266127 -104428 4742
9878 4742 209079 91042 -321715 -31958 -84943 93542 34419 -85700 98429 33885 -33301
9867 -33301 -239195 194481 244403 -184615 -279835 -192889 8301 28323 14401 -377425 -58797
9856 -58797 161786 23089 306509 169161 -98610 339926 104063 -181496 180808 329184
9846 329184 161390 42840 -187846 -185629 -101683 -100582 -120709 93382 167610 -23459 -198269
9835 -198269 13161 52109 -144747 -206870 1751 200078 317248 315430 343071 -19647 18643
9824 18643 -16308 8979 65052 104900 360264 132659 -87151 -262457 -44348 67039 101348
9813 101348 -29411 5594 -215823 102456 314084 210516 19726 134231 327899 83710
9803 83710 183183 286020 74250 90315 -1935 165981 236741 229670 451237 362505 281290
9792 281290 251075 -192418 153573 356807 258809 493863 487054 260449 251652 274412 250683
9781 250683 501820 427272 420982 669827 633048 625524 658422 627104 448331 254190 275985
9770 275985 158992 65239 274555 402568 404569 411612 335791 414614 715635 611326 377386
9759 377386 643500 558921 665998 360464 446468 685057 607169 553792 530454 476036 554107
9748 554107 522511 608749 543951 407329 626238 404201 643909 877824 599685 452778
9738 452778 464828 547718 748266 631843 418757 526567 612715 315384 105189 386717
9728 386717 579263 479943 699473 581709 524137 -86350 56888 -135240 103296 394876
9718 394876 84175 -24916 188875 186608 812 61469 243684 328287 651474 632674 170592
9707 170592 208745 460171 304242 187435 224494 -138575 -161656 -257801 -28669 143086
9697 143086 140618 236987 120858 219201 419591 116817 141650 17929 15584 -67805 -77669
9686 -77669 204686 160949 69704 161303 281390 194969 469171 281825 79324 -74800 -253027
9675 -253027 -187294 30190 57730 133011 -10536 -93979 108884 -166060 4096 -141572
9665 -141572 -195546 34688 37870 37678 -88567 44468 -186629 -375203 -273649 -111008 318988
9654 318988 73989 -110368 -53231 -241186 62987 -6885 -172456 284001 197148 -17809
9644 -17809 99297 -238547 -123170 156044 60700 245490 -93495 -46213 93740 210036
9634 210036 177992 43288 -149419 -90296 265117 -127652 -648423 -378427 -7760 37775
9624 37775 -215871 36367 -94678 -131107 -250840 -66395 -250902 -257827 -161700 -228172 -138657
9613 -138657 81243 81268 55164 -33848 -330678 -367919 -252409 -66043 -219790 -191939 -110759
9602 -110759 -64613 -214618 -200417 -282056 -113662 223338 -208772 -105378 -237933 -251276
9592 -251276 -145792 -316295 -180099 -67962 13628 77470 -90199 127519 20894 -303951
9582 -303951 -132072 224334 12403 96479 53794 212977 165543 104792 -83560 -153554 -48711
9571 -48711 -344518 18826 -259746 38139 -41096 -315722 -8284 -123315 -91779 -68954
9561 -68954 -258702 -400158 -142876 -165440 -361146 -39210 -34279 159885 219009 16198 19979
9550 19979 285725 -102152 -28373 -279461 -479299 -448381 -403906 -311722 281628 167489 99887
9539 99887 136415 -19732 -232975 56933 374483 118965 23805 226490 318529 112699
9529 112699 102574 173649 -5079 125533 206212 76896 173129 145785 244827 -134941 -40762
9518 -40762 59511 -44610 264177 184859 175407 -76863 -122457 139540 -103195 -179212 -115723
9507 -115723 56678 -38853 -131542 13912 107355 241768 41541 99533 -89200 179629
9497 179629 158533 276747 -90884 -49240 13549 59658 25387 207562 129167 -179445 -257654
9486 -257654 -46601 73116 42627 -32354 -441314 -262096 184645 -20694 -259753 1464
9476 1464 -139229 80479 70663 167535 -53596 -111704 -121189 -50236 -153330 -343592 -92843
9465 -92843 -41611 202465 202924 -474938 -118922 -111297 32816 -34287 183228 186950 162162 366553
9453 366553 203302 8650 -132059 -260740 37221 -75985 -186694 -160089 -316969 -406946
9443 -406946 -279093 177185 82959 -14513 -59751 -127230 -238396 -251999 -215399 120105 -69238
9432 -69238 -219843 50295 -44949 -317339 -359117 -37812 -319061 -147399 154266 165681
9422 165681 -173452 -232733 -163737 -76518 138958 -27447 -59028 100351 49884 126835 39811
9411 39811 -112285 108607 19955 115736 -179418 -121827 -31343 -235471 -264544 -193191 63014
9400 63014 154498 197016 180428 211624 253139 154236 87188 150380 -40227 162799 -16505
9389 -16505 144365 -154171 -263248 -207633 -225286 -29428 108763 15646 -114550 21939
9379 21939 89639 78843 85830 -40271 -178757 93806 -90900 -151660 -283543 -425577 8718
9368 8718 187965 -11686 -28624 -12468 194326 214684 -29082 -99750 -77656 -224627 439531
9357 439531 348747 -180579 -56793 -81450 -282170 -190530 -300531 -356558 -178064 137609
9347 137609 -36361 -279236 -456067 -198914 -199586 -104120 14693 -114078 -87581 54200 109318
9336 109318 -164621 -193772 -340478 -134523 -269087 -239099 -102667 -101451 -167052 -181778 -120359
9325 -120359 -171106 19234 -84068 -78344 -162852 8137 -91735 -199409 -65017 -363937 -315497
9314 -315497 -212601 -22215 -26127 143798 -38318 -203147 -78347 -113302 -186625 -6178
9304 -6178 116794 123240 216982 174507 460747 178410 152263 -71882 -270624 -236869 -121951
9293 -121951 193034 55738 35866 -186547 51696 -39174 5773 56335 -2870 133212 268010
9282 268010 63984 96855 -82058 87026 114616 -261567 68667 -125645 -157032 -272683
9272 -272683 -75276 -136097 -14621 149199 -33394 -88346 -136066 -67089 -162626 -369634 -293235
9261 -293235 -73302 -327638 112071 189183 -24051 46377 -290910 -193602 -148186 -98608 -149957
9250 -149957 -163537 39939 92331 -66569 -223025 -91501 -42407 -149222 166991 146130
9240 146130 101864 94917 102925 -81105 -3537 104268 58632 194932 120958 -291519 -135685
9229 -135685 -144274 97810 146018 39530 253346 284926 42228 -51949 -10684 -68703 94374
9218 94374 -47613 -172819 -291340 -323953 -258726 -101765 -124210 55681 152580 164359 17091
9207 17091 -495207 -408025 -203914 -366206 88007 -167176 -34894 -59722 -136816 -60157 -111272
9196 -111272 -11433 -118719 -192835 -267254 -180421 1008 175505 -291413 -212123 -293881 -198914
9185 -198914 -117822 -96386 -95984 -40420 -123314 142491 -46911 55309 -149306 -279176 -231449
9174 -231449 -188032 -116447 -50907 -208954 -325651 -208764 -110394 89393 -286688 -256496 -285711
9163 -285711 -44214 -114390 -130740 -70599 -227019 -39296 -66346 -264713 -180467 -234341 -54126
9152 -54126 -317933 -228706 -432215 -88555 -72785 -223046 -238401 -204829 -75296 -74359 -367136
9141 -367136 93847 -67962 -10146 -276713 -113337 -264911 -336260 -470622 -204684 48347
9131 48347 -383192 -409227 -84057 -133813 -108159 -170855 -388256 -296079 -171511 -48551 -53164
9120 -53164 -5946 -270263 -269661 -268728 -434634 -471489 -193098 58214 184956 338704 145121
9109 145121 -115637 136538 -80676 79165 -122653 55305 -58129 31046 142696 -40454
9099 -40454 -102122 -144345 -169438 -207351 -407925 -442063 -358030 -104334 -222696 -193022 -88955
9088 -88955 -134276 -145429 -23611 42918 178455 -69474 200722 198035 29118 -223379 -396883
9077 -396883 4460 43948 51735 33449 65910 -45369 -227776 -9512 278124 86915 -22910
9066 -22910 -103434 42203 -43894 -60997 -291232 -224921 34867 -28388 112933 -75227 -259719
9055 -259719 -317335 -95495 197951 145410 -165329 -33505 -195093 -303103 -307446 -7142
9045 -7142 3003 141213 -23669 -166703 -38330 26731 92535 26998 24616 68218 100100
9034 100100 -48685 -179521 102632 -69180 -191897 -138014 -6927 -138332 -93513 60625
9024 60625 -71700 -216598 -94187 -165040 -195788 -98660 -13227 -85792 -272720 10236 -54672
9013 -54672 -244826 -249174 -94204 -67200 -245901 -535530 -53470 -1302 -11707 -85363 -436473
9002 -436473 -323597 -331296 26442 -97358 110042 133407 -143001 -103639 -111733 26240 -44254
8991 -44254 -200832 91434 371791 -16681 -76336 18575 -29292 49913 130806 -140944 -93577
8980 -93577 167111 188192 -180876 -150560 46638 71666 74606 155373 124938 377029 80574
8969 80574 31302 44267 71373 -123417 -69516 -80430 274525 303581 204351 -281756 -83912
8958 -83912 -369467 -378404 -125177 -178469 29409 177308 32356 -229766 -196877 -40757 -10393
8947 -10393 60600 -58270 -29960 168104 -129179 126683 246168 -37713 -148623 -136748
8937 -136748 19221 302603 235790 277327 182875 202501 -45195 45386 2411 -109130 2135
8926 2135 -117824 22565 33443 30175 264680 -36579 147046 387360 525571 493354 254592
8915 254592 64026 30541 147829 -71528 -90182 -307440 -369752 142779 -320966 -152385
8905 -152385 -84113 -105256 115639 34244 31635 -253839 -347113 -384077 -187518 285346 69279
8894 69279 82772 46166 -19429 15938 -49508 -72054 410197 285137 68474 111267 229885
8883 229885 247781 -40408 -138501 -249904 -340077 -36877 86865 -388217 -428917 -79705
8873 -79705 -169387 111737 193380 218421 157307 25431 237243 -39865 -181304 -187405 148353
8862 148353 108678 -11323 -156390 240924 219247 124039 171559 135338 -138878 -141272 -158910
8851 -158910 -125361 -96175 -185399 19838 -280818 -284128 -127500 -257254 -31729 -60670 30480
8840 30480 -71297 -388079 -173645 -78606 13113 133367 221734 -87379 -136011 61310 -136718
8829 -136718 -54580 34856 -312280 -259778 209962 264747 -116157 -333875 -227909 10790
8819 10790 53747 -37773 -56994 4917 374077 32418 -151360 -50628 -121809 -96631 -195176
8808 -195176 -9602 94675 80193 153823 58986 17567 225007 326777 86650 -129599
8798 -129599 -62550 196295 149306 187782 16305 -200404 -394835 -158173 -222397 -244797 -30517
8787 -30517 -145373 -113392 11546 382166 368483 221726 63621 410786 69540 -31076
8777 -31076 -153129 56148 49186 -163785 -82718 -18396 -48738 -62134 63305 171275 87611
8766 87611 61252 261133 -100519 -161414 -345883 15360 30863 -181564 -111131 -60348 2437
8755 2437 83705 -7356 -49672 284530 78471 -158916 -252620 -80745 77177 -78411 29259
8744 29259 75840 -52270 181048 -39138 200332 -70647 -22019 -178607 91592 272251
8734 272251 134222 223506 14733 121527 -70642 -62408 107072 391752 368792 87142
8724 87142 -33013 13100 534320 182456 -59659 22006 -43479 -163833 -143091 164530 -315271
8713 -315271 -280247 -41203 -120259 -8659 -109277 -89850 270138 282948 107563 143673 55111
8702 55111 -234257 82575 144003 461439 493587 397425 176272 236208 12829 233557 303370
8691 303370 246371 395391 487729 303667 382755 395576 340250 290389 55223 119610 67906
8680 67906 213736 248925 520181 298307 100166 161852 178045 557242 725390 364093
8670 364093 353707 354798 206009 -116349 68582 344932 -54843 -283508 212652 391671
8660 391671 321107 241339 318207 482232 234855 494064 376391 180172 348952 467988
8650 467988 582715 418041 184825 416893 214953 411200 104338 15771 235751 264329
8640 264329 285648 253303 454122 359786 593084 697659 754410 529751 482747 616145 681157
8629 681157 495743 243116 492741 514381 605025 730970 404161 653472 850928 907963
8619 907963 716424 770628 851564 1094397 844757 961680 1281863 994416 1237116 1172540
8609 1172540 1115586 1042390 970634 1079482 901494 785225 977041 1153715 1187195 1113362
8599 1113362 823039 1038444 1191104 1082984 927105 1045119 1338200 1357759 1667021 1388102
8589 1388102 1375966 1571368 1499678 1385582 1367581 1502295 1524864 1547160 1991810 2011091 2086940
8578 2086940 2225965 2636949 2522221 2499958 2768281 2904286 2877307 2952078 3303819 3743228
8568 3743228 3873424 4127581 4547111 4774669 4852737 5566054 5908351 6041944 6448952 6923133
8558 6923133 6755200 6309032 5837316 5079160 4754239 4527366 4126946 3678570 3319872 3261041
8548 3261041 3347338 3159212 3222057 2876076 3168884 2920034 2499077 2215710 2107482 2055234
8538 2055234 1844384 1775629 1507790 1570266 1683317 1477451 1549984 1561010 1487628 1610063
8528 1610063 1538750 1272459 1306106 1259483 1153086 757727 943407 879895 1085991 901520
8518 901520 757166 902582 991869 870866 956866 547911 641238 659855 710955 612848 489329
8507 489329 792291 735293 964423 857286 533104 899213 854693 606039 492045 619222
8497 619222 1067421 827488 868151 892518 833842 383533 745427 936097 637710 315974
8487 315974 370980 587786 522432 422447 540581 837487 318104 330550 517057 655229
8477 655229 538007 577512 760766 896276 840795 889828 682441 541923 603014 675194 647848
8466 647848 454831 359696 644492 828067 908104 880058 678492 852113 958178 790650
8456 790650 789229 735828 721603 911671 752544 670776 740101 870229 824311 733260 885554
8445 885554 817832 856350 798982 765196 896851 1019340 1375467 1539032 1518786 883602 1246594
8434 1246594 1329073 1227045 1042203 833339 725594 946685 1231766 1503223 1381560 1140042
8424 1140042 870931 1068648 1442680 1480242 1408654 1684089 2169267 2240883 2394061 2440884
8414 2440884 1999644 1952905 1629122 1561847 1355722 1226510 1254956 1428771 1240765 1078598
8404 1078598 1159317 1184790 1101886 1112183 1094281 1231345 808351 1086229 1079600 876528 955712
8393 955712 1205281 1180593 1222720 1230519 1158273 1030816 940393 1088447 1062696 683706 818132
8382 818132 852467 905119 1061350 920574 998125 1002862 1151710 1007575 1149269 1117587 1246227
8371 1246227 1332156 1447893 1352508 1282346 1522019 1408140 1501017 1405411 1405074 1408640 1375320
8360 1375320 1241099 1217333 1389468 1202715 1485754 1357339 1417588 1154291 1165625 1335453
8350 1335453 1140990 1027232 1127192 1220263 1509149 1340808 1112805 1054254 1204851 1304382
8340 1304382 1452803 1562394 1505878 1253030 1737610 1538249 1590923 1597090 1590013 1390399 1484618
8329 1484618 1323175 1351564 1205641 1107086 1015734 839409 1067109 1044140 909623 941880
8319 941880 1050752 1060609 1149613 1179243 1284900 1030261 1160170 1254602 1006454 781936 677611
8308 677611 804166 707513 679052 1002679 794344 1055197 1255713 1153427 1028125 931662
8298 931662 927631 927872 715147 906724 988425 911874 1034796 977595 1191031 992418 967157
8287 967157 851536 914319 1003310 931922 1073794 1226099 1082861 1177000 1315598 1178817
8277 1178817 988391 1053286 1502675 1257874 977390 1226836 1310651 1527414 1649067 1410911
8267 1410911 1489030 1710342 1679465 1598349 1639794 1946038 1707770 1589196 1306395 1484135
8257 1484135 1637294 1673172 1732206 1950180 1963421 1990467 1914975 1601608 1695274 1537513 1681647
8246 1681647 2075402 1968331 1985929 2051754 2171480 2307561 2191599 1952961 2371332 2338079
8236 2338079 2252836 2259151 2042663 2192287 2389922 2395295 2611883 2269557 2354854 2232300 2483935
8225 2483935 2637651 2566048 2643099 2381284 2566894 2648021 2582532 2511799 2739092 2898433
8215 2898433 2959865 2595093 3036636 2653798 2862942 3142579 3021885 3032690 3276120 3284781
8205 3284781 2968238 3098389 3205496 2848058 3431193 3312401 3584431 3318759 3757345 3950560
8195 3950560 4463475 4271425 6667075 643926 -1148509 1851152 1756210 2773909 2579762
8186 2579762 3458717 3184374 3601647 3739012 4099566 3670956 4092497 3754684 3873764 3761443
8176 3761443 3928469 3907271 4229520 4009248 3950954 4211220 4556757 4663494 5002627 5024688
8166 5024688 5318990 5229574 4911388 5066371 5120073 5382912 5721844 5557865 5585290 5554426
8156 5554426 5516591 5565327 5683641 5682296 5771774 5245216 5563218 5356908 5570417 5583917 5594236
8145 5594236 5665924 5393283 5367019 5487074 5586071 5478020 5913925 5948484 6151301 6115670
8135 6115670 6253456 6345138 6734324 6621448 6909155 7194008 7513040 7855977 8004228 8280254
8125 8280254 8622457 8889687 8824541 8815212 9344007 9774230 10090637 10307597 10719493 10653996
8115 10653996 11242993 11253187 11652741 12188153 12243454 12684170 13309873 13704110 14169270 14444885
8105 14444885 14844161 15233627 15766146 16256934 17003186 17505436 17734687 18240804 19294372
8096 19294372 19620315 20312596 20681335 21626982 22308475 22867373 23828957 25198651 26129349
8087 26129349 27019394 28291170 29081495 30064019 31332649 33042071 34725571 36176113 38126177
8078 38126177 39897085 41860635 44293015 47250980 50146719 54070827 58337901 63478566
8070 63478566 70585521 79359412 89120605 101638302 117626460 139378889 168596184 209271706
8062 209271706 260787543 289847702 277904831 230487486 182640651 146429175 120424607
8055 120424607 102071592 88498147 78475984 70901226 64873214 59127065 54247198 49905519
8047 49905519 46143759 43263147 41093368 38668639 36437851 34507350 33147919 32138224
8039 32138224 30978684 30258216 29736512 29093802 28968471 28256708 27527716 27447122 27216448
8030 27216448 27048605 26630965 26223762 25941581 26020042 26286140 26202246 26282273 26132975 26192858
8020 26192858 26417799 26684120 27318690 28101425 28257695 28345515 28501211 29144277 29814751 30545606
8010 30545606 31227237 31970011 32585441 33427375 34576201 35928780 37033451 38426593 40427062
8001 40427062 42731018 45443828 48265305 51168190 54018147 57035994 59783191 61566469
7993 61566469 62675089 62676597 62012078 61143807 60899482 60571482 61135064 62419207 64072472
7984 64072472 66148092 68789503 71360706 74072500 75840710 77229161 77911634 77855763 77021940
7975 77021940 76642243 76631776 77074379 78329907 80651819 83520353 87068099 91155308 95517248
7966 95517248 100484278 104762675 107661585 109543413 109736964 109063822 107577361 105671080
7958 105671080 104463289 103766804 103597495 104610925 106436474 108955364 111784287 115158154
7950 115158154 117356720 118800305 119774831 118727515 116489508 114205120 111516675 109955835
7942 109955835 108722499 109404135 111507215 114967312 119422961 124831480 130195817 134712830
7934 134712830 137922994 138909562 138610425 137863914 137416819 137307504 136631103 134340923 130734367
7925 130734367 125849754 120155461 114871319 110586922 107573986 105533968 104197288 102323157
7917 102323157 99978511 97468118 93942781 90458937 87019557 84243709 82080449 80322162
7909 80322162 79788463 80468007 82195258 84759224 88027077 91696798 93539243 94578603
7901 94578603 94018449 92418885 90583666 89420734 89298890 89485964 89289713 87586331 83882241
7892 83882241 78651989 72457925 66941315 62058698 57724807 54492890 51925327 49267839
7884 49267839 47089696 45176990 43645171 42430849 41447660 40627455 40214041 39708951 39265165
7875 39265165 39243609 39230152 39206746 39138150 38852182 39314443 39526368 39352739 39529015 39689258
7865 39689258 40006521 40670409 41088697 41539369 42104218 42690751 43522776 44459121 45400476
7856 45400476 46748917 47900800 49231665 50680748 52617301 54981655 57362632 60065484
7848 60065484 62826993 65734011 69001848 72616314 75430204 78175546 80769954 83182891
7840 83182891 85959841 88402691 90617373 92896899 94848345 95097115 95386990 95297986 95053700
7831 95053700 94836696 94742831 94847280 94880468 94778910 93891956 92576546 91962587 91019194 90556057
7821 90556057 90497443 90594581 90471158 90522391 91530482 92177529 93585401 95022979 96423648
7812 96423648 97772434 99075112 100617954 102071864 103490039 105206099 106818817 108376496
7804 108376496 109388702 109932947 109888510 109934478 110101808 110105985 110145146 109608152 108141877 106225660
7794 106225660 103862548 101471572 98677218 96096012 93527148 90815429 88042053 85288090
7786 85288090 82844815 80331621 78497637 77254240 76762049 76915957 77781335 78534810 79205823
7777 79205823 79441331 79502991 79277997 79157507 79448076 80060180 80936638 81972943 82504483
7768 82504483 82579118 82009052 80558829 78622860 76164410 74203073 72250117 70448824 69015312
7759 69015312 67748136 66630516 65512783 64858623 64493497 64301166 64752620 65767667 67600681
7750 67600681 69861848 72116831 74686429 76435232 77122694 76750392 75762457 74033866 72710296
7741 72710296 71915730 71269484 70643566 68904565 66445855 63095153 59517881 55642925 52218592
7732 52218592 49097337 46431515 44203102 41987213 40550249 39718820 38632854 37942520
7724 37942520 37358467 37469008 37439640 37870552 38583197 39447874 40349547 40851770 41035243 40668899
7714 40668899 40544199 39692891 38841354 37877500 37215129 37051171 36152998 35469749 34031382
7705 34031382 32269527 30074986 28640795 26895214 24978736 23455393 22081356 20736748
7697 20736748 19686674 18876950 18262602 17643389 17106964 16468998 15898322 15629692 15310239
7688 15310239 15055541 14283048 13831996 13857753 13319536 12748975 12674365 12288943 11943271 11565170
7678 11565170 11152627 10842533 10767509 10660003 9890029 9981045 9698081 9277188 9229145 9052113
7668 9052113 8840677 8677150 8677497 8804059 8899431 8636368 8346035 7859342 7751423 7557858
7658 7557858 7601101 7367812 7077135 7027633 7169861 6749252 6590567 6612652 6156147 6043609
7648 6043609 5976681 5525361 5324464 5338061 5380154 5253056 4978805 4703376 4695234 4325171
7638 4325171 4334652 4603091 4612000 4118177 3847917 4110717 3973722 3645132 3432686 3621564
7628 3621564 3618785 3781440 3868652 3628363 3373968 3508779 3278377 2849193 3077021 3113097
7618 3113097 2932479 2986800 2959273 2632540 2632902 2421741 2503747 2320213 2676123 2585633 2476209
7607 2476209 2376334 2374647 2274125 1890570 1954135 2012301 1894714 1697695 1768371 1758577 1703306
7596 1703306 1633032 1806009 1835689 1885596 2089034 1799598 1460816 1625507 1738658 1749972
7586 1749972 1377176 1462619 1446541 1767240 1556975 1280093 1168805 1238321 1250804 1370872
7576 1370872 1193000 1286115 1130654 1272258 1439537 1263894 1331102 1219709 1394977 1513443
7566 1513443 1686588 1464987 1581672 1440043 1498904 1253089 1393878 1321899 1492517 1484937
7556 1484937 1260961 1356768 1322464 1075053 795294 980738 819998 1127412 1415964 1153856
7546 1153856 902702 1054152 1100800 949811 1235608 1243318 1205278 839515 819674 922823
7536 922823 888955 901611 1148547 947543 1207434 1290848 1243515 1067068 1131564 1088727 952816
7525 952816 1165640 1339758 1288796 1228698 1193573 1048236 1140353 994344 1003436 1129939 908443
7514 908443 904167 1114663 1023541 644733 687636 848257 763982 733028 697556 608964 577664
7503 577664 666748 882266 933799 854603 867709 636986 596855 820986 906569 882913 890621
7492 890621 1115747 1202395 1124354 1231754 1332428 1122992 1013914 968524 1008946 1375321
7482 1375321 1075896 1365433 1376697 1201083 1535026 1493259 1472298 1387360 1218667 1433105
7472 1433105 1375573 1857508 1547458 1397313 1392589 1506648 1494701 1462342 1467621 1248542 1251291
7461 1251291 1328965 1340157 1334704 1284542 1035260 1060254 1251811 935913 912972 865837 632543
7450 632543 663960 1012045 702365 928771 933140 674256 463550 283854 651978 652639 590907
7439 590907 565692 770327 602329 412245 216098 470859 691390 483729 538036 551629
7429 551629 722754 539439 541390 395941 424598 689924 380650 177690 222394 554475
7419 554475 363446 375776 606047 431751 412045 270854 339176 553146 179029 310220
7409 310220 565603 564989 316933 494325 429597 295055 389310 331213 21767 -137690 13487
7398 13487 261725 258047 31052 -66749 -48659 510793 201313 103321 111933 210435 95213
7387 95213 -64746 -42777 337717 291106 -37740 32014 148007 80820 250496 211650 141562
7376 141562 256533 24210 143385 135539 219179 241967 126405 -274363 -23895 627 -35833
7365 -35833 -95520 -64195 107946 101003 276223 147009 141426 63642 -230008 -23502 -29110
7354 -29110 -44510 -253193 -102861 75647 53247 235884 117384 -164902 -11154 17184
7344 17184 -450802 85147 230466 199141 464950 368949 233219 96664 10449 -94462
7334 -94462 269274 484427 148513 447308 355325 249037 340935 227213 153534 190696 369698
7323 369698 209804 279522 101741 194114 397148 258805 206815 -82628 211678 530144
7313 530144 303373 150521 -3760 394398 386105 370563 489309 400424 498485 482066 448949
7302 448949 406355 543536 465678 372498 413673 412316 1025158 751455 657295 626640 888015
7291 888015 821937 579717 789795 967114 956486 786692 1052068 1151569 1107216 1307935
7281 1307935 994962 1303830 1366899 1491319 1481487 1567939 1737240 2234910 2137626 1890222
7271 1890222 1967709 2296792 2669823 2537188 2691031 2625007 2581014 2729726 3054351 2885939
7261 2885939 3247954 3419244 3707504 3899288 4110469 4470963 4771824 5329690 6134398 6728600
7251 6728600 7381210 8267808 9314738 9805373 10494394 11013639 11584236 12236399 12325553 12461665
7241 12461665 12304651 12084653 11848365 11414038 10487986 9782639 9113104 8337647 7366669
7232 7366669 6788518 6078932 5671005 5199759 4764759 4672467 4590558 4555973 4380470 4144042
7222 4144042 3971156 4066576 4143434 3951596 4030374 4069879 3976969 4157122 4047578 3700463
7212 3700463 3432174 3340543 3257520 3019677 2494181 2614048 2575351 2346091 1916686 1548168
7202 1548168 1823483 1693190 1411309 1274773 1074877 1154767 1094690 1029315 776340 726526
7192 726526 668890 821625 565714 618459 569172 702301 654428 592466 439157 591040 620987
7181 620987 204602 364610 621377 227795 435963 559361 502140 218517 168973 312348
7171 312348 399045 437395 183285 167749 147819 431969 555043 562820 212852 384005 194146
7160 194146 70069 10144 -295150 -5636 165365 384030 368137 406096 287599 213725
7150 213725 392846 213523 100913 37954 15834 131925 12595 47394 -26551 118662
7140 118662 225688 -50252 -37704 246332 -93161 -133895 24048 341419 340401 219525
7130 219525 122020 33170 105983 316116 160300 145632 -27315 -135263 -130492 104022 64262
7119 64262 235791 121168 106301 469457 160947 124905 -54777 97200 50413 -33479 -126060
7108 -126060 -174681 175847 84813 84835 77957 189420 362711 44664 40669 101771 -30771 168
7096 168 184781 87814 294888 299164 149277 194979 130818 -16049 340523 176960 54974
7085 54974 139139 265365 9536 -49202 155413 178016 127415 115622 -146578 -76436 239367
7074 239367 270238 44212 153588 -324224 -78687 103565 195722 -185787 139534 138051
7064 138051 22748 -160649 56253 -37385 -117710 39351 118100 252256 18575 78408
7054 78408 -156308 -160925 81312 35314 12829 -36717 80302 739 3904 -83862 -196770
7043 -196770 -328060 -228848 70246 199628 119586 -228961 -90127 -297947 -83981 119735
7033 119735 -87178 41110 -300269 37236 -102618 -16358 23948 -123430 -237985 -290256
7023 -290256 9262 127732 -6115 -147863 182001 286988 107307 -37572 142492 156825
7013 156825 -2900 -2288 -229511 -155246 24429 -111990 -164703 -20483 -71184 -62344 244902
7002 244902 48422 13471 95276 361756 42216 331622 506743 585680 157233 160269 171258
6991 171258 26407 -2077 -14150 44177 -47880 142950 246728 -7421 202769 89711
6981 89711 80595 -46697 318494 89235 69947 -135547 93706 205352 42144 33680 -11362
6970 -11362 -134871 -77706 -247301 -53491 34410 56759 401751 -87817 -90517 -92573 -257281
6959 -257281 -189887 -118588 -85723 -212055 -275156 -379996 -371434 -257088 -470005 -384383 -267548
6948 -267548 37232 69592 -103946 -70613 -35657 138251 -76269 -206476 51475 -58262
6938 -58262 -91950 93758 -356675 -194648 201398 84049 107713 230195 205455 183720 -125628
6927 -125628 -63457 -132310 87606 283867 85806 -158927 -206605 -463299 -119828 32359
6917 32359 -97902 -262976 -230204 -171651 160975 321155 -105714 1116 -418839 -246308
6907 -246308 -17604 -53280 -543074 -123440 16226 -180209 -148580 -28756 -77304 244126
6897 244126 346591 337363 -191488 -17300 56635 111505 -14251 -32009 156717 -10756 -28337
6886 -28337 142507 -129980 -220780 -59623 26688 199403 84603 55521 171209 -9872
6876 -9872 -22036 -40747 117632 270732 208971 174248 173112 -25111 -36242 -116203 -253742
6865 -253742 -218632 165489 136765 -288070 -192586 -89848 4183 -274620 -274348 -289478 -285113
6854 -285113 -129652 122973 -58609 -398418 -122766 -318702 -20443 55883 -74047 -283561
6844 -283561 -517646 -67029 -126467 -174751 64241 392391 -37117 -2632 -236148 -234720 -302312
6833 -302312 2286 -265001 -216504 -41122 339836 656737 580895 446619 286507 275785
6823 275785 185270 134282 77507 99472 80297 19304 46952 230037 -30562 -177140 -85781
6812 -85781 131528 221514 277095 124601 80396 156919 -93381 167137 -14293 -242243 65317
6801 65317 80990 -52757 67615 393724 98080 -63809 -156277 127564 117034 140097 100890
6790 100890 212440 353187 293364 278261 -28941 130664 -148573 -125428 -81829 -72664 -26346
6779 -26346 -48976 -210328 -161137 19251 -190574 -32953 -111616 -20871 -39519 -92518 -39763
6768 -39763 100499 150234 85258 42927 151810 254020 324564 105518 19533 62222 375664
6757 375664 -92724 -156402 127052 24464 268417 526167 -116040 -156926 235199 370768
6747 370768 198509 38035 -75827 -91942 150128 110883 121943 497972 347459 -96689
6737 -96689 -54640 45588 -114058 -64717 79603 286849 327085 254021 34893 109023 182943
6726 182943 234479 257652 130371 236917 52651 -73312 -32180 119063 -91760 -14566
6716 -14566 -26429 -122319 96637 200844 113129 120405 386626 184186 144117 62705 -2147
6705 -2147 133982 273107 356691 414268 108361 112032 350620 88004 252878 503850 181257
6694 181257 22096 -18138 94161 199043 -2546 -53715 133970 232678 -14182 -220994
6684 -220994 10537 10666 145742 63926 66868 439225 389133 315427 131843 567460 217770
6673 217770 133033 35869 382242 175984 321740 -82838 201893 175375 117462 68699 23535
6662 23535 104417 254002 302810 421376 144062 252133 309086 -35383 270088 123788
6652 123788 -164133 168232 131071 117592 375751 131804 140786 256022 340635 325378 224256
6641 224256 100342 -37883 328454 524249 198363 166966 -59382 -151870 -49946 119937
6631 119937 385196 204500 391545 476136 385949 486925 326878 295235 253777 181032 -18260
6620 -18260 322434 246651 85753 128008 369426 380801 410645 224732 329941 161185 192166
6609 192166 284977 273091 134962 397781 841245 562565 393174 367847 744382 108730
6599 108730 82318 131325 201670 251006 308182 426722 338135 480313 62129 102726 256179
6588 256179 407719 210517 116933 -24918 -67567 -27986 45497 137169 245550 149748 230167
6577 230167 110261 215872 499666 376275 356325 116422 164703 260316 197155 212590 385776
6566 385776 321826 372031 515119 238962 429913 297810 399419 314671 425259 213068
6556 213068 323409 536545 571940 524005 264738 191285 193420 415950 265976 119576 131119
6545 131119 262189 307359 360232 164653 -268104 -1922 281098 434550 293525 311796
6535 311796 102938 56452 35188 380956 465824 400589 596564 224406 337261 404422 640922
6524 640922 661856 484314 439125 180211 487582 456097 295265 266660 146053 151616 113955
6513 113955 -168608 28029 -44236 417541 565124 482401 544287 379104 367373 271390 144056
6502 144056 525192 587589 198315 372959 409128 443702 261669 661401 620591 363816
6492 363816 535484 495181 157398 144010 432180 561567 424748 356694 413810 465188 849257
6481 849257 558895 373489 709954 621454 426928 492955 619624 650434 803575 445268
6471 445268 383707 452032 335142 278246 560743 506239 391317 796702 749064 594138 476089
6460 476089 517639 727553 548803 576135 429937 472011 569319 604423 430077 564308 476699
6449 476699 747650 714993 556089 855970 553119 550535 600565 879114 726734 746677 589977
6438 589977 411535 534076 394663 723798 440882 424495 740623 916707 787291 677975
6428 677975 403251 712967 783489 744167 613343 615951 921043 1212765 1083386 933615
6418 933615 787921 616701 659618 771579 486661 536225 638261 767457 540208 554970
6408 554970 823830 833341 563623 441564 556033 618847 974930 949128 953051 975037 900072
6397 900072 1165509 1219533 1070790 813269 891656 883452 1058033 1183680 990121 1120731
6387 1120731 772472 926559 839010 925581 926427 1140856 1425251 1384255 1388421 1155221 1044870
6376 1044870 1099432 838301 787265 1221974 1365256 1107012 783351 1046589 1114146 1081489
6366 1081489 1146111 1209029 1241027 875418 1038867 1065866 1239669 1163246 1399763 1587314
6356 1587314 1168175 1183244 818166 809534 929947 1278250 1337862 964783 1193339 1279384
6346 1279384 1415144 1266543 1168015 1616417 1529365 1270184 1222858 1315982 1364524 1520089
6336 1520089 1567429 1193769 1271892 1231957 1239474 1352111 1224451 1129689 1453668 1465779 1624360
6325 1624360 1552703 1549957 1577739 1419460 1580600 1454218 1598982 1834205 1417216 1535752
6315 1535752 1505536 1731501 1620824 1320335 1223240 1610032 1853096 1598372 1678969 1934354
6305 1934354 1928635 1963810 1916282 1645180 1776645 1949687 1705949 1818576 1832713 1683599
6295 1683599 1770740 2029838 1990865 1986288 2186971 2481985 2501242 2457913 2502102 2758637 2324799
6284 2324799 2349301 2455667 2284758 2236168 2427344 2521384 2835365 2998472 2719961 2768189
6274 2768189 2659551 2986672 2943193 2992080 3171584 2935805 3010311 3134348 3619582 3724402
6264 3724402 3405843 3637596 3544099 3782904 4213173 4256766 4099792 4477674 4464715 4703213
6254 4703213 4801346 4623883 4625991 4821722 4977191 5233904 5504181 5657635 5927983 5792325
6244 5792325 5884787 6249855 6254887 6517319 6820649 7107900 7307936 7496186 7516665 7804595
6234 7804595 8253759 8410198 8688388 8674653 8989547 9233785 9419728 9674349 10002360 10699939
6224 10699939 11173608 11469957 11938534 12744239 13041467 13365707 13984956 14739177 15251274
6215 15251274 16148804 16435719 17442029 18452431 19167111 20018484 21117318 21938513 23385222
6206 23385222 24385507 25421889 26519477 27673512 28877071 29810831 30998082 32307279
6198 32307279 33282730 34287341 35058376 35871506 36433602 37028404 37333696 37717843 38062153
6189 38062153 38007642 38028615 37516631 37583420 37269911 36982725 36301436 35812315 35080792 34674703
6179 34674703 34264457 33322464 32964253 32468736 31883317 31721776 31539241 31326631 31099156
6170 31099156 31170704 31103340 31295308 31414346 31943469 31970977 32671916 33031276 33517444 34287087
6160 34287087 35105532 35511425 36179772 37035358 38046802 38952265 39699199 40832872 41759602
6151 41759602 42243989 42830478 43420156 43500098 44012101 44428738 44371700 43931447 43392919 42861516
6141 42861516 42385172 41896011 41391930 40208884 39205312 38266010 36599279 35535294 34146073
6132 34146073 32710620 31399095 30529198 28997544 27611031 26664462 25655334 24582748
6124 24582748 23523465 22623524 21681366 21181705 20100788 19463413 18905880 18143299 17801194
6115 17801194 17212079 16445405 16388245 15834010 15420737 15152933 14939228 14650571 13839272 13249665
6105 13249665 13393473 13353257 12819366 12524365 12229401 12018759 12009180 11657062 11827624 11310835
6095 11310835 11433961 11309199 10969316 10673812 10620758 10321971 9956186 10115604 10080689 9990730
6085 9990730 9964968 9657694 9372361 9578155 9599900 9292333 8978570 9089977 8886427 8643843
6075 8643843 8775615 8550579 8541210 8308731 8145539 8410104 8208147 7894962 7913574 7658569
6065 7658569 7296107 7479878 7696382 7541001 7584476 7536103 7274258 7198411 7419498 7323523
6055 7323523 7393277 6972924 6812864 6819591 6651241 6534772 6436240 6633967 6476023 6665400
6045 6665400 6812484 6594681 6518765 6322808 6219852 6520583 6468474 6183983 6248668 6547714
6035 6547714 6391861 6322311 6043317 6264854 6286833 6540867 6261150 5962480 6118414 6265272
6025 6265272 5807878 6056122 6425050 6400669 6290380 6003764 5799321 6128967 6379669 6198536
6015 6198536 6359283 6374059 6364105 6294422 6099198 6354482 6339060 6397608 6580985 6887565 6822340
6004 6822340 7135550 7001221 6768297 6921909 7009629 6845938 7073206 7466402 7212498 7355941
5994 7355941 7239488 7191831 7329402 7313862 7582811 7784508 7787947 7999550 8018555 8352647
5984 8352647 8126798 8245055 8472541 8689196 8636251 8689884 8803229 8871554 9181732 9490660
5974 9490660 9496554 9837347 9771424 9977561 10368868 10793303 11138776 11056910 11450492 11405353
5964 11405353 11849206 11978452 12469670 12848814 13445987 13506574 13862242 14460413 14676972 14923330
5954 14923330 15549609 16064877 16204733 16892227 17398133 18149115 18799421 19169434 19702711
5945 19702711 19957277 20618344 21290405 21911048 22816163 23607618 24170214 24722095 25106960
5936 25106960 25785578 26797690 27615595 28266905 29295344 30353214 31194296 32017963 32894634
5927 32894634 34016070 35156271 36341208 37234177 38530959 39805724 41167872 42653003
5919 42653003 44216094 45981348 47543561 49606691 51727424 54294867 57211744 59957065
5911 59957065 63075275 66301907 69829058 74004096 78483922 82707543 86985841 90803772
5903 90803772 94262509 97052076 99602085 101002139 102166061 103231636 104376646 105957251
5895 105957251 107746270 109917509 112820042 116264820 120497403 125219985 130536710 136374286
5887 136374286 142159231 147697221 152778315 155831494 157151202 156227828 152804490 148643720
5879 148643720 143932526 139110789 134987077 131439318 128647120 126539970 124810915 123849934
5871 123849934 123687642 124383388 125241351 125613544 125967322 125974959 125226638 123380991 121330054
5862 121330054 118668642 115496112 112327423 109520535 106458653 104207920 102703280 101472360
5854 101472360 100502615 99812118 99911660 100672502 101457849 102509372 104110450 105846022 107694932
5845 107694932 109500995 111598065 114126737 116065982 117386764 119165196 120908953 122283013
5837 122283013 123864119 125348324 126780214 129010386 130755224 133021398 135642427 138078839
5829 138078839 140439520 142592270 144391672 145875105 146308525 146118758 145226722 143807802
5821 143807802 141968141 139535879 136939347 134408220 131878383 129520753 127663766 125746927
5813 125746927 124010395 122308641 120878232 119170931 117779918 115710867 113558980 110977795
5805 110977795 108241727 105550585 102885623 100216726 96748700 94103679 91918317 89363240
5797 89363240 87141184 85257862 82936974 81221479 79764097 78102019 76270982 74847430
5789 74847430 73583419 72222085 70823128 69797052 68517086 67570487 66794232 66009021 65160996
5780 65160996 64461933 63861984 63051940 62562942 61937033 61466544 60880312 60119795 59604520
5771 59604520 58383051 57848353 56920129 55938785 55112044 54186245 53349291 52572340 51546687
5762 51546687 50932916 50338920 49606595 49133974 48592976 48457222 48170017 47851271 47434036
5753 47434036 47241348 47622175 47370312 47168014 46900662 46963732 46873291 46630411 46132222 45690289
5743 45690289 45171038 44894574 44655351 43864520 43780989 43700896 42770380 42472008 42330173 41886629
5733 41886629 41472589 41125257 40733316 40551380 40235095 40010734 39511131 38762199 38299993
5724 38299993 37771528 36979601 36284306 35281118 34585312 33899194 33326528 32540772 31409413
5715 31409413 30894115 30000640 29007169 28516767 27869214 27152608 26571314 25757493 25086366
5706 25086366 24607074 24282078 23772659 23470307 23269569 22961020 22454827 22240898 21797312
5697 21797312 21539153 21448025 21414286 21215194 21202203 21005122 20606046 20367668 20322362 20247459
5687 20247459 20327567 20498947 20239241 20183758 20172856 20382451 20559140 20177809 20289651 19690175
5677 19690175 19956565 19911746 20008300 20374326 20164956 19874121 20104823 20175594 20073229 20302595
5667 20302595 20432421 20447794 20812945 20742603 20599915 20902002 21193787 21243393 21702799 21750726
5657 21750726 21883943 21677539 21612042 22219986 22447703 22561739 22883657 23104860 23127325 23507915
5647 23507915 24208384 24288605 24361109 24676809 25248107 25109968 24890453 25283722 25384740 25451618
5637 25451618 25763309 25801196 26288159 26652031 27012847 27347262 28036794 28375679 28577023 29189959
5627 29189959 29553449 30095827 30592524 31650564 32883738 34069311 34908079 35794651 36326899
5618 36326899 36302445 36002914 36345430 36579286 36874790 37561967 37913640 38325494 38932299 39323694
5608 39323694 39876489 40992134 41865751 42633949 43523095 44208031 45358448 46599754 47690419
5599 47690419 49318036 51011624 52504067 53682462 54928392 55882733 56750592 57589008 58271433
5590 58271433 59530274 60698918 62150218 63548890 65045390 66661658 68681542 70635743
5582 70635743 73209460 75860020 79181293 82568461 86089567 89963724 94101802 97994614
5574 97994614 102400348 106129950 109373468 112213850 114442938 116162799 117289772 118656640
5566 118656640 119804355 120928000 122572472 124137411 126343396 128668266 131434661 135310191
5558 135310191 139574350 143368728 147388249 151211983 154137909 156136820 157129944 157526916
5550 157526916 157155546 155860261 153861717 151538359 148943188 146795185 144674279 143280660
5542 143280660 142023971 141542380 141572791 141946414 142676829 143424912 144373530 145467873 146382704
5533 146382704 147508658 148542549 149467601 150600026 151434374 152288722 153417731 154755296
5525 154755296 155649857 156809574 157891941 158540122 159033967 159634959 159894120 160473591 160733849
5516 160733849 161476619 162952870 163933107 165456141 167610619 169782814 171957642 174465195
5508 174465195 176083168 177431902 177786619 176839794 174520933 171122364 167619579 163498379
5500 163498379 159274265 155390989 151553016 147987997 144826678 142166639 139760902 136953052
5492 136953052 134810315 132566669 130398697 128098781 125199970 122399265 119146345 116077811
5484 116077811 112851055 109843803 106598160 103761392 101312053 99007233 96560224 94621441
5476 94621441 92904659 91427387 90295807 89470997 88538611 87646238 87509516 87413129 87466526
5467 87466526 87207190 86928184 87119233 87417012 88032406 88852985 89499561 90627521 91947312
5458 91947312 93052763 94236221 95303549 96443174 97887421 99604812 101441800 103191130
5450 103191130 105114601 106680701 108737189 110946938 113041391 115182643 117385906 119342155
5442 119342155 120750433 122736480 124590178 126860926 129444474 132057023 134800371 137779431
5434 137779431 140922946 144838535 148962576 153002941 157762308 162187733 167052469 171728613
5426 171728613 176827628 182161470 187467461 192972637 198321647 203723763 209595539 215279696
5418 215279696 220998310 226471183 230876997 235324731 239972612 244101039 247737420 250876620
5410 250876620 254274236 257200243 259029983 260889879 262300437 263279030 263562885 263579406 263780724
5401 263780724 264250468 264867784 265360947 265426511 265634728 265549362 264566736 263169041 261730523
5392 261730523 259944887 257320798 254948263 251640586 247339100 242304627 236284682 229836039
5384 229836039 222640464 215662792 208545263 201519526 194600325 188098072 182159532 176127605
5376 176127605 170098949 164196795 158872131 153433443 147887341 143090099 138327357 134127144
5368 134127144 130501012 126956268 123805871 120958208 118095976 115720409 113398387 110925465
5360 110925465 108722599 106448777 103986622 101943691 99722244 97510745 95487459 93429057
5352 93429057 91433781 89736906 88425858 86896251 85611844 84232674 82656595 81369680
5344 81369680 79974371 78683774 77591531 76423292 75304088 74540056 73487578 72401876
5336 72401876 71629669 70849904 69975441 69328549 68449318 67796964 67023401 66337305 65543746
5327 65543746 64716487 64015992 63322740 62708416 62350242 61860096 61054989 60451159 60238875
5318 60238875 59765377 59164213 59034087 58560751 58175561 57647422 57186911 56565110 56388145
5309 56388145 55772404 54992581 54291891 53376202 52977768 52795303 52021013 51516883 51344449
5300 51344449 50548190 49686387 49205778 48167122 47173463 46361957 45669702 44500164 43776779
5291 43776779 43266317 42373949 41706315 40667940 39971980 39214011 38466721 37835905 37420475
5282 37420475 36604333 35666599 35151204 34524616 33842756 33099636 33011229 32551430 32263306 31645440
5272 31645440 31267518 31031295 30598937 30206848 30289525 30027434 29527722 29479684 29065522 28962365
5262 28962365 29091391 28551571 28449661 28671093 28424649 28204849 28319298 28312027 28326907 28263158
5252 28263158 28121198 28286492 28666691 28800195 28545634 28620330 28668952 28812917 29046980 29687619
5242 29687619 29653642 30003192 30481726 30598567 31004438 31138867 31389367 31944471 32276804 32478000
5232 32478000 32636386 32878385 33130622 33886253 34137148 34129334 34437756 34582902 35041142 35723541
5222 35723541 35937209 36158620 36330785 36668060 37071241 37278356 37702014 38115480 38444843
5213 38444843 38909776 39329741 39918457 40142196 40362457 40461189 40883226 41196128 41333510 41763683
5203 41763683 42017616 42159982 42304723 42428555 42915963 43192607 43226362 43595277 43486714 43719745
5193 43719745 43761233 43923497 44076430 44073970 44191853 44654001 44392158 44440967 44557887 44128186
5183 44128186 44158976 44161181 44110293 44825318 44645498 44616799 44733007 44659388 44813409 44530781
5173 44530781 44167034 43990895 43615926 43061305 42819893 42468500 42203719 41621405 41485298
5164 41485298 41534235 41429504 40895674 40618712 39992316 39962013 39729461 39675964 39221508 38680373
5154 38680373 38616640 38312326 38136355 37792716 37673577 37173657 36919778 36536632 36419685 36243061
5144 36243061 36055326 36042320 35779504 35500373 35617060 35722292 35766087 35639835 35526686 35473845
5134 35473845 36045072 35692804 35812802 35831312 35945693 36130464 36450666 36826305 37109430 37329499
5124 37329499 37519414 37835158 37843305 38388722 38918727 39579387 40233295 41147437 41977359 43150680
5114 43150680 44548981 46650660 49143720 52195676 55336341 58284733 60127454 60003435
5106 60003435 58429076 55788168 53611134 51609106 49911537 49408435 49658741 50275343 50203273
5097 50203273 50325410 50764660 50827537 50366117 49844853 49373355 49283766 49706061 50190059 50826085
5087 50826085 51662558 52865523 53749391 54524396 56189218 57657884 59343568 60511630 61993333
5078 61993333 63481535 64609194 66044115 67441761 68771906 70410881 72311831 74287024
5070 74287024 76080653 78322406 80606999 83218162 85791339 88556415 91494764 94702179
5062 94702179 98304151 102291434 107144699 112365314 118342391 125032673 131837223 138311474
5054 138311474 143003745 146652676 149636912 152352901 155759094 160437339 165848958 171846648
5046 171846648 178907042 186492980 194079438 201575213 208959029 215917372 221623740 226684424
5038 226684424 230783307 233196691 234773870 235444870 235389903 234912715 234374832 233223996 232188660
5029 232188660 231679321 230745949 229586342 227952499 225641082 222473618 218365873 213251586
5021 213251586 206992955 200071013 192370369 184160291 175448955 167546432 159902946 152281429
5013 152281429 145238437 138792838 132780479 127190787 121904938 117125053 112804990 109424114
5005 109424114 105580343 102706254 99895774 97524420 95202369 92996901 90941369 89223896
4997 89223896 87628507 86395035 84648309 83882962 82794502 81198950 80173448 78910193
4989 78910193 78110677 77163123 75924890 75246261 74461774 73951652 73188343 72383526 72050906
4980 72050906 71321156 70600606 69562178 69471410 69067207 68471366 68003515 67748180 67147311
4971 67147311 66626570 66665948 66748704 66599621 66459302 66965161 66818498 66918155 67284784 67484442
4961 67484442 67861570 68507369 69536135 70465218 71657101 72728310 74290406 76175699 77689096
4952 77689096 79888712 82309508 84900485 87897108 90833622 94139498 97648004 101328477
4944 101328477 104909926 108740408 112852371 116829217 120461654 123627258 126465456 129687776
4936 129687776 132676654 135516193 138201542 141139992 144469252 148442752 152535958 157049861
4928 157049861 162123711 167342198 173119790 179160470 185555861 191678520 197699670 202935213
4920 202935213 207218905 210648066 212394363 213317409 212788411 211437121 209596815 207650145
4912 207650145 205226917 203602463 202426310 201291558 200993303 201148129 202025258 204145617
4904 204145617 206635662 209353459 212374703 215729804 218467069 220620246 222128995 222403957
4896 222403957 220731304 217597310 213209378 208008720 202088147 195605355 188787511 182172782
4888 182172782 176198807 170767394 165430397 160803898 156667641 153021164 149761545 146539022
4880 146539022 143444767 140339407 137200043 133641608 130012280 125880447 121824314 116984099
4872 116984099 112221678 107617726 103255251 98729420 94364707 90221216 86835531 83550682
4864 83550682 80133203 77119548 74580178 72001881 69814689 67674542 65754784 63597399
4856 63597399 61544246 60138207 58586832 56947525 55065756 53737469 52564864 51107349
4848 51107349 49789041 48732447 47635214 46723442 45828991 44752677 43749553 42875762 42138391
4839 42138391 41015861 39542849 38596034 37524333 36536939 35975521 34614963 33220198 32494072
4830 32494072 31937127 30879178 29802442 29450674 29010528 28046435 27435549 26928813 26268957
4821 26268957 25583795 25198249 24721625 24077429 23422077 22648924 22016696 21690234 21367628
4812 21367628 20828196 20456994 19748806 19317723 19231049 18776503 18432452 18028181 17527824 17472618
4802 17472618 17131734 17258047 16964020 16401172 16492872 16193125 15669656 15748112 15713417 15356920
4792 15356920 15541821 15652837 15546679 15553701 15662818 15684280 15040749 14810604 14785414 14642361
4782 14642361 14392413 13678633 13276810 13101351 13002065 12623036 12691513 12146186 11984408 12094833
4772 12094833 11647291 11536199 11242018 10882115 10615402 10643041 10568060 10433672 10019744 9911222
4762 9911222 10054865 9798401 9527885 9212872 9114802 9249572 9224548 9137999 8940447 9009168
4752 9009168 9066955 9108924 9181038 9285082 9564122 9407224 9299934 9225564 8700576 8334085
4742 8334085 8022395 7937415 7705464 7519410 7364630 7202590 6962533 6938725 6787189 6661700
4732 6661700 6895598 7327832 7300556 7174534 6831307 6712321 6730314 6637742 7075701 7177116
4722 7177116 6760248 6734980 7175731 6861618 6774486 6949341 6765256 6683717 6928830 6489506
4712 6489506 6647873 6816587 6993689 6894645 6686221 6837603 6751767 6581127 6612202 6739858
4702 6739858 6742272 6801531 6822185 6891025 6910792 6902706 6787909 6635737 6913341 6945568 6990410
4691 6990410 7117457 6789718 6880787 7043781 6988440 7394810 7538680 7477718 7522347 7611553
4681 7611553 7921373 8089934 8104115 8399657 8737547 8791216 9080817 9367738 9381726 9537600
4671 9537600 9728372 10187197 10206480 9915942 9987024 10099553 10416738 10778096 11112871 11025379
4661 11025379 11458358 12384034 13042642 13675632 14179805 14520984 14852132 14960810 14256538
4652 14256538 13617386 12966144 11931716 11145930 10811816 10702772 10461785 10083320 10037703
4643 10037703 10084762 9530167 9512428 9720310 9960354 10016043 9752892 9854167 10238302 10379319
4633 10379319 10520354 10161091 10134775 10244502 10464414 10615307 10439009 10339058 10936640 10907895
4623 10907895 10984084 11593078 11322006 12015233 12698623 12911711 13235265 13723094 14280538 15288663
4613 15288663 15617970 16252436 17215976 17859451 19275935 21105382 22873076 24811019 25725609
4604 25725609 25738048 24968819 23765676 22538480 22089137 21851295 22271860 22606527 22924497
4595 22924497 23747538 24448067 25617866 26611233 27678856 28945963 29639077 30282802 30838277
4586 30838277 31011024 31632632 32458481 33226439 34366830 36160801 38336854 41158084 44256721
4577 44256721 48781945 54063401 61610149 69924876 76384242 82554571 86404084 90950039
4569 90950039 96662386 99484829 97255190 89350748 78353217 67972309 60531620 54860558
4561 54860558 50865674 48323873 46342659 45090162 44774246 45120472 46340217 48803364
4553 48803364 53115491 57465758 61276255 63679337 64513964 64099257 62873138 59816916
4545 59816916 55177534 49326366 43276598 38297462 34198839 31000809 28587096 26502562
4537 26502562 24763238 23522455 21872027 20978465 20118888 19209301 18667559 17746492 16838030
4528 16838030 16211355 16007126 15574084 14753706 14748468 14559310 14114312 13802600 13070662 12982298
4518 12982298 13072855 13120941 12671172 12669760 12382545 12082650 11521368 11650896 11572001 11417098
4508 11417098 11281009 11395566 11234413 11302748 11313277 11091201 10994670 10499271 10854433 10715921
4498 10715921 10822509 10753428 10749281 10825315 10840591 10781459 11054268 10906296 10980868 10931034 10963935
4487 10963935 10886620 11196765 11212756 11211623 11351660 11098627 11326203 11292525 11117484 11162026
4477 11162026 11437396 11787526 11856966 11765121 12405747 12528364 12827750 12690611 12754656 13319871
4467 13319871 13697331 13894389 14538369 14822077 15118209 15703936 16128205 16839613 17234281
4458 17234281 17482096 17669056 18227843 18554447 18837972 19114087 19387764 19479434 19896576 20701776
4448 20701776 21658288 22181182 22546436 22953357 23795578 24742301 25639589 26457748 27702763
4439 27702763 28753861 30128440 31250883 32228624 33458238 35059493 36216095 37743721
4431 37743721 39387759 40717374 41920267 43573896 45232015 47022044 48720645 50535705
4423 50535705 52586202 54376141 56167853 58319141 60234439 62196050 64124176 66040509
4415 66040509 67792883 70276181 72453388 74735155 77136870 79185746 81412779 84218305
4407 84218305 86827531 90042027 93446926 96464591 99495122 102590316 105378694 108341121
4399 108341121 111481720 114451433 117341685 120232276 122999816 125917885 129109100 132163372
4391 132163372 135510654 139271255 143421305 147944008 153593328 160167971 167889117 177160673
4383 177160673 188068015 199030397 208378294 215294503 220361244 223318511 224916515 224034977
4375 224034977 220921555 216058399 210562557 205595123 202016609 198924118 196425147 194479887
4367 194479887 192758857 191546230 190763475 189636719 189270014 188714005 188723622 188498291 188371829
4358 188371829 187664709 187491474 186434175 185107629 183304458 181249272 178146755 174365817
4350 174365817 170310531 166231450 162310353 158410294 154754074 150900130 147644138 145218341
4342 145218341 142610394 140231931 137825172 135276375 133173813 131205764 129402803 127363427
4334 127363427 124774379 122688559 120528448 118133241 115481537 112697133 109919979 106589284
4326 106589284 103646291 100614601 97774090 94805469 92456353 89515535 87108930 84404911
4318 84404911 82158029 79693559 77025326 74609479 72732540 70604797 68613146 66769017
4310 66769017 64995925 62865840 60828315 58799628 56777860 54927043 53124595 51441239
4302 51441239 49487476 47751068 46172245 44714567 43267354 42214617 40748246 39177968
4294 39177968 38160451 37065424 36163452 35237577 33865949 32713817 31709950 30863831 30076879
4285 30076879 29313128 28579873 27807797 27295907 26755796 25996031 25376995 25037398 24916773
4276 24916773 24644451 24337624 24187716 24243304 24121410 23756951 23688199 24008404 24629589 25063532
4266 25063532 25464717 26794029 27990138 29130269 29847063 30002814 29880096 30163783 31156751
4257 31156751 32594109 35215576 38164708 39495854 38639586 35882909 31472507 27633882
4249 27633882 24915301 23284662 21524980 19864786 19059694 18267391 17134452 16064764
4241 16064764 15280796 14967494 14849790 14474413 13968125 13562819 13148262 12655741 12238636
4232 12238636 11938544 11823389 11617884 11565383 11337856 11093515 10927921 10889751 10692460 10215441
4222 10215441 10250477 10341884 10300014 10002394 9774125 9539510 9480803 9318398 9126026 9200942
4212 9200942 8929541 8809706 8671821 8779376 8941541 8766807 8546886 8269018 8287256 8315872
4202 8315872 8216034 7855324 8134467 7828128 7634242 8020047 7591771 7649201 7935077 7703609
4192 7703609 7851684 7736778 7682343 7693114 7538820 7527111 7521158 7734285 7330718 7501516
4182 7501516 7645380 7466962 7158364 7373203 7283765 7024452 7246277 6956307 7269076 7248577
4172 7248577 7300427 7233595 7299546 7089931 6923155 7109100 7618188 7682682 7440330 7273812
4162 7273812 7327790 7241173 7016721 6777201 6821680 6752057 6607071 6875614 6682921 6429532
4152 6429532 6380479 6327683 6501769 6351536 6161058 6130683 6134280 6188729 6316843 6234603 5948533
4141 5948533 6223077 6081145 5898138 5944177 5972862 5473765 5957811 5846063 5795200 5846176
4131 5846176 5782336 5913731 6043503 5880899 6010710 6105689 6121662 6139212 6092462 6145177 6355415
4120 6355415 6112497 5972504 6031247 5929465 5912933 5887770 5730313 5700093 5356165 5209411
4110 5209411 5243484 4772676 4946799 4667799 4671094 4912441 4755399 4791811 4704915 4651617 4555934
4099 4555934 4526040 4808386 4611503 4600239 4489787 4445724 4195251 4234485 4442327 4314327
4089 4314327 4331741 4256080 4195071 4152762 4305714 4130774 4180746 4107174 3957078 3913259 3882671
4078 3882671 4038776 4283565 4336857 4503101 4270678 4089209 4105169 3965018 3721853 4013067
4068 4013067 4361710 4379114 4419584 4474948 4470087 4168985 4368346 4402944 4214457 4203188 4398643
4057 4398643 4173508 4265808 4172660 4068034 4310516 4276628 4339903 4783955 4693399 4486355
4047 4486355 4632057 4560855 4438496 4482951 4595801 4656506 4823385 5143594 4956914 5085932
4037 5085932 5310682 5378330 5538979 5829108 5575771 5494224 5829905 5869854 5945247 6272169
4027 6272169 6446568 6347743 6386842 6498826 6421677 6390652 6630572 6585785 6551600 6563714 6576265
4016 6576265 6845635 7114828 7244343 7298626 7364252 7678019 7722281 8150478 8342123 8678587
4006 8678587 8778695 9236304 9676404 9969376 10243308 10325711 10589559 10919781 11584370 12285050
3996 12285050 13450066 14127960 14234342 13529238 12960624 12096527 11442196 11094832 11169141
3987 11169141 11322164 10981361 11001259 11152604 11083139 11119056 11374889 11314723 11583042 11680007
3977 11680007 11827791 12228323 12362490 12724783 13075221 13410076 13879687 13958346 14679694 15118755
3967 15118755 15586762 16194905 16968596 17601855 18188045 19139475 19951164 20740902 22081346
3958 22081346 23452201 24847482 26302518 27686469 29292162 31116998 32741208 34760946
3950 34760946 35856149 35446758 34082619 32104781 29613415 27221453 24892196 22980974
3942 22980974 21217066 19831821 18815560 17802285 16751501 16419589 16018675 15501014 15467819
3933 15467819 15543440 15824959 15756581 16133808 16729832 17582751 18753548 19944518 20710437
3924 20710437 20350465 18988133 17730416 16159661 14998395 14257353 14021921 13324693 13621931
3915 13621931 13770412 14118271 14623759 14898482 15203220 15035034 14440132 13426361 12619562
3906 12619562 12431875 12158941 12141086 12501637 12914126 12781197 12517678 11573007 10846513 9775418
3896 9775418 9151350 8970530 8583490 8308289 8180666 7839225 7572498 7603289 7240632 6802025
3886 6802025 6454607 6415567 6601964 6215550 5932862 5634991 5356746 5297093 5250449 5343380
3876 5343380 4892398 4722278 4576174 4722337 4951203 4467856 4512510 4595659 4244953 3912831
3866 3912831 3900942 3977017 3966335 3968844 3990675 4098734 3952249 4181005 4002597 3784983 3468272
3855 3468272 3491272 3418386 3700730 3633847 3549414 3326416 3680357 3854381 3647195 3365532
3845 3365532 3323839 3428794 3796060 3881068 3532740 3314361 3300801 3081102 2925887 3022208
3835 3022208 3008157 3294373 3373299 3250598 3317245 3303989 3048609 2813965 3106712 3027492
3825 3027492 2792889 2878367 2876339 3096545 2762787 3163556 3168488 3166411 3068570 3169412 3238349
3814 3238349 3239979 3134748 3089033 3212992 2920228 3080557 3228253 3181292 3357306 3448170
3804 3448170 3291187 3452921 3627299 3350481 3540487 3724398 3771884 3912730 3827907 3783431
3794 3783431 3129952 3247741 3097073 3046974 3236906 3151145 3017306 3091469 2925342 2845717
3784 2845717 2576341 2655271 2520982 2812238 2791406 2543335 2634993 2451724 2571258 2602252
3774 2602252 2666599 2789186 2745000 2806278 2983379 2679631 2285957 2428638 2478186 2160219
3764 2160219 2483512 2616497 2567015 2068701 2094637 2415259 2283546 2399697 2381000 2366443
3754 2366443 2454202 2434712 2256300 2435283 2712582 2600071 2343790 2677909 2632284 2635713
3744 2635713 2744054 2534735 2261766 2140781 2548376 2515289 2614354 2657534 2536291 2689914
3734 2689914 2703217 2589207 2821759 2737511 3093934 3085117 2670455 2564564 2643250 2929158
3724 2929158 2777158 2638938 2796480 2791912 2605393 2881843 2897034 2912358 2750565 3084913
3714 3084913 3022440 2887229 3071611 3191543 3214833 2922838 3002682 3094802 3291437 3227964
3704 3227964 3347027 3400363 3338651 3115740 3553732 3551711 3494452 3923850 3949083 3696552 3287949
3693 3287949 3154308 3117495 2987916 3273866 3278145 2952856 2909983 2840132 2810463 2672074 2711728
3682 2711728 2742124 2592917 2483989 2817803 2824995 2722654 2824410 2458388 2778888 2582400
3672 2582400 2212875 2421787 2343079 2299471 2106137 1811544 2035299 1806405 1847172 1695664
3662 1695664 1509642 1356120 1389087 1393495 1576464 1566530 1580104 1331013 1435608 1506019 1465248
3651 1465248 1700905 1431793 1378008 1285099 1306674 1234461 1229310 1402906 1211851 1419978 1361455
3640 1361455 1424194 1218926 1076734 1037215 859983 1101087 1106360 914682 805719 470526
3630 470526 944201 1227188 793612 530473 394761 616919 376620 457772 728377 771703
3620 771703 635496 841580 898236 980941 910895 744525 825563 833640 546539 446055 473438
3609 473438 789077 715075 853986 864917 813989 632205 654879 677227 489762 508032 533917
3598 533917 697784 721913 635154 640587 597549 633036 465416 580932 679999 637948 655347
3587 655347 521479 538332 560927 538091 563284 757330 834795 711280 462587 499764 494796
3576 494796 451161 749065 765981 665666 438213 509120 724805 936237 812850 589673
3566 589673 458085 305969 499012 553647 500873 466342 565672 575612 549559 870290 437696
3555 437696 441891 407612 637309 580523 500139 600438 513095 357009 264548 279655 317846
3544 317846 672490 402273 361773 278345 214190 336560 291943 383914 427488 284548 442436
3533 442436 371292 371330 230477 475579 450725 410488 475821 143606 464647 506172 449612
3522 449612 269689 114576 46425 21033 -41872 -121213 338154 586286 98579 276504
3512 276504 233604 174102 352437 356075 429785 566041 330835 298177 526928 561558 688000
3501 688000 574881 644179 778017 489044 317144 358796 227804 244691 34225 306618
3491 306618 326311 214503 218567 257599 -15003 110806 179071 13857 251645 237304 298360
3480 298360 433476 499380 284487 101981 557539 234275 136737 391337 32484 -40324
3470 -40324 251066 116977 127112 114457 374710 411281 409255 563539 366860 336638 428027
3459 428027 106574 6484 286001 220698 107342 220845 323697 471414 205193 13677
3449 13677 417280 67209 -202909 97246 192701 103418 166714 57734 391508 473324 328812
3438 328812 157422 181803 -13326 233243 359225 207619 198184 125608 494122 482212 244073
3427 244073 234904 408692 395836 132574 154563 291379 386186 324609 531116 573330 391114
3416 391114 282140 460076 394502 276972 216114 78387 -84210 -24577 187106 183200 237717
3405 237717 307166 270317 269225 149859 16372 -118607 125908 44796 69259 241231 120983
3394 120983 176620 -44283 355096 38640 22166 91288 283965 276783 249197 458020 673886
3383 673886 249204 563369 670817 514579 232623 349348 -55526 165210 352558 403958
3373 403958 158839 176399 630661 341224 249544 229901 246064 -63807 -22965 151776 387304
3362 387304 304703 15871 -136672 216434 174493 252633 22539 -199874 3294 -115620
3352 -115620 -218651 -280384 -128566 12821 143292 166433 122337 407810 201034 165929
3342 165929 277134 352092 408195 284367 445832 320046 68409 2505 -48911 78214
3332 78214 103050 322311 139355 214008 289284 451909 433864 305037 240148 475262 426223
3321 426223 87060 176721 451342 343500 264947 276098 326511 220244 272008 446206 265043
3310 265043 419254 463380 329594 -11265 -263414 161435 259468 171483 313080 398993
3300 398993 229735 374897 240029 197207 334751 134401 103864 400735 364696 125791
3290 125791 337508 441374 438331 48823 29518 156586 291524 161655 469166 616523
3280 616523 191093 49518 166989 304046 251683 157314 313072 530427 390537 114552
3270 114552 -338658 195879 127971 -26742 78551 60708 40724 170122 16179 355723
3260 355723 524184 317588 210329 197650 231926 30322 -164399 250143 400518 255014
3250 255014 82360 213791 162573 -73882 33613 249809 219555 229035 314512 165323 -18468
3239 -18468 127147 88998 198861 35456 106795 82963 -198380 155655 152899 107584 274792
3228 274792 383009 294062 -41249 145809 326389 431027 472582 193122 353032 117685
3218 117685 167878 185103 512963 477961 437173 145360 106713 27944 -123747 -170735 -8254
3207 -8254 81787 61216 -67553 -182063 -237064 -98691 23542 480297 451168 -92022 146974
3196 146974 421578 459504 341728 83967 374100 122522 66999 220376 202551 432544
3186 432544 267066 76462 209399 326852 295813 381719 537426 133228 390664 284079
3176 284079 669794 514043 633840 550562 484403 557604 324312 397823 354329 549442 503571
3165 503571 468031 203162 428949 783289 773414 1010673 1083294 697598 715960 595664 664027
3154 664027 986875 735737 819420 878343 1040055 1217441 1141415 1343234 1468243 1716925
3144 1716925 1790545 1667075 1714098 1764060 1710461 2060188 1970123 1670082 1818129 1916828 2227703
3133 2227703 2320293 2431024 3087339 3341848 3371515 3524069 3675977 3687441 3652252 4133142
3123 4133142 4471533 4922460 5048359 5397954 5580183 5772462 5833626 6506857 6993676 7655010
3113 7655010 8515877 9004487 9906566 10793325 11813664 12956389 14441476 16521244 19339707
3104 19339707 23361938 28338142 35574099 44123078 47635655 46629204 39338785 31122469
3096 31122469 25133266 20708195 17531527 15186114 13585467 12684843 11506246 10363002
3088 10363002 9363106 8808275 7713444 7047136 6149065 5868207 5251733 4762320 5035501
3079 5035501 4226721 4199357 4100650 3711645 3692780 3796253 3753196 3117309 3191379 3305058
3069 3305058 3088784 2893918 2929064 2891756 2237434 2578398 2458255 1889810 2153708 2162112
3059 2162112 1923585 1995245 1991083 2002171 1871952 1663737 1704961 1481360 1530748 1704403 1791874
3048 1791874 1500533 909484 1109441 1114983 1293615 1131213 1007817 1106364 1018819 914836
3038 914836 734859 295269 522452 881417 879661 876802 1015122 595098 680650 824011 725152
3027 725152 700621 622335 608436 679706 538977 345878 557119 377446 273015 769993
3017 769993 656184 487140 332076 243743 235925 556375 361666 527253 624711 640998 413452
3006 413452 641216 446122 -83422 126984 354641 430232 337000 507465 534987 183916
2996 183916 202238 359746 110679 -26917 220312 345717 269595 505531 320300 130942
2986 130942 369242 211721 291202 724977 498784 652211 310989 61154 229947 55586
2976 55586 159136 467487 247309 79056 356767 559366 421756 127560 183468 420579
2966 420579 338872 324518 323974 339296 429287 599489 292032 148615 100283 157008 442729
2955 442729 381054 454599 209586 39119 -113241 -159221 1576 196625 502923 349334
2945 349334 221613 127441 100183 8919 265568 320617 10941 8300 -114570 -299708 145724
2934 145724 -51382 -287400 -186995 -10140 -109049 248492 177302 111569 41598 -90309
2924 -90309 -111102 -50885 390933 358978 -66485 -50768 175285 181830 75867 -35915 162331
2913 162331 114744 192778 375898 75075 187110 560409 371447 302626 307299 146645 150317
2902 150317 349834 130009 43778 212414 678764 386420 301823 461821 251959 33639
2892 33639 149879 279835 247833 39891 96274 -92529 -2859 -110482 -200157 171515 241741
2881 241741 254282 161628 306496 401348 13659 286068 -74017 40613 320668 147909
2871 147909 48299 -163365 -328399 -126527 -34727 36022 372007 114136 -206680 -107153
2861 -107153 194117 462784 256357 -155636 -418916 -151897 -47040 -85022 84708 283534
2851 283534 402404 290349 83090 112434 24023 -335424 -192291 -58290 117421 238651
2841 238651 38960 15055 -15872 17318 20824 -155896 -102179 28891 -62798 225781 31757
2830 31757 61688 194929 89250 204369 95763 -99869 -86278 85516 -53271 -256650
2820 -256650 -340727 91242 -135686 -278408 -296581 268167 133831 255615 291437 94514
2810 94514 -167093 -38537 -64092 -307178 -351801 -210041 -22046 51578 117216 104446 -263525
2799 -263525 -132746 181831 250189 -120062 -126333 -88901 -286496 -88413 -2086 84456 39454
2788 39454 53926 186892 120752 161492 89062 -230862 -175704 -170889 24374 -8570 -177855
2777 -177855 -52668 -293983 -3811 -136436 20498 -126027 -368125 -2814 31267 -109366
2767 -109366 -116712 117328 -188937 -174973 -215540 -61120 -35925 34132 -42549 53951 -160888
2756 -160888 -316645 -441103 -278775 -264964 -557729 -212740 -49366 -46946 -15403 40499 -194494
2745 -194494 51345 34268 -131692 12911 -166663 239165 498016 129879 -98886 106809
2735 106809 181391 28701 -213628 -132719 -17077 11651 -46461 -75204 257248 111487 122495
2724 122495 91976 169852 -70146 -147526 -8513 -204829 199963 -7661 -70264 99683
2714 99683 -13922 -24278 8519 -52738 48042 106594 -67344 -265452 -248059 -231903 -238761
2703 -238761 77155 447475 103068 206270 236690 271384 203001 110205 11203 94921 -164090
2692 -164090 60560 120007 242834 198173 24428 9222 -236215 13005 -304532 52780
2682 52780 -36559 -322464 -238336 -104627 -85960 321457 207095 231970 109719 7994 -53615
2671 -53615 176260 233307 92678 89955 -5572 -103449 -71881 44364 213861 244917 245019 352776
2659 352776 167715 -28242 -206282 -52317 -36797 -58507 168752 371469 124040 200191
2649 200191 98296 58319 147386 241864 250625 159621 -35473 40931 32896 175233 -56689
2638 -56689 -96751 -152158 11059 26263 30790 -40401 -87852 -156565 -7526 -189822 -352607
2627 -352607 -86892 -107253 -28369 72723 147414 43219 309321 76818 -44491 134741
2617 134741 -151836 29026 192932 102910 112122 -53601 103831 105242 210297 215301 -85708
2606 -85708 -105224 119337 -24137 27409 85230 43811 -4735 -28643 -18086 165711 191899
2595 191899 -80672 -115949 -143796 -246932 -51860 -220456 -214954 -163883 -360859 -489214 -393270
2584 -393270 -339250 -282915 167472 -22684 -71866 -165100 -136124 -52126 -215860 -290618 -98541
2573 -98541 -160339 -120187 -20591 -122926 -55316 -15466 187465 175001 138900 209949 563680
2562 563680 54651 70554 -21139 -173797 91160 -21257 -167946 -143406 74870 105712
2552 105712 -123599 -50406 -223336 -120558 -353569 -173722 83899 -108209 -218083 -191716
2542 -191716 52935 -25372 -72511 -122727 73144 -68118 -94887 71226 52565 104367 -108081
2531 -108081 -250261 -432877 -193762 -233385 -215125 -279888 -134970 147731 276351 -181172
2521 -181172 -63020 145317 -157858 157841 -35172 112312 442633 207590 62913 -120833
2511 -120833 63468 -18099 25962 -15670 157969 141465 -151883 93991 -4182 -147549 -162449
2500 -162449 -86661 15235 276706 300195 169605 -247196 -15672 246 -15369 -354295
2490 -354295 24779 -52975 105938 70662 292759 133756 39729 127624 -114574 -441642
2480 -441642 51092 65738 -409645 160184 392054 296971 222459 60565 -45029 -96539
2470 -96539 93163 158662 21444 2161 60155 -16148 -123382 8030 -215151 -319159 -46382
2459 -46382 261417 264523 284990 -20400 -94663 6586 16763 -26304 20775 130202 -137173
2448 -137173 -423081 -373870 -360034 -236537 -214873 -220531 44816 10826 27997 -26026 -155449
2437 -155449 111762 104601 20748 -63261 -157441 -376733 -190803 -239124 -223186 -72213 10219
2426 10219 238972 4568 4101 128016 -110438 200177 23791 129524 228733 324071 -16575
2415 -16575 -403744 -213935 -274922 -164045 209906 333983 28974 -300507 -156613 117921
2405 117921 79031 251229 145908 -122608 -288131 -52205 -136845 -87576 -33794 9024 -61742
2394 -61742 -179375 24630 -203386 -68917 24494 198336 371509 302907 147931 18911
2384 18911 99594 9595 -30188 125958 339398 200837 -15191 100692 -12561 -120786
2374 -120786 3836 -155984 -281989 20556 116439 102676 80167 34618 349989 141503
2364 141503 158284 179477 128764 326204 261751 138993 79016 143059 99875 -107214 -16133
2353 -16133 -81859 23083 55578 187214 54567 -69648 267238 8015 -303450 -248068
2343 -248068 47576 160494 -94391 -323981 -288275 -35708 -72228 53528 -150797 -79013
2333 -79013 -162090 -303874 -325365 -255809 -284068 35994 -59297 -73681 134789 104366 77363
2322 77363 195908 106626 -140380 216348 -269882 -27175 196791 73977 -49097 -79930
2312 -79930 -202018 -82310 -38557 18199 159357 27460 -118257 -184608 -459274 -150442
2302 -150442 -125603 60226 -37293 -55980 -201688 -217776 -129270 -199451 -18956 -28819 -158762
2291 -158762 -248237 -58596 -318849 -180852 -27071 -36256 -24865 -283920 -106391 -370855
2281 -370855 -335703 -353663 -225409 24250 -155255 -48153 -96061 -82600 115740 466029
2271 466029 298011 -144577 181748 225859 96250 -19391 -156267 -150557 -49235 -78528
2261 -78528 -279659 -420303 -355285 -140437 -238437 -98203 -380689 -457153 -410305 -340727 -27510
2250 -27510 -30460 138993 169670 -90578 80976 -180059 -236359 132518 -117477 -419275 -235362
2239 -235362 -30990 226656 48888 -8434 -71249 164470 41074 -161898 -303985 -226002
2229 -226002 11467 -126025 -130104 -510717 -343412 37189 -192299 -28252 149038 158316
2219 158316 41061 221426 247682 159516 -24020 -351299 -131922 48140 -50976 11488
2209 11488 -173796 -133148 -213572 -89276 -120478 16990 -309118 -252904 -23314 124911 -82619
2198 -82619 -283738 36727 -4377 10621 -117850 -233895 -363202 122878 -42018 28427
2188 28427 114962 55256 140124 72261 12684 -164336 -40658 -33204 -115878 -215587 -59681
2177 -59681 165773 220971 -75069 75074 -192934 31608 75022 48205 -10456 -47966 180655
2166 180655 -196992 -20721 -232020 -115352 -89167 -89499 -160667 73840 -356340 -636829 -464152
2155 -464152 124765 -135635 -117381 -1750 86566 194562 9742 -121338 -6056 -97606
2145 -97606 -8905 118497 -28645 -26606 22401 -317045 23492 -168326 -373143 -327979 -448991
2134 -448991 -281457 -243352 -202871 -66692 -202597 -66329 80360 -299024 -597341 -253061
2124 -253061 129986 164144 84179 -92077 38093 86835 -10770 -48618 -95066 -464006 -158942
2113 -158942 -175703 -144138 -209291 -355881 -265314 -285233 -189730 -56406 -394696 -294437 -236604
2102 -236604 -143697 226454 192602 37453 56045 14633 -133774 -123085 -162860 -203144 145627
2091 145627 268110 264982 202032 1232 -159478 32403 -171734 -186562 -187095 -14918 -240783
2080 -240783 -348536 4410 123415 23193 145658 -215489 -63440 191749 -132341 136866
2070 136866 -44817 178498 447733 319374 41516 -70799 16066 -24676 22439 -197984
2060 -197984 64097 8591 -91363 -172819 38885 -206490 -171686 -96121 33911 116815 -188610
2049 -188610 -206871 12372 -28089 -25482 -154804 -63716 -289796 -476588 -365543 -307760 -222604
2038 -222604 -160843 -297572 -195922 155141 15713 73906 -111296 114800 61385 189580
2028 189580 291452 -84796 -41495 1701 4192 105384 110542 72854 -327249 -97786 -69678
2017 -69678 -29583 -155328 -318196 -347935 83307 -154355 -155773 -223411 -276241 7404 -22784
2006 -22784 70855 155104 106787 24077 -152075 132235 -157094 183214 30827 12189 19527
1995 19527 -968 243088 46477 -90968 98239 263350 119484 17527 -320543 -296401
1985 -296401 -108230 -154378 -16728 103151 -75393 116973 129084 143080 -39430 -10280
1975 -10280 221170 -38602 51322 44576 -156288 140026 -213072 -109335 -127197 -330781 -226102
1964 -226102 188776 236422 56141 -21808 193226 273771 284697 145796 -396243 -1415
1954 -1415 78640 198235 113615 38180 137474 102395 -95024 -75981 268313 99222 226798
1943 226798 38899 -43935 -19897 5818 -97662 -69487 -230712 51741 133023 -2213 38706
1932 38706 -177651 -80579 4997 -89094 -369571 -398056 -129535 -177054 -467609 -186831 59945
1921 59945 13672 19713 -123011 -74418 61487 46006 7738 26823 -6755 -190125 -71512
1910 -71512 265924 124758 65682 -122099 -204180 -51658 24554 -172165 -239927 -304733 -143302
1899 -143302 -181678 -91816 404602 177601 328190 100480 -123087 119596 141364 -84151
1889 -84151 -68785 -148496 -92024 106037 129243 30014 72414 -180788 -274584 -17416 -81246
1878 -81246 1609 -237339 -97127 -145663 -64631 142234 3838 -208546 -312655 -69988
1868 -69988 -44202 -91511 105802 112565 93157 51160 -168803 -153123 -231200 -162498 -154054 -234554
1856 -234554 -189223 99015 114708 -75012 -65673 -168249 -312485 -243777 -65470 -121015 18008
1845 18008 -60324 36913 885 -73672 -218271 -208935 -249676 -112876 -52463 -174685 -104257
1834 -104257 -288414 -188270 -161659 -135757 -199729 -227595 25983 12224 -329210 -130808 -443672
1823 -443672 -463673 -78022 203686 112063 -173393 -30675 -98482 78747 -44121 59390
1813 59390 29556 -26236 -118311 64374 125912 61540 214498 118613 -333353 -205551 78790
1802 78790 -194556 -333700 -18787 112321 -378723 -197545 -437185 -461001 -172074 84290
1792 84290 -64775 117868 227612 28476 105531 275046 -34557 -288218 -61236 33986
1782 33986 46311 24180 -271088 -400803 -352183 -171229 -2389 -133002 -25998 114059
1772 114059 -120735 -168747 -198705 -142839 -294893 -186295 -281554 83367 371712 208459
1762 208459 -37081 -476276 -254849 -37867 -57312 -340985 -197376 -344377 -291882 -156962
1752 -156962 -118865 -355515 -65764 113411 87403 36305 8859 -134651 -198667 84368 70181
1741 70181 -45657 -229551 -380668 -186939 -88984 -253931 -214934 -51517 23453 190209
1731 190209 49356 -373283 -221044 -92243 35958 75811 -124874 -192169 57542 -94308
1721 -94308 -173738 -118822 -23730 69654 249597 -127431 -83247 372907 547728 171550 121620
1710 121620 169190 -54879 19707 -58224 108688 -53433 -146184 -207285 -166728 79656 133174
1699 133174 134982 -7759 -47430 201809 140951 -179604 -292282 -296827 -269219 44258 110620
1688 110620 -27356 111097 -265456 -224371 78563 -82581 -167048 -60481 -61883 140047
1678 140047 29654 -93345 241210 -50527 58206 125610 49581 -18699 -71632 -204843
1668 -204843 -145437 -190040 -21012 -142189 31983 -29381 -376293 -394672 -98240 168761
1658 168761 105003 -133758 -147832 -240301 -56894 -138791 67987 292949 296032 170090 114455
1647 114455 -10628 -128995 -160414 -61969 139982 49111 26810 -46393 128267 -182120 -122959
1636 -122959 -20621 -198433 -109251 31953 37914 -188862 -434222 -393544 -138320 -260129
1626 -260129 -257910 -411283 -393066 -270473 -29647 -178325 -317744 -107826 123776 110955
1616 110955 -306497 -36989 -320068 -290082 -210651 -269291 -361057 -81779 39312 -141709
1606 -141709 -345749 -330826 -236626 157 -244477 215700 200424 97089 -42384 -435859
1596 -435859 -300041 -16915 -121820 159229 147086 -101812 18369 -134490 247767 180428
1586 180428 -136838 -21640 59538 -47315 143943 29105 -91843 15968 -262491 -257423
1576 -257423 -212427 -150702 -204335 -103302 -119102 -173871 -116153 -277648 -181658 409661 351429
1565 351429 371235 -20128 -628172 -407957 -281922 49411 -24565 -43702 -82143 -85740 -220806
1554 -220806 -155316 -68230 -63270 -20987 114933 -190981 -97603 -97624 -52509 -42365 -60223 -211062
1542 -211062 16199 -38033 -438872 16855 324957 -31803 -92897 17632 -20382 193083
1532 193083 240042 13222 -289687 -168991 -185462 -15995 -106644 -100554 -133463 -222177 3611
1521 3611 173295 136765 37519 76409 196182 254799 -28423 122798 -81612 -227199 -43923
1510 -43923 -204602 -262204 -343199 -250338 -354388 -139973 -38450 51565 44501 -111747 1356
1499 1356 -296884 -385942 -294306 -299159 -138699 -5978 -193923 -34754 -63015 29436 -229259
1488 -229259 -370098 -115990 -294043 -103378 -128312 -395765 -215168 -51690 -51270 30329 39371
1477 39371 52291 -132736 -343040 -90940 -184706 -282653 -165037 -300803 -34283 238868
1467 238868 137339 -7100 133225 -209659 -427521 -271537 -425404 -176913 -198867 -236724
1457 -236724 21976 115222 123399 -60520 -351544 -52857 -29764 -60842 54177 142710 190206
1446 190206 -40687 -274881 -130594 51634 -225406 -214442 -337477 -462891 -250729 -80254
1436 -80254 -350341 -315863 -10513 -135083 -393280 -380730 -188911 102897 121192 -108819
1426 -108819 -257518 -234233 -27544 -302630 -269687 32973 -137897 -103119 -229308 -169425
1416 -169425 30955 352750 30329 -25680 473 -300111 317516 -60614 -303958 -121665
1406 -121665 -161682 -200245 -40408 58866 -230964 -162245 105515 174880 48406 -121893 -275298
1395 -275298 -157666 -260921 -236177 -259887 -97911 8956 103291 148411 -94843 156410
1385 156410 106469 11019 102510 -120842 14590 185553 194914 54910 -67330 82281 -58970
1374 -58970 -214792 -309451 -221695 116808 27702 35989 118386 187292 -197238 -127689 65529
1363 65529 -326836 -317276 -119818 170434 -75794 2342 188283 -56129 -182431 -102820 -225896
1352 -225896 146017 241209 -26091 529 119369 280201 -34418 -73119 -119538 -97544 56102
1341 56102 -171115 4607 32785 -3233 -165129 -221860 -60805 -26570 -93263 -298038 -36277
1330 -36277 -149911 -278456 128595 84679 97036 27958 -160894 -298597 -372008 -186582 -145281
1319 -145281 -157426 -8500 77216 -77148 -119911 10137 116541 -49132 -86922 -79754 388883
1308 388883 307107 -232940 182620 338278 62883 105727 58079 -138202 -113920 108380
1298 108380 35569 -139237 -127193 266290 -53693 84643 117757 -47947 261476 14241
1288 14241 -219519 -80883 -45746 -66942 -93067 142189 91410 51917 167348 167451 49229
1277 49229 -106114 -120894 220796 305348 -152534 -144749 -183268 45790 142925 218586 199584
1266 199584 318576 251785 -37945 -106803 -67177 127163 -163169 -235812 -82203 -45783 -94566
1255 -94566 -126279 6617 -134213 146909 228333 -162702 -255796 28695 237283 284358 26586
1244 26586 -79770 -84245 61826 43106 -13892 -15870 15045 90599 225435 570598 49999
1233 49999 -58552 155310 37550 -83581 -153819 -216497 -353176 -345845 -160293 114684 -2822
1222 -2822 -177156 -183823 2673 76653 135195 215712 235948 36050 117177 108897 61984 -10865
1210 -10865 74123 37891 186937 336079 295696 351118 263868 110760 -130900 3987 -172168
1199 -172168 -400156 -137079 33011 -6806 132231 187626 -52719 -78761 -203444 25845
1189 25845 144605 142028 27889 49208 89062 118237 220376 -113764 4549 -194097 -85596
1178 -85596 -18114 -83302 -95522 -330909 91161 -156778 -196629 -56201 -111644 122232 229934
1167 229934 -3355 -250353 -238393 90569 -38603 -176555 -65889 119524 93099 -88598
1157 -88598 344782 70929 293918 93119 -137792 -134373 -235182 -56476 5132 -116708
1147 -116708 227808 109915 -91670 46598 27685 -30174 93321 111119 20298 299772
1137 299772 40351 -274747 -55639 108846 -61431 -238407 -181213 -244375 -207903 -91391
1127 -91391 -319648 -61201 -7004 124320 228019 190402 34759 77879 200959 217159 -74594
1116 -74594 -145372 129200 -143299 -208714 -84137 350607 311138 376736 297866 -89265 -404921
1105 -404921 -276668 -157988 174359 287737 -263207 -15569 -120044 -210516 -97363 -155430
1095 -155430 95064 278334 209104 -13438 85444 -41194 -170962 -35497 -118835 -151111
1085 -151111 -314595 -132567 -369417 -297476 -312113 -357967 -292463 -326293 -300190 -390925 -109469
1074 -109469 91783 155176 69551 262780 70435 -46847 95808 182744 127214 175201 136506
1063 136506 170256 96077 42004 -209345 -131686 -83309 145244 313067 288974 177729 54056
1052 54056 107302 239159 265507 217630 207448 -43833 -60514 113066 143887 452336 455114
1041 455114 368958 263252 247298 -80449 -142582 -30286 -131396 -380353 16563 -147260
1031 -147260 -78891 53043 -197833 108802 -201912 -102768 157323 390080 111684 -120519
1021 -120519 2653 -8091 -111621 -46264 -174250 -136473 -302892 -211095 -75170 -71462 18357
1010 18357 169787 149142 108616 -204810 131073 360974 227186 231714 73189 -79947 19766
999 19766 -64511 -94301 -197991 -96091 41734 244721 239943 309550 -35012 -200002 -402842
988 -402842 5628 73500 140581 44569 -165865 -95174 72884 67683 -22667 12592 -13372
977 -13372 165468 430478 625406 298760 295445 194716 315577 133495 -370061 -180880
967 -180880 103899 -3152 -142022 436184 377980 9988 -205734 -115040 -54278 -87388 92374
956 92374 210513 359970 338160 126064 -236386 -92393 -36700 141130 226440 204845 -97000
945 -97000 21511 146791 168552 223329 78808 28031 -226200 248017 433834 -160799 -49939
934 -49939 101423 18175 65774 336724 140418 352703 42155 116531 235183 146677 -70680
923 -70680 -26726 -16120 -294363 -160514 -96710 -145421 73744 -71962 -144058 -141644 157522
912 157522 90150 -40846 -224250 -360040 -106180 -121538 -34420 75168 150390 107364 -171236
901 -171236 52084 32411 53277 48690 -124475 -62884 -171251 -421632 28052 -18818 -220753
890 -220753 -123985 -148813 -100048 -289398 -314120 5817 -181971 -362747 -50175 -93987 47053
879 47053 -77350 -47069 -17581 50813 169294 312407 57525 -23680 -4726 105478 116789
868 116789 118731 260730 525051 90189 253702 192313 116606 -50524 -123102 -178038 -201080
857 -201080 -108391 -180026 -137292 237878 90298 -167413 -12842 -4281 330344 -40280 -586119
846 -586119 -353891 -64354 103 -43670 -98533 72302 67444 -160748 13959 170577 139949
835 139949 189484 -88688 211671 23185 -5653 -157245 -184328 220044 -25505 -325924
825 -325924 179504 181227 14695 -102059 6842 414276 315379 -274858 -149482 154293
815 154293 110495 -21909 -99679 -2891 -66586 -160956 -256013 -66753 -70304 24469 108135 -163220
803 -163220 -62950 -432123 -439830 -242365 -248579 72410 296006 381631 121053 -115395 -298133
792 -298133 -26177 54884 349595 87378 465431 222502 195183 -139899 37629 64535
782 64535 139338 176813 70437 68280 -11105 140952 65762 79922 378593 211794 59357
771 59357 157807 -247118 -120322 -11602 111021 170670 212703 120560 20279 -142551 -174027
760 -174027 55657 303128 -145241 45773 43570 106101 142603 223638 156094 229936 151949
749 151949 36451 -120395 -8838 -132835 68545 45975 -49507 -52563 21390 171017 36222
738 36222 -66774 -90284 -31028 -17551 129462 -203366 -114825 -35150 -117559 42979 6791
727 6791 -4479 -83522 145409 -11209 15999 145137 281732 300045 415140 121650 60146
716 60146 -27295 176335 237180 64336 279410 242079 254709 96374 10629 132441 27187
705 27187 -7891 255167 -282032 58879 -87634 -170564 110687 37468 -1611 229889 236044
694 236044 64004 -118576 -104655 90033 229539 181133 91908 -55387 417588 574090
684 574090 390798 173882 132817 47023 -148152 -289120 -203836 242257 217760 461953 313999
673 313999 19309 -66797 -44215 144900 50625 28094 -83717 122079 -128517 44061 113345
662 113345 302682 183059 -44334 68254 227555 350036 55057 31692 -186004 -77419
652 -77419 183306 102516 304099 406881 363979 186271 295711 102461 38857 -157923 -144488
641 -144488 63826 113460 336817 254344 420022 227026 238083 132797 -76000 -262113
631 -262113 -340571 -260581 -127784 22270 -120212 -229438 -178502 3814 -206546 -39100
621 -39100 5770 184793 412454 308082 228013 55432 35939 28686 108504 55460 177200
610 177200 188489 387216 249639 311053 398980 254270 54669 -22682 -66241 -62197 -29535
599 -29535 60811 -8213 65685 -59655 -5746 110237 184731 29414 -48933 257607 167288
588 167288 -60808 -67843 19192 518233 135699 -97603 127026 235364 74192 486729
578 486729 461637 58563 227206 112700 64091 229718 190924 202404 64303 296256 23295
567 23295 1509 25365 -273 86428 -120496 -74180 -137602 -121923 33066 -28761 -96770 -82023
555 -82023 -190956 113483 139531 128156 -1218 44621 237414 334481 149015 69968 133748
544 133748 -89016 81139 74200 67245 106588 107363 151452 -70812 11740 84289 266361 -4236
532 -4236 -151068 -239425 -52408 16290 214471 87815 -16849 -249144 -118667 -54197 -232459
521 -232459 53885 94820 -80256 -12655 295618 64261 -122950 165027 122644 315490
511 315490 426257 331701 12063 -18369 -181625 -125465 59661 -150469 56560 45057 32744
500 32744 107346 295201 309802 103065 -226975 1272 50557 131483 249501 157361 6875
489 6875 -363379 39702 147704 -183901 -129803 26541 -44152 42827 113266 93684 103893
478 103893 115699 152964 -193369 97082 24107 12521 372248 398402 540048 192200 -107378
467 -107378 105259 20121 -147981 47498 257577 56697 -55125 231979 303761 303355 -76869
456 -76869 -134750 -5899 -33520 200747 -215534 -98001 -5211 -77064 79288 144701 77236
445 77236 -65513 143905 -46102 102002 124944 33318 170403 163345 -126973 103268 252478
434 252478 297948 185635 177328 90563 48916 -50999 84403 144924 -314734 -315472 313642 295896
422 295896 85703 -80412 -270084 33797 -151281 98612 114748 -106849 -101313 -34157 777
411 777 2962 333790 132471 321620 -6588 47124 266178 112558 135492 78334 526138
400 526138 308348 139351 -78112 -64989 162920 147025 41987 194034 226818 46962
390 46962 -38827 103754 -43737 -35472 -199388 -55744 169363 174266 312437 325045 36218
379 36218 -31108 19459 -96032 158683 168438 319440 218997 304943 392485 113133 -116601
368 -116601 219934 330379 148356 101689 269746 -60194 290957 -264 -149700 156931
358 156931 -117265 184265 -201508 -86252 -20811 261726 204112 249530 -12570 -37980 192266
347 192266 407101 419911 293853 214504 164760 146171 173522 316774 368237 503677 185646
336 185646 136574 184246 253813 226351 170878 292646 458477 422874 47668 -69233 -113573
325 -113573 66871 193255 -22586 11762 -59655 -65061 61470 165729 186768 -174573 -338207
314 -338207 -111793 249885 194333 381270 179827 100506 -335711 -214368 6469 198681
304 198681 12686 32482 120374 111042 -45206 -53520 210524 237105 205632 95039 93062 39605
292 39605 22303 39954 50798 159125 408554 378814 221076 422976 439141 395106 297207
281 297207 195907 77010 -95467 -69167 52251 244406 177309 106339 -349514 245748
271 245748 344378 339656 62979 -43204 81088 210091 192889 335855 1731 111858 188094
260 188094 109968 221974 271412 -16932 -4236 184920 -98504 -204099 70088 -193532
250 -193532 119081 509150 308408 374261 363487 95684 169953 328402 260204 439515 125791
239 125791 116825 47919 353901 22478 23809 212411 207370 309372 240642 127510 125405 334000
227 334000 238265 -34564 -216756 -184845 3207 140447 39276 100681 245778 122937
217 122937 61851 209453 -47041 -120694 5980 225260 198625 4974 127627 243617
207 243617 102340 -17491 240195 316305 -34808 20600 452066 191366 6380 120429
197 120429 78478 347178 277387 137153 87658 209627 287770 249124 141818 72328 -96294
186 -96294 -183108 -148305 50394 -72853 -67822 -125366 315913 529215 347406 229841 117153
175 117153 49173 -27794 96218 -15270 -159635 178580 416541 308864 38986 -70793
165 -70793 25178 309130 23362 145375 370079 376531 48678 24440 233822 265005 448418
154 448418 162245 -26951 7997 391763 354523 240422 305919 189700 3999 201669
144 201669 183134 126511 -3470 398879 273220 45287 78609 470897 348361 209537
$$ [...]
##END NTUPLES=NMR SPECTRUM
##END=
