##TITLE=1H_EC-3334(III-22)
 CDCl3
 8 sc, 
 2.11.2024
##JCAMPDX= 6.0         $$ Bruker NMR JCAMP-DX V2.0
##DATA TYPE= NMR SPECTRUM
##DATA CLASS= NTUPLES
##ORIGIN= UXNMR, Bruker Analytische Messtechnik GmbH
##OWNER= root
$$ XWIN-NMR		Version 3.5
$$ Sat Nov  2 14:11:49 2024 Russian Standard Time (UT+4h)  she@DPX200
##.OBSERVE FREQUENCY= 200.1318
##.OBSERVE NUCLEUS= ^1H
##.ACQUISITION MODE= SIMULTANEOUS
##.ACQUISITION SCHEME= undefined
##.AVERAGES= 8
##.DIGITISER RES= 18
##SPECTROMETER/DATA SYSTEM= spect
##.PULSE SEQUENCE= zg30
##.SOLVENT NAME= CDCl3
##.SHIFT REFERENCE= (INTERNAL, CDCl3, 0, 21.0149)
##AUDIT TRAIL= $$ (NUMBER, WHEN, WHO, WHERE, WHAT)
$$ ##TITLE= Audit trail, XWIN-NMR		Version 3.5
$$ ##JCAMPDX= 5.01
$$ ##ORIGIN= Bruker BioSpin GmbH
$$ ##OWNER= she
$$ F:/spectra/data/she/nmr/H-F/1/pdata/1/auditp.txt
$$ ##AUDIT TRAIL=  $$ (NUMBER, WHEN, WHO, WHERE, WHAT)
(   1,<2024-11-02 14:06:07.29 +0400>,<she>,<DPX200>,
      <created by zg, POWCHK disabled, PULCHK disabled
       configuration hash MD5:
       00 E9 B6 7A A2 85 ED C7 34 08 36 98 17 FE 4E 26
       data hash MD5: 16K
       74 13 95 49 55 F0 99 CC 9B 9F A9 FA EF FF 51 F7>)
(   2,<2024-11-02 14:10:18.39 +0400>,<she>,<DPX200>,
      <Start of raw data processing
       efp BC_mod = 2 LB = 0.24 FT_mod = 6 PKNL = 1 PHC0 = -26349.7 PHC1 = 10.98743 SI = 16K 
       data hash MD5: 16K
       41 75 B7 14 A8 7D 93 48 16 20 B8 CA 2C B0 EF C7>)
(   3,<2024-11-02 14:10:38.09 +0400>,<she>,<DPX200>,
      <pk PHC0 = -154.2665 PHC1 = -2 
       data hash MD5: 16K
       D6 CD 8B 46 D3 56 5A 8C 8A B0 57 F2 FF 52 97 5E>)
(   4,<2024-11-02 14:10:41.45 +0400>,<she>,<DPX200>,
      <abs ABSG = 5 
       data hash MD5: 16K
       65 76 E6 09 53 C6 A8 40 6C E9 E9 23 DD B0 05 67>)
(   5,<2024-11-02 14:11:12.92 +0400>,<she>,<DPX200>,
      <abs ABSG = 5 
       data hash MD5: 16K
       05 1B 61 C0 59 E8 66 1B D3 98 C7 66 5E AF 52 22>)
$$ ##END=
$$ 
$$ hash MD5
$$ DC EC 94 B2 50 66 1D E6 BD DC 4B 31 93 AF 7E 0F
##$RELAX= 
##$RELAX= 
##$RELAX= 
##$RELAX= 
##$RELAX= 
##$RELAX= 
$$ Bruker specific parameters
$$ --------------------------
##$DU= <F:/spectra>
##$EXPNO= 1
##$NAME= <H-F>
##$PROCNO= 1
##$TYPE= <nmr>
##$USER= <she>
##$AMP= (0..31)
100 100 100 100 100 100 100 100 100 100 100 100 100 100 100 100 100 100 
100 100 100 100 100 100 100 100 100 100 100 100 100 100 
##$AQSEQ= 0
##$AQ_mod= 1
##$AUNM= <au_zg>
##$AUTOPOS= <>
##$BF1= 200.13
##$BF2= 200.13
##$BF3= 200.13
##$BF4= 200.13
##$BF5= 200.13
##$BF6= 200.13
##$BF7= 200.13
##$BF8= 200.13
##$BYTORDA= 1
##$CFDGTYP= 0
##$CFRGTYP= 5
##$CHEMSTR= <none>
##$CNST= (0..31)
1 1 145 1 1 1 1 1 1 1 1 1 1 1 1 1 1 1 1 1 1 1 1 1 1 1 1 1 1 1 1 1 
##$CPDPRG= <>
##$CPDPRG1= <>
##$CPDPRG2= <>
##$CPDPRG3= <>
##$CPDPRG4= <mlev>
##$CPDPRG5= <mlev>
##$CPDPRG6= <mlev>
##$CPDPRG7= <mlev>
##$CPDPRG8= <mlev>
##$CPDPRGB= <>
##$CPDPRGT= <>
##$D= (0..31)
0 1.2 0 0 0 0 0 0 0 0.06 0 0.03 0 0 0 0 0.0002 0 0 0 0 0 0 0 0 0 0 0 0 
0 0 0 
##$DATE= 1730541966
##$DBL= (0..7)
$$ [...]
##$SUBNAM3= <"">
##$SUBNAM4= <"">
##$SUBNAM5= <"">
##$SUBNAM6= <"">
##$SUBNAM7= <"">
##$SUBNAM8= <"">
##$SUBNAM9= <"">
##$SW= 24.0689170037331
##$SWIBOX= (0..15)
0 0 2 0 0 0 0 0 0 0 0 0 0 0 0 0 
##$SW_h= 4816.95568400771
##$TD= 16384
##$TD0= 1
##$TE= 0
##$TE2= 300
##$TE3= 300
##$TEG= 300
##$TL= (0..7)
0 120 120 120 120 120 120 120 
##$TP= (0..7)
150 150 150 150 150 150 150 150 
##$TP07= 0
##$TPNAME0= <>
##$TPNAME1= <>
##$TPNAME2= <>
##$TPNAME3= <>
##$TPNAME4= <>
##$TPNAME5= <>
##$TPNAME6= <>
##$TPNAME7= <>
##$TPOAL= (0..7)
0.5 0.5 0.5 0.5 0.5 0.5 0.5 0.5 
##$TPOFFS= (0..7)
0 0 0 0 0 0 0 0 
##$TUNHIN= 0
##$TUNHOUT= 0
##$TUNXOUT= 0
##$USERA1= <user>
##$USERA2= <user>
##$USERA3= <user>
##$USERA4= <user>
##$USERA5= <user>
##$V9= 5
##$VALIST= <valist>
##$VCLIST= <CCCCCCCCCCCCCCC>
##$VD= 0
##$VDLIST= <DDDDDDDDDDDDDDD>
##$VPLIST= <PPPPPPPPPPPPPPP>
##$VTLIST= <TTTTTTTTTTTTTTT>
##$WBST= 1024
##$WBSW= 4
##$XGAIN= (0..3)
0 0 0 0 
##$XL= 0
##$YL= 0
##$YMAX_a= 265595
##$YMIN_a= -414921
##$ZGOPTNS= <>
##$ZL1= 120
##$ZL2= 120
##$ZL3= 120
##$ZL4= 120
##$ABSF1= 21.01495
##$ABSF2= -3.054184
##$ABSG= 5
##$ABSL= 3
##$ALPHA= 0
##$AQORDER= 0
##$ASSFAC= 0
##$ASSFACI= 0
##$ASSFACX= 0
##$ASSWID= 0
##$AUNMP= <proc_1d>
##$AZFE= 0.1
##$AZFW= 0.1
##$BCFW= 0
##$BC_mod= 2
##$BYTORDP= 0
##$COROFFS= 0
##$CY= -3
##$DATMOD= 1
##$DC= 0
##$DFILT= <>
##$DTYPP= 0
##$F1P= 0
##$F2P= 0
##$FCOR= 1
##$FTSIZE= 16384
##$FT_mod= 6
##$GAMMA= 0
##$GB= 0
##$INTBC= 1
##$INTSCL= 3.70164e-10
##$ISEN= 128
##$LB= 0.24
##$LEV0= 0
##$LPBIN= 0
##$MAXI= 10000
##$MC2= 0
##$MEAN= 0
##$ME_mod= 0
##$MI= 1.114404
##$NCOEF= 0
##$NC_proc= -7
##$NLEV= 6
##$NOISF1= 3.799351
##$NOISF2= 2.8
##$NSP= 0
##$NTH_PI= 0
##$NZP= 0
##$OFFSET= 21.01495
##$PC= 1
##$PHC0= -26503.96
##$PHC1= 8.98743
##$PH_mod= 1
##$PKNL= yes
##$PPARMOD= 0
##$PSCAL= 0
##$PSIGN= 0
##$REVERSE= no
##$SF= 200.130002755354
##$SI= 16384
##$SIGF1= 3
##$SIGF2= 2
##$SINO= 5.538805
##$SIOLD= 16384
##$SREGLST= <1H.CDCl3>
##$SSB= 0
##$STSI= 16384
##$STSR= 0
##$SW_p= 4816.95568400771
##$SYMM= 0
##$S_DEV= 0
##$TDeff= 16384
##$TDoff= 0
##$TI= <>
##$TILT= no
##$TM1= 0
##$TM2= 0
##$TOPLEV= 0
##$USERP1= <user>
##$USERP2= <user>
##$USERP3= <user>
##$USERP4= <user>
##$USERP5= <user>
##$WDW= 1
##$XDIM= 16384
##$YMAX_p= 327203943
##$YMIN_p= -541948
$$ End of Bruker specific parameters
$$ ---------------------------------
##NTUPLES= NMR SPECTRUM
##VAR_NAME=  FREQUENCY,     SPECTRUM/REAL,   SPECTRUM/IMAG
##SYMBOL=    X,             R,               I
##VAR_TYPE=  INDEPENDENT,   DEPENDENT,       DEPENDENT
##VAR_FORM=  AFFN,          ASDF,            ASDF
##VAR_DIM=   16384,         16384,           16384
##UNITS=     HZ,            ARBITRARY UNITS, ARBITRARY UNITS
##FACTOR=    0.29402158847633, 1,            1
##FIRST=     4205.72196109424, 0,            0
##LAST=      -611.233722913471, 0,           0
##MIN=       -611.233722913471, -541948,     0
##MAX=       4205.72196109424, 327203943,    0
$$ Real data points
##PAGE= N=1
##DATA TABLE= (X++(R..R)), XYDATA
$$ [...]
5982A393062j4463j14497l6914j06874N1768J639n8227N0930n5022r6426n8911
5971I56065J2394J05806L0090q4001K0254O3427p3480N7539K2139l4924P8861
5960A154170n8544O2886q8208N1186O948j8886l787O8070o7454Q13k3502N6525
5948A140217J48977j05958j0000J19643P778J45534J4867j4726J82491l3353J91763
5937A787233K29880J24374O1549M9782L2275J6318j9969K9128k0207K9015K7553
5926B346931k6256q1080j48354p3971l6195q3320o9913M6519R3281L7148k4477
5915A980313K343j7276j0289L0321m1972O2288J08867K5095K2987J8309O8926
5904B249912J48919M4263M1657J40757R6010m3379J14142O4089K00878K6677N6837
$$ y = [1393062, 1378599, 1264102, 1227188, 1120314, 1172082, 1173721, 1115494, 1166424, 1111402, 1014976, 956065, 968459, 1074265, 1104355, 1020354, 1040608, 1104035, 1030555, 1088094, 1110233, 1075309, 1154170, 1095626, 1158512, 1070304, 1121490, 1128438, 1109552, 1105765, 1173835, 1106381, 1107194, 1083692, 1140217, 1289194, 1183236, 1173236, 1292879, 1300657, 1446191, 1461058, 1446332, 1628823, 1595470, 1787233, 2017113, 2141487, 2203036, 2252818, 2285093, 2301411, 2281442, 2310570, 2290363, 2319378, 2346931, 2320675, 2239595, 2091241, 2017270, 1981075, 1897755, 1827842, 1874361, 1967642, 2004790, 1980313, 1982656, 1965380, 1955091, 1985412, 1943440, 2005728, 2114595, 2139690, 2162677, 2180986, 2249912, 2398831, 2443094, 2484751, 2625508, 2721518, 2678139, 2792281, 2856370, 3057248, 3083925, 3140762]
5893C140762O3968R3734J71284O9430J19118J46914K29629N0721J19372K88995
5883D493927K36305K32561K21433L60503L70838M11572M51045M88245M90152N71533
5873H328114N84611N68197N12246J73524J33940P8029j04888n91l0611j63750
5863A0078821k72408m25271l51810m14293l08466l09672k48045k59839j40694
5854G348323j59843j37125j50271r3070r3502j47808p9183m174K3898P9208j2657
5843F573796J00723N4787K27261K65680K23226K85688K47285M01304M78007N84091
5833I441848N28698M57999L43191J12278J4676j45678j35372J5888j08091k53305
5823A0272132l62812n80628n55186l94274n84921l78988k93116k47675l68465
$$ y = [3140762, 3204730, 3298464, 3469748, 3539178, 3658296, 3805210, 4034839, 4085560, 4204932, 4493927, 4730232, 4962793, 5184226, 5544729, 5915567, 6327139, 6778184, 7266429, 7756581, 8328114, 8912725, 9480922, 9993168, 10166692, 10300632, 10378661, 10273773, 10273182, 10242571, 10078821, 9806413, 9381142, 9029332, 8615039, 8306573, 7996901, 7748856, 7489017, 7348323, 7188480, 7051355, 6901084, 6808014, 6714512, 6566704, 6487521, 6483347, 6507245, 6586453, 6573796, 6674519, 6729306, 6956567, 7222247, 7445473, 7731161, 7978446, 8379750, 8857757, 9441848, 9970546, 10428545, 10771736, 10884014, 10898690, 10753012, 10617640, 10633528, 10525437, 10272132, 9909320, 9328692, 8773506, 8379232, 7794311, 7415323, 7122207, 6874532, 6506067]
5814F506067j70666j97029l69329k46516j98497k03625q0688k08266o2411m3933
5804D725107m6235j57891l2485m1011j56324o1312L8492J04220l2965q2776J19937
5793D376757Q4609K1870m473o8538r4596o9047k2345r6216p1711j91550j91663
5782C673097q8354j49686j19372k1149m4685q7169r0166n8523j05517m6212n2725
5771B809539o9808o6465p6568k3951K2647j32668K511O121k8831r8129N7676J08183
5759B510257Q4004o7548P8849M8482K04118J69902j874P2485j12635o6866l9376
5748B879798L7723J0857j79308l2018j2435k40747q2318n4953m7457r8361M1326
5737B222107j27417o2266n3950R9630m7665j02616Q4098p5936r587q9782l1046
$$ y = [6506067, 6335401, 6138372, 5769043, 5522527, 5324030, 5120405, 5039717, 4831451, 4769040, 4725107, 4678872, 4520981, 4488496, 4447485, 4291161, 4229849, 4268341, 4372561, 4339596, 4256820, 4376757, 4461366, 4483236, 4478763, 4410225, 4315629, 4246582, 4224237, 4128021, 4056310, 3864760, 3673097, 3584743, 3435057, 3315685, 3294536, 3249851, 3162682, 3072516, 3013993, 2908476, 2862264, 2809539, 2739731, 2673266, 2596698, 2572747, 2595394, 2462726, 2465237, 2471358, 2442527, 2344398, 2402074, 2510257, 2594261, 2526713, 2605562, 2654044, 2858162, 3028064, 3026190, 3098675, 2986040, 2919174, 2879798, 2917521, 2928378, 2749070, 2717052, 2704617, 2463870, 2381552, 2326599, 2279142, 2180781, 2222107, 2094690, 2032424, 1978474, 2078104, 2030439, 1927823, 2011921, 1935985, 1926398, 1836616, 1805570]
5726A805570J7561l1069K0615N9781K303L8229N7750J76256P4569N8561O3998
5715B344124J34208Q6372J17448J23838j52753l9377n8339K78j17482m6840j18132
5704B273345j12072j83517j72844j8947q4811j05557m1472P5809Q023P070p9955
5693A565072O7516l4165l2425R9111L0131k7754L7318O6724r5929r3392k5549
5682A556658n8191p5275m4220J1851o3227o8299j1579l7273M5306j08197k9313
5671A118241R7104q1164l1736J3897r1849j9763L8809l589r1475J2827j731N2952
5659A012523l7769K3659m7726j16034n1294N8276m534r6220J07531l5810n0070
5648G62532p4328J39003q8484k3135k2429k5066J02991L68n8631k0246l7408M4331
$$ y = [1805570, 1823131, 1792062, 1812677, 1872458, 1874761, 1912990, 1970740, 2146996, 2221565, 2280126, 2344124, 2478332, 2564704, 2682152, 2805990, 2653237, 2613860, 2555521, 2555799, 2438317, 2391477, 2273345, 2161273, 1977756, 1804912, 1785965, 1701154, 1595597, 1554125, 1629934, 1637957, 1645027, 1565072, 1632588, 1598423, 1565998, 1665109, 1695240, 1667486, 1704804, 1771528, 1675599, 1582207, 1556658, 1498467, 1423192, 1378972, 1390823, 1327596, 1259297, 1247718, 1210445, 1255751, 1147554, 1118241, 1215345, 1134181, 1102445, 1116342, 1024493, 1004730, 1043539, 1039950, 948475, 961302, 959571, 1012523, 974754, 998413, 950687, 834653, 783359, 841635, 837101, 740881, 848412, 812602, 762532, 688204, 827207, 738723, 715588, 693159, 668093, 771084, 771452, 712821, 692575, 655167, 699498]
5636F99498m9692q482m5101j7035O4230L1007M6498r1632R70k8635L640K3692
5624F28958l6547O5037p6196l8768j7692j5206O9607P7729o8697p956m7945o5957
5612D66367K2152M1037o2865L4597O4810n7430l0062q6600J3185J03116N7176
5601E65483j17486L7532J3133k2358K4913O5762N9134j59135n547o973l5100J00578
5589E19936l0281J0576L7091m4098P6149O0425o1447Q712J330N2947N6209L0775
5577G18324K3894K7255N3880O8334n7021J0220j8987Q043L7243K145o8997n5454
5565G48879l2064j78871L2148r046q3487K2700K8857k0348r9021l32J12855j7791
5553E04479j01371J6265k6917P6383p761q3609J7903o015j6304L4301J3273n7454
$$ y = [699498, 649806, 641324, 596223, 579188, 643418, 674425, 720923, 629291, 630261, 601626, 605266, 628958, 592411, 657448, 581252, 542484, 524792, 509586, 579193, 656922, 588225, 580269, 532324, 466367, 488519, 529556, 466691, 501288, 566098, 508668, 478606, 392006, 405191, 508307, 565483, 447997, 485529, 498662, 476304, 501217, 566979, 626113, 466978, 461431, 454458, 419358, 519936, 489655, 500231, 537322, 493224, 569373, 629798, 568351, 577063, 578393, 631340, 687549, 718324, 742218, 769473, 823353, 891687, 834666, 844886, 825899, 833942, 871185, 873330, 804333, 748879, 716815, 537944, 570092, 561046, 477559, 500259, 529116, 508768, 409747, 409415, 522270, 504479, 403108, 419373, 392456, 468839, 461078, 377469, 395372, 389357, 373053, 407354, 420627, 363173]
5541C63173N5316j32329k0243K018N2246R550o4174j26853L0511K4312o2328R9565
5529B30764m8150Q2576n080q4624M1017J49500l6710p2631l2310J3911K4722L9636
5517C02621K2885l1689n6953j5444m119L2788P3757n9880l8457J0314o62L5692
5505B70853m5104J02551n3832j21822J810l5263l599M8764m7029O4935N3924r030
5493B27158N4820o1507l4704N0172O8528O5421J7891j55152j03007Q6246N8717
5482B74583j45986O5764M3174j6135L7017P232j8330O5168l7112j0938P6345r9245
5470B41537j57067J06612M1111j8661N3758j3326Q0166m1488j0289m5195M8788
5459B85946J7915N6567k0585l1961m9856R3103q0019J3521L8516K0219j10743
$$ y = [363173, 418489, 286160, 265917, 267935, 320181, 329731, 265557, 138704, 169215, 193527, 131199, 230764, 182614, 265190, 260110, 175486, 216503, 366003, 329293, 256662, 224352, 238263, 262985, 302621, 325506, 293817, 236864, 221420, 217301, 250089, 323846, 263966, 225509, 235823, 235161, 270853, 225749, 328300, 274468, 152646, 154456, 119193, 115594, 164358, 117329, 182264, 236188, 227158, 281978, 220471, 185767, 235939, 304467, 369888, 387779, 232627, 129620, 215866, 274583, 128597, 194361, 237535, 221400, 258417, 265649, 247319, 312487, 275375, 264437, 340782, 241537, 84470, 191082, 232193, 213532, 267290, 253964, 334130, 292642, 282353, 237158, 285946, 303861, 360428, 339843, 307882, 258026, 351129, 271110, 284631, 323147, 343366, 232623]
5448B32623O8878K2028n7312n5025o5890J53759O1970p5651N4999n9574k8502
5437B52303Q1311J4523O0150o9963p853N789L790j07354N1389K9670l5216L863
5425B82402O5909o6178J5129K609q9328J60027P8109o6914p7818O1449N241Q3678
5413D54315q834N1974j1292M4949O8524m6474p15j09078L8178m9567O7755j3548
5401D86187o4521o6228j0754J06711M1583l4737k745M8654J48093k15489P1704
5390E08458J3142j1425n3880J39074k5302L719n5166j10764J2600k0636J07947
5379E07767r5574M7075P8958N986k8590J02726K6272j60527O6643M9086N7870
5368F57692M7081m2797m8747R5638m0416j28057K8469P4348N3559o7704m8315
$$ y = [232623, 301501, 323529, 266217, 211192, 145302, 299061, 361031, 285380, 340379, 280805, 252303, 333614, 348137, 408287, 338324, 330471, 336260, 340050, 232696, 284085, 313755, 278539, 282402, 348311, 282133, 297262, 299871, 210543, 370570, 448679, 381765, 303947, 365396, 370637, 454315, 445481, 497455, 486163, 531112, 599636, 553162, 552447, 443369, 481547, 431980, 499735, 486187, 421666, 355438, 344684, 451395, 492978, 458241, 455496, 504150, 652243, 436754, 508458, 521600, 510175, 456295, 595369, 570067, 573786, 518620, 407856, 420456, 399820, 507767, 412193, 459268, 538226, 544212, 515622, 618348, 644620, 484093, 550736, 599822, 657692, 704773, 661976, 613229, 708867, 668451, 540394, 568863, 643211, 696770, 629066, 580751]
5357E80751K6612j7891o6615Q6064P3341j14487J07950o4724m5559L6231K7756
5346F29429K7238l2553R106p4817J04491L1042Q4180r9119n60p9596n0657J13656
5334F61840j0099m1485M1596n0579n7152N0777l6475P3844j5876m7640N7717r4775
5322E31693N8199P9880L8304m8432o4285l7670J6292O9302Q336k5866m905M3391
5310F64239K7595K0725J05568P1657q6575j27080J48957l4326l4744N6463p8274
5299G34205M5618J0006L7666j29231j4766M979J2574j9782J01935J02760j67991
5288G17973O1098J952k4089N7407N4403o2375j3587J3860k4563L7094l6654j4220
5276G68299k7036j2330j060P5852P1207L9237j04901l9730L0989p1390M8451K2198
$$ y = [580751, 607363, 589472, 522857, 608921, 682262, 567775, 675725, 611001, 565442, 601673, 629429, 656667, 624114, 633220, 558403, 662894, 693936, 778116, 678997, 678437, 598841, 548184, 661840, 651741, 610256, 651852, 601273, 544121, 594898, 558423, 632267, 616391, 568751, 626468, 531693, 589892, 669772, 708076, 659644, 595359, 557689, 573981, 643283, 651619, 625753, 620848, 664239, 691834, 712559, 818127, 889784, 803209, 676129, 825086, 790760, 756016, 812479, 734205, 779823, 789829, 827495, 698264, 683498, 688477, 701051, 681269, 783204, 885964, 717973, 779071, 781023, 756934, 814341, 868744, 806369, 792782, 806642, 782079, 819173, 782519, 768299, 741263, 728933, 727873, 803725, 874932, 914169, 809268, 769538, 800527, 729137, 777588, 799786]
5264G99786N958J8232q3756J1238K4023M7806O552o7696J14087R3944n9769p174
5252I03231m932J31669m360m1474j558J1308r45J9309O6766j3648N2024Q546J60960
5239A286896o0744Q1663K6828p4972N1573j61790J34427R5482l0637k0444m6656
5228A281626P4254o663n073J0694O7704o0584o75J07032J32899p865N3890Q7411
5216A734650J08491Q2501k6646M699P1533l3759j12787j8112q3104M6733J11394
5205A885593j29606M2924j6409o5992O1079j7100j0636r574k8108j5286O005J89957
5193A892847L3837O1738J2365O1240l4225n3646K8366m9178r075j52684J05711
5182A897296K3430j21280L4883j99631Q5559L0722O5446m8324j20427P3126l7662
$$ y = [799786, 805744, 823976, 740220, 751458, 775481, 823287, 829839, 762143, 876230, 970174, 910405, 903231, 898299, 1029968, 1025608, 984134, 982576, 993884, 992939, 1012248, 1079014, 1065366, 1117390, 1125936, 1286896, 1226152, 1307815, 1334643, 1259671, 1311244, 1149454, 1283881, 1379363, 1348726, 1328282, 1281626, 1355880, 1349217, 1344144, 1354838, 1422542, 1361958, 1361283, 1468315, 1601214, 1593349, 1647239, 1734650, 1843141, 1925642, 1898996, 1903695, 1975228, 1941469, 1828682, 1810570, 1727466, 1774199, 1885593, 1755987, 1798911, 1782502, 1716510, 1777589, 1760489, 1749853, 1740279, 1712171, 1696885, 1702890, 1892847, 1926684, 1988422, 2000787, 2062027, 2027802, 1974156, 2002522, 1953344, 1944269, 1791585, 1897296, 1920726, 1799446, 1834329, 1634698, 1720257, 1750979, 1816425, 1768101, 1647674, 1720800, 1683138]
5171A683138l4680O8624j23342P0540P9467j43292J1097p5977J01566k497p0786
5160A563858L6833O3608l8893P4998j1367j4175j9277l67o2014o7069R8594J16404
5148A741133m6479l774K0723Q4947o6902j64355Q4540k668K5375Q8846j9212r648
5136A732526J8988k1048p483J15097j03198J14584j08734n6014O2156J5217M805
5125A766896N6539J8501o5038J307J2720k2097J15122K1702q517m4933m2572N7369
5113A866999l5021K9348l1162m6087O3905q8177j15960O2246O0071Q8216p7609
5102A776769j7850R3962j56438J19642q322N0436J25079N5923M5193j9377l638
5091B061379J4137L6013O8308L3647r0601M4550J12907J13002J01147l0959L3382
$$ y = [1683138, 1648458, 1717082, 1593740, 1664280, 1743747, 1600455, 1611552, 1535575, 1637141, 1634644, 1563858, 1600691, 1664299, 1625406, 1700404, 1689037, 1674862, 1655585, 1655218, 1593204, 1526135, 1624729, 1741133, 1694654, 1690880, 1711603, 1796550, 1729648, 1565293, 1649833, 1647165, 1672540, 1761386, 1742174, 1732526, 1751514, 1730466, 1722983, 1838080, 1734882, 1849466, 1740732, 1684718, 1746874, 1762091, 1766896, 1823435, 1841936, 1776898, 1778205, 1790925, 1768828, 1883950, 1905652, 1897135, 1852202, 1809630, 1866999, 1831978, 1861326, 1830164, 1784077, 1847982, 1759805, 1643845, 1706091, 1766162, 1854378, 1776769, 1758919, 1852881, 1696443, 1816085, 1807763, 1858199, 1983278, 2039201, 2084394, 2065017, 2061379, 2075516, 2111529, 2179837, 2213484, 2122883, 2167433, 2280340, 2393342, 2494489, 2463530, 2496912]
5080B496912L1227P9735J60800o6520j3167N8540J75236M2611l3661K332P4113
5069C008158N3683R8204J69138R3087J20807J12280Q0872J66424J36255J47734
5059D186642J15550N532K27516J10619Q0760P1144O8535N9712J01917K46949P2808
5048E347684J32764J14011K05022J74986J22068K03032J70632J54662J94332Q1332
5038F900525J80178J65523J00903J33813J81604K4533K0872J21114J59526J16902
5028H105493K07580L07193J41568K29423L20146K89219K90621L90444L85662K63829
5018A0931178L46849L91386M32539M89094M18042N08433M95515N50616O60956
5009A5224608N19426N23530L17020M44810L97683L12782J86737K11986L50342
$$ y = [2496912, 2528139, 2607874, 2768674, 2702154, 2688987, 2747527, 2922763, 2965374, 2931713, 2934045, 3008158, 3061841, 3160045, 3329183, 3422270, 3543077, 3655357, 3736229, 3902653, 4038908, 4186642, 4302192, 4307724, 4535240, 4645859, 4726619, 4797763, 4866298, 4926010, 5027927, 5274876, 5347684, 5480448, 5594459, 5799481, 5974467, 6096535, 6299567, 6470199, 6624861, 6819193, 6900525, 7080703, 7246226, 7347129, 7480942, 7662546, 7687079, 7707951, 7829065, 7988591, 8105493, 8313073, 8620266, 8761834, 8991257, 9311403, 9600622, 9891243, 10281687, 10667349, 10931178, 11278027, 11669413, 12101952, 12591046, 13009088, 13517521, 14013036, 14563652, 15224608, 15744034, 16267564, 16584584, 17029394, 17427077, 17739859, 17926596, 18138582, 18488924]
5000A8488924M22435L42962L77498L75631N04613O23597O23566P99002O87773
4991B3246001P00249O58417N22935L66970J83965O2689o1449j29523j03707k27589
4981B5218958j07522k16074k03527k36717l11795j78122j22785j24835j18280
4972B3599301j34678m2187p5103j76749j85089k09570j92046k80963l08861l07153
4962B1686902k79433l17272m47286j93443l33744l46740n6356k06139j81772j19254
4952A9205463Q104J56855o1233Q4245K17863K36780J18799K16806L06336J50794
4942B0640812M07720L14097M87864N71523N76282O04653P64018O59529J028130
4933B6054628J197080J097986J281264J483587J635053K007293K250874K466107
$$ y = [18488924, 18911359, 19254321, 19631819, 20007450, 20512063, 21135660, 21759226, 22558228, 23246001, 23946250, 24604667, 25127602, 25494572, 25678537, 25741226, 25679777, 25550254, 25446547, 25218958, 25111436, 24895362, 24691835, 24455118, 24143323, 23965201, 23842416, 23717581, 23599301, 23464623, 23422436, 23347333, 23170584, 22985495, 22775925, 22583879, 22302916, 21994055, 21686902, 21407469, 21090197, 20642911, 20449468, 20115724, 19768984, 19712628, 19506489, 19324717, 19205463, 19213567, 19370422, 19309189, 19393434, 19611297, 19848077, 19966876, 20183682, 20490018, 20640812, 21048532, 21362629, 21850493, 22422016, 22998298, 23602951, 24366969, 25026498, 26054628, 27251708, 28349694, 29630958, 31114545, 32749598, 34756891, 37007765, 39473872]
4925C9473872K615211K728666K490291K172629J543413J051610M71927J70847
4917E2718466p6260m6652P7049K94965P77965J085116J515305K046962K476675
4908F0869591L100556L711318M110588M273920L603942K430433P33225n71077
4900H2262496j735375k464901k997159l095880k792080k613091k089531j561052
4892F2913427j432568q54814m87377L033L00487M98101L86022j1227r67918j572234
4882E8774932k083496k619405k879140k872588k848891k500092k408084k191611
4874C8371625k071795j856426j711788j615191j507384j457919j338542j198925
4866B5613655j151585j139642j103016r63978q21648r22756p65207p65923n46737
$$ y = [39473872, 42089083, 44817749, 47308040, 49480669, 51024082, 52075692, 52547619, 52718466, 52642206, 52595554, 52672603, 52967568, 53745533, 54830649, 56345954, 58392916, 60869591, 63970147, 67681465, 71792053, 76065973, 79669915, 82100348, 82833573, 82262496, 80527121, 78062220, 75065061, 71969181, 69177101, 66564010, 64474479, 62913427, 61480859, 60626045, 60138668, 60141701, 60442188, 60940289, 61326311, 61315084, 60347166, 58774932, 56691436, 54072031, 51192891, 48320303, 45471412, 42971320, 40563236, 38371625, 36299830, 34443404, 32731616, 31116425, 29609041, 28151122, 26812580, 25613655, 24462070, 23322428, 22219412, 21255434, 20433786, 19511030, 18745823, 17979900, 17433163]
4857A7433163n86061o13312m16079m12324l59032k69115l25746k54002l42012
4848A3855480r5238j11763k03459J9375j10520N3569M7309N8650J48433J55873
4838A3817709J78246K92575L13740L56075L78431J39066N2446O7106M2286j46064
4828A5491616o5045q3392o3431k4666p4153Q2936N2927K40419K16127M13403M08218
4817A6594959O04419O65999L27772L49794J28768m4924k24823l98943o55912n00330
4807A6846779m75717n46026n06287m32116l31311m40608l43456j90259p9069M7529
4797A3549459n1847M7417j42648j10951j28197l69936l75085n79025m20854m97446
4787A0920887m75764l88841m62779l00866m37137m35799k62827l63633j95979
$$ y = [17433163, 16847102, 16233790, 15817711, 15405387, 15046355, 14777240, 14451494, 14197492, 13855480, 13760242, 13648479, 13445020, 13464395, 13353875, 13407444, 13454753, 13513403, 13661836, 13817709, 13995955, 14288530, 14602270, 14958345, 15336776, 15475842, 15528288, 15595394, 15637680, 15491616, 15426571, 15343179, 15279748, 15255082, 15180929, 15263865, 15316792, 15557211, 15773338, 16186741, 16594959, 17199378, 17865377, 18193149, 18542943, 18671711, 18626787, 18401964, 18003021, 17347109, 16846779, 16371062, 15825036, 15318749, 14886633, 14555322, 14114714, 13771258, 13580999, 13501930, 13549459, 13497612, 13545029, 13402381, 13291430, 13163233, 12793297, 12418212, 11839187, 11418333, 10920887, 10445123, 10056282, 9593503, 9292637, 8855500, 8419701, 8156874, 7793241, 7597262]
4778G597262k71480k42058k78837j54200k16100q9839j61161k91264m3071J6569
4768E865821r4748k76540k9749J0721K1031j27585M3656l2510j13388m8131J08919
4757E327497Q5292p4053p0816P9800J72613p1567O4261K41120o24p9991l482R1228
4745E761278r5042K0062l8750J1256l5394o1076r0567O0883k6466k0454o33O7104
4733E552201o7863k8795P111j950R1584M2422P2327J4735O2457n0810K5304J81471
4721E900194J31582O1252P9845P1537N5150P6354J41608Q2240N0620N0286J29911
4710F830579J41374J34776K52197K04855L13803L33352K52083K17229R1650J03799
4700H875697L3134k32325j39300j70026k52891p2966j44836k39158M3452j08758
$$ y = [7597262, 7325782, 7083724, 6804887, 6650687, 6434587, 6344748, 6183587, 5892323, 5849252, 5865821, 5771073, 5494533, 5464784, 5475505, 5496536, 5368951, 5412607, 5380097, 5266709, 5218578, 5327497, 5412789, 5338736, 5267920, 5347720, 5520333, 5448766, 5513027, 5754147, 5753523, 5673532, 5670050, 5761278, 5666236, 5686298, 5647548, 5658804, 5623410, 5562334, 5471767, 5532650, 5506184, 5485730, 5485097, 5552201, 5484338, 5455543, 5462654, 5460704, 5552288, 5594710, 5667037, 5681772, 5744229, 5693419, 5718723, 5900194, 6031776, 6093028, 6172873, 6244410, 6299560, 6375914, 6517522, 6599762, 6650382, 6700668, 6830579, 6971953, 7106729, 7358926, 7563781, 7877584, 8210936, 8463019, 8680248, 8771898, 8875697, 8908831, 8676506, 8537206, 8367180, 8114289, 8041323, 7896487, 7657329, 7700781, 7592023]
4690G592023Q1104P9264o7438O4453J6230J08824J10037K01778J46407J26664
4680H459346r642K41621K09124K91189K26503J31259j23658K3226p2930j26063
4670I249975o9534q4139N3995j18577m0409k9875N2942R912O2875M1818P0331
4659I199314M4148P2696J86953N6278J33842J26869Q2192J57451L7331J79214
4649A0276288K63424K19447J96779J65379J95869K50871J39328N8584J73345K66436
4639A2205750K69711J92016J21120K58220L10244J95789L26757K92340K76927
4630A4448874K70768L90098L53664M32830M26867M95047M84484N92643N56019
4621A8451294P47035P51232O58214P39401P61767P65359R24323P66964P61533
$$ y = [7592023, 7673127, 7752391, 7684953, 7749406, 7765636, 7874460, 7984497, 8186275, 8332682, 8459346, 8449704, 8691325, 8900449, 9191638, 9418141, 9549400, 9425742, 9448968, 9376038, 9249975, 9180441, 9096302, 9150297, 9031720, 8991311, 8961436, 9014378, 9024290, 9087165, 9128983, 9199314, 9243462, 9316158, 9503111, 9559389, 9693231, 9820100, 9902292, 10059743, 10097074, 10276288, 10539712, 10759159, 10955938, 11121317, 11317186, 11568057, 11707385, 11765969, 11939314, 12205750, 12475461, 12667477, 12788597, 13046817, 13357061, 13552850, 13879607, 14171947, 14448874, 14719642, 15109740, 15463404, 15896234, 16323101, 16818148, 17302632, 17895275, 18451294, 19198329, 19949561, 20607775, 21347176, 22108943, 22874302, 23798625, 24565589, 25327122]
4612B5327122Q88426Q28483Q88060Q44391R10299J033211R41440R08324R05722
4603C3475478Q02512P71041R09983R17974R06195P91358Q41465Q68885Q61219
4594D1146110J026647J046028J130241J304951J362480J422917J282042J271271
4586E0992687J124259R26535R54706R61454J006305J147608J375685J332451J763301
4577F1584991K293905K509360K839719L230127L051331K582590J872142R43536
4569H0907701J73668l48388p28546o45281k72271k5111L42566R32904J231261
4560H1568503J880627K464212L084302L868306M720572M845532M261770K692616
4552A09386440P39563r97745k365433l264663l223683k765320k018890j064088
$$ y = [25327122, 26215548, 27044031, 27932091, 28776482, 29686781, 30719992, 31661432, 32569756, 33475478, 34277990, 35049031, 35959014, 36876988, 37783183, 38574541, 39416006, 40284891, 41146110, 42172757, 43218785, 44349026, 45653977, 47016457, 48439374, 49721416, 50992687, 52116946, 53043481, 53998187, 54959641, 55965946, 57113554, 58489239, 59821690, 61584991, 63878896, 66388256, 69227975, 72458102, 75509433, 78092023, 79964165, 80907701, 81081369, 80732981, 80004435, 79359154, 79086883, 79061772, 79404338, 80337242, 81568503, 83449130, 85913342, 88997644, 92865950, 97586522, 102432054, 106693824, 109386440, 110126003, 109128258, 106762825, 103498162, 100274479, 97509159, 95490269, 94426181]
4544I4426181m17680K9186L74077Q88148J215706J413854K064533K610485K906666
4535A05511156K928281K704322K551626K429026K503135K696206L278440L984547
4527A28586739M570878M811497M831892M218963K836985J148484o66654k101736
4519A48237048l480262m541458m870605m823140m720438m455959m121353l581311
4511A13642522l101384k812883k413255k245667k057779j978546j810455j494574
4503I5727979j078021o48378j98759K82110O14464J155801J548344J694580J281666
4494A00379786Q52908N29249r2370q80893j418305j924226k325196k394464k404872
4485I0321617k308982k137886k099840j950959j803076j483316j118942q56078
$$ y = [94426181, 94008501, 94037687, 94411764, 95299912, 96515618, 97929472, 99994005, 102604490, 105511156, 108439437, 111143759, 113695385, 116124411, 118627546, 121323752, 124602192, 128586739, 133157617, 137969114, 142801006, 147019969, 149856954, 151005438, 150338784, 148237048, 144756786, 140215328, 135344723, 130521583, 125801145, 121345186, 117223833, 113642522, 110541138, 107728255, 105315000, 103069333, 101011554, 99033008, 97222553, 95727979, 94649958, 94001580, 93802821, 94084931, 94699395, 95855196, 97403540, 99098120, 100379786, 101232694, 101761943, 101669573, 100788680, 99370375, 97446149, 95120953, 92726489, 90321617, 88012635, 85874749, 83774909, 81823950, 80020874, 78537558, 77418616, 76562538]
4477G6562538n19204m73885j87858j37580m5308j87147l61065m67546n40445n64392
4467G3078108o03257m18497m80244j65101J14871K90569P15366R50098J231151
4458G4713064J222907J609237J519705J347427J164867J022754R36434R81350
4450H4517745J253191J626999K061147K390339K487554J934409J196482N54438
4442I8022304j73807k90989l00836l7850L07483P99073J150018J354804J481467
4433A02311667J568026J892726K172552K171867J931589J067644J03471j009537
4425A12210005k234735l252361m115083m297307m196532l864017l210758k585964
4417H4453248j987926j444911j306032o80656n82588m27708k69425q16993j630279
$$ y = [76562538, 76043334, 75569449, 75381591, 75244011, 75198703, 75011556, 74650491, 74182945, 73642500, 73078108, 72474851, 72056354, 71576110, 71411009, 71525880, 71816449, 72531815, 73481913, 74713064, 75935971, 77545208, 79064913, 80412340, 81577207, 82599961, 83536395, 84517745, 85770936, 87397935, 89459082, 91849421, 94336975, 96271384, 97467866, 98022304, 97848497, 97557508, 97256672, 97218822, 97526305, 98325378, 99475396, 100830200, 102311667, 103879693, 105772419, 107944971, 110116838, 112048427, 113116071, 113219542, 112210005, 109975270, 106722909, 102607826, 98310519, 94113987, 90249970, 87039212, 84453248, 82465322, 81020411, 79714379, 79033723, 78451135, 78023427, 77754002, 76937009, 75306730]
4408G5306730k460046l147721l911094m043689l982939l791073l304768k921249
4400D7744151k559015k291443k026566j866333j722134j699309j592787j536654
4392C2449910j300528j170784r41747j192263q75029o93208o91146o06529o88095
4383B4290581o50132m23325l98867l74607m89554l90105j86366l14004l92404
4374B0671217k52747j70853k09019k07860k11584k22695m761k03194k22580p9076
4364A8886848j71088r2674r6305M6766l6096k10036k79118k14726k78543j72835
4354A7382193j23594r2119q4112j16547k33402j31791j06015q3763r6257l14199
4344A6000394k83514j85987k81761l28005k88299l34182j56094j82050k39634
$$ y = [75306730, 72846684, 69698963, 65787869, 61744180, 57761241, 53970168, 50665400, 47744151, 45185136, 42893693, 40867127, 39000794, 37278660, 35579351, 33986564, 32449910, 31149382, 29978598, 29036851, 27844588, 26969559, 26276351, 25585205, 24978676, 24290581, 23640449, 23217124, 22818257, 22443650, 21954096, 21563991, 21377625, 21063621, 20671217, 20418470, 20247617, 20038598, 19830738, 19619154, 19396459, 19391698, 19188504, 18965924, 18886848, 18715760, 18623086, 18526781, 18573547, 18537451, 18327415, 18048297, 17833571, 17555028, 17382193, 17258599, 17166480, 17082368, 16965821, 16732419, 16600628, 16494613, 16410850, 16314593, 16000394, 15716880, 15530893, 15249132, 14921127, 14632828, 14298646, 14142552, 13960502, 13720868]
4335A3720868j67702j27079j33432j54487K0967r4264j56276P183p5293q3895
4325A2756590L997l1945L01773N70985P14328J255638J109226j95666l03976Q5387
4315A6266337k67120p21103p60878j119071j101053q45857p34701m96303l30913
4306I889338m07383l83693k49586j76032j26197j39174k9685m5579j30183j30557
4296H071269j37642p4282r8765j00475j00700q4473j42249o0597l2396J700J6786
4285G258176r7010p8011r7180M1903r1206q7977j40306k8899q8117j99529n7216
4274F334628m6588j8114K4719j28239j8306M434J09192j02322m6351J8243j32502
4263E998794p5413j80162j13923q2694l7920j8966k2468p8877p7790j82940J3994
$$ y = [13720868, 13553166, 13426087, 13292655, 13138168, 13159135, 13064871, 12908595, 12915778, 12840485, 12756590, 12760587, 12728642, 13030415, 13601400, 14315728, 15571366, 16680592, 16484926, 16180950, 16266337, 15999217, 15278114, 14517236, 13398165, 12297112, 11451255, 10716554, 10220251, 9889338, 9481955, 9098262, 8848676, 8672644, 8546447, 8407273, 8377588, 8332009, 8201826, 8071269, 7933627, 7859345, 7760580, 7660105, 7559405, 7474932, 7332683, 7272086, 7239690, 7241390, 7258176, 7161166, 7083155, 6985975, 7027878, 6936672, 6848695, 6708389, 6679490, 6591373, 6391844, 6334628, 6288040, 6269926, 6294645, 6166406, 6148100, 6152534, 6261726, 6159404, 6113053, 6131296, 5998794, 5923381, 5743219, 5629296, 5546602, 5508682, 5489716, 5467248, 5388371, 5310581, 5127641, 5141635]
4252E141635l2936j00784J2443M5134o2918j2048o5905n156J3084m843J7637j7146
4240D928197n1384k6345J00179r0145o1709o6774k6246J22087m0552J7482r200
4229D795590K9779Q5820N05o5377N5069O9513K1834M6595o4077P9025p3363l5133
4217D945780R6895l6071R3131L8058J01324K5064l0310J43688J4489M6564Q5713
4206E524325J1294R9254J07691l4363J12589M3974k9031O5823J82317J07228J8846
4195F209947R6092J30568K32773J01237O9071N3918M5887R0769N3787j3249L6096
4184G106896J53717q68l3190P8494m1656J04323J37311O1160J44357N0551J37798
4173G898893J58432J08402J88699J33751R5733J98465J4403o1544j15827P8077
$$ y = [5141635, 5108699, 5007915, 5020358, 5065492, 5002574, 4990526, 4924621, 4919465, 4932549, 4927706, 4945343, 4928197, 4876813, 4850468, 4950647, 4860502, 4798793, 4732019, 4705773, 4827860, 4787308, 4804790, 4795590, 4825369, 4911189, 4911694, 4846317, 4901386, 4970899, 4992733, 5039328, 4975251, 5054276, 4980913, 4945780, 5042675, 5006604, 5099735, 5137793, 5239117, 5264181, 5233871, 5377559, 5392048, 5438612, 5524325, 5535619, 5634873, 5742564, 5708201, 5820790, 5864764, 5835733, 5901556, 6083873, 6191101, 6209947, 6306039, 6436607, 6669380, 6770617, 6839688, 6893606, 6939493, 7030262, 7084049, 7070800, 7106896, 7260613, 7259745, 7226555, 7305049, 7263393, 7367716, 7505027, 7566187, 7710544, 7761095, 7898893, 8057325, 8165727, 8354426, 8488177, 8583910, 8782375, 8796778, 8735234, 8619407, 8697484]
4163H697484P3871J9863r3031k6796l0648L8115J1969j07982n2465q2771P703
4152H455312j13039Q786L9278n2483l053j6135k3545j6301R5772l1143N8617M6972
4140H449038l8218O3094l7277O6453r2840j8215j2330M5653o9484j7683r6312
4129H241879k8111J42261k2473N902l8374N8330P4479O8025N5413J3204o6028
4118H504507r5197J49743J57834L6924J67221R8879J66829J38429J05842J04116
4108I535127K59017N3855K96706K16543K00260K76999K90929L52640M86640N24438
4098A2493154N46683O81130O49186O74574P95815N94318O81862M96976L34861
4089A7948559L61569J60946J67550P4835n5793j90198k81423k80371k72044k00864
$$ y = [8697484, 8771355, 8791218, 8698187, 8671391, 8640743, 8678858, 8690827, 8582845, 8530380, 8447609, 8455312, 8342273, 8351059, 8390337, 8337854, 8334801, 8318666, 8295121, 8278820, 8374592, 8343449, 8402066, 8449038, 8410820, 8473914, 8436637, 8503090, 8410250, 8392035, 8379705, 8425358, 8355874, 8338191, 8241879, 8213768, 8356029, 8333556, 8339458, 8301084, 8359414, 8433893, 8501918, 8557331, 8570535, 8504507, 8409310, 8559053, 8716887, 8753811, 8921032, 9019911, 9186740, 9325169, 9431011, 9535127, 9794144, 9847999, 10144705, 10361248, 10561508, 10838507, 11129436, 11482076, 11968716, 12493154, 13039837, 13720967, 14370153, 15044727, 15840542, 16434860, 17116722, 17613698, 17948559, 18310128, 18471074, 18638624, 18713459, 18657666, 18467468, 18186045, 17905674, 17633630, 17432766]
4079A7432766P3116N1649K1572K77226M11393L88957O68354O26635O96959O42501
4069B1291128P34408N66532N05698L88514K11265K01708L53844M73592N89777
4060B5316466O68826O95291Q24092R61901R88155J035711J176848J285591J364546
4051C4317427J128326J360531J374246J347274J292083J311585J338858J273365
4043D4743695J136760J263876J481038J470012J787575J897506K098690K402247
4035E8281399K623216K724256L044288L110278L159441L286353L229597L051423
4027H2510251K734434K580179K584311K492990K643588K634319K771511L033893
4019A03985476L172186L092830L146945K886973K697113K242177K019571J866901
$$ y = [17432766, 17505882, 17557531, 17579103, 17856329, 18267722, 18656679, 19325033, 19951668, 20648627, 21291128, 22025536, 22592068, 23097766, 23486280, 23697545, 23899253, 24253097, 24726689, 25316466, 25985292, 26680583, 27504675, 28466576, 29454731, 30490442, 31667290, 32952881, 34317427, 35445753, 36806284, 38180530, 39527804, 40819887, 42131472, 43470330, 44743695, 45880455, 47144331, 48625369, 50095381, 51882956, 53780462, 55879152, 58281399, 60904615, 63628871, 66673159, 69783437, 72942878, 76229231, 79458828, 82510251, 85244685, 87824864, 90409175, 92902165, 95545753, 98180072, 100951583, 103985476, 107157662, 110250492, 113397437, 116284410, 118981523, 121223700, 123243271, 125110172]
4011A25110172J749922J449215J295579Q28246l6962j121617k106761l226963
4003A23940831l763553m087879m066547l582746k792382j891868j195957o77469
3995A01882430q91757j499093k599295l320476m000588m378303m071485l492422
3987G7629011k949324k316158k040867j661737j207130j245314j032853q88348
3979F4287280q61897o42815p38007q54650p93422p65552q56595o32457o09975
3970E7531910n05980n06529n38360n54760o63797p78721q59948p58585q31256
3961E1533974p26171n80994n22794m10665m87096l21658j9029J84099L51779O24507
3951D9625952R15915J365211J646879J821730J782165J720898J488025J154115
$$ y = [125110172, 126860094, 128309309, 129604888, 130433134, 130396172, 129274555, 127167794, 123940831, 120177278, 116089399, 112022852, 108440106, 105647724, 103755856, 102559899, 101882430, 100990673, 99491580, 96892285, 93571809, 89571221, 85192918, 81121433, 77629011, 74679687, 72363529, 70322662, 68660925, 67453795, 66208481, 65175628, 64287280, 63425383, 62782568, 62044561, 61189911, 60396489, 59630937, 58774342, 58141885, 57531910, 57025930, 56519401, 55981041, 55426281, 54762484, 53983763, 53123815, 52365230, 51533974, 50807803, 50226809, 49704015, 49293350, 48806254, 48484596, 48465567, 48649666, 49001445, 49625952, 50541867, 51907078, 53553957, 55375687, 57157852, 58878750, 60366775, 61520890]
3943F1520890N23114m4639p95529j426178j971307k234391k371244k540059k552135
3934D8108522k251772k191249k058045k011856j660895j515653j563181j299673
3926C3556198j183489j027080q56026q37429o97434p19521o44244l74549m44184
3917B6772242l03011k17281j17232k14034k61676k30486l60356m59288m09466
3908B4199412m62362m48066m37539m02689l51947k68226j14256j09761J4612l7047
3898B1582131L9804j0436J57994K57580K33726J54917K19340L58245K68884L37504
3888B3599689L90460M73746M72900O40429O90881Q37466P56551Q66107J073883
3879B9802112J161710J373334J416696J437800J660175J670934J786748J727313
$$ y = [61520890, 62044004, 61999365, 61203836, 59777658, 57806351, 55571960, 53200716, 50660657, 48108522, 45856750, 43665501, 41607456, 39595600, 37934705, 36419052, 34855871, 33556198, 32372709, 31345629, 30489603, 29652174, 28954740, 28235219, 27590975, 27216426, 26772242, 26469231, 26251950, 26134718, 25920684, 25659008, 25428522, 25068166, 24608878, 24199412, 23737050, 23288984, 22851445, 22448756, 22096809, 21828583, 21714327, 21604566, 21619178, 21582131, 21621935, 21611499, 21769493, 22027073, 22260799, 22415716, 22635056, 22993301, 23262185, 23599689, 23990149, 24463895, 24936795, 25577224, 26268105, 27105571, 27862122, 28728229, 29802112, 30963822, 32337156, 33753852, 35191652, 36851827, 38522761, 40309509, 42036822]
3871D2036822J761131J970597K337969K543978K855819L255127L426473L398757
3863F3586673K923276J927773J159910P82674M02166K22313M94545O81545Q33221
3854G3014096J133462J467348J899815K385853K824699L229640L585623L343018
3846I2883554L023634K253433R05183l45233j360655k062320k303432k220559
3838I0773605j765449j311936p21172l82794K51341O17868J147128J704226J945475
3829I2258292K061256J747427J297976O79519N3321l92193o53020n45617l02806
3820I6204155K27695O81342J377643K325839L115964L960022M641633N878939
3812A18413232O916218Q370191J0445176J2656306J5170413J7501650J8712401
$$ y = [42036822, 43797953, 45768550, 48106519, 50650497, 53506316, 56761443, 60187916, 63586673, 66509949, 68437722, 69597632, 70380306, 70782472, 71004785, 71499330, 72180875, 73014096, 74147558, 75614906, 77514721, 79900574, 82725273, 85954913, 89540536, 92883554, 95907188, 98160621, 99065804, 98720571, 97359916, 95297596, 92994164, 90773605, 89008156, 87696220, 86975048, 86592254, 86843595, 87461463, 88608591, 90312817, 92258292, 94319548, 96066975, 97364951, 98044470, 98097791, 97705598, 97052578, 96506961, 96204155, 96431850, 97113192, 98490835, 100816674, 103932638, 107892660, 112534293, 118413232, 125329450, 133699641, 144144817, 156801123, 171971536, 189473186, 208185587]
3805B08185587J6840290R730891J675886m445445r667476j2614741j2951113j2072585
3797A84681294j0862839r656687q815914p792049o375733n237014m561944m483263
3789A26895851m830899n062412n094491n149737n167855n028057n040711n113475
3781H6408214n278869n143052m983564m623421m240255l819642l386438l066691
3773E1866282k640961k597617k251119k075356j899272j796646j623143j411739
3765C5570429j400118j268057j234734j050603q64936q59360r70369q36979p49519
3756B6335754o51610n44148o28389m12976o30136m37277l97834m01248l79004
3747B1853132l52098k13034l15157k95822j90879k75301k80864k67594k00763
$$ y = [208185587, 225025877, 234756768, 236432654, 231987209, 222319733, 209704992, 196753879, 184681294, 173818455, 164161768, 155345854, 147553805, 141178072, 135941058, 131379114, 126895851, 122064952, 117002540, 111908049, 106758312, 101590457, 96562400, 91521689, 86408214, 81129345, 75986293, 71002729, 66379308, 62139053, 58319411, 54932973, 51866282, 49225321, 46627704, 44376585, 42301229, 40401957, 38605311, 36982168, 35570429, 34170311, 32902254, 31667520, 30616917, 29751981, 28892621, 27922252, 27085273, 26335754, 25684144, 25139996, 24511607, 24098631, 23468495, 23031218, 22633384, 22232136, 21853132, 21501034, 21288000, 20972843, 20677021, 20486142, 20210841, 19929977, 19662383, 19461620]
3738A9461620k26666k10594m8686j70440k37796j47983j74411j59813j05601j60934
3728A7818696k32366j98610l11386k32307k48001l14513l07695l48398k25120
3719A5400300j72210j91910k32667k06290j31125j78491o4122j95875j52421p9414
3709A3795775j31586j45212j84805l19853l26301k14774l43336k00799k01258
3700A1727851k41763k19780j83806j65465j44358r3719o7379m1722q9601j60661
3690A0319597j40116j67482j95980k27672j25960j03914l9190l2869n8415J3116
3680I241115p3645r8909m1467l3746q1274j39324j3232R06j5142j02483j00682
3669H542117j08936j2291n5655P3796r2777L4140J17392q7248j9944J55997n3863
$$ y = [19461620, 19234954, 19024360, 18975674, 18805234, 18567438, 18419455, 18245044, 18085231, 17979630, 17818696, 17586330, 17387720, 17076334, 16844027, 16596026, 16281513, 15973818, 15625420, 15400300, 15228090, 15036180, 14803513, 14597223, 14466098, 14287607, 14223485, 14027610, 13875189, 13795775, 13664189, 13518977, 13334172, 13014319, 12688018, 12473244, 12129908, 11929109, 11727851, 11486088, 11266308, 11082502, 10917037, 10772679, 10678960, 10611581, 10569859, 10480258, 10319597, 10179481, 10011999, 9816019, 9588347, 9462387, 9358473, 9319283, 9286414, 9227999, 9241115, 9167470, 9068561, 9027094, 8993348, 8912074, 8772750, 8759518, 8760424, 8745282, 8642799, 8542117, 8433181, 8420890, 8365235, 8439031, 8346254, 8380394, 8497786, 8410538, 8390594, 8546591, 8492728]
3658H492728l9212q8J1339n2875L3228l0486j8193Q9647J53100Q179q7044R5091
3646H655414m4227J32318J96429J43181M8660j8525J61072R7452J77635J03439
3636I652848J14806L13709K80698K49752L17008K93124L13934K37531J95627P7480
3626A2046517Q057j16753q8761K6726M4225j81765O6332P9765p399J06078O0022
3615A2043044Q1743J6580J22523J64470K72717J06035o2853j45116j25027l60818
3605A2113298k14103q4827k0751l6561J5003K4886J13608J51515L5138J00060
3595A2197266J39153K25752J48727J69326K65757K25961J83149K12689J34086
3586A3901866K51542K20829L63002L53920L49160M24875L22848M44393M19064
$$ y = [8492728, 8453516, 8453428, 8464767, 8411892, 8445120, 8414634, 8396441, 8486088, 8639188, 8647367, 8560323, 8655414, 8611187, 8743505, 8939934, 9083115, 9131775, 9113250, 9274322, 9371774, 9549409, 9652848, 9767654, 10081363, 10362061, 10611813, 10928821, 11221945, 11535879, 11773410, 11969037, 12046517, 12054574, 11937821, 11849060, 11875786, 11920011, 11738246, 11804578, 11884343, 11876944, 11983022, 12043044, 12124787, 12141367, 12263890, 12428360, 12701077, 12807112, 12744259, 12599143, 12474116, 12113298, 11899195, 11814368, 11793617, 11757056, 11772059, 11796945, 11910553, 12062068, 12097206, 12197266, 12336419, 12562171, 12710898, 12880224, 13145981, 13371942, 13555091, 13767780, 13901866, 14153408, 14374237, 14737239, 15091159, 15440319, 15865194, 16188042, 16632435, 17051499]
3577A7051499O23585L17359M75018M79302M49164M02253N98071N12031N92236
3568B1500518O21711N45687P24594P78437P44553O73700Q29741R38739R99089
3559B8356769R96614J235959J350994J507868J599351J973237K027942K277937
3551D1326671K706150K847459L225824L466721L488457L224180K617852J484327
3543F4387641J78464n73623j223208j652173j517601j320618j094020p76911m20554
3534E5987397k52782j06463r3184l3829l1478o4569k08436m29864n53376q05385
3524E3408031r00902j094723j059162q96586q26340q18591p39996o35713n80309
3515D5855709m84647l85022k61299k69210k99817j13542j27023m9002R5076M3450
$$ y = [17051499, 17675084, 17992443, 18467461, 18946763, 19395927, 19798180, 20396251, 20908282, 21500518, 22122229, 22667916, 23392510, 24170947, 24915500, 25589200, 26418941, 27357680, 28356769, 29353383, 30589342, 31940336, 33448204, 35047555, 37020792, 39048734, 41326671, 44032821, 46880280, 50106104, 53572825, 57061282, 60285462, 62903314, 64387641, 64566105, 63992482, 62769274, 61117101, 59599500, 58278882, 57184862, 56407951, 55987397, 55734615, 55628152, 55534968, 55501139, 55469661, 55405092, 55196656, 54766792, 54213416, 53408031, 52507129, 51412406, 50353244, 49456658, 48630318, 47811727, 47071731, 46436018, 45855709, 45371062, 44986040, 44724741, 44455531, 44155714, 44042172, 43915149, 43866147, 43961223, 44004673]
3505D4004673J29458R0070K41445K34268N08603L67122N27402P69622P14734P52186
3495D8339583R09361J107117J203030J274634J404460J561881J622731J805242
3487E9228039J880355K061573K150736K128042K383501K596224K676119K808905
3479G7913494K894016K914054L175518L108601L157197L368582L240344L321534
3471A03093340L459182L397045L496191L370778L127377L363064L138048K902756
3463A29347781K857990K629369K521178K361955K338274K109608J758012J578094
3455A47502261J087306R66218N42864K27695n2694j49923n42090q30241j223782
3446A47527614j737848k058922k504519k703253l036257l035309l326944l411532
$$ y = [44004673, 44134131, 44224201, 44465646, 44699914, 45208517, 45575639, 46103041, 46872663, 47587397, 48339583, 49248944, 50356061, 51559091, 52833725, 54238185, 55800066, 57422797, 59228039, 61108394, 63169967, 65320703, 67448745, 69832246, 72428470, 75104589, 77913494, 80807510, 83721564, 86897082, 90005683, 93162880, 96531462, 99771806, 103093340, 106552522, 109949567, 113445758, 116816536, 119943913, 123306977, 126445025, 129347781, 132205771, 134835140, 137356318, 139718273, 142056547, 144166155, 145924167, 147502261, 148589567, 149555785, 150098649, 150326344, 150273650, 150123727, 149581637, 148751396, 147527614, 145789766, 143730844, 141226325, 138523072, 135486815, 132451506, 129124562, 125713030]
3438A25713030l626589l542779l818964l936057l819752l951178l887925l834424
3430I5295362l650594l548971l378603l180172l071806k805149k622792k325298
3422G0711977k195863k383335k691967k618970k788576k997701k745532k689804
3414D9600229k335424k259897k104064j918492j688810j596295j498700j414487
3406C4784060j326096j135633j101756j082144q76284q51401p16562o71071o99751
3397B6323362n94117m70997o25673m67119n08244m99497m06291l37888m12659
3388B2000877k92884l68673l69820m13162l02378j88462k85917l37348k60870
3379A9181363k19443j82220j90331k71789n7540j61819k14133j25529j34150k3960
$$ y = [125713030, 122086441, 118543662, 114724698, 110788641, 106968889, 103017711, 99129786, 95295362, 91644768, 88095797, 84717194, 81537022, 78465216, 75660067, 73037275, 70711977, 68516114, 66132779, 63440812, 60821842, 58033266, 55035565, 52290033, 49600229, 47264805, 45004908, 42900844, 40982352, 39293542, 37697247, 36198547, 34784060, 33457964, 32322331, 31220575, 30138431, 29262147, 28410746, 27694184, 27023113, 26323362, 25729245, 25258248, 24632575, 24165456, 23657212, 23157715, 22751424, 22413536, 22000877, 21707993, 21339320, 20969500, 20556338, 20253960, 20065498, 19779581, 19442233, 19181363, 18961920, 18779700, 18589369, 18317580, 18260040, 18098221, 17884088, 17758559, 17624409, 17600449]
3369A7600449j50732o6555r4169o4520K0572L6182o8027j14482J130m4021R0364
3358A7146191n9836j64475O111n3389j51281M1054l0608N7246n9617J7477K0500
3347A6769373J04405J73883L7481J49141K29952K90557K67249L53541L80945L38954
3337A9095481L38298L89772J18883J65565J45707O7735J00068J14277K5653j3638
3327B0547801N8845R6864M504m9304m4413k51042k15707j07895K191l6909o2764
3316A9942171J3847O8027J09025J80689K06763L63548L57689M34723M70423M61685
3306B2608590N62500N39122N45401N31485O48316O65085M98136N89501P22315
3297B7910451Q10694O03984Q71582R04494Q44188Q40531P54865O21493P18140
$$ y = [17600449, 17449717, 17383162, 17288993, 17224473, 17245045, 17281227, 17213200, 17098718, 17099848, 17055827, 17146191, 17086355, 16921880, 16927991, 16874602, 16723321, 16764375, 16733767, 16791013, 16731396, 16748873, 16769373, 16873778, 17047661, 17085142, 17234283, 17464235, 17754792, 18022041, 18375582, 18756527, 19095481, 19433779, 19823551, 19942434, 20107999, 20253706, 20321441, 20421509, 20535786, 20561439, 20547801, 20606646, 20703510, 20708014, 20658710, 20614297, 20363255, 20147548, 20039653, 20041844, 20004935, 19942171, 19956018, 20024045, 20133070, 20313759, 20520522, 20884070, 21241759, 21676482, 22146905, 22608590, 23171090, 23710212, 24255613, 24787098, 25435414, 26100499, 26598635, 27188136, 27910451, 28721145, 29325129, 30196711, 31101205, 31945393, 32785924, 33540789, 34162282, 34880422]
3288C4880422N72485N66053O66761N79430N90687P80110P97400N82763O39264
3279D0655375O56887O48288O22782M41157N68287N15652N70088L62321L03612
3270D5344449M16153M48220M16192K50243M47525L61339L55399O7926K52823K53900
3260D8614169M383J36296J73733J61805K21980M51349M96881M42615N38442P09805
3250E1951458O80752R63524R54187J119027J221110J422309J510909J607194J859085
3241F3289555J854331K235312K295259K612303K833036K875171L006667L220739
3233H4222373L298350L231948L369942L249765L077242K950047K977827K918532
3225A09296026K649003K544350K467921K050004J980485J566486J194339J034332
$$ y = [34880422, 35452907, 36018960, 36685721, 37265151, 37855838, 38635948, 39433348, 40016111, 40655375, 41312262, 41960550, 42583332, 43024489, 43592776, 44108428, 44678516, 45040837, 45344449, 45760602, 46208822, 46625014, 46875257, 47322782, 47684121, 48039520, 48107446, 48360269, 48614169, 48618552, 48754848, 48928581, 49090386, 49312366, 49763715, 50260596, 50703211, 51241653, 51951458, 52632210, 53595734, 54549921, 55668948, 56890058, 58312367, 59823276, 61430470, 63289555, 65143886, 67379198, 69674457, 72286760, 75119796, 77994967, 81001634, 84222373, 87520723, 90752671, 94122613, 97372378, 100449620, 103399667, 106377494, 109296026, 111945029, 114489379, 116957300, 119007304, 120987789, 122554275, 123748614, 124782946]
3217A24782946O45602N06870K61665N8352L3051j75310j98527j07554j40877o5607
3207A25600611K2026K09478L13877O42244R03950J232118J722533J969240K401971
3198A35018048K963051L252399L974225M422279M980811N371250N771458O281099
3190A72034620O459731O930890P144600P341250P501924P594433P535955P320616
3182B29864019P227436O878483O487118O042451N521684N099362M473754L732802
3174B75327109K891565K292230J503802Q67388N37545J34159K38810J88022K07952
3165B84188582Q6613Q0137l5730l51139l18009l20287k09969P9321N28733J312965
3155B85041217K376049L595380M855876O197463O839449O706372N747054M154558
$$ y = [124782946, 125428548, 125935418, 126197083, 126255435, 126288486, 126113176, 125914649, 125807095, 125666218, 125600611, 125622637, 125832115, 126145992, 126788236, 127692186, 128924304, 130646837, 132616077, 135018048, 137981099, 141233498, 145207723, 149630002, 154610813, 159982063, 165753521, 172034620, 178494351, 185425241, 192569841, 199911091, 207413015, 215007448, 222543403, 229864019, 237091455, 243969938, 250457056, 256499507, 262021191, 267120553, 271594307, 275327109, 278218674, 280510904, 282014706, 282882094, 283419639, 283553798, 283792608, 283980630, 284188582, 284275195, 284355332, 284319602, 283968463, 283650454, 283330167, 283120198, 283199519, 283728252, 285041217, 287417266, 291012646, 295868522, 302065985, 308905434, 315611806, 321358860, 325513418]
3147C25513418J690525r00662l408108n289704o298555o640295o341594o052249
3139B92272776o011837o614263p856398r664984j1533811j3304379j4465000j4459870
3131B08362234j4071749j2957596j1516564r903868q374838p034803n807280m919905
3123A33775631m025119l345816k807006k513415k113391j919057j749978j569881
3115A13731968j325651r18613q88169q49636o09137n74256n96673o25806r20648
3106A06423379q86960r60241j032847r28191r61554o90924o27872n23550m52516
3097I9358724k47930k04492j4812J51471L18361O66305P05640J071684J351294
3088A03156245J670152J979480K604331L017693L580959M005641M674100N158406
$$ y = [325513418, 327203943, 326303281, 322895173, 317605469, 311306914, 304666619, 298325025, 292272776, 286260939, 279646676, 271790278, 262125294, 250591483, 237287104, 222822104, 208362234, 194290485, 181332889, 169816325, 159912457, 151537619, 144502816, 138695536, 133775631, 129750512, 126404696, 123597690, 121084275, 118970884, 117051827, 115301849, 113731968, 112406317, 111487704, 110599535, 109749899, 109140762, 108566506, 107969833, 107344027, 106423379, 105536419, 104576178, 103543331, 102615140, 101653586, 100962662, 100334790, 99811240, 99358724, 99110794, 98906302, 98891490, 99042961, 99361322, 100027627, 100733267, 101804951, 103156245, 104826397, 106805877, 109410208, 112427901, 116008860, 120014501, 124688601, 129847007]
3080A29847007N713294O492943P308602P779501Q131190Q801059R266903J0162251
3072A93502750J1096528J2064599J2927398J3280840J2846480J1352480R043900
3065B76114975O247238L070774M91023j433688k806712l409092l603278m013879
3057B70657361m820566o355351q174356j0541508j2719773j4108176j5238833
3050A98698798j5141990j4432907j3426349j2043632j0874038r740792q551432
3043A14487658p774471o844028o069476n624873m839842m525610l991848l677461
3035G1140049l312855l032984k860376k586161k427458k303951k180518j999187
3027E0436559j787155j735105j599114j478877j283972j295695j188743j102674
$$ y = [129847007, 135560301, 142053244, 149361846, 157141347, 165272537, 174073596, 183340499, 193502750, 204599278, 216663877, 229591275, 242872115, 255718595, 267071075, 276114975, 282362213, 285432987, 285924010, 284490322, 281683610, 278274518, 274671240, 270657361, 265836795, 259481444, 251307088, 240765580, 228045807, 213937631, 198698798, 183556808, 169123901, 155697552, 143653920, 132779882, 123039090, 114487658, 106713187, 99869159, 93799683, 88174810, 83334968, 78809358, 74817510, 71140049, 67827194, 64794210, 61933834, 59347673, 56920215, 54616264, 52435746, 50436559, 48649404, 46914299, 45315185, 43836308, 42552336, 41256641, 40067898, 38965224]
3019C8965224j008980r68646r63128q54418p74325q32915o75413q40150n95457
3010C1451792o46537o20879p08478m82983n28273o67520n03250m40230m59728
3001B6393914m39024m18128n18044l80480m91178k12325l43669m15501m74526
2992B2701039l95057k60972k81695l10418j71415k14738k33862l22276j60311
2983B0350295k53992j83927p3014j93358n6476k09391l6502R2647Q9114K3859
2973A9549255J09030K62593K23393n564l6094k06889l05486k20844l52332k69239
2963A8747823l53356j71380j40420j47456p3712p5802r5930k3189O5864L4840
2953A7767282J67597J77882L13557L43549R9108K09910J42190j18200p7778J12058
$$ y = [38965224, 37956244, 36987598, 36024470, 35170052, 34395727, 33562812, 32887399, 32047249, 31451792, 30805255, 30184376, 29475898, 28992915, 28464642, 27797122, 27293872, 26853642, 26393914, 25954890, 25536762, 25018718, 24638238, 24147060, 23934735, 23591066, 23175565, 22701039, 22305982, 22045010, 21763315, 21452897, 21281482, 21066744, 20832882, 20510606, 20350295, 20096303, 19912376, 19839362, 19646004, 19589528, 19380137, 19343635, 19436282, 19525396, 19549255, 19658285, 19920878, 20144271, 20138707, 20102613, 19895724, 19590238, 19369394, 19017062, 18747823, 18394467, 18223087, 18082667, 17935211, 17861499, 17785697, 17689767, 17666578, 17732442, 17767282, 17934879, 18112761, 18426318, 18769867, 18868975, 19078885, 19221075, 19102875, 19025097, 19137155]
2943A9137155J9596K22452L76706M41044N17153O18960O55424N20139N86040M84136
2933B3578805K29352L6609n3483j49526o3568m25855p19462q44626j102746r49380
2923A9536120q88423p60786o73591o06551m72267k96510l00943k67451l59577
2914A4910021j76613j55881m29482m05393k17076k84260k77627l30713k19395
2905A2413581j42736k5396j5909R0195O5929k89913j28905l22129m56342k88278
2895A0900097k83774j73495j65730j03951j318N0759p0833M4876J90647L34711
2885A0721989M32754N66169M33956R2742R1720K8458j84174m57836o23388n42257
2875A0560133n00089m45396k30089k12461m1316K2333p9671K1077N9961J45279
$$ y = [19137155, 19156751, 19379203, 19755909, 20196953, 20714106, 21333066, 21988490, 22508629, 23094669, 23578805, 23808157, 23844766, 23791283, 23641757, 23578189, 23152334, 22432872, 21588246, 20485500, 19536120, 18647697, 17886911, 17213320, 16606769, 16134502, 15837992, 15537049, 15269598, 14910021, 14733408, 14577527, 14148045, 13742652, 13525576, 13241316, 12963689, 12632976, 12413581, 12270845, 12245449, 12229540, 12319735, 12385664, 12095751, 11966846, 11644717, 11188375, 10900097, 10616323, 10442828, 10277098, 10173147, 10171829, 10222588, 10151755, 10196631, 10387278, 10721989, 11154743, 11720912, 12154868, 12247610, 12339330, 12367788, 12183614, 11725778, 11102390, 10560133, 10060044, 9614648, 9384559, 9172098, 9130782, 9153115, 9073444, 9094521, 9154482, 9299761]
2865I299761L07039K94113M95643N92877O68020R74437O69921n335l929n9148
2855A3233399k74394o25493q91288q18841o66504n03732k16682l44017l64934
2846H527514k6190k28570r9726j42205j52664K0557O8616O2619J79692K11217
2836H420860M04794K78046j06759j67941l02650k00237o25959m93592n13173m02171
2826F291218l08997l11311k31559j37160j48781k09283j86519j33799j26904j21246
2816D375659r790k2451q800j25276r2085K5045J17628R9733K19053k5757j43609
2805D409350q0146k03332j73779j38992j01051j22776q4453m7844l6952j38289
2795C281736m5287J6679O738j8063J9787L6190k0872K22700N7279p6429M1407
$$ y = [9299761, 9606800, 9900913, 10396556, 10989433, 11657453, 12631890, 13301811, 13296476, 13292547, 13233399, 12959005, 12333512, 11442224, 10623383, 9956879, 9453147, 9236465, 8892448, 8527514, 8501324, 8272754, 8173028, 8030823, 7878159, 7898716, 7967332, 8029951, 8209643, 8420860, 8825654, 9103700, 8996941, 8829000, 8526350, 8326113, 7700154, 7206562, 6693389, 6291218, 5982221, 5670910, 5439351, 5302191, 5153410, 4944127, 4757608, 4623809, 4496905, 4375659, 4365869, 4343418, 4334618, 4209342, 4117257, 4142302, 4259930, 4359663, 4578716, 4552959, 4409350, 4329204, 4125872, 3952093, 3813101, 3712050, 3589274, 3504821, 3456977, 3420025, 3281736, 3236449, 3253128, 3259866, 3241803, 3261590, 3297780, 3276908, 3499608, 3556887, 3480458, 3521865]
2784C521865j29119p5130j75274k05925p3920j57784n5386j04856l4813j00703
2774B408955k5877o2586l6967o4569N4667o4132p9662P2942K2874j7482j21712
2763B086451N5112L2292o9101k3118J9701L940j49871K7476M1209n8808R629m0201
2751A934711n3369j39296O0974L4430r9210n0875R0880M2082q8059n6422R5192
2740A771038O0626q2843m3212Q1874j55676N2273n7742q4978O1014M6536m1075
2729A607835r328M2097L3450L2826K7278k4757L3609J9582p7513k8087M0805M8734
2717A746531n1842L5309J3269M9210J761L6783j8888O4398O1816R833m7361J10884
2705B011703J63506j8545J375P3210N2753m3701J6039J03436P3161j40592j6761
$$ y = [3521865, 3392746, 3317616, 3142342, 2936417, 2862497, 2704713, 2649327, 2544471, 2509658, 2408955, 2383078, 2320492, 2283525, 2218956, 2273623, 2209491, 2129829, 2202771, 2225645, 2208163, 2086451, 2141563, 2173855, 2104754, 2081636, 2101337, 2105277, 1955406, 1982882, 2024091, 1965283, 1974912, 1934711, 1881342, 1742046, 1803020, 1837450, 1738240, 1687365, 1778245, 1820327, 1732268, 1675846, 1771038, 1831664, 1748821, 1705609, 1787483, 1631807, 1684080, 1626338, 1541360, 1602374, 1648910, 1607835, 1598507, 1640604, 1674054, 1706880, 1734158, 1709401, 1743010, 1762592, 1685079, 1656992, 1697797, 1746531, 1694689, 1729998, 1743267, 1792477, 1794238, 1831021, 1812133, 1876531, 1938347, 1948180, 1900819, 2011703, 2175209, 2156664, 2158039, 2231249, 2284002, 2240301, 2256340, 2359776, 2432937, 2292345, 2275584]
2694B275584J03150R263K6767L5564K3733J80475L9987j754R934J27930Q7968
2683B918601L1811J45276Q4944O6777J11529n069l1215K0620p7953j41683j1083
2672C112555M4759j06564q40l5973L3049N6746L8577j8394L0767n187j205J22666
2660C270956j8510j12762J4110m4371O2179l6858o1166k00113k712q3153j22484
2649B665116m9325j38244q8495J03654O6590q5143O0670l1545Q7127j06655p3523
2638B410227M5650j10277m7300K9380l6049j14997j96763j062n0225m6631q4771
2627A797182k7441j26511j06515m7650n8608k9209p8553n2736N0408k460j02680
2616A215227k1166m4417m4041m899r8059L9780r4186n5836l5023N8535l4882j18153
$$ y = [2275584, 2378734, 2387997, 2414764, 2450328, 2474061, 2654536, 2694523, 2692769, 2702703, 2830633, 2918601, 2950412, 3095688, 3180632, 3247409, 3358938, 3353869, 3322654, 3343274, 3265321, 3123638, 3112555, 3157314, 3050750, 3049910, 3013937, 3046986, 3103732, 3142309, 3123915, 3154682, 3149495, 3148290, 3270956, 3252446, 3139684, 3153794, 3109423, 3171602, 3134744, 3073578, 2873465, 2870753, 2787600, 2665116, 2615791, 2477547, 2389052, 2492706, 2559296, 2474153, 2534823, 2503278, 2590405, 2483750, 2410227, 2455877, 2345600, 2298300, 2327680, 2291631, 2176634, 1979871, 1978809, 1928584, 1881953, 1797182, 1769741, 1643230, 1536715, 1489065, 1430457, 1401248, 1322695, 1269959, 1320367, 1317907, 1215227, 1194061, 1149644, 1105603, 1100704, 1002645, 1042425, 948239, 892403, 857380, 915915, 881033, 762880]
2604G62880L7035p6142N0417P9361l1007k4961q645j29881M6494r9983K7967j87
2592F33348P6236k8790m4239j6220M7506j22298P9260L854K8037j4818j23856
2581E18020N8866r1532O907j2231k5092P026L316p1172n3084R0286n023L0524
2569D56811o343j1396m8031J364m7572j51982j1931O5524J749K487R154J24746
2557C84580J11715m0878j03135n0859j0906Q9735o6484j02785Q7380l2144m9457
2546B16762J01303L3598j51935L3292J11849k7767K9932K95n0720M6715n6347
2535B86977k72n2529N646R0324N8019n7228n3873l6840J7472Q6991o741q8961
2523B48985o5186m0450j2262M8275R3130p3455L5917J4777p853j4187P3928j58071
$$ y = [762880, 799915, 723773, 774190, 853551, 822544, 797583, 788938, 659057, 705551, 605568, 633535, 633348, 709584, 680794, 636555, 620335, 667841, 545543, 624803, 628657, 656694, 641876, 518020, 576886, 485354, 492261, 480030, 454938, 461964, 465280, 394108, 341024, 431310, 426287, 456811, 450468, 439072, 391041, 392405, 344833, 192851, 180920, 246444, 248193, 250680, 259834, 384580, 496295, 455417, 352282, 301423, 290517, 380252, 313768, 210983, 298363, 266219, 216762, 318065, 351663, 199728, 233020, 344869, 317102, 347034, 347329, 296609, 343324, 286977, 286705, 234176, 239822, 330146, 388165, 330937, 277064, 240224, 257696, 344687, 337946, 248985, 183799, 143349, 131087, 179362, 272492, 199037, 234954, 249731, 241878, 227691, 301619, 143548]
2511A43548o1440J01838o6153L4562j2314J922O9562Q8182p2255j04614K5403
2500A48241p808L3091j4484n50m9831p8687P6196k6245J165R1817J1569K6718
2488B11192j49644P3098n2672N9061m9743L3454L441N4333j13740n7770O7838
2477G8848q5175N3532N0360N1180n4100L0630J7397r278j4184m7393j7613l0113
2465B4091j16293K4541N1754J8596O6543M2349L8611j01780L6720j05699r3976
2454a14543J47069K7654J4781M3107q2567N2573N6669r4069q5208R779L6123L8851
2442E0219R9920P9208n1958j28507p6533P4243j9449r996m6961j811J30961L2455
2430A31791p5853Q8238N7330j80844k79M8525O2669m8609J3881j6023q2321n0505
$$ y = [143548, 82108, 183946, 117793, 152355, 140041, 141963, 211525, 299707, 227452, 122838, 148241, 140433, 173524, 159040, 158490, 108659, 29972, 106168, 79923, 81088, 172905, 184474, 211192, 61548, 134646, 81974, 141035, 91292, 124746, 128187, 182520, 68780, 11010, 78848, -6327, 47205, 97565, 148745, 94645, 125275, 142672, 133394, 119210, 71817, 54204, 24091, -92202, -67661, -15907, 2689, 69232, 111581, 150192, 48412, 85132, -20567, -114543, 32526, 60180, 74961, 118068, 35501, 88074, 144743, 50674, -34534, -24755, 11368, 50219, 150139, 229347, 177389, 48882, -27651, 46592, 27143, 17147, -29814, -31625, 99336, 131791, 55938, 144176, 201506, 20662, 20383, 68908, 131577, 82968, 96849, 80826, -1495, -52000]
2418e2000K7130j14341P9776J063L1637M6229M4238o2527N605K7719l696n6848
2406b6015L7552l1880N5101p5476R054j8060J2076J21443l9337m3015n7657O1641
2394E427N349k3053j8366j6563k1890m5543M8697J18927o9387m5565P7307j8998
2382c658K4813j08705J22051J2682N5893o4064j78314P918M5878J15076j3874
2371A5696K6501J9594k4808r4069L5279K6880K4891r5668q5415Q9185J422O9863
2359I351k7350r2611n3382n9521J33720Q8503n6990k9696J8952P368O4221l6061
2347c3496r0514P3893J247P3036r4543M6818M1110q6291L2373N6362k7103k6591
2335c3699j51010J17810m4359R6799m7812m920J14854j12920l322L0388M5189
$$ y = [-52000, -24870, -139211, -59435, -58372, -26735, 19494, 63732, 1205, 6810, 34529, 30833, -26015, 11537, -20343, 34758, -40718, -31664, -49724, -37648, 83795, 44458, 1443, -56214, 5427, 10776, -12277, -30643, -47206, -69096, -114639, -65942, 52985, -16402, -61967, 15340, -3658, 21155, -87550, 34501, 47183, 103076, 39012, -139302, -131384, -85506, 29570, 15696, 42197, 61791, 36983, -57086, -21807, 5073, 29964, -65704, -151119, -61934, -60512, 9351, -17999, -110610, -163992, -223513, -89793, -1290, -58280, -87976, -69024, -61656, 2565, -33496, -124010, -50117, -48870, 24166, -70377, -23559, 17551, -68740, -36367, 19995, -7108, -33699, -184709, -66899, -111258, -14459, -62271, -67191, 47663, -65257, -68579, -38191, 6998]
2324F998l6720o1040M6553P3894j05971J2013n9900O1494Q4158l2622N1310o5494
2312b5327m4892p4761j5727J26805l2792J485o2221L3145M8545N3493j57087O3684
2300h5650o518Q9442o0793q5819K0133P5850j3956O2557n5154q6488J05322M3557
2288B483p8686J43683r4878O0568k4619q4178J35694L0180j40190P091J5817L6801
2276I766J3479l8068N9182K8782J855j6869m3273o8619L5417j9027l5668N1454
2264b1589l2081m294O7578N50k3858O5703k11056J2587J02112J15778q7535l9738
2252e5843K5617p6327J11986o4636R0207k4517j11083K9820k9085M3203m3847
2241a04505N0405J02716k0005k2951o2521J1630R577J6806l4012J3635m8578O7181
$$ y = [6998, -29722, -90762, -44209, 29685, -76286, -64273, -124173, -62679, 21479, -11143, 40167, -25327, -70219, -144980, -160707, -33902, -66694, -65209, -127430, -94285, -45740, 7753, -149334, -85650, -92168, -2726, -63519, -149338, -129205, -53355, -67311, -4754, -59908, -146396, -41074, 2483, -76203, 67480, -27398, 33170, 8551, -75627, 60067, 90247, -49943, -42852, -27035, 9766, 23245, -14823, 44359, 73141, 74996, 58127, 14854, -53765, -18348, -37375, -73043, -21589, -53670, -57964, 9614, 10164, -13694, 52009, -159047, -146460, -44348, 71430, -16105, -55843, -30226, -106553, 5433, -59203, 31004, 6487, -104596, -74776, -103861, -60658, -104505, -54100, 48616, 28611, 5660, -56861, -45231, -35654, -18848, -52860, -39225, -87803, -20622]
2229b0622n3009q5184P5357O2405K8491l3148q4259o3390O0774J71360k1220l2283
2217E272r1775k4395J02239L6161q0211M620J545P356n7524J9327Q4888m2895
2205c5392n5108K3178K2071K4897o42O1520l5162J07457O518j11088m1968M092
2193b9627r224l1876Q5802k5676O1581j029j07310J19149M6589k3309p5615q7634
2181g8179k7549P5491O8017Q1060j31077j33809P7286K379j31993J95173l6903
2170d0104j3745J26151j07516k6110P626m4182N7393j1215J5129l6444k7192l232
2158a03441J75976j07110Q130M2290r2986k6010J24325k5392k0289k7361L2263
2147a9605J25653K9787J5664j7823J8670N7861p484o4454M89N8166P2083o9794
$$ y = [-20622, -73631, -158815, -83458, -21053, 7438, -25710, -109969, -173359, -112585, 58775, 37555, 5272, -86503, -110898, -8659, 27502, -52709, -48089, -46544, -39188, -96712, -77385, 7503, -35392, -90500, -67322, -45251, -20354, -20996, 40524, 5362, 112819, 119337, 8249, -33719, -29627, -38851, -70727, 15075, -10601, 50980, 49951, -57359, 61790, 108379, 85070, 9455, -78179, -105728, -30237, 37780, 118840, -12237, -146046, -68760, -66381, -198374, -3201, -40104, -53849, 72302, -35214, -61324, -53698, -97880, -40487, -51702, -36573, -73017, -100209, -103441, 72535, -34575, -26445, 15845, -77141, -103151, 21174, -4218, -24507, -51868, -19605, 106048, 135835, 151499, 133676, 152346, 210207, 202723, 138269, 138758, 196924, 269007, 199213]
2135A99213j0485J1355O0235m034l0123N2282J2079K3029J19812K947J4440k4720
2123D26030J23195j6429o2145R155m3442M124J21262J0549L9702P9554n8287Q6542
2111G19810J50307n6769O9774n3816P3366J74635p56J00834J26899J03212K53467
2100A660963K0849N8120J78079J17240k6476R9847K14390K62347J82555L60524
2090C128438J83317K68416L10216N36998O27269Q13449R87488J456934J915654
2081A0228179K626530P65893n30511j072751k146608j874046j464344j009372
2073E522970p55451n62714n29834l28614l03416k17057k99430j67736m11227j87631
2063A759860j39019j54214j11497j06475j00264p3330L1659n7759l6945j83432
$$ y = [199213, 188728, 200083, 260318, 256284, 226161, 278443, 290522, 313551, 433363, 436310, 450750, 426030, 549225, 532796, 470651, 479806, 436364, 440488, 561750, 572299, 612001, 691555, 633268, 719810, 870117, 813348, 883122, 829306, 902672, 1077307, 1076551, 1177385, 1304284, 1407496, 1660963, 1681812, 1739932, 1918011, 2035251, 2008775, 2108622, 2323012, 2585359, 2767914, 3128438, 3311755, 3580171, 3890387, 4427385, 5054654, 5868103, 6855591, 8312525, 10228179, 12854709, 13620602, 13090091, 12017340, 9870732, 7996686, 6532342, 5522970, 4767519, 4204805, 3674971, 3346357, 3042941, 2825884, 2526454, 2358718, 1947491, 1759860, 1620841, 1466627, 1355130, 1248655, 1148391, 1075061, 1106720, 1048961, 1012016, 828584]
2053H28584j29051m0893j61620K8536j02775P9436k3469L9343m800j06658J9107
2042D25740m8142L8380N6064j46223J8021O1647l0287m3670m9974r7111N8604
2031B43049M2781L5821l6212l6382q7661k9999J34296m7020n9674M159P083n233
2019A65008m5718j05201N3999L1796K8272M8825M4720j9625r0728P993m4069R414
2007H4686K1903m5469K9037O0484j6231q0611l0466M5069O9389k045o6714N2766
1995A21798q4697n2457L2456o2139L3696k7818J09465K6880j16107R7920K4679
1984A03676l8823j16910m0943L7525p9578O5295m4184R3137L9628J5522p97j20746
1972h7198J2854J0415l7381N9637l9738l3457k2002M4020M0440n6472L1980J9442
$$ y = [828584, 699533, 658640, 497020, 525556, 422781, 502217, 478748, 518091, 513291, 406633, 425740, 377598, 415978, 472042, 325819, 343840, 405487, 375200, 331530, 281556, 184445, 243049, 285830, 321651, 285439, 249057, 161396, 131397, 265693, 218673, 158999, 163158, 170241, 165008, 119290, 14089, 68088, 99884, 128156, 176981, 221701, 202076, 111348, 119341, 75272, 84686, 106589, 61120, 90157, 150641, 134410, 53799, 23333, 68402, 137791, 135746, 69032, 121798, 37101, -15356, 17100, -45039, -11343, -39161, 70304, 97184, -18923, 78997, 103676, 64853, -52057, -93000, -55475, -135053, -69758, -113942, -20805, 18823, 34345, 33548, -87198, -74344, -63929, -101310, -41673, -81411, -114868, -136870, -92850, -52410, -108882, -76902, -57460]
1960e7460m631n9436Q9602k983k7318l0902J41995r985o0350R4022r3227J7798
1948b875K3509j59887l7207J18830M6096K1634k8392J8084k8233j07735O4900
1937g1276j808K8273q3832k7227N2985p2509O2909R1241p947K3786J5774j3592
1925c223m0347k19996P3766R1617j58961J07958J14523j0168m2746O5753j1673
1914c3497K0457J2877n7781N9581l2486L7056l4691j01514R0175j13641j9360
1903a72824J78968p5120k1976l0306M0106j23615M673M8915L313K9736M2784o8443
1891a43789Q7481m7693r7420J86053N3587j07298n1926O7244j06725Q0335l363
1880h3514N1438q1078J0356J2137P7687j15536J1744R0055j12190k7004J52147
$$ y = [-57460, -62091, -121527, -31925, -34908, -62226, -93128, 48867, 38882, -21468, 72554, -20673, -2875, 20634, -139253, -176460, -57630, -11534, 10100, -18292, -208, -28441, -136176, -71276, -73084, -44811, -128643, -155870, -102885, -175394, -112485, -21244, -29191, -5405, 10369, -3223, -43570, -263566, -189800, -98183, -257144, -149186, -34663, -44831, -87577, -21824, -33497, -13040, -163, -57944, 1637, -30849, 6207, -28484, -129998, -39823, -153464, -172824, 6144, -68976, -90952, -121258, -81152, -204767, -200094, -151179, -147866, -118130, -75346, -143789, -56308, -104001, -201421, -15368, 38219, -69079, -121005, -53761, -160486, -80151, -83514, -32076, -113154, -102798, -90661, -12974, -128510, -116766, -26711, -138901, -165905, -13758]
1869a3758k6638r7544J59844j02595m0435L4659n1217P5122q8566M7309J1742
1858i2077o5303J08292o5200N8278J5380l2954K3490l5786J4131r833P4464j01944
1846a09062n8717N6893l3284J7316j3647r208k1070J62764j4674M9535K5253j82653
1834a30554J4917N0520k0640N7676j46984M1307O5162O734p6306J4952m3905l430
1822a70551K9586M8546J35037N259j74074m562k9515L9474O6808L768O4032K7322
1810D1130q8078l3422r668j5871K6332J2948j3296M3916n2237N5407P410m9741
1798g5170P46n1646L0450k0762l0001j9668J8807M2682O3987K4831j39039l1607
1786a86390O5283K7381L561l6123K7686M6875J7093l7248q626l6446J14302j09579
$$ y = [-13758, -40396, -137940, 21904, -80691, -121126, -86467, -137684, -62562, -151128, -103819, -92077, -157380, -49088, -114288, -56010, -40630, -73584, -50094, -85880, -71749, -81582, -7118, -109062, -167779, -110886, -144170, -126854, -140501, -149709, -170779, -8015, -22689, 26846, 52099, -130554, -115637, -65117, -85757, -28081, -175065, -133758, -68596, -61862, -138168, -123216, -167121, -170551, -140965, -92419, 42618, 47877, -126197, -130759, -160274, -120800, -53992, -50224, 13808, 41130, -46948, -80370, -90038, -105909, -79577, -66629, -79925, -36009, -88246, -32839, -25429, -75170, -74424, -126070, -95620, -116382, -146383, -166051, -147244, -104562, -40575, -15744, -154783, -186390, -121107, -93726, -90165, -126288, -98602, -51727, -34634, -71882, -80508, -116954, -2652, -112231]
1774a12231l4970P2012K0523P444J05972m0722j7815J8113n3265o9680k082R0013
1762a6688K9688m8255m9744j31796m0822J81304L7698m4162n9420L8103k0887
1751a24981J11849J6377j17802q7632k6174P8454l8889P4558J1117R6826o5296
1740g1593r5354O3371P6071m341j46100J2320K0240p2879R0127K4671J4910J23979
1728C5422j42761k7296k7228j7504K9694k849P8059q805l1561L8213l0576M530
1716a02662L0947P3007J1837j47323J0388N2627o9708J42404J2233r2847r29j6243
1704i6269N0776J2810N2716j91870J19095m762o3409N2164j2404J7098J39546
1693G5491q6472N8887q9937J0201P0290j23741p8645P0268r9041Q6451R7088m485
$$ y = [-112231, -147201, -75189, -54666, -47222, 58750, 18028, 213, 18326, -34939, -104619, -106701, -16688, 13000, -35255, -84999, -216795, -257617, -76313, -38615, -82777, -142197, -104094, -124981, -13132, 3245, -114557, -202189, -228363, -149909, -188798, -114240, -103123, -6297, -71593, -166947, -103576, -27505, -31846, -177946, -165626, -145386, -218265, -128138, -103467, -88557, 35422, -107339, -134635, -161863, -179367, -149673, -152522, -74463, -83268, -114829, -76616, -107192, -102662, -71715, 1292, 13129, -134194, -123806, -71179, -140887, 1517, 13750, -79097, -80026, -96269, -45493, -32683, 20033, -171837, -52742, -57504, -120913, -68749, -81153, -64055, 75491, -10981, 47906, -42031, -31830, 38460, -85281, -163926, -93658, -192699, -106248, -9160, -13645]
1681a3645K0100K0323j10473m7517j9594P7942Q6237q8779k7636m8848J18754
1670c3136m1526k3731l4310j7674j0900J8473L1016m0612j3892O8723m8802M8842
1658i7529n0262K2324n4179O0444Q4128r8363K9800m3578j9743J31280n9759R2852
1646b585j8790J0976L3761p7849L9390M3117j10128p806o7134O6592J2962k2113
1634i9607r172j7734K1022O619p729P1440k3518l7450j5104l6466L0611J02260
1622a4828l3579j36857N1679J33360l9858N940Q0067j9755j42030M4950J18587
1611D7676o0852q2036l6223N8387m6397Q0067n2098J12317j10242J7210q1424
1600a53615k468J37367o0077j07806k4591R4621J0168n5329o0422J36951Q4216
$$ y = [-13645, 6455, 26778, -83695, -131212, -150806, -72864, 13373, -75406, -103042, -151890, -33136, -74662, -98393, -132703, -150377, -161277, -142804, -111788, -152400, -166292, -97569, -146371, -97529, -147791, -125467, -179646, -119202, -35074, -133437, -103637, -147215, -166958, -35678, -95437, -2585, -21375, -10399, 23362, -54487, -15097, 28020, -82108, -89914, -157048, -90456, -77494, -99607, -108779, -126513, -105491, -98872, -106601, -35161, -58679, -96129, -111233, -147699, -117088, -14828, -48407, -185264, -133585, -225, -40083, -34143, 45924, 26169, -115861, -70911, 47676, -13176, -95212, -131435, -73048, -119445, -39378, -91476, 20841, -89401, -72191, -153615, -156083, -18716, -78793, -186599, -211190, -116569, -106401, -161730, -222152, -85201, -985]
1589i85k9222m79K730m8712P4046n407r8788L1973N5738K4699O586n6897N1793
1576G075n6009r1188j397Q289m8457J49755L9118K1933R292k9182j18757j1132
1564a20660O777K7001K6140O9639k0161n7601k3410p632J8026O9488j50805P7087
1552h6111J6554n8693j2101o5021P7092P0306r111o2628m3667J48162P6990k3922
1540B7850o1970q1499M5394K011L1407j13407Q571K9157J45179l4185n7181r420
1528f8093R7618Q634L5732j04550j6649K3303J6611p2995O470M5003P0355q6132
1516d4693M6039J13884o0501q9549m6018n1475J04608M9956j03943j2621q1834
1505a76147O9152M5096J157L6745r2830M1454J36157m2206M4035m2984o0698j9796
$$ y = [-985, -30207, -30686, -27956, -76668, -2622, -8029, -106817, -74844, -19106, 5593, 12179, -44718, 7075, -48934, -140122, -141519, -133230, -181687, -31932, 7186, 29119, 38411, 9229, -109528, -120660, -113883, -86882, -60742, 8897, -11264, -68865, -92275, -99907, -81881, -12393, -163198, -86111, -69557, -128250, -140351, -205372, -128280, -57974, -67085, -129713, -173380, -25218, 51772, 27850, -34120, -115619, -70225, -68214, -36807, -150214, -141643, -112486, 32693, -1492, -58673, -68093, 29525, 38159, 73891, -30659, -47308, -24005, -7394, -80389, -73919, -28916, 41439, -44693, 1346, 115230, 54729, -34820, -80838, -132313, -27705, 22251, -81692, -94313, -176147, -106995, -61899, -60742, -23997, -116827, -75373, 60784, 18578, 62613, 19629, -41069, -60865]
1493f0865p5095O7197k9192K794J39286j31483m7297P3370K0439N6139n4823n4786
1481i4316P306P9513r7806p626P2283k9227m7392P539k9867J02467p703j5191
1469f0020j780O689k1036p4047P2639n6275M9415M2212j4149L9516n963l5530
1457e8329n1372Q3222k6968P644j7861K016j491o430j5501J1889M2091o6605R117
1444h8578p5845k6371O3480L2250l4847k5702N2019J15208J1498l4741O1888K5877
1432G6136j12940m2483n4323M9497R790p559j1659o9672J0767M8115M5692L1939
1420b6700n8033k8239J19327K516k0652j4992p3001M3630K535K8620n8322J8608
1408f4703K7064j4081M1876k219m2578p0624L5978n991k658K9179J7177p9145
$$ y = [-60865, -135960, -68763, -97955, -95161, 44125, -87358, -134655, -61285, -40846, 15293, -39530, -94316, -87010, -7497, -105303, -112929, -40646, -69873, -117265, -109726, -139593, -37126, -44829, -60020, -61800, -55111, -76147, -150194, -77555, -133830, -84415, -42203, -56352, -16836, -22799, -58329, -109701, -26479, -53447, -45803, -63664, -61648, -63139, -69569, -85070, -73181, -31090, -97695, -88578, -164423, -190794, -127314, -95064, -129911, -155613, -103594, 11614, 23112, -11629, 50259, 76136, -36804, -79287, -133610, -84113, -74323, -81882, -93541, -163213, -152446, -104331, -58639, -26700, -84733, -112972, 6355, 8871, -11781, -26773, -99774, -56144, -53609, -24989, -83311, -64703, -37639, -51720, -9844, -12063, -54641, -125265, -89287, -95278, -97936, -68757, -51580, -130725]
1396a30725N0538J6533q0615L5502n0704m2521J34787j4237J4963J03498n5678
1385a8659M7051r6764k4011j3902j4592j1728K71N987K7276l3085J47066k0764
1373e854q2037m55j8936K3855M5010K8638j5408L2070m2427k0225k0700Q253K0594
1360d7622M1157m1194k8304N5884n8786L2527K7181o7794l8831J01876m5618P5621
1348F097m1221O7890j22060k1493J29362l0556L134J4775J7481r3930K4961l5469
1336h1029o3098R8411N9037m0369K385L7302j06381P384Q7547R996o7825L7932
1324a8708j5088J8268L7151j24246J12562K8900j6149j0088m3512l2704M7343
1313a6271j439m4284j5848M2713L9710n3990k712j4249j15027L7745p5480J0266
$$ y = [-130725, -80187, -63654, -144269, -108767, -159471, -201992, -67205, -81442, -66479, 37019, -18659, 28392, -68372, -92383, -106285, -120877, -132605, -132334, -126347, -99071, -132156, 14910, -5854, -87891, -88346, -107282, -83427, -38417, -9779, -25187, 6883, -35544, -55769, -76469, -68216, -47622, -6465, -47659, -75963, -20079, -78865, -46338, -19157, -86951, -125782, -23906, -69524, 6097, -35124, 32766, -89294, -110787, 18575, -11981, -8847, 5928, 23409, -70521, -45560, -81029, -144127, -45716, 13321, -27048, -24663, 12639, -93742, -86358, 1189, 11185, -56640, -18708, -33796, -15528, 21623, -102623, 9939, 38839, 22690, 12602, -30910, -63614, -16271, -17710, -61994, -77842, -35129, 4581, -49409, -52121, -66370, -181397, -143652, -219132, -208866]
1301b08866Q1995P1808k942O8158r5663L4569J4084N1309k1101r9861k0109P9870
1289d6749o9952m2213O922r445J52086O9354p8181k4114P3544L3824p4364K8583
1277A9295l5562L8631m875n2181j00789m7392J20481o41J7650j29245j5308O5443
1265a24493j2994J9723J0805P3582j209k792J634N24q460M2731n571K7936j1718
1252I698m8839K1323J2533k0913m7169P532J8019m6950m7743M3190K5981K1865
1240e1473l3875K083R398K5055N3219P656n7018l2543K6806j0972k6482R459O4899
1227a3788Q2201j37774K601L5819l9688J07106o2826j2435J0649Q0838o9820j53706
1215a70823L8142M2535J2027J32055j01559O8091k3176l4670N9862j29l9094p3813
$$ y = [-208866, -126871, -55063, -58005, 10153, -85510, -50941, -36857, 14452, -6649, -106510, -126619, -46749, -116701, -158914, -151992, -161437, -9351, 60003, -18178, -42292, 31252, 65076, -9288, 19295, -16267, 22364, 17489, -34692, -135481, -182873, -62392, -63033, -45383, -174628, -189936, -124493, -137487, -117764, -106959, -33377, -34586, -37378, -35744, -35220, -43680, -949, -6520, 21416, 9698, -39141, -17818, -5285, -26198, -73367, -65835, -47816, -94766, -142509, -99319, -73338, -51473, -85348, -83265, -73867, -48812, 4407, 12063, -44955, -77498, -50692, -61664, -88146, -78687, -13788, 68413, -69361, -66760, -30941, -70629, 36477, -26349, -38784, -28135, 52703, -17117, -170823, -132681, -90146, -78119, 53936, -47623, 20468, -2708, -37378, 22484, 22355, -16739, -90552]
1203i0552J27668o8931N8205m8487K1843M4805J1493p9876K3430j41525L0068
1192a11859O452J07411K2645j8355q7341K5116K6810K0245l015P9782l5480l627
1180B8784j9326n8074j488j9614N2965j0280o3572j9552Q1504l784o792L0998
1168h231O3369j7458J11262p9712l8661m7766n5544j7964O810J55847l8532j9149
1156A4271p8506l160l649M2950M618q2712P0078Q955L0299j4464n7048Q4638K1582
1143C7852m8989L1595l0947o1311l3656K5261l1178N9851J9573j9556k3856K2218
1131e3143j7921K3921J19479j03293k4164m9878N5793j822M8914M7814o0062P3266
1119E8904O29l3104k4726k8583o7838k9392p480K44307m647k4337j29880L2641
$$ y = [-90552, 37116, -31815, 26390, -22097, -254, 44551, 56044, -23832, -402, -141927, -111859, -105407, 2004, 24649, 6294, -81047, -55931, -29121, -8876, -11891, 67891, 32411, 28784, 9458, -48616, -50104, -69718, -16753, -27033, -90605, -110157, -28653, -32437, -39229, -8231, 55138, 37680, 148942, 69230, 30569, -17197, -72741, -90705, -83895, 71952, 33420, 14271, -64235, -67395, -71044, -28094, -23476, -106188, -36110, -27155, 3144, -11320, -68368, 16270, 37852, -11137, 20458, -10489, -71800, -105456, -80195, -111373, -51522, -31949, -51505, -75361, -53143, -71064, -47143, 72336, -30957, -55121, -104999, -49206, -51028, -2114, 45700, -14362, 58904, 59533, 26429, 1703, -26880, -94718, -124110, -131590, 112717, 108070, 83733, -46147, -13506]
1107a3506P5704K1659q9238L0679o069L5025l015q9116J5759N275k7027m3855
1095h7725J3214J28461p2094p7612J36999k0961l4627Q2558K293m2194r0925K4658
1083c7955N651m459j7134J5335L9352L6272p3878J1713N5734j3446N030J4553
1071C6768M9962p1501K6705l155l0680K8941p9065l4529j4198J15135P5016j54509
1059e5110k3140M485O2778j06p1613J01923M0049m7165o3836N055N7303J973J06818
1046A19414m4402j3355m2751L1917n9905J1435N5707p0802J08974m2155j45618
1035i1541L3902p1780J3475Q7320J581M6411L3713m2095K039j6727R454q2848
1023g7096P1906l6450m4547j17367J12526J25541K3110K0901L3892j80346L7383
$$ y = [-13506, 62198, 83857, -5381, 25298, 19229, 54254, 51239, -37877, -22118, -16843, -43870, -87725, -74511, 53950, -18144, -95756, 41243, 20282, -14345, 68213, 70506, 28312, -62613, -37955, -32304, -36763, -53897, -38562, 790, 37062, -36816, -25103, 30631, 17185, 22215, 36768, 86730, 15229, 41934, 38779, 8099, 37040, -42025, -76554, -90752, 24383, 99399, -55110, -78250, -73765, -10987, -11093, -82706, 19217, 59266, 12101, -51735, -46680, 10623, 12596, 119414, 75012, 61657, 18906, 50823, -9082, 2353, 58060, -12742, 96232, 54077, -91541, -57639, -129419, -115944, -28624, -27043, 19368, 53081, 10986, 13025, -3702, 5752, -77096, -5190, -41640, -86187, -203554, -91028, 34513, 57623, 78524, 112416, -67930, -30547]
1012c0547K0740K1926J09561j0410o1953n8340q6398l2981Q7843l757M1629N1957
1000D9270j6060K4769n5859o2593Q7069m9281k5658J16203j9606p4776L1079j4725
988a0168r5718L6883R7029J6340q318l0717M3265m0941q5554K0296J7689J21300
976H1386Q652q1309O5597l9233K0856N3992L6630j44857O7119L9147o1618o138
964D0224J7676o0108L1087k1503J2388J6404r360K8924j0034l8002n4914J8807
952b8411O4214P4253o8423j06453L562O3925n247Q676p2870q168L9430j5493P83
939e0222J1486j556q3585P8049k6531J84891k3516p7418l2861k2674J28467p9378
927E152o1600Q8219l7869n0360J9932O5020Q1053m8196m8906m6802J4822J29182
$$ y = [-30547, -9807, 12119, 121680, 111270, 49317, -9023, -95421, -128402, -40559, -44316, -2687, 49270, 33210, 57979, 2120, -60473, 26596, -22685, -48343, 67860, 48254, -26522, 4557, -10168, -105886, -69003, 28026, 44366, 36048, 5331, 48596, 7655, -77899, -57603, -39914, 81386, 90038, 8729, 74326, 35093, 55949, 109941, 146571, 1714, 68833, 107980, 46362, 40224, 57900, -2208, 28879, 7376, 19764, 36168, 26808, 55732, 45698, 7696, -47218, -28411, 35803, 110056, 41633, -64820, -61258, 2667, -2580, 6096, -66774, -74942, -35512, -51005, -50222, -38736, -40292, -123877, -45828, -72359, 112532, 89016, 11598, -21263, -43937, 84530, 5152, -56448, 31771, -6098, -56458, -36526, 28494, 109547, 61351, 12445, -34357, -19535, 109647]
915A09647r6452r6700N8933K3136k6722p4355M4460M5047l35N6893o1700m7149
903f5297K4485O0295N5973N5520j09760n6876o7191K6606N4061J36906K3947j90304
891e1635o5660O8533J47453r9021p4229J9851N5059N3612O129K2285J00913r5384
879H7906k2249k437n4690L1178n6568N5842p6443R563R5483p9677J3268m0304
867c9128Q2994Q1859j10662R8241j56670j22446R0704J78098N487n1456L6466
856I3487p2977P0679J06463r6498o2699k3339N1892m4996m9496R3772l2426k0013
844A3849J2953K5456Q57J1599j20608O4372O3223Q282n51l927p9210O5828j02723
831d0600J13339p7696P110L7686j2577l4349J00811j23822n6722J67180j11739
$$ y = [109647, 13195, -83505, -24572, -1436, -28158, -102513, -58053, -13006, -13341, 43552, -18148, -65297, -40812, 19483, 75456, 130976, 21216, -35660, -102851, -76245, -22184, 114722, 138669, -51635, -117295, -48762, 98691, -330, -74559, -54708, 351, 53963, 60092, 82377, 183290, 87906, 65657, 63220, 8530, 39708, -16860, 38982, -37461, -27898, 67585, -12092, 1176, -39128, 43866, 125725, 15063, 113304, -43366, -165812, -75108, 102990, 108477, 57021, 93487, 20510, 91189, 197652, 101154, 38455, 15116, 67008, 22012, -27484, 66288, 33862, 13849, 26802, 52258, 53115, 64714, -55894, 8478, 71701, 79983, 79432, 75505, -3705, 62123, -40600, 72739, -4957, 2153, 39839, 27262, -7087, 93724, -30098, -86820, 80360, -31379]
820c1379K8934R2366M6474j55048J00007N6934m7865l1784l1960L9429K1671K9060
808A16839j56907j992P6658J6657k2294m5912O7887M2191p8484O0158L9335r1783
796B2353J9851M6041q4758P028J01662p7517k828P54m7123l9144L1261q3637J08720
783B663M6455O6240Q5678o1913j20509O3480M4058r4612J40837o3120k5751j7707
771F5799N4480P7208q0672l4695K7506n6132n6267M0835L1976N5785O485r9844
759C2464o4416K1696J53322j25729l918J9470k1512k4594O2606J9910m2219m1233
747a4153j6229J20134p3162o1853P0575j18298L2037P7929K8111q5489O4410J00301
735A24313p5361J8108p3453p1604J0752R6389N8197j509j17721Q37m2285J17624
$$ y = [-31379, -2445, 89921, 136395, -18653, 81354, 138288, 90423, 58639, 26679, 66108, 87779, 116839, -40068, -42060, 34598, 51255, 28961, -16951, 50936, 93127, 14643, 74801, 114136, 22353, 42204, 88245, 3487, 10515, 112177, 34660, 31832, 32586, -14537, -53681, -22420, -106057, 2663, 49118, 115358, 201036, 139123, 18614, 82094, 126152, 31540, 172377, 109257, 83506, 65799, 120279, 197487, 116815, 82120, 109626, 53494, -2773, 38062, 70038, 125823, 132308, 32464, -31952, -10256, 143066, 17337, 13419, 32889, 11377, -13217, 49389, 69299, 27080, -14153, -30382, 89752, 16590, -45263, 25312, -92986, -60949, 16980, 45091, -40398, 24012, 124313, 48952, 67060, -6393, -77997, -67245, 29144, 87341, 85832, -31889, -31052, -73337, 44287]
723D4287Q2196o9196n3780N0574N0695n0954o583J5446r5408M1337n0555M6108
711D167m3783Q5127k6547P0456o3120p0065O232O6808l5697K1993m1304l0925
699e6658m1763R2179J1297j35497J36560K9935k3890o3706m6234J14420J7973
688C4616j11606Q9508P9371J9585m6869l634j2005j3858Q204P36J5131l5593J9729
675D3315O3857q8441l728K2683n2020m1620N3851J30523j3641l6913k8326q5731
663c6191J41857j9998L112O6908n1519m5998n4796L544l3933l1828J06298q7676
651d0220k7848P0480O7405N3798k7279R063l4133o6402l177J2511J22705r6788
639D0115J0446J2007l5195K9423j0180J7407k2600P327q358K3244L0446L5122
$$ y = [44287, 126483, 57287, 3507, 54081, 104776, 53822, 47239, 62685, -32723, 8614, -41941, 4167, -39616, 45511, 18964, 89420, 26300, -43765, -37533, 29275, -6422, 15571, -25733, -56658, -98421, -6242, 5055, -130442, 6118, 36053, 12163, -51543, -97777, 16643, 34616, -76990, 12518, 91889, 111474, 64605, 60971, 48966, 35108, 43312, 44048, 59179, 23586, 43315, 107172, 18731, 15003, 37686, -14334, -55954, -2103, 128420, 114779, 77866, 49540, -36191, 105666, 85668, 88780, 155688, 104169, 58171, 3375, 6919, -27014, -58842, 47456, -40220, -68068, 2412, 69817, 123615, 96336, 105399, 71266, 4864, 1687, 14198, 136903, 40115, 50561, 62568, 27373, 56796, 46616, 64023, 41423, 48750, 40392, 63636, 94082, 129204]
627A29204j02086O4494N6773J7370J8696Q546j00583K6861J6911N2657j7449L705
615A75099m7719j8979n2871l3158O7214q0024K0750J4151Q3111j14244O8674Q2247
603A64251l5120L65k771q3379K794L6046j09009k895J17207o41j1779N967O1731
590A42767l2398p6749k6951j8088k049l1531k2077r750J82002l2985Q0345n70
578A51966m7835j714L6228j3615p8212P6398p1332r001k3683j8518K0456K3586
566D4724j2667m6660M1374J7064J8882L6690j23345Q8589J24386m9291o1068m1765
554C6913L1253P6791J09k6587n3204K5858j10476j1539N1281m3766N9225R0862
542A26720m364P775k5746M2285q7047j17007M6720M2126j5563k5544k706O3601
$$ y = [129204, 27118, 91612, 148385, 165755, 184451, 192997, 92414, 119275, 136186, 188843, 171394, 175099, 127380, 108401, 55530, 22372, 89586, 9562, 30312, 44463, 127574, 13330, 82004, 164251, 129131, 129496, 126725, 43346, 46140, 82186, -26823, -29718, 87489, 86848, 75069, 81036, 142767, 110369, 33620, 6669, -11419, -13468, -44999, -67076, -76826, 105176, 72191, 152536, 151966, 104131, 102417, 138645, 125030, 46818, 123216, 51884, 42883, 19200, 682, 21138, 44724, 32057, -14603, 26771, 43835, 62717, 99407, -23938, 64651, 189037, 139746, 78678, 36913, 68166, 144957, 145066, 118479, 65275, 91133, -19343, -30882, 20399, -23367, 35858, 126720, 122356, 130131, 104385, 146670, 59623, -57384, -10664, 31462, 15899, -9645, -12351, 51250]
530E1250o7305Q9906Q7814r549o393K1820m4943j18274M3121K2013Q5326l4957
518A19829K5355l2743j05743J1664M8072n5630N1862K5556p7837n1534O8233R9734
506A26818j42704J00698N876l6312n0638J6162q1402J7063J3441Q1712M3711k0419
494G4006k1351l2286N327J5149R5489l6186K716l8542J4386m6416J14941o3453
482H3780j11583l0572n1266J67401K6036n5563Q061N6146M8059n8921k0362J7055
470G8271M6050P3804q6261j70422J22035J1033m018j29258O292O1286J10578K4545
458A43935j3958k3825P5411M8570r6689q0324M4793K5501j3421k9863m8535j6750
446A4845Q4188p8493N1700J10177j61353o3134K8373J3191j607J08068j00741
$$ y = [51250, -16055, 73851, 161665, 152116, 145723, 167543, 122600, 4326, 47447, 69460, 154786, 119829, 145184, 112441, 6698, 18362, 66434, 10804, 62666, 88222, 10385, -41149, 27084, 126818, -15886, 84812, 90688, 54376, 3738, 19900, -61502, -44439, -30998, 50714, 94425, 74006, 52655, 20369, 25696, 40845, 136334, 100148, 102864, 64322, 78708, 32292, 147233, 83780, -27803, -58375, -109641, 57760, 83796, 28233, 36294, 92440, 140499, 81578, 61216, 78271, 124321, 198125, 111864, -58558, 63477, 74510, 70492, -58766, -52474, 8812, 119390, 143935, 129977, 106152, 181563, 230133, 133444, 53120, 97913, 123414, 109993, 80130, 31595, 14845, 99033, 20540, 72240, 182417, 21064, -42070, -13697, -506, -2113, 105955, 5214]
435E214n3889J01399j8771P3780l9048m9701J30652j39228J1935P1982q095Q196
423I4426Q731k1720n7129R1949P310m5915L2483L321k9554J2181l9069N6103K3351
410A36468l9163N3077p2355m0597j3721j62J10760q8726p6972J04061J1129j20825
398c7026P6087K8053J1090J34k950m1351O7397J631K0765n3427m0880J10267k6818
385A12972N8568P883j03582o4811J9769j0827L0952N0731r6486R4479N1718L691
373A55057m494n4318o2198p6704P3710o672J17198q3636N3121Q6954n4306q2463
361F1249l0814Q8283p2311k4828R7641L9754m9503M6968j7705k4301j7762p1041
349B5630n5142R8135j08041L3345J20200n2161o4116j7345R6958n7927m3918J35856
$$ y = [5214, -48675, 52724, 33953, 107733, 68685, 18984, 149636, 10408, 22343, 94325, 86230, 94426, 103157, 81437, 24308, 116257, 123567, 77652, 110135, 113456, 83902, 96083, 57014, 113117, 136468, 97305, 150382, 78027, 37430, 23709, 23547, 134307, 45581, -31391, 72670, 83799, -37026, 39061, 67114, 78204, 78338, 75388, 34037, 101434, 103065, 123830, 70403, 29523, 139790, 112972, 171540, 179423, 75841, 11030, 30799, 19972, 50924, 101655, 5169, 99648, 151366, 155057, 150563, 96245, 34047, -42657, 31053, 24381, 141579, 57943, 111064, 198018, 143712, 61249, 30435, 118718, 46407, 21579, 119220, 158974, 109471, 156439, 138734, 114433, 96671, 25630, -29512, 68623, -39418, -6073, 114127, 61966, -2150, -19495, 77463, 19536, -24382, 111474]
337A11474n2094k5451j6894K8080M680l2635P2183m5325q2729M3391J00564P158
325A12402j3056K548j6120J9341J30709j39065m458j99j3123R879N7655q714L1584
312A69383o5932L0199n1218M4049j3795o112N1692j5183l1588l4798n1358J15833
300A41172j268q9650j14291J24753J08559j7833j42179L3822R900k159j81113
289a30287P71J63370N7352m5546L2770J297p6239Q977M2716k0467K4529M3613
277A02856o6461J33935j1854m4141q7177P5672m4715N796Q3525K2843r4608k6522
265D9149L9552n6745J4128j8360K8855k4267O0701K3261l2691k5421m5436Q6376
253I9102K8911m7662l8756P8093j6775L0635k3715j6745o1741K7165n3926O0975
$$ y = [111474, 59380, 33929, 17035, 45115, 49795, 17160, 89343, 44018, -38711, 4680, 105244, 112402, 99346, 101894, 85774, 105115, 235824, 96759, 92301, 92102, 78979, 88858, 146513, 137799, 169383, 103451, 133650, 82432, 126481, 112686, 106574, 158266, 143083, 111495, 76697, 25339, 141172, 139904, 50254, -64037, 60716, 169275, 151442, 9263, 43085, 52985, 50826, -130287, -129516, 33854, 91206, 45660, 78430, 79727, 3488, 12465, 55181, 34714, 59243, 102856, 36395, 170330, 158476, 114335, 27158, 102830, 58115, 63911, 147436, 170279, 75671, 49149, 88701, 31956, 46084, 27724, 56579, 32312, 93013, 116274, 83583, 58162, 12726, 99102, 128013, 80351, 41595, 119688, 102913, 133548, 109833, 93088, 31347, 58512, 4586, 65561]
241F5561l6609J73774j36685m9878Q8005j9191J71P3642j8801o2146m0658o2163
229b4978Q5891p8305N8284L8010q9206M3829k0879R046Q4949r451J2231l2878
217G6543q5842K6737M4706M4957J1855n3429L9826j1277K9559p3852M6235Q230
205A04248o2550N6678J8122M8810O0998n7883p5056q6518K8432O8575Q218l0575
193H1499J6281k0980K5937L0324o1849M1286l6692k7993Q2530J6044m0946j47004
181d1563Q7339M4100L8868m8643j6154K9596l2367N7662l7816M6779j04705J56483
169A79579p608q2744J2786M6147m6838l183o3587J03419l0985j2411p43J2613
157A06445m7376k4984k1978j2278Q7068L1289N8527m8195r8049R233O4418n429
$$ y = [65561, 28952, 202726, 66041, 16163, 104168, 84977, 85148, 158790, 139989, 77843, 37185, -24978, 60913, -17392, 40892, 78902, -10304, 33525, 12646, 21692, 106641, 97190, 109421, 76543, -9299, 17438, 62144, 107101, 118956, 65527, 105353, 94076, 123635, 49783, 96018, 104248, 41698, 98376, 116498, 165308, 226306, 168423, 93367, 6849, 35281, 103856, 112074, 81499, 97780, 76800, 102737, 133061, 71212, 112498, 75806, 47813, 130343, 146387, 105441, -41563, 45776, 89876, 128744, 80101, 63947, 93543, 61176, 118838, 81022, 127801, 23096, 179579, 171971, 89227, 102013, 148160, 101322, 98139, 34552, 137971, 106986, 94575, 93832, 106445, 59069, 34085, 12107, -171, 86897, 118186, 176713, 128518, 30469, 39702, 104120, 98691]
145I8691q451N3511P3253q4430k6020k34j9995l5304m0156j8372q041J32622j5024
132A02050j1744j005k4882m6980K0324j7455J7695J52304M3708o6308n1743j6897
120I9067k0011K6715l8373K8633o906L0302l4933k1173m8935o1451K5017M9849
108B7801N6675m6436n6788k2556N3627Q7991o016m9070J39846N6977j16484O5810
96A91377j02784k3082N6603m6471r105M5327k4127p984k5530N1725L7100m7747
84I5302J6967k0244K549K0495k8260O3552p1966r081K2203m3222L8682L8179r8710
71B6446M5525n7706l7588N6097P2920p7693J5492k071P8131k3997J2299k3882
59H3973R285O220o7130M5563L2234j10957L1385M1449l3784K5013J0893O9314
$$ y = [98691, 90240, 143751, 217004, 132574, 106554, 106320, 86325, 51021, 10865, -7507, -15548, 117074, 102050, 90306, 89301, 64419, 17439, 37763, 20308, 38003, 190307, 234015, 167707, 115964, 99067, 79056, 105771, 67398, 96031, 89125, 119427, 84494, 63321, 14386, -47065, -22048, 27801, 84476, 38040, -18748, -41304, 12323, 100314, 94298, 45228, 185074, 242051, 125567, 191377, 88593, 65511, 122114, 75643, 66538, 111865, 87738, 79754, 54224, 105949, 143049, 95302, 112269, 92025, 94574, 115069, 86809, 150361, 78395, 69314, 91517, 48295, 86977, 125156, 26446, 71971, 14265, -23323, 32774, 105694, 28001, 43493, 41422, 119553, 95556, 107855, 83973, 93258, 99478, 32348, 77911, 110145, -812, 30573, 72022, 38238, 63251, 74144, 143458]
47A43458J9245J5630j5046m0494M5242l5958m3862O805L3172n8226K8921m091
35I4796K5947J9921j02433K1933R7179J9445o7194l362L3643j9030m0314L6124
23A16655l4257r685N4509l6133r2580P3595j058k4994N1893J8703o2879l8324
11A5445k2150N9193K7012k9946k2938J40268J2875o4415l6310J5882J9978
0A14894
$$ y = [143458, 162703, 178333, 163287, 122793, 168035, 132077, 88215, 95020, 128192, 69966, 98887, 94796, 120743, 140664, 38231, 60164, 157343, 176788, 109594, 106232, 139875, 120845, 80531, 116655, 82398, 72713, 127222, 91089, -1491, 72104, 71046, 46052, 97945, 116648, 53769, 15445, -6705, 52488, 79500, 49554, 26616, 166884, 179759, 115344, 79034, 94916, 114894]
$$ Imaginary data points
##PAGE= N=2
##DATA TABLE= (X++(I..I)), XYDATA
16383c442934J16412l0453J6820N9580N8193J1481Q9638N5456L1881O0384M1412
16372b932130p775N3876N1266M9172N9188N9912O485O0640m6474N3368P7087J31215
16360b384170J5846J5681M2796M3828M9373O8371k5935Q253O2551P0218J03791
16349a929397L2788m4312J9307Q8805L3341M3119Q1092K6379J287P1935j3569
16338a589225J21136r127O9412m5960R0280N807P0072Q0370J9094L940J03624
16327a080577l826Q4002K2261M1561M8366M3233k1612o130R8190R3083N3266K5640
16315f02543R6643j18470O9633N1205M0182L1009O543O0499Q7567j1330K20K1221
16303b67621K286N7924J01618J5415Q6340K4046k8995N0976O9258J8576l9414
$$ y = [-3442934, -3326522, -3356975, -3340155, -3280575, -3222382, -3210901, -3121263, -3065807, -3033926, -2973542, -2932130, -2939905, -2886029, -2834763, -2785591, -2726403, -2666491, -2660006, -2599366, -2645840, -2592472, -2515385, -2384170, -2368324, -2352643, -2309847, -2266019, -2216646, -2148275, -2174210, -2165957, -2103406, -2033188, -1929397, -1896609, -1940921, -1921614, -1832809, -1799468, -1756349, -1675257, -1648878, -1647591, -1575656, -1589225, -1468089, -1477216, -1407804, -1453764, -1363484, -1357677, -1287605, -1207235, -1188141, -1184201, -1080577, -1084403, -1000401, -978140, -936579, -888213, -844980, -866592, -872722, -774532, -681449, -628183, -602543, -505900, -624370, -554737, -503532, -463350, -432341, -425798, -365299, -277732, -289062, -288842, -267621, -265335, -207411, -105793, -90378, -4038, 20008, -8987, 41989, 111247, 129823, 90409]
16292I0409J28449K757j3995L2555R7639k4832l1548J91722P1932j2334k7387
$$ y = [90409, 218858, 221615, 207620, 240175, 337814, 312982, 281434, 473156, 545088, 532754, 505367]
$$ [...]
##END NTUPLES=NMR SPECTRUM
##END=
