##TITLE=1H_EC-3334(III-21)
 CDCl3
 8 sc, 
 2.11.2024
##JCAMPDX= 6.0         $$ Bruker NMR JCAMP-DX V2.0
##DATA TYPE= NMR SPECTRUM
##DATA CLASS= NTUPLES
##ORIGIN= UXNMR, Bruker Analytische Messtechnik GmbH
##OWNER= root
$$ XWIN-NMR		Version 3.5
$$ Sat Nov  2 14:18:46 2024 Russian Standard Time (UT+4h)  she@DPX200
##.OBSERVE FREQUENCY= 200.1318
##.OBSERVE NUCLEUS= ^1H
##.ACQUISITION MODE= SIMULTANEOUS
##.ACQUISITION SCHEME= undefined
##.AVERAGES= 8
##.DIGITISER RES= 18
##SPECTROMETER/DATA SYSTEM= spect
##.PULSE SEQUENCE= zg30
##.SOLVENT NAME= CDCl3
##.SHIFT REFERENCE= (INTERNAL, CDCl3, 0, 20.9885)
##AUDIT TRAIL= $$ (NUMBER, WHEN, WHO, WHERE, WHAT)
$$ ##TITLE= Audit trail, XWIN-NMR		Version 3.5
$$ ##JCAMPDX= 5.01
$$ ##ORIGIN= Bruker BioSpin GmbH
$$ ##OWNER= she
$$ F:/spectra/data/she/nmr/H-F/1/pdata/1/auditp.txt
$$ ##AUDIT TRAIL=  $$ (NUMBER, WHEN, WHO, WHERE, WHAT)
(   1,<2024-11-02 14:17:23.85 +0400>,<she>,<DPX200>,
      <created by zg, POWCHK disabled, PULCHK disabled
       configuration hash MD5:
       00 E9 B6 7A A2 85 ED C7 34 08 36 98 17 FE 4E 26
       data hash MD5: 16K
       56 A1 F5 1F F9 4D FC 01 57 9C A2 A6 7F 6D 47 02>)
(   2,<2024-11-02 14:17:26.79 +0400>,<she>,<DPX200>,
      <Start of raw data processing
       efp BC_mod = 2 LB = 0.24 FT_mod = 6 PKNL = 1 PHC0 = -26503.96 PHC1 = 8.98743 SI = 16K 
       data hash MD5: 16K
       BE D6 E4 6A 20 2C 5A 64 D2 36 9F 75 C5 F7 9C 4B>)
(   3,<2024-11-02 14:17:31.00 +0400>,<she>,<DPX200>,
      <abs ABSG = 5 
       data hash MD5: 16K
       4E B2 A2 A9 86 37 D6 61 20 67 AC 72 49 3E 56 29>)
(   4,<2024-11-02 14:17:45.81 +0400>,<she>,<DPX200>,
      <pk PHC0 = 0.3336061 PHC1 = 0 
       data hash MD5: 16K
       20 86 73 F9 D0 9B FB 88 9B C0 43 F4 12 EE 89 28>)
(   5,<2024-11-02 14:17:49.42 +0400>,<she>,<DPX200>,
      <abs ABSG = 5 
       data hash MD5: 16K
       ED 1B B4 29 31 FB 6B D7 C7 AE D7 D8 81 7D 84 33>)
$$ ##END=
$$ 
$$ hash MD5
$$ E6 50 5D 1C C4 41 72 B8 33 EE 58 FB 63 02 AA 76
##$RELAX= 
##$RELAX= 
##$RELAX= 
##$RELAX= 
##$RELAX= 
##$RELAX= 
$$ Bruker specific parameters
$$ --------------------------
##$DU= <F:/spectra>
##$EXPNO= 1
##$NAME= <H-F>
##$PROCNO= 1
##$TYPE= <nmr>
##$USER= <she>
##$AMP= (0..31)
100 100 100 100 100 100 100 100 100 100 100 100 100 100 100 100 100 100 
100 100 100 100 100 100 100 100 100 100 100 100 100 100 
##$AQSEQ= 0
##$AQ_mod= 1
##$AUNM= <au_zg>
##$AUTOPOS= <>
##$BF1= 200.13
##$BF2= 200.13
##$BF3= 200.13
##$BF4= 200.13
##$BF5= 200.13
##$BF6= 200.13
##$BF7= 200.13
##$BF8= 200.13
##$BYTORDA= 1
##$CFDGTYP= 0
##$CFRGTYP= 5
##$CHEMSTR= <none>
##$CNST= (0..31)
1 1 145 1 1 1 1 1 1 1 1 1 1 1 1 1 1 1 1 1 1 1 1 1 1 1 1 1 1 1 1 1 
##$CPDPRG= <>
##$CPDPRG1= <>
##$CPDPRG2= <>
##$CPDPRG3= <>
##$CPDPRG4= <mlev>
##$CPDPRG5= <mlev>
##$CPDPRG6= <mlev>
##$CPDPRG7= <mlev>
##$CPDPRG8= <mlev>
##$CPDPRGB= <>
##$CPDPRGT= <>
##$D= (0..31)
0 1.2 0 0 0 0 0 0 0 0.06 0 0.03 0 0 0 0 0.0002 0 0 0 0 0 0 0 0 0 0 0 0 
0 0 0 
##$DATE= 1730542643
##$DBL= (0..7)
$$ [...]
##$SUBNAM3= <"">
##$SUBNAM4= <"">
##$SUBNAM5= <"">
##$SUBNAM6= <"">
##$SUBNAM7= <"">
##$SUBNAM8= <"">
##$SUBNAM9= <"">
##$SW= 24.0689170037331
##$SWIBOX= (0..15)
0 0 2 0 0 0 0 0 0 0 0 0 0 0 0 0 
##$SW_h= 4816.95568400771
##$TD= 16384
##$TD0= 1
##$TE= 0
##$TE2= 300
##$TE3= 300
##$TEG= 300
##$TL= (0..7)
0 120 120 120 120 120 120 120 
##$TP= (0..7)
150 150 150 150 150 150 150 150 
##$TP07= 0
##$TPNAME0= <>
##$TPNAME1= <>
##$TPNAME2= <>
##$TPNAME3= <>
##$TPNAME4= <>
##$TPNAME5= <>
##$TPNAME6= <>
##$TPNAME7= <>
##$TPOAL= (0..7)
0.5 0.5 0.5 0.5 0.5 0.5 0.5 0.5 
##$TPOFFS= (0..7)
0 0 0 0 0 0 0 0 
##$TUNHIN= 0
##$TUNHOUT= 0
##$TUNXOUT= 0
##$USERA1= <user>
##$USERA2= <user>
##$USERA3= <user>
##$USERA4= <user>
##$USERA5= <user>
##$V9= 5
##$VALIST= <valist>
##$VCLIST= <CCCCCCCCCCCCCCC>
##$VD= 0
##$VDLIST= <DDDDDDDDDDDDDDD>
##$VPLIST= <PPPPPPPPPPPPPPP>
##$VTLIST= <TTTTTTTTTTTTTTT>
##$WBST= 1024
##$WBSW= 4
##$XGAIN= (0..3)
0 0 0 0 
##$XL= 0
##$YL= 0
##$YMAX_a= 92213
##$YMIN_a= -242628
##$ZGOPTNS= <>
##$ZL1= 120
##$ZL2= 120
##$ZL3= 120
##$ZL4= 120
##$ABSF1= 21.01495
##$ABSF2= -3.054184
##$ABSG= 5
##$ABSL= 3
##$ALPHA= 0
##$AQORDER= 0
##$ASSFAC= 0
##$ASSFACI= 0
##$ASSFACX= 0
##$ASSWID= 0
##$AUNMP= <proc_1d>
##$AZFE= 0.1
##$AZFW= 0.1
##$BCFW= 0
##$BC_mod= 2
##$BYTORDP= 0
##$COROFFS= 0
##$CY= -3
##$DATMOD= 1
##$DC= 0
##$DFILT= <>
##$DTYPP= 0
##$F1P= 0
##$F2P= 0
##$FCOR= 1
##$FTSIZE= 16384
##$FT_mod= 6
##$GAMMA= 0
##$GB= 0
##$INTBC= 1
##$INTSCL= 3.70164e-10
##$ISEN= 128
##$LB= 0.24
##$LEV0= 0
##$LPBIN= 0
##$MAXI= 10000
##$MC2= 0
##$MEAN= 0
##$ME_mod= 0
##$MI= 1.114404
##$NCOEF= 0
##$NC_proc= -9
##$NLEV= 6
##$NOISF1= 3.799351
##$NOISF2= 2.8
##$NSP= 0
##$NTH_PI= 0
##$NZP= 0
##$OFFSET= 20.98851
##$PC= 1
##$PHC0= -26503.63
##$PHC1= 8.98743
##$PH_mod= 1
##$PKNL= yes
##$PPARMOD= 0
##$PSCAL= 0
##$PSIGN= 0
##$REVERSE= no
##$SF= 200.13000804727
##$SI= 16384
##$SIGF1= 3
##$SIGF2= 2
##$SINO= 5.538805
##$SIOLD= 16384
##$SREGLST= <1H.CDCl3>
##$SSB= 0
##$STSI= 16384
##$STSR= 0
##$SW_p= 4816.95568400771
##$SYMM= 0
##$S_DEV= 0
##$TDeff= 16384
##$TDoff= 0
##$TI= <>
##$TILT= no
##$TM1= 0
##$TM2= 0
##$TOPLEV= 0
##$USERP1= <user>
##$USERP2= <user>
##$USERP3= <user>
##$USERP4= <user>
##$USERP5= <user>
##$WDW= 1
##$XDIM= 16384
##$YMAX_p= 483086204
##$YMIN_p= -3003715
$$ End of Bruker specific parameters
$$ ---------------------------------
##NTUPLES= NMR SPECTRUM
##VAR_NAME=  FREQUENCY,     SPECTRUM/REAL,   SPECTRUM/IMAG
##SYMBOL=    X,             R,               I
##VAR_TYPE=  INDEPENDENT,   DEPENDENT,       DEPENDENT
##VAR_FORM=  AFFN,          ASDF,            ASDF
##VAR_DIM=   16384,         16384,           16384
##UNITS=     HZ,            ARBITRARY UNITS, ARBITRARY UNITS
##FACTOR=    0.29402158847633, 1,            1
##FIRST=     4200.43070158453, 0,            0
##LAST=      -616.524982423176, 0,           0
##MIN=       -616.524982423176, -3003715,    0
##MAX=       4200.43070158453, 483086204,    0
$$ Real data points
##PAGE= N=1
##DATA TABLE= (X++(R..R)), XYDATA
$$ [...]
7920 214800 294796 245787 -18769 183458 391916 403066 357837 197543 -113098 41162
7910 41162 114252 32931 196933 358656 599210 346725 -183903 76297 49507 2028 -58772
7899 -58772 -139379 -986127 -341534 555024 158609 425037 331487 344470 434387 345403 340959
7888 340959 351800 238341 533712 478359 682389 603917 587844 484254 777959 371655
7878 371655 445332 179736 -175213 255726 464156 534525 388804 135335 85432 167950
7868 167950 315319 337229 406579 529765 304628 465015 590440 350195 454332 762059
7858 762059 685112 576582 780027 887211 574323 357756 443556 832178 713350 151927
7848 151927 465163 431096 663455 549735 684552 647188 339244 197643 288339 135078
7838 135078 189888 -20078 146000 254868 190547 123298 261209 457652 265829 98828
7828 98828 464699 231293 -262330 -92679 135306 257100 33169 415019 577135 417262
7818 417262 367700 159405 46693 53565 107636 232152 241802 769352 422678 243073 345291
7807 345291 47654 410803 608495 123549 383247 813843 896576 936204 525024 574410
7797 574410 545594 405145 393844 626381 715427 678264 1024912 1179199 1289412 872638
7787 872638 1163751 1289088 1148306 1127526 1464203 1958488 1828285 1927223 2461865 2531732
7777 2531732 2624604 2964618 3236171 3378845 3585476 3074724 2811417 2808601 3249827 3370415
7767 3370415 3496938 3552118 3520713 3201866 3066625 3421047 3041714 3270290 2560209 2556668
7757 2556668 2812664 2810663 3265004 2857770 3096001 3408048 3234118 3472907 3944087 4271308
7747 4271308 4926282 4924992 5611454 6436744 7163849 7930120 8435462 8057159 7287132 6292578
7737 6292578 5588071 5181154 4585908 3998822 3861652 3871188 3533998 3721785 3396221 3286752
7727 3286752 3131229 3014678 2593025 2482419 2574574 2628475 2560983 2791790 2625618 2387547
7717 2387547 2579686 2441675 2194315 2363609 2795055 2957746 2655918 2714947 2903730 2739762
7707 2739762 2988363 3857626 3909740 4226413 5169093 5996353 7061327 7987388 8265023 7995698
7697 7995698 7436867 6233281 5132777 4142431 3944869 3816499 3155425 2697155 2353839
7688 2353839 2182587 2392406 2442216 2373106 2043044 1620951 1769673 1360151 1128954 1739659
7678 1739659 1272645 1260652 1126274 1107890 1349415 1590359 1267262 1237077 1330731 1399446
7668 1399446 1453430 1039636 791524 837013 1254526 730995 534145 1132883 1319749 1112217
7658 1112217 1287850 825680 690589 788483 1143515 998452 1175370 1130532 1186247 1186527 742841
7647 742841 750003 938773 1013314 878853 1142669 1323459 1213041 1049024 981506 843977
7637 843977 1110659 803882 1171922 1442120 1330086 1111150 1180313 1295103 1434625 1648815
7627 1648815 1562123 1531112 1701972 1757724 2064239 2042071 1686151 1789174 1977655 2091774
7617 2091774 1861111 2301326 2378003 2435535 2254756 2468421 2958512 3077624 3028508 2869238
7607 2869238 3221912 3430956 3701467 4120596 4065412 3487160 3179853 3363233 3345046 3306457
7597 3306457 3275607 3109665 3264531 3132508 3189984 2906942 2987812 3331025 3400425 3336386
7587 3336386 3352948 3353842 3074746 3369592 3690328 3662158 3403458 3740195 3926865 3893979 4242814
7576 4242814 4505553 4612840 4687546 4395305 4509897 4373423 4582087 4276680 4406056 3862542
7566 3862542 3875086 3495414 3353757 3483199 3413081 3580901 3286067 3521166 3781431 4071154
7556 4071154 4195272 4677665 4569483 4544448 4480492 4816738 4778490 4784036 4726624 4714099 4761539
7545 4761539 4630996 4664458 4951376 5353948 5486234 5396379 5214280 5476438 5503104 5737205
7535 5737205 6098858 6308905 6479770 7095041 7565659 8215379 8557739 8683508 9045568 9639931
7525 9639931 9632788 9432001 9229191 9478442 10048822 9702766 9476866 8875465 8249387 7771361
7515 7771361 7137382 6542729 6111857 5683654 5774975 5857908 5653776 5219906 5349728 5448547
7505 5448547 5094965 5001033 5487573 5394053 5210917 4841866 4769487 5048489 5166257 5110771
7495 5110771 4690796 4625666 4207362 4165813 3736402 4220076 4117122 4326456 4165538 4133348
7485 4133348 4265016 4073879 4783991 4686927 4672383 4474340 4556651 4326289 3979713 4167311
7475 4167311 4196251 3660361 3453708 3378480 3374540 3091214 2932348 2720838 2757034 2669897 2531315
7464 2531315 2503476 2649233 2650019 2471113 2294571 2114715 1975908 2270779 2353644 2096548
7454 2096548 1943799 2215942 2223009 2445732 2042845 2108231 2278873 2098369 1739758 2159835
7444 2159835 2215025 2204135 2250121 2043615 1626952 1736868 1738278 2162130 2235622 2056216 2210534
7433 2210534 1962896 1887159 2129378 1806377 1967272 1865163 1956608 1922417 1733203 1661120
7423 1661120 1769304 1755169 1715575 1936293 1752815 1536562 1597479 2006534 1834850 2047908
7413 2047908 1723538 1701949 1683611 1799286 1820135 1952831 1887308 1923730 1905657 1793344 2098212
7402 2098212 2251892 1982394 2460911 2677996 2809155 2536832 3210370 3661778 3620250 3345398
7392 3345398 2887753 2287964 2597627 2104269 1837408 1913780 1676566 1553830 1398830 1589185
7382 1589185 2120048 1994673 2184765 1636863 1631600 1614220 1668200 1869686 1800658 1936409
7372 1936409 2073148 1944117 1915156 2252780 2299457 2156997 1846295 1783067 2108126 2245257
7362 2245257 1787930 1938674 1884693 2039011 2066448 1936006 2136396 1743589 1872892 1884898
7352 1884898 1712957 1471350 1698696 1647172 1342984 1422235 1565329 1759445 1568519 1417359
7342 1417359 1148825 1487452 1445258 1206403 1330860 1392954 1628848 1607433 1692968 2104764
7332 2104764 2016386 1559946 1393922 1700856 1917160 1734424 1538884 1874663 2017057 1877587
7322 1877587 1730131 1902101 1946432 2072654 2045756 2199408 2011926 1816713 1866233 1680058
7312 1680058 1800644 2121467 1910840 1874096 1434959 1611956 1550223 1473294 1426215 1372783
7302 1372783 1622059 1504184 1740511 1555842 1557100 1751262 1592745 1883256 1835225 1812622
7292 1812622 1808968 1645580 1725861 1750694 1733374 1907160 1944372 1840906 2204632 2081354 1927235
7281 1927235 2431268 2510347 1806902 1899355 1915067 2002301 2218036 2293467 2020599 1941636 2245917
7270 2245917 2320495 2152467 2225277 2218206 2067333 2108498 2389199 2337450 1882523 2128640 2039868
7259 2039868 2112581 2332986 2577124 2211828 2213150 2543735 2562116 2481698 2449611 2317820 2473409
7248 2473409 2517434 2441960 2696145 3012493 2967979 2895869 3060317 3145722 2881800 3004603
7238 3004603 3210657 2344747 2421853 3064065 3075360 2965387 3302837 3177826 3079561 3523492
7228 3523492 3294797 3257966 3417219 3863690 3705458 3612874 3865776 3741742 3480188 3334939
7218 3334939 3619611 3759220 3604052 3613873 3663354 3813546 3766419 3862240 3879387 3840349 3567676
7207 3567676 3736196 3663508 3747075 3747489 3926133 4268422 4498196 4249461 3920757 3878724 4176777
7196 4176777 4000321 4129071 4132426 4041361 4121968 4245836 4376263 4458490 4269734 4465619
7186 4465619 4841734 4447530 4777969 5058295 4905710 4964175 5148283 5548716 5755472 5946755
7176 5946755 6098426 6343239 6902801 6995941 6693182 6435048 6441468 6772746 7007654 6875797
7166 6875797 6769413 6743645 6771917 6656213 6795731 7127180 7235663 7304111 7508929 7596225
7156 7596225 7668408 7355218 7579602 7965246 8191412 8119949 8559272 8992431 9213707 9674291
7146 9674291 9710450 9882894 10398924 10678305 10912648 11413154 12206135 12295158 12826688 13116573
7136 13116573 13699961 14086445 15025359 15258848 15350807 15949268 16882417 17253939 17823610 18693355
7126 18693355 19428789 19873205 20753679 21886539 22966903 23442756 25294301 26897017 28317781
7117 28317781 30462268 32653076 34359713 35587073 36456101 37574711 38547646 39778549
7109 39778549 41017784 41901764 42315914 42956809 43327083 43968097 44124417 44379795 44343949
7100 44343949 44287866 44408178 44917469 45482132 45978557 46254845 47107256 47766450 48861256
7091 48861256 49924391 51168297 52631555 54169608 55795350 57265300 59058740 60407690
7083 60407690 61488117 62823639 64168065 65172650 66121293 66756926 67805073 68914446
7075 68914446 70137609 71217981 72065626 73035207 73731465 74860231 76328179 77646710 78687043
7066 78687043 79787094 81625512 83448188 85093690 86957145 89289607 91318070 93457704
7058 93457704 95512129 98798621 102218070 106573579 111688803 117513890 125132306 133531109
7050 133531109 143516725 155730302 170600892 190061172 211521456 238646866 272539011
7043 272539011 321201430 387244033 464081417 483086204 445669923 375381596 301590550
7036 301590550 251263814 213568702 188598799 171162328 159343603 148860140 140860746
7029 140860746 133957797 128505933 122768433 117700282 113345219 109816712 105942196 102716935
7021 102716935 99850321 97755945 95887219 94548686 93568005 93161316 92725974 92145795 91136487
7012 91136487 90387696 89627704 89611623 89198555 89331477 89154406 89377891 88713460 88211092 87236356
7002 87236356 86820174 85921168 85634847 85612770 85869241 85774654 85848178 86772913 87548241 87895272
6992 87895272 88937700 89325105 89542371 89903987 89873312 89010734 88628009 88116759 87601438
6983 87601438 86719469 86464399 85948244 86025169 86045012 86327520 86745967 87561408 88259541 88823843
6973 88823843 88418320 87704533 87193630 86221343 85470194 84917918 84573742 84791008 85802909
6964 85802909 87323912 89802152 92182825 93904647 94149448 93028696 90842834 88197750
6956 88197750 86051699 84390331 83169223 82422687 81809203 81964450 82692088 84182068 85997680
6947 85997680 87134857 87765596 87252315 85484109 83913958 82199352 80606926 79819954 78797426
6938 78797426 78754675 79165216 79621548 80814217 82683206 84636113 86103813 86184441 84320354
6929 84320354 81626975 78110233 75065733 72728883 71212716 70435562 70072962 70662277 72120257
6920 72120257 74132000 76405209 78977064 80793235 80674881 78767708 76152886 72760418
6912 72760418 69563357 67173190 65473105 64463801 63972280 63905408 63705750 64072956 64687278
6903 64687278 65544301 66403122 66793184 67256631 67460277 67872399 67968351 68074346 67649040 66818950
6893 66818950 66131794 65765916 65978340 65878441 65860729 65372247 64771943 63968332 63111579 61820521
6883 61820521 60471786 59963872 59553489 59218691 59504043 60165437 61083120 62223757 63543877
6874 63543877 65141481 66799074 68282014 69549077 70539398 71528036 72370609 73128452 74084571
6865 74084571 74251641 73516374 72713840 71236082 69156952 67369773 65955235 64575637 63253985
6856 63253985 61532899 59620970 57828382 55947288 54758903 53881726 52701845 52383054
6848 52383054 52603027 53204856 53721557 54777431 56138479 57323758 58217950 59671323 61066533
6839 61066533 62178666 63087403 64084026 64559257 64781893 65113759 65351115 65515803 65127856
6830 65127856 64395556 64313249 62994523 62246961 61060910 60416902 59847119 59868095 59747625
6821 59747625 59940827 60513893 61203586 61786678 62662253 63699659 64718333 66442861 68126376
6812 68126376 69999437 71924633 73932806 76247825 79069865 82205146 85378885 87679308
6804 87679308 89158022 89422406 89146388 89520925 90314194 91108113 92437713 94182966 94748261
6795 94748261 93720252 92061366 91251288 90431967 89910024 89406565 89301685 89708706 90080323
6786 90080323 90615611 91818455 93277432 94494345 96818837 99276886 101684475 104379036
6778 104379036 107255965 110619015 114449319 117667325 120982157 122318261 123623394 123606994
6770 123606994 123821770 125372083 127045717 128992077 130160422 130005842 127984978 124635368
6762 124635368 121302725 118396895 116073040 113871685 112697333 111499154 111064867 110104055
6754 110104055 109875219 110535114 112015782 113348059 116035058 119433823 122957803 126473626
6746 126473626 129337187 131137883 131308587 130311890 128622847 127092153 126760223 126427447 126243946
6737 126243946 125755011 124956894 122624829 118993445 114603236 109466358 105377933 101671122
6729 101671122 98401774 95566765 93684147 92556405 91663197 90921165 90594153 90315315 90856442
6720 90856442 91962497 92648874 93974749 96063343 98654810 101365948 104369569 106796303
6712 106796303 107677108 107235405 106269854 104833015 103828842 104397603 106190005 108443267 109551006
6703 109551006 108787421 105346575 100186257 94159749 88703660 83976681 80160452 76431066
6695 76431066 73376166 70609378 68523138 65957346 63619889 61102387 58859611 57147348
6687 57147348 54999620 53783991 52656421 51815786 51573619 50864323 49774452 49110579 48030177
6678 48030177 46736966 46737492 46564032 46337377 46765642 47424364 48133566 48942454 50275477 51810081
6668 51810081 53773302 56254795 59556936 63327920 66261765 67278649 65949148 63527115
6660 63527115 60656181 57943440 55891441 54380674 52647178 51037380 49604384 48507251
6652 48507251 47590829 46796382 46201611 45835560 46390733 47191810 48583742 50380006 52100254
6643 52100254 53531205 51784600 48530198 45016526 41154647 37992191 35409806 33395322
6635 33395322 31850639 30572999 29606263 28904852 28201541 27363834 26801566 26385910 26373634
6626 26373634 26239207 26385507 26208051 26187748 25799848 26170220 26094463 26286801 26371411 25455772
6616 25455772 25475452 25624799 25364905 25752171 26144417 27441583 28309578 29270855 31255185
6607 31255185 33599278 36064264 39274237 41532902 42284156 41509388 38229198 34861939
6599 34861939 31462875 28714865 26021272 24045334 22423860 21152412 20060336 19105935
6591 19105935 18203973 17614162 16975640 16215641 15631250 15514026 15071946 14626446 14073516
6582 14073516 13911011 13569338 13802938 13379034 13160681 12868807 11949082 11465134 11412117 11425015
6572 11425015 11660280 11447597 11318834 11494942 11711816 11669312 11699864 11931379 12162376 12086494
6562 12086494 12131269 11859352 11652547 11587384 11287257 10974934 10559028 10085925 9598294 9238971
6552 9238971 9161463 8951214 8786350 8567380 7907201 7866587 7536193 7390704 7453053 7453877 7737527
6541 7737527 7645139 7705337 7508939 7991820 8242536 7852044 7898708 8003216 8006265 8229570
6531 8229570 7976413 8035908 7999505 7976511 7712176 7827464 7936346 7275494 7381463 7592933
6521 7592933 7493499 7161647 7236840 7183749 7147607 6817244 6916835 7150780 6842752 6705844
6511 6705844 6921934 6484147 6662264 6777403 6649885 6689318 6197187 6260583 6112811 6254715
6501 6254715 6314696 6317951 6870396 6650118 6719035 6866179 7171118 7034362 6967589 7036282 7002390
6490 7002390 6808985 6997803 6927034 7030845 6826012 6436203 6029114 6090224 6104436 5847708
6480 5847708 5795087 5560832 5509752 5170511 5492976 5294752 5044271 5203136 4964282 4898361
6470 4898361 5138914 5349512 5165940 5048178 4827326 4600346 4422263 4575465 4468790 4161694
6460 4161694 4094408 4284666 4158512 4681526 4618507 4275979 3999530 3998558 4047486 4195322 4061968
6449 4061968 3907975 3628603 3594090 4169850 3515375 3457851 3472581 3218711 3063119 3446351
6439 3446351 3400435 3387155 3386324 3044243 2752749 3009223 3038473 3516041 3707650 3157344 2718177
6428 2718177 3081929 3216194 3077256 2961390 2590829 2976614 2664326 2744939 2682073 2555914
6418 2555914 2912818 2965591 2467325 2551617 2263965 2137247 2693560 2557316 2588377 2615417
6408 2615417 2416978 1975296 2355241 2200438 2199963 2311212 2432229 2521645 2362272 2475012
6398 2475012 2432987 2859223 2447397 2172293 2444425 2574322 2631903 2319057 2209979 2665220
6388 2665220 3076899 3176263 3277214 3057696 2728950 2627879 3126470 2826288 2913817 3088719
6378 3088719 2997222 3007345 3007665 2736594 2857788 2796872 2574926 2433065 2579063 2502356 2803551
6367 2803551 2825248 2538728 2298650 2148524 2163464 2547690 2688665 2757946 2622305 2607748
6357 2607748 2766562 2679774 2694787 2614846 2848710 2770421 2821324 2668989 2925807 2712230
6347 2712230 2782192 2615096 2570324 2979393 2862614 2573066 2311979 2345787 2340193 2576748
6337 2576748 2503029 2538372 2918858 2619460 2515673 2536657 2250088 1922144 1909835 2021455
6327 2021455 1980930 2009724 2290171 2085334 2298633 2380325 2167486 1889711 2128041 1791351
6317 1791351 1544884 1784775 1913379 1815221 2173744 2006527 2056204 1911895 1785257 2007152
6307 2007152 2000679 2298097 2155784 1722813 1411141 1489947 1520023 1414495 1719139 1663075
6297 1663075 1521904 1423769 1423527 1224298 1555834 1428081 1271124 1269866 1380088 977447 882349
6286 882349 836686 1020176 1025009 1236337 1501402 1461839 1720311 1505411 1403170 1314344 1795964
6275 1795964 1289871 1891202 2037075 1928799 1973239 1779881 1536166 1646870 1534544 1329807
6265 1329807 1251102 1283083 1287942 1174801 1209768 1335880 988898 1036202 1356590 1469825 1523131
6254 1523131 1341126 1250220 1455037 1456836 1567103 1576928 1677041 1507082 1550910 1439139 1420428
6243 1420428 1778379 1948512 1749130 1496197 1616185 1837808 1684458 1864876 1819722 2032081
6233 2032081 2121953 2253428 1788085 2113837 2179971 1771990 2309087 2258497 2206497 2364509
6223 2364509 2592638 2605858 3037543 2920178 3032893 3088146 3048435 3294345 3304381 3524036
6213 3524036 3352848 3194331 3074304 2633563 2442173 2708759 2908589 2776933 2296290 2376589
6203 2376589 2436675 2633925 2888885 2795301 2471453 2305380 2499691 2267362 2447883 2624260
6193 2624260 2937236 3075267 3245377 2871091 2777770 3136846 2975927 2803639 2977562 3270340
6183 3270340 3529364 3343005 3721418 3807744 3642572 3724599 3519098 3946679 4664350 4595175
6173 4595175 4635154 4621278 5011917 5418964 5564709 5320157 5527451 5856025 6136375 6656132
6163 6656132 7038848 7198077 7233286 7338265 7788226 7928949 8300519 8522168 8209242 8655036
6153 8655036 9206799 9408455 9980509 10037652 10566076 10911506 11383348 12154203 12617915 13012049
6143 13012049 14160188 15517809 16190207 16861032 17746124 18304307 18738336 19573637 20711450
6134 20711450 21261893 21579129 21462044 21682511 21943719 21933603 22570423 22944546 23475068 23184368
6124 23184368 23518758 23705271 24042247 24245157 24599790 25211853 25719018 26162244 26614247
6115 26614247 26949263 27736835 27989338 28675298 28626189 28305905 28599243 28006118 27436776 27264201
6105 27264201 26737402 26321384 25833875 24910574 24321150 24012035 23919974 23420992 22941077 22967137
6095 22967137 23045717 23512044 23538281 23959326 23984689 24384542 24903116 25349984 25525265 25563482
6085 25563482 25864542 25893764 26249177 26781951 27174467 27221970 27063888 26801013 27347505 27778566
6075 27778566 28332240 28685071 28984954 28425233 28263265 28302970 28461991 28559779 28178860 28561448
6065 28561448 28206628 27637298 27992200 28426852 28485057 28289014 28393974 28027181 28031416 28058459
6055 28058459 27950617 28238522 28649227 28355604 28216401 28119756 27605669 26929462 26225825 25795665
6045 25795665 25163901 24867591 23737492 22951370 22385853 21682452 21289329 20511451 20147362
6036 20147362 20256247 20004450 19911898 19661945 19621161 19835163 20285343 19886611 19861230 19550421
6026 19550421 19004949 18875005 18215948 17925819 17583604 17329413 17245349 16653322 16042630 15545274
6016 15545274 15391031 15547014 15032290 14934165 15210202 15073433 14451708 14714471 14898884 14705373
6006 14705373 14486684 14336010 13905981 13737205 13482631 13432756 13478699 13331349 13326504 13401675
5996 13401675 13053189 12896302 12807825 12641750 13006702 12653820 12576692 12505537 12825937 12788328
5986 12788328 12893171 12940482 12680244 12972532 12979584 13250954 13593198 13822437 13636987 13764092
5976 13764092 13964435 13965883 13939644 14176804 14335265 14503771 15332223 16030972 16460710 17029391
5966 17029391 17709783 18398324 19378598 20095639 21156429 22360008 24062944 26230731 27814208
5957 27814208 30196463 32924453 36639750 40355035 44579600 46765303 47323597 46699573
5949 46699573 46031459 46181245 47172342 47687599 46504517 44392685 41009660 37317324 33909657
5940 33909657 31218899 29007532 27906848 27212853 26355636 25251280 24762918 23838693 23738928
5931 23738928 23414199 23068483 22606308 22646305 22483829 22738409 22874298 23168366 23499420 23454389
5921 23454389 23813786 24486581 24844627 25154809 25667045 26007177 26304513 26569321 26953813
5912 26953813 27550237 27983167 28470230 29084845 29500874 30449160 31492250 32710126 34506574
5903 34506574 36276746 38075884 40299952 42496895 44973520 47241973 49917389 53067262
5895 53067262 56594855 60738369 64740106 67775018 69034469 68635925 68061574 67901110 67862987
5886 67862987 68871871 68805728 66976907 63740672 60182668 57827025 55923104 53797514
5878 53797514 52255609 50516709 49026426 48113360 46936647 45799189 44788038 43832462
5870 43832462 42763660 41792060 41038724 40746306 40293912 40277808 40083598 40805520 41640348
5861 41640348 42359902 43461209 43886975 44207686 45046978 45752118 46727476 47696856 48758451
5852 48758451 48693209 48719324 48151336 47507209 47215068 46790569 46485598 46436802 45739370 44666698
5842 44666698 43846455 43598644 42854702 41729727 41126867 40058825 39358979 38444063 37202901
5833 37202901 36587623 35826076 34550516 34135953 33300691 32757872 31480087 30933971 30759369
5824 30759369 30303734 30145414 29820103 29969145 30148349 30529420 30583867 30515410 30505349 30742719
5814 30742719 30540270 30117367 29753896 29441434 29322199 28899341 28270479 28249426 28196257 27841945
5804 27841945 27800875 27281725 26935921 27040195 26888460 27159670 27364923 27577206 27412969 27029537
5794 27029537 26973348 26824013 26803181 26723723 26578345 26432395 26357608 26067601 26541770 27010950
5784 27010950 27943535 28826449 29698526 31228610 33019661 34833064 37224810 40209804 44105923
5775 44105923 47901812 50270790 50673044 50191630 49057822 48219587 48782330 49133412 48020331
5766 48020331 45548068 42231890 38784239 36106404 33675016 32025185 30866057 29637075
5758 29637075 28599798 28161155 27276609 26618618 26525184 26423752 26299614 26113175 25713025
5749 25713025 25790271 26013474 25718696 25867111 26721555 27606454 28644521 29866555 31666429
5740 31666429 33323726 35214687 37654518 40764970 44091854 46601149 47799141 47750136
5732 47750136 46487174 45140867 44600176 44740135 44985530 43713785 40681049 37227438 33872456
5723 33872456 31105106 29795683 28203738 27221619 26576370 26160238 26347422 26766102 27436841
5714 27436841 28040045 28548077 29106704 30304502 31094417 30439103 28823260 26551247 24120286
5705 24120286 21886522 20075163 18895103 17828675 16759170 16125656 15029034 14465445
5697 14465445 13841752 13157505 12564848 12527887 12169486 11648374 11541395 10930931 10767362 10927128
5687 10927128 10702181 10108791 10185030 10337384 10201734 9753615 9886623 9737377 9533041 9081935
5677 9081935 8654832 8634498 8418416 8009766 7626635 8002121 7752847 7385789 7242609 7118620
5667 7118620 6876889 6799226 6636428 6464211 6718408 6863641 6448232 6371466 6512734 6444357
5657 6444357 6324863 6094701 5998680 5844543 5986728 5976036 5563616 5447179 5226147 5476613
5647 5476613 5317977 5178861 5000764 4795117 4898800 4479473 4624804 4847683 4515667 4297070
5637 4297070 4230254 4083400 4169225 4211948 4001363 3580854 4140217 4204028 4112894 3591957
5627 3591957 3653819 3966468 3704820 3600247 3605112 3586369 3593714 3652852 3639892 3276536 3422748
5616 3422748 3268139 3344159 3364570 3348729 3038387 3041938 3166784 3248475 3382134 2947402 3117255
5605 3117255 3357378 3101002 2671656 2937255 3402663 3387405 3373357 3453075 3009774 2890667
5595 2890667 3337415 3733013 3709585 3900118 3533348 3294394 3318978 3137691 2934158 2959086
5585 2959086 2800970 3132480 3082653 2982762 3115120 2953476 2747034 2743252 2935092 2766977
5575 2766977 2557076 2479382 2525958 2682430 2499847 2500939 2485011 2705247 2553517 2242691
5565 2242691 2687933 2612043 2563090 2200685 2148714 2020043 2218762 2099055 1990427 2084324
5555 2084324 2319690 2290810 1984617 2103070 2225329 2642264 2632700 2355170 2106779 2285299
5545 2285299 2057342 2212259 2194706 2311424 2570058 2306371 2654082 2919083 3002588 2674127
5535 2674127 2438708 2618159 2622871 2371415 2473943 2606327 2661403 2406449 2584538 2391358
5525 2391358 2295106 2817171 2366114 2532307 2352307 2330640 1890735 2070266 1867949 1751344
5515 1751344 2150067 2408729 2564354 2829535 2865704 2614796 2557123 2789443 2542712 2525592
5505 2525592 2826129 2731545 2748479 2872397 3096367 3126271 3475741 3169956 2623502 2691158
5495 2691158 2889373 2865868 2910791 2685265 2699289 2541982 2880614 2660889 2646010 3054924
5485 3054924 3103177 2878138 3016084 3119464 2798643 3001793 3067012 2736169 3025652 3066196
5475 3066196 2939951 3385017 3338570 3004811 3285476 3556709 3590392 3439994 3558763 3565868
5465 3565868 3440218 3851382 3854138 3744743 3700014 4019006 4249096 4626316 4962367 4573985
5455 4573985 4839035 5439977 5784148 6169123 6709245 6954352 6871298 6577473 6082026 5534919
5445 5534919 5182575 5191744 4943733 4717780 5334408 5557991 5175848 5348306 5857425 6236426
5435 6236426 6324707 6775427 7462993 7998973 8713830 9139733 9699678 9170352 8351221 8071151
5425 8071151 7280306 7164078 6762350 6490025 6479156 6644420 6400020 6466366 6740010 7457367
5415 7457367 7860904 7817345 8454448 9125043 9558252 10387204 11623767 12002696 11530871 10745654
5405 10745654 10166557 9471794 9029807 8239524 8147254 8248984 7639433 7318234 7214319 7367857
5395 7367857 7426607 7738717 8231165 8165520 8592907 8829933 9591723 10627760 10838932 10548733
5385 10548733 10212546 9618161 9054958 8815454 8221089 8091165 7439710 7071095 6941647
5376 6941647 7057257 7322147 7099855 6986720 7140771 7535182 7193149 7354929 7581315 8396413
5366 8396413 8417113 8371043 8460091 7852067 7681345 7204472 6592728 6746922 7019070 6581838
5356 6581838 6444570 6384028 6243080 6162781 6684557 6348998 6111001 6288123 6238575 6221565
5346 6221565 6164116 6023564 6428165 6702179 6009716 6086968 6296018 6653137 6824068 6829804
5336 6829804 7106966 7560279 7857327 8029445 8528836 8556680 8545948 7527958 7100404 7050445
5326 7050445 6955202 6400488 5943431 5723845 5822997 5576650 5332667 5849232 5792662 5815856
5316 5815856 5679713 5627025 5501406 5404655 5388511 5655585 5980976 6116415 5920560 6309459
5306 6309459 6118081 5978588 6273883 6329530 6003982 5991659 6276705 6381866 6108884 6103035
5296 6103035 6256893 6187033 6196554 6325863 6584281 6452760 7004199 6715803 6771090 6573121
5286 6573121 6470985 6517600 6411944 6207300 5882569 5755358 5957391 6213762 6092298 5871623
5276 5871623 5769503 5919171 5880565 6174189 5845583 5916549 5644192 5936717 6219281 6117629
5266 6117629 6228269 6324765 6690004 6915558 6518966 6544936 6873386 6960130 7309798 7155315
5256 7155315 7108448 7329939 7381522 7679897 7522817 7603591 7969140 7857388 7913945 8238570
5246 8238570 8366755 9027447 9215679 9066089 8835647 9023855 9554446 9397248 9646938 9570158
5236 9570158 10094105 10393347 9861561 9741113 9552103 9360327 9088583 9057352 8933062 8732412
5226 8732412 8692627 8600822 9021114 8915519 9154560 9142856 9260166 9607363 9648928 9659389
5216 9659389 9800062 10308658 10586044 10450581 11036647 11316797 11854357 11979159 11819969 11998622
5206 11998622 12125791 11814043 11501214 10653090 10196308 10033772 9556294 9467630 9266314 8767249
5196 8767249 8675842 8420940 8391336 8336611 8314829 8082693 8093447 8064477 8104617 8091075 8034491
5185 8034491 8177990 8374424 8237666 8204910 8613284 8375093 8370119 8026557 8288817 8324029
5175 8324029 8495219 8257690 8274977 8001627 8316618 8506540 8232364 8250265 8521996 8137031
5165 8137031 8243035 8138203 8203457 8429542 8692966 8526335 8612023 8454960 8593093 8836997
5155 8836997 8691317 8542699 8384699 8558311 8523086 8297847 8234609 8118467 8324125 8497081
5145 8497081 8098409 8333011 8100178 8346297 8393886 8423242 8332563 8069972 8335012 8507060
5135 8507060 8313910 7787857 7935058 8297298 8300711 7985709 8206243 8326603 8439822 8616411
5125 8616411 8488403 8618223 8792365 8697343 8795357 9047415 9332989 9312693 9477840 9525778
5115 9525778 9461010 9736043 9972735 10305712 10338178 10555014 10221483 10131660 10269637 10518646
5105 10518646 10711806 10682740 10880971 11281656 11294956 11315207 11289627 11717973 11915204 11696512
5095 11696512 11759533 12324970 12623546 12943820 12787923 12883912 13428282 13701650 13727238 14044759
5085 14044759 14393127 14350946 14753342 14887995 15622236 16052335 15953265 16593851 17000467 17782959
5075 17782959 18394324 18627596 19064369 19293333 19584657 20168950 20570595 21356223 21828565
5066 21828565 22611379 23362580 24000992 24621096 25684295 26596082 26903798 27807511 29073513
5057 29073513 29804019 30595759 31724112 32847921 33826934 35128433 36642728 37916613 39276305
5048 39276305 40836462 42318745 44222270 46459133 48133647 49902932 52382126 54594418
5040 54594418 56832983 59416604 61896662 64837864 67430284 70851011 74132277 77279522
5032 77279522 80798600 84761393 88164677 92104352 96012098 101211913 105983755 110684724
5024 110684724 115565356 120445136 125045751 128654576 131599748 133201887 134678547 136832598
5016 136832598 138928444 140860156 143268739 146192218 149670186 153481151 157363758 162007942
5008 162007942 166679234 171205586 175411992 177808494 178026487 176522340 173283687 168585510
5000 168585510 163094836 157717503 152925533 148483911 145578252 143033406 141286336 139791634
4992 139791634 138930296 138343006 137765860 136655242 134970254 132049751 128275699 123715882
4984 123715882 118905093 113499526 108696826 104261239 100378534 96813209 93030331 89763612
4976 89763612 87251305 84819435 82465302 80643711 79482008 77858806 76710693 75624951
4968 75624951 74826053 74455658 74191596 73858056 73425577 73915389 74189010 75090396 75301093
4959 75301093 76239263 77569073 78789372 80296307 82360777 84282145 86855661 88995759
4951 88995759 90106752 91135466 91323412 91821892 92542934 94049834 96044872 98430460 101579067
4942 101579067 104177663 106576526 109292862 111653138 114148931 116010368 117615932 119509863
4934 119509863 120539127 121456010 121263257 120200184 119360756 118062486 116764641 116612405 116823530
4925 116823530 117645051 119158525 121283032 123558924 125288774 126623055 126933124 125967700
4917 125967700 124451536 122748934 120490515 118292671 115942420 113107588 109845508 106057581
4909 106057581 102207968 98577507 95183483 92403134 90301668 88106453 86354723 84950281
4901 84950281 83588748 82125886 80505178 78354263 76681036 74616797 72692480 70717048
4893 70717048 68669044 66459410 64308743 62377601 59895619 57325427 55272451 53313227
4885 53313227 51315541 49713393 48247424 46973007 45744085 44750243 44134422 43522621 42953988
4876 42953988 42265047 41638139 41584343 41206688 41075737 40809106 40336282 40432992 40297783 40341656
4866 40341656 39737145 39193660 38958168 38928313 38692914 38780573 38810883 38966527 38980298 39167691
4856 39167691 39145873 38743219 38593247 37844340 37338211 37006311 36462416 36016868 35802808 35823824
4846 35823824 35603915 35269372 35855803 36169012 36638553 37372553 38295185 39400347 40727598
4837 40727598 41745809 42413936 42613490 41723671 40105127 39009835 37756474 36695769 35630895
4828 35630895 34991286 34052840 33228435 32997835 32377473 32127292 32206297 32628401 32818338 32817622
4818 32817622 33907623 34498477 35511458 36107382 35412015 33903017 31456071 29488241 28492793
4809 28492793 27376278 26631380 25556161 24648939 24392403 23885312 23544755 23726784 23084422
4800 23084422 23220834 23352085 23481600 24001254 24640964 25129653 25208052 25139069 24356513 22923521
4790 22923521 21900448 20895999 19875960 19875890 19814006 19414172 19184399 19225215 19319216 19025587
4780 19025587 19543821 19671273 19645670 19646399 19573358 19523925 19780072 19962854 19908959 19631794 19396045
4769 19396045 19278697 18422112 18033634 17688195 17267081 17149627 17919579 17355273 17168788
4760 17168788 17294465 17712208 17349218 17250279 17623146 17936207 18322968 18333410 18366046 18413574
4750 18413574 18540915 18342420 18449182 18350453 18011679 18030841 17726881 17841879 18321383 18366165
4740 18366165 18704335 18759048 18888390 19127059 19229335 19481081 19779150 19832396 19944953 20024713
4730 20024713 20035717 20372074 20355008 20760175 20630329 20817474 20758351 20478435 20627013 20586786
4720 20586786 20603369 20845056 20915441 21084103 20746749 21118974 21592209 21652862 21173614 21471039
4710 21471039 21739827 21789395 22051772 22161190 22340056 22564999 22877050 22753797 23122372 23382673
4700 23382673 24059968 24205901 24171160 24972005 25333131 25835711 25939009 26175833 26703432 27078992
4690 27078992 27514320 27933682 28659651 29419175 29702808 29962372 30319725 31078200 31660069
4681 31660069 32419279 32998977 33881491 35061149 35645629 36698344 38029258 39110993 40064370
4672 40064370 40803158 41616957 42356938 44025783 45054437 46110777 47299083 48566986 50393654
4663 50393654 51551220 53454731 54730094 56227453 58215124 59959737 61841602 64210459
4655 64210459 66512577 68841936 71970140 74895937 77711440 80965829 84207740 88270203
4647 88270203 92734799 97615663 102078049 108091412 113629003 119524410 125314420 130250202
4639 130250202 134346190 137361679 139428517 140851290 142936849 145530890 148245688 152052879
4631 152052879 156084465 161334612 167323830 173498253 181062742 187952304 194221374 199277824
4623 199277824 202684793 203724311 202272235 199350156 195406885 192097078 189371820 188170150
4615 188170150 188516646 189553098 191767977 194157803 197767192 201223152 204288104 207230013
4607 207230013 209479298 209305842 206572073 202435552 196219282 190007356 184630020 180147408
4599 180147408 176662465 174649840 173179606 172370152 171699089 172157869 172452650 172910757 173306977
4590 173306977 174678339 176382833 178033680 179983981 181609578 183851449 186543089 188907861
4582 188907861 187666210 184826375 181681428 178209019 174379301 171109203 168882446 167000335
4574 167000335 165767654 165430110 165159087 165795778 166977845 168935790 171427033 174440931
4566 174440931 177478146 180432963 183339904 187158141 192062836 197280389 202863301 207883482
4558 207883482 209092890 208520242 207149286 205089363 202980874 201391107 201539547 202211183
4550 202211183 203400013 205120676 206304272 206646171 206858672 206030687 204980768 204225505 203649235
4541 203649235 202732418 202429769 203025556 204135390 206137268 208366112 209946670 211050036
4533 211050036 211540334 212465568 213693506 214971166 216137643 218283290 220678479 223838302
4525 223838302 227451254 231697757 237015368 243149978 250171020 257994009 266612778 275668493
4517 275668493 284060410 291416220 297418777 301262120 303780154 304542371 304475856 303495958 302073479
4508 302073479 300191094 298577068 296582660 294880911 294053844 293785243 295043446 297182308
4500 297182308 299344655 301643996 302740397 302657959 302506021 302186368 302125021 302744787 303509526
4491 303509526 305287129 307261235 309276643 311127061 312632467 314081020 313972363 312996979
4483 312996979 310381434 306339241 301645679 295934768 290414312 284482021 279233273 274553780
4475 274553780 270517576 267192141 265072909 263471515 262748767 262259618 262429816 262040204 260646086
4466 260646086 258623745 255618940 251581516 247597900 244395807 241410481 239405246 237842289
4458 237842289 235954433 234851358 233948376 230499505 225229553 218604459 211482158 204894336
4450 204894336 199574407 194642007 190943625 187577035 183875592 180889218 177253212 173427254
4442 173427254 169183911 165195849 160988906 156773187 152584435 148263445 143657493 139512858
4434 139512858 134974301 130939916 127447733 123753941 120918117 117821772 114829408 112074452
4426 112074452 109087971 105639478 102492374 99209688 96682793 93738175 91227890 88495697
4418 88495697 86141211 84423172 82346405 80728296 79248729 77865987 76794515 75421169
4410 75421169 73957951 72820354 71846637 70570060 69932026 68976845 68307258 67941901 67672086
4401 67672086 67738356 67728934 67648161 68156819 68289213 68546145 68974422 69955188 71526844 73086302
4391 73086302 75421707 78886472 83000001 87888043 89910408 87815192 84714375 80567306
4383 80567306 75763747 70967948 67079108 64270525 61909953 60710334 59204214 58130935
4375 58130935 57695213 57080607 56566053 55998056 55924327 55712122 55688965 55568818 55156413 54657468
4365 54657468 53822646 52892892 51827869 50387150 48838529 47054119 45388932 44161392
4357 44161392 43048917 42300989 41175831 40360301 39759172 38860251 38055119 37075227 36157461
4348 36157461 35275277 34493550 34014758 33498373 33150678 32628415 32028578 31487245 30814135
4339 30814135 30213005 29672099 28982194 28193915 27916289 27397504 27331288 26875119 26254464 26032689
4329 26032689 25482253 24815283 24711925 24688238 24707946 24497682 24085344 23740181 23690656 23341965
4319 23341965 23250666 23164207 23007857 22642382 22186308 22352290 22591143 22770614 22551335 22264019
4309 22264019 21837096 21489659 21288816 21212397 21147735 20939650 20827051 20326363 20187318 20457776
4299 20457776 20428881 20320925 20171365 20143905 20236655 20011482 19850733 19736538 19816097 19317635
4289 19317635 19544956 19380220 19315779 19102153 18836563 18721442 19088213 18513361 18263143 18212769
4279 18212769 18039530 18404688 18217653 17528883 17336605 17635947 17631136 17378853 17105351 17028001
4269 17028001 16901038 16997506 16700879 16368187 16431685 16971588 16802299 16671659 16375601 16234710
4259 16234710 16193694 16379044 16278504 16316830 16084510 15818364 15956569 15811922 16217751 16108284
4249 16108284 16293221 16285461 16259786 16121407 16242173 16636648 16245407 16382750 16295467 16342908
4239 16342908 16216194 16226337 16279116 16618697 16391851 16826549 16416585 16401535 16648250 16674521
4229 16674521 16869874 16602720 16843625 16724666 16733010 16805849 16766585 16883683 16771110 16978203
4219 16978203 17269292 17415743 17509358 17596749 17658051 17892713 18349515 18032783 18238322 18669562
4209 18669562 18603482 19059316 19320647 19519486 20018746 20143100 20666245 20511894 20666293 20539822
4199 20539822 20997269 21280173 21536900 21972015 21896187 21879594 21947793 22011185 22218376 22161992
4189 22161992 22340211 22380151 22097650 22372716 22238962 22301979 22341832 22466507 22879003 23490032
4179 23490032 23380953 23410607 23622056 24147575 24340761 24471108 24457857 24460641 24537364 24775657
4169 24775657 25254183 25706342 26082916 26177152 26169865 26661002 27214335 27415258 27458162 27441654
4159 27441654 28239240 28875445 29202766 29813785 30182100 30229132 30731277 31495869 31982877 32726102
4149 32726102 33452931 33867779 34690999 36080205 36721139 37770703 39034022 39862288 40849448
4140 40849448 41840027 43290000 44811384 46481247 47537776 49382540 51294635 52902867
4132 52902867 55550835 58335926 61993323 65778449 70078041 75042121 80826027 87704073
4124 87704073 95121685 103226402 112942640 123849993 135694724 148331472 159452666 167633042
4116 167633042 169066823 164074380 154161210 141215563 127968581 116324754 106077986
4109 106077986 97582952 90998129 85368079 80217032 75763911 72476523 69122764 66343217
4101 66343217 63575029 61224128 59219815 57119016 55724122 54236172 52846509 52723844
4093 52723844 51794110 51001359 50514204 49861498 49486164 49612333 49318814 49109667 49471961
4084 49471961 50295671 50286427 50489335 50793454 50832455 51201565 51574550 51925952 52492384 53994119
4074 53994119 55260633 56315825 57537837 59339175 60898592 62444005 63572649 65096010
4066 65096010 66631551 68223575 69526632 70851533 72312247 74166314 75996148 77770472
4058 77770472 79570733 81808707 84331398 86442339 88451967 90989419 93486202 96184181
4050 96184181 98486814 100691814 102916342 105047935 107367009 109418402 111722880 113523824
4042 113523824 115193198 117248672 119586379 121260945 122504391 123675570 124842876 126392006
4034 126392006 127651272 128493189 129533968 130066403 130322947 129350723 128013424 126858467 125399869
4025 125399869 123834574 122295692 121164078 120398936 120001723 119824963 119412371 118800655 117578804
4016 117578804 115415667 113531431 111233319 109701238 107822233 106603002 105163337 104334341
4008 104334341 104022839 104666830 105585574 106606875 107404616 107769077 108426544 108919689 108938109
3999 108938109 108123926 107222562 106091513 104930997 104005592 103306569 102695978 102219016 102036602
3990 102036602 102344994 102567197 102889083 103108988 103463940 103135653 102496009 101919386 101775835
3981 101775835 101040062 100659672 99708477 99372437 99973868 100069916 100642998 101305164 101961062
3972 101961062 103296388 104467703 105367634 106116476 106684216 106655393 106225171 105547073 104310247
3963 104310247 103162616 102055077 101263517 100565298 99594513 98375407 96633973 94514799
3955 94514799 91991000 89498784 87070220 84509086 82063792 80424047 78730540 76874083
3947 76874083 75545531 74535598 73368089 72518355 71705883 71045738 70611329 70095073 69666698
3938 69666698 69448316 68968952 68614007 68360748 67326198 65692565 64351308 63287114 62361344
3929 62361344 61432928 60648766 59504723 58304075 57081771 56180348 55032548 54293465 53938579
3920 53938579 53435053 53338950 52771536 52370077 52018298 52547248 52768121 52588552 53152804 53796991
3910 53796991 54357056 54937985 55516467 56451962 57654160 58466534 60176570 62054137 63210524
3901 63210524 64960160 66787392 67833363 68950906 69804026 70023065 70258978 70489647 70639375
3892 70639375 71205035 71777146 72661282 74098603 75231420 76667233 78375010 80243149 81847225
3883 81847225 83883000 85586918 87177478 87516770 87926054 88325517 87897582 88196095 88424784
3874 88424784 88806728 89331804 90653340 92017469 93115676 94782665 96652070 98784318
3866 98784318 100358694 102232628 103845628 105005777 106283874 107325330 108476233 109538780
3858 109538780 110808659 112151838 113975618 115794517 118449071 120694338 123176436 126067727
3850 126067727 128674123 131538177 133975270 136281124 138257587 140442144 143051001 144995147
3842 144995147 147553611 150176589 153213016 156577347 160417052 164809416 169808195 175464035
3834 175464035 181533642 188472169 195785305 204982882 214362159 225185771 235348536 242122060
3826 242122060 242820921 239110978 233391621 227686432 224032131 222877696 223819514 226909135
3818 226909135 229942842 232887410 234818547 236185079 237477505 239426780 242762101 246556641
3810 246556641 250246418 253170692 255133519 255747417 254127487 249209278 241507506 230982666
3802 230982666 219057697 206601186 194478304 183744270 173908200 165023839 156967485
3795 156967485 149639487 143227075 136967243 131229787 126159094 121447976 116544003 112762193
3787 112762193 109121205 106055162 103729012 101525313 99303483 98241615 97426039 96527388
3779 96527388 96210953 96727568 97065447 98002490 98990138 100314657 102359707 104615968 106972814
3770 106972814 109532106 111826170 113762775 114485655 113962019 112743879 111599427 110153937
3762 110153937 109322128 109150367 109880945 110950361 112520771 115195018 118111455 121102365
3754 121102365 123331546 125253577 126345832 126143985 124457750 121617306 117208692 112667435
3746 112667435 107595602 103297404 99863063 96962943 94749810 93476941 92871820 92445102
3738 92445102 92565459 92089776 91237780 89538867 86502611 82705711 78577441 74475367 70371168
3729 70371168 66664019 63531548 60853553 58469327 56072442 54092139 52480465 51001165
3721 51001165 49540664 47855743 46812758 45977594 45314218 44567203 43555438 42899684 42701709
3712 42701709 41848307 41199724 41017483 40272978 39702566 39153676 38993670 38247591 37969820
3703 37969820 37683955 37601441 37251606 36817277 36853648 36856658 36660882 36638693 36947028 36642722
3693 36642722 36614693 36234382 36419103 36324119 36226306 36112807 36022960 36406854 36284993 35866629
3683 35866629 35735150 35815672 35894259 35820172 35795571 35876051 35942206 36229450 36383714 36335793 36655246
3672 36655246 36560799 36802080 36811636 37167368 37447178 37358820 37284938 37457075 37433389 37513032 37738444
3661 37738444 37742888 38045913 38381390 38792011 39064289 39308804 39204700 39529945 39785706 39958326
3651 39958326 40111172 40202635 39856401 39709229 39476925 39229834 39250284 39559594 39751302 40351137
3641 40351137 40901891 41366760 41493602 41779133 42060041 42581691 43361558 43924669 44392933
3632 44392933 44978396 45372599 45397158 45074635 44875866 44841590 44981647 45175815 45399382 45485862
3622 45485862 45751153 46121847 46585814 47215198 47804971 48646477 49017448 49719502 50150260
3613 50150260 50484760 51357545 52196569 52856176 53807982 54592970 55411290 56049766 57248695
3604 57248695 57965174 58546633 59747469 60968222 61946452 63225156 64409470 66161224 67488354
3595 67488354 68725394 70362598 72282508 74334023 76055132 77829407 80309031 82926771
3587 82926771 84930838 87063127 89440787 91684296 94486447 96606895 99110144 101803159
3579 101803159 104243019 107495753 111021686 114947434 119368016 124881879 130474464 137305087
3571 137305087 144426248 152805893 162379727 173551192 184510662 194682513 204165919 211668759
3563 211668759 217553678 221115018 222117792 222709478 222772297 223086629 224483364 227000237 230351141
3554 230351141 234107975 237826011 240815808 243549475 244863405 244631558 243335528 240604982
3546 240604982 236511301 230712663 224264334 218173734 211947571 206096017 201120955 196383353
3538 196383353 192230927 189641762 187063400 184094520 182309650 180409196 179209400 178528037
3530 178528037 177410676 177082245 176819826 176990716 177333818 177875295 178266013 178578023 179032609
3521 179032609 179723597 180293915 181205856 182205559 183597699 185066143 186759376 187872813 188286151
3512 188286151 188174406 187705084 186265555 184615116 183181704 182012675 181266716 180075848
3504 180075848 179043462 178552430 178178888 177470977 176831709 176087684 175723881 175578856 175767953
3495 175767953 176380020 177020793 177840327 178875049 180375767 181657623 183375447 185276613
3487 185276613 187770901 190887011 193950707 198542758 203555107 209200297 216052769 223708584
3479 223708584 232179673 242632085 254127963 266563020 280210458 294092150 306972771
3472 306972771 317936039 326241906 331665984 333716208 333056206 331778328 329757408 327755767
3464 327755767 326326849 325543555 324200856 321725004 317310433 311470172 303464357 293980877
3456 293980877 284393867 275321171 267745166 262415738 259257635 257381401 258005130 260813254
3448 260813254 265528688 272089183 281338576 293639627 308247319 324397683 338030991
3441 338030991 342420719 334380697 315117164 289258019 261938731 237420821 216824859
3434 216824859 199541929 185688368 174108658 164526913 156419148 149511170 143439226 138469881
3426 138469881 134329749 130511130 127689306 125745043 124058071 123196042 123048717 123199125
3418 123199125 123668455 124204799 123956520 122799203 120979023 118564916 116521294 113938186
3410 113938186 111321763 109147231 107608594 105619441 103600794 101276780 98219309 94814691
3402 94814691 91438247 88071730 84770536 81656949 79367998 77475872 75328089 74020283
3394 74020283 72479170 71047828 70222915 68993135 67847920 66935100 65850924 64601313
3386 64601313 63680511 63079555 61807181 61225383 60238288 59217939 58391575 57250597 56094494
3377 56094494 54793225 53714714 53012064 51946303 50869143 50137505 49311407 49189939 48989329
3368 48989329 48301283 47604191 47697060 47571484 47903656 47371581 47242056 47249879 47367519 47876651
3358 47876651 48319060 48137712 48578771 49019594 49459726 49861524 50345503 51506918 52273640
3349 52273640 53091360 54377845 55742050 57383595 58754903 60765631 63438554 66112988
3341 66112988 69942141 73612033 77967074 82554393 87491143 91685690 95097471 97304076
3333 97304076 98222782 98651552 98594158 98182299 98094147 97766727 97634303 97364795 96748031 95660439
3323 95660439 93775767 90714648 87392877 83286762 79734770 76291185 73290649 70675558
3315 70675558 68707971 67431562 66320857 65862516 65349279 65045651 65488521 65650131 65667680
3306 65667680 66413033 66869799 67559117 68283155 69065759 69716086 70480914 70840018 71424510
3297 71424510 72241833 72595498 72935746 72927102 73330349 73455720 73790274 74026507 74204917 74567528
3287 74567528 74358813 74238896 73978044 74320308 74208112 74144054 74453918 74956575 75484026 76048364
3277 76048364 76375176 77079295 78253440 79051053 80210808 81750285 82937369 84293300 85982782
3268 85982782 87968437 89830743 91828067 94451749 96468638 99572377 102249824 105241873
3260 105241873 108769762 112799031 117245458 121824360 126662733 132320767 138125018 144050176
3252 144050176 150366675 156809880 163593795 170990463 178525607 186181502 194023883 201853206
3244 201853206 209843437 217280613 224735508 231865535 238243500 245083869 252352367 260261758
3236 260261758 269285125 278581339 288297001 297747071 305995761 312878319 318163900 321217640
3228 321217640 323014481 324794845 327412882 331695462 336769754 342329744 346110013 347209252
3220 347209252 345948934 341489356 334758721 327170223 319434793 311377307 304550124 298199518
3212 298199518 292619528 286735633 280118086 272655886 264382077 255313925 246284292 237705110
3204 237705110 229824905 222993976 216949211 211665771 207157472 202790893 199206864 195399197
3196 195399197 191943443 188708934 185369781 182513220 179038624 176049253 173461361 171157769
3188 171157769 168963851 166668163 165146381 162978283 161261621 159519318 157892360 156188268
3180 156188268 154366599 152771359 151347531 149690080 148233818 146669202 145388279 144035704
3172 144035704 142346988 140924736 139199263 137616704 135493812 132810578 130521576 127772258
3164 127772258 124895134 121980439 119101101 115820553 112792442 109892381 107081963 104237768
3156 104237768 100541915 97889648 95254407 92424068 89632962 87231697 84688087 82640779
3148 82640779 80751285 79071377 77701845 75922679 74865703 73786116 72506401 72068576
3140 72068576 71597917 70636766 70383626 70061360 69819897 69563863 69413196 69655908 69589391 69529018
3130 69529018 69425613 69410949 69704682 70634945 70558211 70517891 71133165 71344735 71981029 72541986
3120 72541986 73325879 74480826 75344380 76664742 78084001 79811994 81604371 83820814
3112 83820814 86410003 89409095 92336184 96306235 100508103 105362990 110143081 116116977
3104 116116977 122207273 128662484 135246875 141284487 146776075 150929744 154191582 156424883
3096 156424883 157399280 157885162 157932621 157708054 156992596 156156568 154060438 151024734 147198827
3087 147198827 142022314 136046352 128945173 121958887 115063051 108348150 102171004 96759417
3079 96759417 91622544 87135363 83089040 79389863 75732470 72074061 69473281 66535688
3071 66535688 63918342 61230388 59205887 57145676 55320064 53896292 51803489 50308295
3063 50308295 48174496 46883106 45247204 43926042 42666179 41531214 40346114 39116115
3055 39116115 38323935 37402681 36325100 35543341 35112649 34852304 34350357 34061320 33924272
3046 33924272 33290469 32669887 32336631 32001941 31852182 31851193 31062883 30913088 31370517 31099172
3036 31099172 30721318 30625112 30145046 30059138 30450258 30219009 30219198 29877195 30114185 30106997 30169883
3025 30169883 29908412 30180706 30851704 30569471 31031388 31179496 31446133 31824436 32310353
3016 32310353 32750243 33166605 33725689 34207819 35011123 35611117 36384697 37415424 38106896
3007 38106896 39064359 40299077 41512936 43397497 45059751 46980150 49059684 51778726
2999 51778726 54986224 58603448 63181132 67975054 74190099 81051570 90028201 101616248
2991 101616248 112618751 118360757 117095401 110399526 102205560 95231656 89157019 85172591
2983 85172591 82710946 81182259 80279310 80430641 81151554 82662870 84759381 87671081 91255600
2974 91255600 95888176 101280938 109608616 119807859 130822217 137908859 137878028 133194887
2966 133194887 124833738 117966278 112813344 109118838 106804788 106172819 106512170 107254976
2958 107254976 108914647 110982430 113358214 115909403 119147498 122176150 124144202 124807727
2950 124807727 123662880 120614082 116593697 112615522 108838934 105498884 103030507 100604093
2942 100604093 98573734 96850559 95596812 94764884 94112311 94339025 94833706 95750226 97371208
2933 97371208 99811298 102889594 106504415 110499989 114522835 118970816 125419227 132758376
2925 132758376 137081515 141013358 145339984 151314768 160609373 173923344 180833824 174407510
2917 174407510 159764378 141598319 127643532 117408002 110947430 107249306 106051327
2910 106051327 105853973 106902470 108879425 112709490 117655485 125429718 135199820 148091858
2902 148091858 159533392 165893485 172901479 180684550 180556570 169007739 150906922 129781427
2894 129781427 113739185 101200117 91924083 85546625 80447785 76411140 73165984 71109948
2886 71109948 69069369 68096066 67388996 67591951 68742154 69525585 71449674 74990001 77293774
2877 77293774 76724407 75760172 73959736 70271598 65437479 60270954 54921656 50638881
2869 50638881 46816196 43920253 41962648 40155719 39133756 38120380 37254949 36828969
2861 36828969 36548204 35977602 35999311 36452592 37545423 38102358 39654268 41640110 41564201
2852 41564201 39499810 36008486 33229073 30300441 28316514 26950044 25450715 24444569
2844 24444569 23776500 23009733 22216782 21426284 20890770 20402547 20190951 19738341 19182272
2835 19182272 17975445 17104617 16678358 16095547 15787223 15192145 14989757 14940962 14125856
2826 14125856 13561977 13389733 12800622 12640726 12845801 12921693 12307889 11727408 11308559 11021713
2816 11021713 10616663 10466723 10496699 10260072 9800237 9607048 9112774 9232081 9296107 9017035
2806 9017035 8679503 9065829 8825841 8398063 7984856 7798211 8241057 8166886 7718516 7759721
2796 7759721 7345149 6944575 7255632 7135764 7248053 7185779 6831894 6498414 6713460 6826004
2786 6826004 6842526 6402153 6416013 5996384 6145944 6272882 6383040 6237607 5859657 6078149
2776 6078149 5711624 5887003 6143932 6624042 6249596 6372262 6538777 6344374 6108827 5793772
2766 5793772 5607713 5580056 5983106 5844711 5475676 5624598 5402149 5259216 5935847 6056081
2756 6056081 5807906 5829528 6081592 5948801 5969663 5755196 5915052 5720934 6028395 6341474
2746 6341474 6105265 6284149 6302756 6292992 6284462 6142318 6681000 6923735 6839255 6627542 6825791
2735 6825791 7018768 7057553 7038295 7216726 7289910 7390694 7598917 7852207 8145410 8582495
2725 8582495 8838127 8903713 9512195 9545129 9697510 9992286 10742954 11269236 11556548 11368674
2715 11368674 11800559 12039182 12162025 12309452 12293598 12657466 12602312 12936159 13136404 13784791
2705 13784791 14218159 14387385 14715477 14825987 15633880 16106019 16338379 16906470 17810103
2696 17810103 18094490 18432339 18298457 17838318 17001253 16393125 16538500 16260477 15756718
2687 15756718 15773102 15840673 15817868 16369737 16548957 16440782 16300321 16701342 16478964 16637294
2677 16637294 16616885 16772627 16376044 15817888 15904015 15503459 15071548 14150656 13859054 13741924
2667 13741924 13152213 12895092 12796592 12477073 11973030 12241240 12109407 12138586 11572158 10979551
2657 10979551 10788937 10628720 10476251 10090531 9884058 8836787 8498035 8269356 7492922
2648 7492922 6950876 6637707 6777782 6446664 6081665 6253089 6054369 5648666 5265715 5482944
2638 5482944 5739352 5016899 4655146 4410819 4147187 4203524 3803112 3844094 4007172 3660949
2628 3660949 3545314 3396975 3770320 3824613 3337582 3400051 2943440 2742356 2512393 2567729
2618 2567729 2308605 2132841 2282672 2289737 2042718 2353199 2495957 2415912 2526910 2139885
2608 2139885 2159951 2298203 2030782 2017044 1814897 1631069 1609611 1643564 1971472 1709310
2598 1709310 2020996 1701555 1475861 1570055 1635237 1515941 1169146 1423554 1312658 1325276
2588 1325276 1084823 978558 1016837 1408157 1052475 1135346 848980 988426 1083973 716589
2578 716589 942449 1132343 1083462 940324 929899 714231 451035 515800 465806 671597
2568 671597 838993 666112 635469 789859 784181 536566 507740 514038 473530 745367 793907
2557 793907 586547 624145 875509 696058 607623 413561 943441 835584 679164 374396
2547 374396 167483 216382 317885 501445 347286 255804 -102564 231327 428732 800335
2537 800335 620897 400710 268702 872610 746332 488569 363494 236672 -144523 138713
2527 138713 369575 448636 541657 674653 453787 493816 456926 336230 341361 397522 337050
2516 337050 247046 313074 485700 646737 551774 537740 88305 69738 719 96430 382715
2505 382715 169710 133923 91793 424964 251929 244031 251332 234428 323853 21867 21768 371652
2493 371652 257519 369590 610153 434135 157500 256444 440464 342293 -13806 -72167
2483 -72167 -28551 -43735 196545 430218 273961 263893 -64036 29564 39860 60694 210507
2472 210507 -13126 241452 172180 253154 171162 194184 141223 134007 -116500 -209749 38615
2461 38615 72742 -58983 43430 370717 472917 347935 361566 699431 400463 -28887
2451 -28887 51296 278266 199500 -88533 25112 246121 112488 -174271 126608 271205
2441 271205 368171 409135 335209 548916 431016 257999 354434 122495 -106871 -259440
2431 -259440 -262955 -35520 -683 -263323 -141045 244357 187691 -121272 -95108 48895 263201
2420 263201 321625 67409 -134373 60780 173122 156393 314233 198183 138951 -27700
2410 -27700 -404968 -385235 -41474 -355161 -239147 -46317 97710 78091 -171466 92295
2400 92295 41827 -3653 -28768 -91702 -258190 146213 -133780 -219276 -227260 -105699 -300916
2389 -300916 -562112 -411420 -104860 11512 306955 2366 -46616 33358 -54529 53349
2379 53349 -6122 -186154 -62652 64733 -51270 -35932 12701 -60819 142151 99562 209531
2368 209531 22568 103458 148076 43265 -350146 -269679 249709 176351 -283314 -92115
2358 -92115 -93454 -80394 299451 178416 13980 187456 -116863 -233341 -309605 -108049 -281323
2347 -281323 -295336 -14071 -293559 -227902 -304792 -204207 -88925 -287310 -399155 295304
2337 295304 38812 -380296 -460493 -273428 -96754 -152270 -547498 -122972 -286049 112622
2327 112622 -129442 -202925 19493 293853 29801 243759 24781 -63998 420610 16382
2317 16382 -19082 -194071 -319789 -424886 -180950 149752 102999 43754 -145142 67566
2307 67566 73249 -28082 -126949 15301 -202497 -174752 -82483 -167404 -145018 209256 163123
2296 163123 137374 337598 -159527 -296230 -183407 -620390 -549596 -248422 69043 -215781
2286 -215781 -148789 -132940 -86231 -107272 -211128 33720 -353822 -314492 227243 270126 293323
2275 293323 34216 -338966 -183224 -32107 -228498 -18466 7259 -370639 -204530 -147395
2265 -147395 33010 -173606 -477378 -299775 -102102 207211 457925 67284 -112746 -29622
2255 -29622 -25170 120100 -54933 -691867 -414484 -674077 -650735 -203596 -150057 -427481 -487048
2244 -487048 -289361 -155499 33200 -279965 -87264 10967 -243684 -134229 -36718 255712
2234 255712 453025 296853 101527 57665 -74293 -121759 -73678 10367 8048 393252 272820
2223 272820 112721 142448 -227784 -176009 -106342 146214 292292 91100 330569 204940
2213 204940 61772 -274735 -373900 126590 126556 175231 119578 -88306 278813 548172 144291
2202 144291 161175 51314 -296634 -139002 39298 354384 237172 468729 229946 313944
2192 313944 -7784 209708 43773 187859 308202 394872 241226 377265 278173 221738
2182 221738 -18665 38899 259970 325083 465437 255564 319991 454070 271691 129849
2172 129849 345662 603324 774887 888827 697584 722172 987966 789804 734862 660472
2162 660472 349787 674978 971633 1058442 1206312 1364227 1072392 975221 908787 866257
2152 866257 1111232 1052298 1195374 1142504 831368 254957 921026 1436249 1499596 1312729
2142 1312729 1361641 1565244 1612523 1256289 1689735 1573738 1603483 1838109 1992305 2262432
2132 2262432 2482361 2387683 2486346 2515921 2786253 2929880 3587183 3727657 4223231 4472494
2122 4472494 4520616 5018612 5364342 5668892 6162484 6183971 6351604 6724117 7192649 7921269
2112 7921269 8791489 9496050 10444029 11520639 12639255 13635823 15096315 16987225 19085245
2103 19085245 21924498 25455177 29726305 35612022 42993397 52289047 54760954 49997842
2095 49997842 41291880 32126622 25811087 21249813 18405295 15874611 14553418 13157348
2087 13157348 12529655 11589643 10637652 9680463 8970265 7978703 7019319 6640160 6302874
2078 6302874 5635034 4948426 5068602 4505519 4095040 3972591 3341776 3349360 3335049 3038623
2068 3038623 2778278 2897521 2526605 2294260 2267048 2224811 2005070 1826066 1919770 1854297
2058 1854297 1386509 1642037 1047309 1337952 1556055 1553884 1364992 1276482 1261717 1470229
2048 1470229 1498694 1028590 1519461 1592197 1337733 1293801 1182646 1235286 1122537 1046393
2038 1046393 848374 1005124 1055391 803689 807692 726335 701801 346711 582445 457658
2028 457658 511181 789529 456842 335404 508447 433243 258371 468050 470876 491761 655218
2017 655218 725507 533591 513101 402306 523668 40401 536161 466764 300700 463238
2007 463238 -216069 -236739 157303 -68146 137593 46702 -29258 161918 51621 272690
1997 272690 118363 142174 -909 -168946 -92090 161030 117822 -34263 19442 -258662
1987 -258662 -130276 710 -119735 -229198 -269704 117978 99986 -275011 -308973 -42436
1977 -42436 -51769 -98954 -110068 -128271 -171686 24186 47825 273072 203566 -141151 -354934
1966 -354934 -199228 -325198 172520 31424 49687 20897 158252 338873 286614 7297
1956 7297 78206 166678 234129 385095 177106 511921 118505 -45289 -31823 -72212 -315232
1945 -315232 -529424 -245746 6605 16033 106444 325357 -32704 13233 316960 102619
1935 102619 -42984 38118 174518 -117668 120083 -145368 -267536 -62119 140808 325797
1925 325797 92065 8264 -319118 -154789 -273842 89929 60791 -417563 -452852 -386074
1915 -386074 -77496 -275012 -323166 -352781 -138513 -310043 -96783 16103 -185582 -166674
1905 -166674 -189190 59578 -391128 -369810 -296686 49103 -65478 121366 -7891 269880
1895 269880 58554 43466 65298 133785 459237 204549 193601 -612293 -458174 128008
1885 128008 156340 -117679 -268868 -378686 -210573 -130187 -248138 -164279 -221657 -367558
1875 -367558 -154638 -111669 -271199 -326375 -216797 23318 -386671 -272666 -312883 47193
1865 47193 -186385 -251175 -209993 -242384 287352 138686 -139634 -168686 -262435 -342245 -308124
1854 -308124 -474672 -181899 -197915 -58635 -112428 -27348 -97956 148073 83774 -355391 -262288
1843 -262288 -105217 180276 133513 -41946 -264893 -138555 239676 -382377 -172194 -126474
1833 -126474 -315579 -355924 -6476 -267555 -46042 -428685 -256195 -333353 -363223 -90913
1823 -90913 -235691 -282572 -169832 -234392 -213383 -76410 -53054 -426978 -476717 -266896 -588778
1812 -588778 -475942 -68045 -159679 206350 140718 -42878 26928 -273383 -227987 -734654
1802 -734654 -478229 -489295 -49517 267603 -194857 103677 -179591 -273346 -72140 -328191
1792 -328191 -491928 -420611 73327 -258779 18893 117589 -111701 -201506 14096 -56888
1782 -56888 -103550 -430419 -359402 -228212 -246331 -337343 -478246 -93163 164621 -749 -132268
1771 -132268 -68790 52098 133490 -298525 -180525 -40294 -46257 -223511 -335137 -315019 -507769
1760 -507769 -314739 -11517 133170 39105 310458 108453 227350 -154383 -339618 27014
1750 27014 -74489 -464727 -237583 -394071 -75864 -142580 -157856 -129736 188979 -75443
1740 -75443 -184729 -318825 -538902 -218164 -314596 -368147 9598 221603 -50015 -131440
1730 -131440 -362855 -115117 -29796 83484 90636 167763 69060 11100 258315 223188 43506
1719 43506 139998 -201193 -337284 -420845 83706 -59863 -349803 -639472 -128358 13727
1709 13727 -386894 -120475 -166820 5663 200697 -70811 112190 166413 59560 208959
1699 208959 103100 -37980 -57124 -485636 -119270 -115632 251407 144101 -119744 153335
1689 153335 -124224 -222174 -297188 -431057 -337598 340048 72000 277685 -81663 -112175
1679 -112175 -52973 -124441 -92000 -349243 -208898 -53521 119254 -32823 95229 -22303
1669 -22303 -218967 -256995 -187484 -533349 -639609 -294318 -382300 -495491 -297275 -339413 -395463
1658 -395463 6592 -151839 -369745 -287432 -142559 -405412 -121112 -57485 -273829 -131273
1648 -131273 116683 259565 199258 -18764 -116050 -187522 -200783 -14600 -80279 10593 39001
1637 39001 118819 -390824 -506573 -523605 -53043 -225865 -225030 -106730 113883 161943 95200
1626 95200 -105989 -29740 339328 -56283 -80206 124785 129452 -82558 -220780 -203509 143000
1615 143000 313518 17883 60808 380676 138930 97281 59950 326669 267840 -3784
1605 -3784 -486015 -265060 39275 -235844 -284052 -215423 -396201 -285885 -162370 -251096 -126848
1594 -126848 -530816 -611966 -131784 -321505 -131873 -119988 -266264 -566174 -278290 -105814
1584 -105814 -149333 -14861 -227520 -46891 -16102 312090 204824 -510250 -564543 -122681
1574 -122681 -132942 -341928 -289180 -316841 -373058 -353236 -353990 -536135 -576301 -252853 134659
1563 134659 -85336 -31398 -53300 -12969 108981 -291271 -16411 114354 78339 -254380
1553 -254380 -163312 77894 -449153 -278491 -197881 -30797 196797 -148522 -5501 21214
1543 21214 -416184 -105026 258417 137466 -53117 -70258 -258656 -86546 332763 113196
1533 113196 320848 -83907 -235071 -254461 -96156 -118538 -375926 -134390 172785 216706
1523 216706 101699 -76988 -226700 -184859 -76159 -4348 202266 96827 86048 200642
1513 200642 358436 -38505 -188948 -298803 -615619 -513820 -294518 -237332 223294 -41610
1503 -41610 -97094 66935 388579 165289 -157468 -2285 -148428 -293034 -291804 177515
1493 177515 -130731 -113504 -141788 -159885 -128446 70130 -284307 -206972 -48614 87451 218886
1482 218886 -36954 -186537 -140143 -92609 -162348 -247210 -97987 -210942 55413 17296 -3825
1471 -3825 24528 -272227 -106392 -241824 49046 14883 88891 21246 -37608 47206 -39478
1460 -39478 -306433 -146671 88856 -106983 332786 86320 110495 90700 -118608 -48565
1450 -48565 267319 306014 -229403 -438762 -120742 248066 229407 142236 183089 -236176 -151219
1439 -151219 -36317 -254044 -521121 -222553 -270418 -22161 -200215 67202 229990 268989
1429 268989 414772 98118 366013 -58691 -188514 -263542 -138130 35254 -175384 15509
1419 15509 -166248 78755 229143 -33043 -9646 443547 277244 196595 60712 259779
1409 259779 158435 -88114 161941 121408 180685 -944 404192 389726 262213 -239064
1399 -239064 -38126 40729 361333 155513 368055 499683 28165 -95359 -339817 -492009
1389 -492009 -384777 -433950 76868 50726 -188622 -229155 -89318 -257611 -73706 -50856
1379 -50856 -356249 -219867 -264028 142521 59611 -375726 -194535 -114609 184657 59419
1369 59419 167265 185121 76765 -130645 -348214 -109773 122746 32898 -64871 -388343
1359 -388343 -340737 -48409 105333 -107721 31657 -41274 -11990 69032 171219 166062 103012
1348 103012 152895 -98992 128073 -93142 59545 141744 129228 -113066 156925 11653
1338 11653 -129645 -150417 -392847 -375718 85204 258735 84285 -88675 -385277 -4256
1328 -4256 -118972 -661271 -356484 -328414 439 -127398 87340 -252745 -174572 135372
1318 135372 -175775 -122537 196 -263411 -149120 -141225 -423395 2589 -115552 77831
1308 77831 27190 2447 187058 29578 377176 29162 -30639 -57946 -37234 -257272 -453812
1297 -453812 -161078 -57006 246305 234766 36828 8988 160656 32044 -87031 -45457
1287 -45457 -438533 -213188 269737 113689 -154483 11916 -33161 301455 199397 279379
1277 279379 384183 137947 8091 -159510 -103066 135174 146365 129750 -40003 -14986
1267 -14986 -45653 8892 339720 -154435 -72504 41851 -56776 -153849 -214891 -95189 -295509
1256 -295509 -428207 -82363 -149373 -9889 -167501 55129 493727 463997 321375 472225
1246 472225 350604 -71044 -341007 225628 208213 235583 183272 203731 339202 608321
1236 608321 386270 50744 -155274 228781 122165 -18582 139767 -223438 14721 -329588
1226 -329588 -222939 -80948 -100228 -133021 -76368 -113317 -345450 -384878 3561 -82818 -368902
1215 -368902 -327185 -233940 75935 101356 -125392 -42576 365495 526201 202687 201494 187853
1204 187853 -160095 57432 -375934 -230443 34080 35494 166779 -36786 147410 42546
1194 42546 -247 42391 109507 -70728 -86092 -52087 -125374 -179664 55893 31642 31037 2491
1182 2491 72521 -11617 57351 110036 -48585 -213801 -75874 78392 84829 176944 -239805
1171 -239805 119365 181000 -32027 70990 -53459 -430173 -245330 38734 -268249 -77628
1161 -77628 106943 135189 233544 68452 230222 -62867 -422276 -214062 -334041 -342187 -220646
1150 -220646 45113 59678 -235720 -89102 204010 185609 33643 49214 92514 -32817
1140 -32817 -331111 38037 48107 -213103 260173 251116 136608 277023 29584 131963
1130 131963 217106 -19313 -89701 -85203 74515 183040 170762 -133344 73365 -1961 147080
1119 147080 105116 17709 146756 149154 -7145 50117 -6889 114124 -69210 32486 136145
1108 136145 -84129 -5512 241161 590424 -46888 -470246 48044 45917 39460 172689 -82250
1097 -82250 251297 352028 4656 193097 -239433 -258857 147744 149326 -362559 -620413
1087 -620413 -214897 -304791 1482 -178014 -140466 -89934 -122629 67289 331445 451552
1077 451552 -45369 -410338 -119938 -33828 -156697 63495 130913 178564 203374 66317
1067 66317 132109 -262946 -235029 -74183 169928 89973 335301 -13353 415371 303551
1057 303551 329217 597222 181729 15306 -64952 208080 118360 -86603 -313053 -131657
1047 -131657 271157 177584 470629 662324 223972 53096 176719 177747 338380 319710
1037 319710 -47958 -128009 30497 -89627 -173892 90160 -102580 -165229 -58424 169527
1027 169527 122923 1523 -82078 4923 -146711 -2917 -106805 -58386 40445 -96738 95321
1016 95321 265087 320568 239662 155444 234011 130778 -156811 240610 113485 21412 290355
1005 290355 -162722 -186891 -112437 10435 -162667 -59171 -44965 -127601 306946 620613
995 620613 551912 285102 329063 -377382 -184586 -97442 -104444 283166 -136736 227268 304300
984 304300 512752 371753 137252 -94139 -35634 69013 -99446 -234107 -231673 -68302
974 -68302 -113632 142182 235504 104254 225508 26127 -66601 113783 178878 151270 275873
963 275873 244253 10889 -146709 -94572 46921 225673 -101311 -165288 -215428 13362 15436
952 15436 105584 532667 365105 53165 48442 5274 242506 -149778 256406 170647 -138926
941 -138926 -337922 -228960 -75391 39003 210686 161358 -120259 -21202 263978 360941
931 360941 295706 -124303 35168 -84902 321286 159747 220728 85929 136271 -144819
921 -144819 -78320 -220352 211593 -42097 -252855 -77444 -322656 -348649 -368445 -189130
911 -189130 -123098 -109109 -91868 -112822 -7034 -107770 229099 281858 -14497 52377 -71085
900 -71085 261514 392640 305030 631156 588191 459449 147730 56018 105196 296810 -28905
889 -28905 310236 294836 198081 394939 -119161 -153034 -83016 -61502 8162 5612 144588
878 144588 190921 -116844 74608 169608 83716 387826 -7863 -83852 -24470 -44108 144742
867 144742 -171917 116384 226567 162906 232404 267822 52277 -58835 328354 51976
857 51976 38551 195244 296513 386407 32347 -212245 -249779 -318899 -286959 -130484 -145948
846 -145948 -176067 -190583 133802 228914 -201919 36928 -28223 -52181 50661 -46382 182935
835 182935 93552 102945 129222 -55353 226921 466942 155805 166340 -46409 21669 108520
824 108520 340478 143591 11622 49819 -147866 7437 188673 296240 295933 371677 143216
813 143216 -239473 -134515 62589 512162 568479 394325 -150902 -195617 72895 64724 559875
802 559875 374281 287535 47433 61170 77043 -73491 390350 138164 -58233 94996
792 94996 -163633 -150333 -90263 -289230 -410055 -704674 -124808 261506 -167721 -104017 23418
781 23418 436867 82032 -11808 132421 -242389 -3207 138411 97535 144159 -39487 -186443
770 -186443 -3824 -273806 -338305 -523778 -249105 72979 512552 362709 -43660 -167509
760 -167509 -403861 -456788 134940 -1617 -109625 -106115 36588 207866 -158852 -175739 252221
749 252221 343070 332714 105429 2522 -9851 -34113 -270868 -237558 -116205 -206609 -221442
738 -221442 -306119 -40910 -238415 -289958 -195856 -48113 -116782 -232581 311183 424254 -111014
727 -111014 -49573 -221830 -64278 426118 122444 -48837 76083 28886 77145 -90806
717 -90806 -74769 -413147 -230937 -36184 241639 76760 151962 -429158 -594327 48170
707 48170 118140 372544 -31928 -191095 -177698 -119220 480033 85261 313736 2921 -431287
696 -431287 -46608 -146640 -222051 53812 426661 161551 239522 396306 270797 149346
686 149346 178147 200739 159509 -52958 92503 579376 194815 -132784 -371452 -84168
676 -84168 377044 226774 253395 46509 -44111 -11128 383197 283117 367191 126408 82851
665 82851 -305392 -178175 -99882 -447125 24013 223524 -121979 196922 119029 51770 -150253
654 -150253 -262906 231041 79624 58051 121961 251741 408601 281018 280620 380398 -84816
643 -84816 87343 33650 9671 13881 -93297 -339303 41811 -258758 -65645 186621 177660
632 177660 371153 -67901 48725 -145051 -449255 38721 531702 75806 -57545 -363332
622 -363332 -220060 -38086 -42814 49671 8067 43299 221929 206885 16449 429512 254892
611 254892 174500 223921 69438 -212623 -3959 44559 208594 -18441 -188033 -207438 -152168
600 -152168 -246187 98647 240701 127094 247987 125085 331221 -20230 -303674 -146788
590 -146788 -295636 -310491 209855 364678 -398440 -226317 -116713 -6546 -20410 78128
580 78128 106324 -111515 -284278 -299176 165363 -199669 -174727 -235767 -28115 247685 227730
569 227730 388710 341970 -1047 -87268 71594 70077 -124677 208533 192404 320691 27214
558 27214 -171991 -34935 -86067 21699 -4035 -188365 -301348 -481830 -262475 135852
548 135852 145360 120704 -323037 -191825 -212568 -3367 356900 553927 99075 -268410 -10797
537 -10797 359666 537767 99246 370690 27234 408058 344498 45724 353113 343215 -188550
526 -188550 -218198 8995 -69437 40118 41075 -115561 -203006 -142371 -13113 151317 -94855
515 -94855 -199109 -61975 -80136 22804 -56356 -85586 243456 -53861 59486 369278 128373
504 128373 65837 325769 48795 -110089 231915 110856 122307 313957 336501 237921 251729
493 251729 445218 348372 197838 31073 -23355 145623 -190215 113567 -502905 -152730
483 -152730 -305705 111044 63907 81010 -41504 -51053 307915 -25303 -29650 -117095 58259
472 58259 -181811 -57808 -191136 -50595 -77380 117727 114176 233606 244396 446735 513289
461 513289 504818 452383 284778 129482 265763 322703 219548 202510 -201243 -115060 60185
450 60185 -100801 -37584 31008 23974 111721 -83894 -169529 -386607 -361470 246472 119085
439 119085 -46197 -121021 202126 68745 -33163 219829 182623 194374 -11101 221032
429 221032 304425 -59566 121786 -100903 -232267 -91597 -44944 -36230 220312 -37957 -131599
418 -131599 42727 -105018 -253492 -692111 -338823 118927 -235215 -337325 -157958 -6454
408 -6454 -259868 -230569 -374492 -85867 245022 61502 -157162 142575 474122 158770
398 158770 182127 211008 23618 135346 267282 81597 -25055 -152636 -162640 22445
388 22445 -63551 -275218 -504392 -108947 -148586 -14979 100236 -133058 -215700 -362755 -219537
377 -219537 42481 -106834 -336782 -264440 -36059 -214620 -88493 -102230 -245666 -33945
367 -33945 83168 -526883 -372303 -198233 -173045 -228897 -104084 95642 58385 -141933 -130204
356 -130204 -1963 -235233 -109968 50835 459601 689059 391079 235126 206628 80756
346 80756 -21857 172446 269785 -272307 -460189 -223869 26879 108652 -59294 -175642
336 -175642 -434591 -568062 -262408 -115585 326443 412240 102062 -66099 -43948 -12086
326 -12086 155436 57730 -67049 -548636 -213678 -263774 -148742 154589 244162 495824 288067
315 288067 -232207 -145095 -180044 -64446 -442436 -215572 117669 122824 -253039 62134 41943
304 41943 -111218 1981 27824 -30396 28579 -162863 -117240 134456 38594 120861 4510
293 4510 85427 -217106 -17941 -64651 415160 237810 -21910 302600 -2423 -125704 -41959
282 -41959 69141 166590 -89864 -35087 114776 176313 380447 332089 177279 -13804 -37645
271 -37645 -247376 -4707 -154191 -158881 30436 -61525 -239467 -656080 -300061 60964 53382
260 53382 242970 -171288 -184234 192010 214126 15138 -299335 -186799 19285 -23605 -140089
249 -140089 6396 12809 -77742 -114164 -132917 -86615 -47051 106535 -284562 -247137 -117165
238 -117165 -118253 200862 -69392 -156297 70956 -10325 -238810 81125 345584 -31645 -270057
227 -270057 -262125 -107020 -177121 -337022 -260657 -534092 -588394 -210770 90531 206795 107092
216 107092 -337069 -91988 33149 -292712 -356668 -32909 20470 277079 184037 -119252
206 -119252 -3240 -225532 181798 122956 199420 374424 -177256 -143154 -292014 -176036
196 -176036 -38642 -140806 -43723 -142962 -30796 292970 148185 264253 -35372 -95371
186 -95371 -334953 -562701 -135906 -57905 -59285 -21875 -129967 -262447 -58625 142277 54331
175 54331 -129161 -258886 -261588 92123 -158328 -210972 -78964 -259714 -126714 299820 331486
164 331486 246206 309019 231809 340751 164084 113539 604 233948 9307 -161559 265281
153 265281 154912 47181 493138 74912 32319 -211277 -77523 -175128 -206526 -26943
143 -26943 -340429 -176005 176628 172199 85838 -6711 160739 257657 149948 91193 161558
132 161558 192373 14732 -62432 -45192 -151534 935 30977 81739 -133815 -186579 -3856
121 -3856 217320 -49803 -315909 48820 234346 10124 -431891 -181152 238211 269936
111 269936 -84854 -15527 141618 79082 139430 -30426 -138992 -255859 -123183 95911
101 95911 -5148 -40500 -1241 -199931 -214604 -70599 -99206 -17252 -213347 -304810 -297422
90 -297422 -130980 117922 -35980 -60837 -16346 -202487 1542 -74960 63136 -121389 204572
79 204572 174581 10011 225894 2975 -913 226586 -14596 -142425 -49184 -34334 -27921
68 -27921 -142138 -407447 -227527 -173036 -87113 -53674 155055 -57768 105477 55404 95231
57 95231 103281 196779 -17652 146994 126602 -13508 122468 77505 13355 -133684 -131498 80064
45 80064 21900 173507 268244 212161 93852 -86754 -198519 -24635 -151230 4224 24728
34 24728 -47804 -200241 70 -188690 -193070 -944 -259431 -195266 61073 385598 115392
23 115392 26003 -1445 -167290 -259332 86003 123981 -46625 -169768 -116702 -39436 145339
12 145339 186431 89074 50354 12593 -66917 -167660 -69139 242075 224421 105864 -174326
1 -174326 -22354
0 -22354
$$ Imaginary data points
##PAGE= N=2
##DATA TABLE= (X++(I..I)), XYDATA
16383 -6921652 -7092308 -6602757 -6336699 -6436705 -6568673 -6345400 -6315401 -6155366 -5992359 -5951539
16373 -5951539 -5802112 -5664955 -5509084 -5556280 -5271865 -5218125 -5183678 -5043201 -4969924 -5063078
16363 -5063078 -5076775 -5036755 -4733059 -4519227 -4531729 -4631537 -4395440 -3955376 -3942577 -4015476
16353 -4015476 -3846147 -3688163 -3851909 -3591109 -3586709 -3721754 -3487373 -3499201 -3557144 -3181453
16343 -3181453 -3034378 -2811286 -2792806 -2863147 -2858814 -2767596 -2546562 -2839810 -2422712 -2250864
16333 -2250864 -2242126 -2213768 -2296200 -2110720 -2060493 -1847123 -1827020 -1773585 -1413883 -1345999 -1333174
16322 -1333174 -1192454 -1304533 -1351939 -1262631 -1043684 -906919 -683346 -468988 -803757 -765611
16312 -765611 -592552 -603315 -267322 -292819 -366759 -348876 -186489 -89502 -58873 13366 339708
16301 339708 489304 297705 204131 225161 278733 479887 680499 757355 807935 839505 1142393
16290 1142393 917555 819118 601962 943382 1162347 1330148 1422175 1319171 1474143 1574442
16280 1574442 1643616 1783027 1789348 2142259 2086561 2190739 2627676 2426805 2264679 2292017
16270 2292017 2335872 2590374 2431649 2579925 2633370 2682993 2632394 2545897 2765072 2881772
16260 2881772 2850943 2941178 3197419 3159803 3236293 3095984 2901613 3303461 3223718 3664125
16250 3664125 3804693 3822167 3654094 3782846 3930166 4025755 3944839 4075859 4134877 4194816
16240 4194816 4321669 3820432 4025321 4553499 4472168 4472535 4391764 4580434 4449459 4573980
16230 4573980 4210600 4421924 4591900 4397903 4656082 4978985 4962303 4860984 4758601 4542478
16220 4542478 4989953 4895612 4898883 5080662 5196009 5161699 5135648 5006056 5231479 5352178
16210 5352178 5596648 5250157 5397873 5633074 5504147 5280897 5695772 5690990 5718957 5579536
16200 5579536 5558274 6015731 6020578 6165917 5868492 6011787 6210663 6292659 6041559 6068238
16190 6068238 6418782 6328884 6454543 6259551 6510749 6417472 6596172 6166804 6102049 6217655
16180 6217655 6552378 6573994 6498489 6429552 6677837 6719926 6701543 6631184 6853871 6699266
16170 6699266 6633410 6823241 6899673 6806156 6616588 7066133 6956606 6941814 6662898 6628552
16160 6628552 6696162 7057165 7334006 7318354 7118706 6991298 7091024 7373492 7314100 7103974
16150 7103974 6948845 7203930 7390397 7388571 7378374 7550247 7399108 7315408 7409586 7594045
16140 7594045 7357366 7116922 7389168 7261670 7619706 7901119 7806694 7563381 7510433 7387886
16130 7387886 7706344 7684767 7778385 7418460 7589129 7518738 7912753 8035671 7584033 7704504
16120 7704504 7742012 7409705 7510121 7555405 7880297 7728516 7665990 8224929 7824349 7610268
16110 7610268 7529432 7803304 7589201 7948218 7890472 7866180 8109919 8053931 7869723 7939962
16100 7939962 7705252 7541677 7990522 8001523 7799731 8097245 8042657 8061840 7968950 8023687
16090 8023687 8100886 8032229 7980192 7949337 7809417 8179702 8135483 8186964 8304757 8323281 8325571
16079 8325571 8497820 8369086 8304389 8031660 8286035 8267310 8148004 8197757 7993122 8095929
16069 8095929 8263298 7942890 8287739 8253476 8180174 8275699 8272695 8262798 8193165 8072799 8016509
16058 8016509 8199249 8257281 8601245 8430746 8366316 8129645 7983601 8219014 8097462 8222652
16048 8222652 8705331 8229679 8239937 8364232 8422333 8276747 8449349 8247019 8463333 8355932
16038 8355932 8474365 8559872 8350640 8575370 8554193 8349855 8628399 8357023 8479080 8383482
16028 8383482 8002518 8130556 7965793 8106838 8195335 8209534 8058235 8129001 8262294 8631626
16018 8631626 8511222 8100705 7784838 7892298 8023348 7952646 7952872 7971738 8303112 8231608
16008 8231608 8119022 8214197 8496784 8775745 8352363 8399838 8183360 7982219 7781503 7806492
15998 7806492 8314700 7902755 8203367 8717214 8494884 8292595 8485240 8461591 8552105 8208959
15988 8208959 8135758 8222882 8263202 8035964 7938282 7885723 8139698 8656502 8281855 8171340
15978 8171340 8314635 8354741 8762496 8542636 8136110 8419332 8504053 8551300 8653046 8398540
15968 8398540 8385890 8209888 8209232 8404419 8176723 8211982 8258001 8539647 8259363 8231835 8352665
15957 8352665 8050296 8214493 8276424 8151026 8153637 8075139 7964343 8136621 8323151 8353392
15947 8353392 8835320 8859883 8497619 8291052 8352586 8183828 8318601 8418933 8390473 8353320
15937 8353320 8578548 8625801 8451205 8544354 8795723 8675647 8505409 8146340 8163910 8373523
15927 8373523 8487986 8303204 8539997 8801509 8611373 8389475 8335668 8294571 8605875 8711529
15917 8711529 8447061 8729104 8639267 8464538 8181084 8094535 8451680 8464187 8366711 8323523
15907 8323523 8194889 8435361 8529826 8350289 8112990 8174545 8540311 8534895 8465333 8535391
15897 8535391 8234743 8218952 8239709 8170745 8663835 8852350 8356102 8259034 8025309 8231856
15887 8231856 8150497 7994283 8450165 8537032 7993706 8246256 8392707 8499441 8548665 8399017
15877 8399017 8496503 8008394 8271818 8452429 8317454 8744080 8925701 8636825 8602211 8825523
15867 8825523 8784305 8612587 8539284 8435014 8508219 8325675 8623798 8419097 8736527 8658939
15857 8658939 8529741 8455424 8490536 8257125 7950570 8417075 8350175 8680633 8588111 8728010
15847 8728010 8473868 8657000 8467945 8327137 8455739 8313754 8665541 8622150 8415398 8526027
15837 8526027 8504439 8543921 8402819 8505631 8173578 8459634 8650192 8283970 8325690 8513283
15827 8513283 8481719 8429832 8319562 8298933 8474107 8322991 8233766 8177406 8102909 8223651
15817 8223651 8437891 8455974 8448112 8711341 8171441 8284660 8524074 8436061 8626986 8403028
15807 8403028 8241198 8199004 8543621 8572379 8562977 8323777 8146474 8170927 8380308 7974913
15797 7974913 8225380 8309134 8291218 8446262 8469371 8630740 8480695 8559029 8518075 8198667
15787 8198667 8378616 8222978 7985876 8185871 8446340 8537547 8626684 8645269 8420164 8365699
15777 8365699 8354228 8513148 8425032 8595149 8395275 8432782 8350434 8736521 8724289 8666018
15767 8666018 8744654 8381799 8539812 8492096 8373488 8319920 8489409 8497021 8485131 8593804
15757 8593804 8274561 8341394 8544085 8431781 8552279 8917256 8686689 8481555 8457409 8343114
15747 8343114 8279432 8389894 8138513 8396233 8361398 8298716 8309076 8196054 8504066 8623194
15737 8623194 8667093 8120092 8481614 8532733 8424770 8616099 8758358 8867598 8650859 8205308
15727 8205308 8621300 8752174 8615333 8468452 8306714 8338463 8863980 8702017 8654895 9087023
15717 9087023 8694884 8233251 8415014 8611504 8703597 8313864 8185512 8252559 7958786 8195211
15707 8195211 8230717 8464806 8906347 8581234 8543588 8747185 8952405 8956871 8646240 8332098
15697 8332098 8052597 8435441 8463988 8532962 8940594 8860310 8678115 8587570 8818250 8829863
15687 8829863 8850776 8358397 8801791 8535632 8684877 8440551 8162185 8582936 8686401 8672437
15677 8672437 8646027 8847481 8638897 8471327 8592710 8907774 8514912 8730727 8873364 8899355
15667 8899355 8861871 8729361 8608464 8810142 8630826 8428706 8749244 8910011 8537086 8486232
15657 8486232 8344732 8758246 8667623 8398529 8651707 8611369 8758387 8558510 8686632 8602766
15647 8602766 8570856 8719007 8282747 8594603 8283057 8362117 8612021 8393532 8492047 8407631
15637 8407631 8260968 8701065 8905125 8444312 8420917 8411426 8425767 8701463 8710237 8501369
15627 8501369 8641359 8709158 8651323 8863343 8400220 8487187 8443459 8850128 8686349 8325483
15617 8325483 8481759 8656429 8635358 8757335 8632297 8887240 8802204 8708076 8906187 8858063
15607 8858063 8739615 8650841 8665613 8749569 8907166 8691086 8883656 8749150 8735760 8572075
15597 8572075 8683744 8719531 8787152 8873531 8751473 8532027 8515020 8319770 8671286 8568222
15587 8568222 8714384 8340642 8247782 8283435 8405039 8378489 8344848 8100688 8303306 8575002
15577 8575002 8565847 8666904 8240435 8581187 8497046 8547433 8734915 8840884 8747519 8489039
15567 8489039 8372898 8369007 8343507 8351583 8460816 8491010 8478704 8553405 8595774 8764357 8794376
15556 8794376 8656475 8348615 8431302 8481500 8524060 8366906 8577227 8528363 8416116 8571109
15546 8571109 8786360 8984994 8446963 8135388 8506272 8333927 8114331 8234537 8182882 8255752
15536 8255752 8326126 8267340 8475221 8546849 8414338 8194562 8172477 8529774 8935511 8857915
15526 8857915 8676964 8197460 8587948 8864031 8787800 8791825 8609803 8826431 8598242 8636418
15516 8636418 8980936 8820236 8607258 8525385 8436135 8702298 8705526 8807696 8550898 8843867
15506 8843867 8776511 8520259 8714993 8730371 8538793 8566122 8348474 8590886 8576922 8775416
15496 8775416 8634621 8783159 8633454 8436059 8370766 8884636 8650396 8625630 8898709 8512240
15486 8512240 8103384 8681720 8799463 8548262 8602078 8577324 8765719 8527282 8734466 8496714
15476 8496714 8801656 8559780 8575854 8481307 8482071 8496373 8372525 8675402 8747513 8956926 9123798
15465 9123798 8627038 8629423 8713125 8775589 8610987 8666361 8656423 8695750 8970022 8954539 8830753
15454 8830753 8509297 8541235 8728236 8821322 9258569 9015785 9150484 8848721 9155284 8938486
15444 8938486 9040924 9098516 8827717 8768743 8584503 8539010 8572962 8849549 9109312 8812973
15434 8812973 8642241 8833735 8578533 8371326 8700695 8724837 8664009 8692980 8850653 8964705
15424 8964705 8684341 8970990 8820744 8830836 8574970 8662571 9100983 9009683 8769229 8961309
15414 8961309 8690274 8571590 8717943 8637344 8501330 8916072 8459265 8416162 8940136 9027904
15404 9027904 8985263 9406115 9177010 9231938 9145374 9024625 9105963 8752688 8727973 8642940
15394 8642940 8603339 8846963 8926987 8816523 8834758 8670354 8704090 8480351 8619872 8986360
15384 8986360 9066804 8834595 8991891 9113405 8781605 8810742 8812767 9079389 8510955 8728232
15374 8728232 8381371 8563273 8794748 8604721 8776300 8975862 9048370 8891043 8852938 9048137
15364 9048137 8916698 8633993 8894650 8730178 8577971 9001543 9261088 9156027 9273014
15355 9273014 9212322 8783855 8442056 8680116 8659569 8751889 8686665 9019919 8931605 8977448
15345 8977448 9017427 8955097 9127396 9086841 9086606 9055908 8456152 8792222 8913468 8837386 8530815
15334 8530815 8286366 8558317 8698552 8546466 8565621 8653713 8851289 9184778 8852442 8854445
15324 8854445 8956868 8438848 8563102 8753713 8915282 8826731 8969257 9440129 8980362 8847249
15314 8847249 8911944 8678708 9122672 9098221 9018629 8876669 8894054 8798475 8963536 8725613
15304 8725613 8736782 9006206 8990048 8563601 8709110 8924547 8736388 8662496 8380686 8660161
15294 8660161 9019140 9002397 8793259 8921950 8871181 8675642 8930090 8745238 8808811 9111639
15284 9111639 9106308 9212677 9241267 9285776 8978131 8835926 8864415 9055856 9008097 8931336 8647310
15273 8647310 8949354 8700877 9045870 8792770 8866970 8972477 8770201 8926724 8864321 9243511
15263 9243511 9236223 9146380 8974404 8722319 8553673 8702014 8730575 8722262 8766115 8697151 9022426
15252 9022426 9060059 9155436 9022870 9008201 8873361 8678984 8646606 8690373 8953651 8951434 8930095
15241 8930095 8670032 9019826 8802006 8699750 8425196 8185413 8775043 8753356 9058407 9593638
15231 9593638 9271190 8917722 9202981 8939640 9007421 9007439 9104355 9320758 8990258 8652189
15221 8652189 8733528 9322701 9694443 9273201 8967552 9121900 9383170 9489252 8970493 9070341
15211 9070341 9129918 8989463 8941754 8957256 8698166 8607111 8567290 8778586 9164141 9117753
15201 9117753 9163370 8836471 8734888 8845946 8755149 8911309 8959882 9061097 8723906 8749811
15191 8749811 9007274 8788339 8820776 8664405 9142357 8983554 9209511 8867697 9114658 9220528
15181 9220528 8907477 8724897 8907111 9224690 9054444 9331163 9283363 9437162 9171972 9043707
15171 9043707 8959060 9106802 9215388 9278071 8895768 8750165 8801918 8670450 8768768 8557289
15161 8557289 8222347 8902554 9085935 8807493 8821386 8698258 8797377 9214010 9137741 9101109
15151 9101109 9176723 9159861 8868404 9091352 9382295 9275755 9157577 9138822 9458033 9144108
15141 9144108 9241270 9231599 9204644 9124028 9213783 9230838 8975217 8673128 9132459 9080131 9190850
15130 9190850 9109946 9085162 8953317 8906226 9002076 8878406 8984033 9083216 8835558 8793015
15120 8793015 8926719 8918325 9021380 9015299 8897062 8998440 8982106 8727224 8828701 8975005
15110 8975005 9153733 9277512 9272547 8881113 8725693 9025252 8997462 8766019 9178903 9054512
15100 9054512 8707177 8951407 9174327 9161010 9315030 9211704 9148841 8929156 9301744 9038833
15090 9038833 9041339 8959179 9076515 8650408 8704510 8977996 8919285 9089008 9254633 9055229
15080 9055229 9137261 9012452 9388478 9321580 9147862 9332425 9140592 8508473 8666016 9248545
15070 9248545 9149525 9339236 9200037 9322244 8758649 8973137 9283459 9189094 9026473 9224716
15060 9224716 9446723 9562225 9416060 9417583 9145542 9046823 8848592 8949517 9018793 8855292
15050 8855292 9281813 9172372 8902221 9137620 9408045 9529931 9070542 9017228 9082918 9175252
15040 9175252 9117234 8760431 9157378 9426921 9156439 9068732 8915061 8800558 8902061 8964834
15030 8964834 9270978 9222547 9410266 9135533 9075046 9009712 9107743 9381786 9308847 9005106
15020 9005106 8941526 9277755 9353431 9252954 9526567 9814288 8902408 8914368 9188251 9106358
15010 9106358 9162450 9074907 9211284 9119926 9044837 9100933 8995483 9364258 9816623 9592806
15000 9592806 9409617 9304757 9586159 9335934 9219162 8909970 9106792 9153460 9270243 9306124
14990 9306124 9561227 9697373 9503790 9411682 9509697 9518636 9289385 8895999 8783133 8989047
14980 8989047 9113849 9091444 9334430 9439650 9006802 8992569 9122696 9265756 9486465 9338176
14970 9338176 9283581 9450177 9504118 9505718 9081255 8983694 9087487 9079782 8836810 9082685 8942648
14959 8942648 8791226 9042524 8900014 8956536 9148993 9092899 9380925 9239749 9247394 9260312
14949 9260312 9360024 9125041 9295716 9206056 9101306 8889578 9100110 9161910 9354734 9022539
14939 9022539 8928339 9113396 9408052 9063152 9072060 9124781 9321706 9475592 9415863 9103914
14929 9103914 9346391 9394018 9415799 9470930 9350487 9333765 9158516 9273606 9426729 9025118
14919 9025118 9103592 9285163 9185801 9455714 9257322 9116857 9313501 9427094 9671889 9279560
14909 9279560 9063334 9032735 9032164 9126396 9152817 9366046 9247886 9391505 9022600 8896949
14899 8896949 8994277 8952116 9242698 9098363 9392548 9545016 9484470 9431804 9320941 9528909
14889 9528909 9155338 9324464 9800307 9534094 9310735 9582249 9218725 8871698 9166853
14880 9166853 9436957 9297622 9806863 9443321 9387031 9057092 9500930 9495929 9159333 9226678
14870 9226678 9340638 9496157 9568082 9526206 9736711 9562879 9084851 8982105 9514677 9467235
14860 9467235 9440389 9485537 9596345 9425707 9420082 9333611 9618991 9578062 9563756 9272403 9325862
14849 9325862 9061675 9174007 9600157 9361122 9520216 9770362 9735071 9419355 9260695 9350662
14839 9350662 9065436 9474094 9273245 9103521 9383977 9537862 9367571 8997396 8897463 9307131
14829 9307131 9671557 9669156 9514825 9198993 9359196 9246001 9241289 9117927 9162592 8906263
14819 8906263 9321595 9577549 9380590 9472564 9381958 9250158 9513819 9582533 9467203 9525841
14809 9525841 9654568 9546391 9169633 9306665 9348516 9558073 9342686 9078010 9255193 8821532
14799 8821532 8853884 9301644 9548659 9373148 9516754 9718635 9580470 9441636 9403708 9276659
14789 9276659 9622743 9460890 9340798 9620636 9570808 9456521 9219652 9122461 9298276 9759788
14779 9759788 9512992 9402954 9622598 9628253 9588289 9285263 9279209 9486712 9759204 9842244
14769 9842244 9719563 9383818 9622430 9555436 9956849 9615276 9424785 9294766 9386722 9374131
14759 9374131 9154678 9179241 9447741 9341940 9529662 9168779 9300033 9897395 9933073 9591810
14749 9591810 9522923 9213276 9301805 9315426 9409045 9590064 9475436 9463459 9349977 9253859
14739 9253859 9676528 9739786 9635851 9391009 9612861 9317934 9432778 9272231 9426939 9358327
14729 9358327 8910013 9544902 9523718 9534548 9777531 9689268 9726477 9813987 9393025 9363846
14719 9363846 9362120 9160387 9236316 9456927 9402151 9738345 9372972 9506923 9719357 9666561
14709 9666561 9124489 9101443 8957887 9179579 9334577 9160964 9041173 9458697 9465296 9156962
14699 9156962 9344338 9519833 9401387 9136780 9208647 9500078 9576430 9259719 9506599 9437454
14689 9437454 9143943 9800755 9936765 9753149 9373249 9488453 9490171 9348060 9439416 9363666
14679 9363666 9244956 9206576 9560638 9445170 9372284 9449252 9623956 9511565 9521738 9699785
14669 9699785 9534321 9486866 9485192 9460340 9711632 9758192 9779274 9709243 9344858 9598175 9575016
14658 9575016 9646665 9317335 9412263 9399971 9404299 9223941 9571459 9487371 9326459 9463271
14648 9463271 9407159 9108680 9316755 9268566 9077921 8976083 9218179 9389193 9322785 9408434
14638 9408434 9647677 10111926 9553280 9612497 9580569 9814561 9674119 9671835 9651231 9660234 9642611
14627 9642611 9414976 9299368 9331293 9312831 9270557 9335401 9603192 9528082 9441896 9433770 9481203
14616 9481203 9562353 9260946 9261249 9391230 9416901 9200262 9318361 9502484 9316652 9268261
14606 9268261 9568953 9680572 9548388 9517735 9337123 9276293 9420402 9691595 9567114 9025282
14596 9025282 9450730 9376535 9683156 9706399 9480962 9243646 9457188 9846616 9599723 9270933
14586 9270933 9530940 9631630 9494911 8984838 9178711 9589456 9743968 9958812 9588417
14577 9588417 9565479 9557854 9367491 9322211 9555259 9671906 9857667 9642769 9689068 9782112
14567 9782112 9909101 9375671 9584454 9613098 9450678 9222801 9449149 9671005 9415178 9767669
14557 9767669 9574012 9698770 9792829 9484345 9579341 9532899 9564610 9856846 9865273 9324630
14547 9324630 9470117 9602541 9479387 9503015 9641484 9544649 9745742 9825012 9505717 9913624
14537 9913624 9784183 9525222 9301467 9179877 9542597 9770588 9759038 9516090 9669078 9584760
$$ [...]
##END NTUPLES=NMR SPECTRUM
##END=
