##TITLE=1H_EC-3334(III-2)
 CDCl3
 8 sc, 
 31.10.2024
##JCAMPDX= 6.0         $$ Bruker NMR JCAMP-DX V2.0
##DATA TYPE= NMR SPECTRUM
##DATA CLASS= NTUPLES
##ORIGIN= UXNMR, Bruker Analytische Messtechnik GmbH
##OWNER= root
$$ XWIN-NMR		Version 3.5
$$ Thu Oct 31 13:56:14 2024 Russian Standard Time (UT+4h)  she@DPX200
##.OBSERVE FREQUENCY= 200.1318
##.OBSERVE NUCLEUS= ^1H
##.ACQUISITION MODE= SIMULTANEOUS
##.ACQUISITION SCHEME= undefined
##.AVERAGES= 8
##.DIGITISER RES= 18
##SPECTROMETER/DATA SYSTEM= spect
##.PULSE SEQUENCE= zg30
##.SOLVENT NAME= CDCl3
##.SHIFT REFERENCE= (INTERNAL, CDCl3, 0, 20.9988)
##AUDIT TRAIL= $$ (NUMBER, WHEN, WHO, WHERE, WHAT)
$$ ##TITLE= Audit trail, XWIN-NMR		Version 3.5
$$ ##JCAMPDX= 5.01
$$ ##ORIGIN= Bruker BioSpin GmbH
$$ ##OWNER= she
$$ F:/spectra/data/she/nmr/H-F/1/pdata/1/auditp.txt
$$ ##AUDIT TRAIL=  $$ (NUMBER, WHEN, WHO, WHERE, WHAT)
(   1,<2024-10-31 13:52:09.04 +0400>,<she>,<DPX200>,
      <created by zg, POWCHK disabled, PULCHK disabled
       configuration hash MD5:
       00 E9 B6 7A A2 85 ED C7 34 08 36 98 17 FE 4E 26
       data hash MD5: 16K
       1B 66 6A 2B F6 1F B7 23 AA 1D 40 A8 85 7A CE E4>)
(   2,<2024-10-31 13:53:25.64 +0400>,<she>,<DPX200>,
      <Start of raw data processing
       efp BC_mod = 2 LB = 0.24 FT_mod = 6 PKNL = 1 PHC0 = -26354.54 PHC1 = 23.78743 SI = 16K 
       data hash MD5: 16K
       72 BE 7A A0 16 F1 0F 4B 8B 20 05 C0 2B 97 E1 A3>)
(   3,<2024-10-31 13:53:45.23 +0400>,<she>,<DPX200>,
      <pk PHC0 = 2.825499 PHC1 = -3.8 
       data hash MD5: 16K
       EA 59 E5 E6 0C A8 D0 09 1B 7F 45 20 8B B6 33 E2>)
(   4,<2024-10-31 13:53:48.89 +0400>,<she>,<DPX200>,
      <abs ABSG = 5 
       data hash MD5: 16K
       EE FB 5F A7 AE E9 A6 14 7D 13 6B B1 2A 47 95 9E>)
$$ ##END=
$$ 
$$ hash MD5
$$ BC 6A 48 7F A7 DD A1 BF 13 AD 2D A0 41 4D 78 12
##$RELAX= 
##$RELAX= 
##$RELAX= 
##$RELAX= 
##$RELAX= 
##$RELAX= 
$$ Bruker specific parameters
$$ --------------------------
##$DU= <F:/spectra>
##$EXPNO= 1
##$NAME= <H-F>
##$PROCNO= 1
##$TYPE= <nmr>
##$USER= <she>
##$AMP= (0..31)
100 100 100 100 100 100 100 100 100 100 100 100 100 100 100 100 100 100 
100 100 100 100 100 100 100 100 100 100 100 100 100 100 
##$AQSEQ= 0
##$AQ_mod= 1
##$AUNM= <au_zg>
##$AUTOPOS= <>
##$BF1= 200.13
##$BF2= 200.13
##$BF3= 200.13
##$BF4= 200.13
##$BF5= 200.13
##$BF6= 200.13
##$BF7= 200.13
##$BF8= 200.13
##$BYTORDA= 1
##$CFDGTYP= 0
##$CFRGTYP= 5
##$CHEMSTR= <none>
##$CNST= (0..31)
1 1 145 1 1 1 1 1 1 1 1 1 1 1 1 1 1 1 1 1 1 1 1 1 1 1 1 1 1 1 1 1 
##$CPDPRG= <>
##$CPDPRG1= <>
##$CPDPRG2= <>
##$CPDPRG3= <>
##$CPDPRG4= <mlev>
##$CPDPRG5= <mlev>
##$CPDPRG6= <mlev>
##$CPDPRG7= <mlev>
##$CPDPRG8= <mlev>
##$CPDPRGB= <>
##$CPDPRGT= <>
##$D= (0..31)
0 1.2 0 0 0 0 0 0 0 0.06 0 0.03 0 0 0 0 0.0002 0 0 0 0 0 0 0 0 0 0 0 0 
0 0 0 
##$DATE= 1730368328
##$DBL= (0..7)
120 120 120 120 120 120 120 120 
##$DBP= (0..7)
150 150 150 150 150 150 150 150 
##$DBP07= 0
##$DBPNAM0= <>
##$DBPNAM1= <>
##$DBPNAM2= <>
##$DBPNAM3= <>
##$DBPNAM4= <>
$$ [...]
##$SUBNAM3= <"">
##$SUBNAM4= <"">
##$SUBNAM5= <"">
##$SUBNAM6= <"">
##$SUBNAM7= <"">
##$SUBNAM8= <"">
##$SUBNAM9= <"">
##$SW= 24.0689170037331
##$SWIBOX= (0..15)
0 0 2 0 0 0 0 0 0 0 0 0 0 0 0 0 
##$SW_h= 4816.95568400771
##$TD= 16384
##$TD0= 1
##$TE= 0
##$TE2= 300
##$TE3= 300
##$TEG= 300
##$TL= (0..7)
0 120 120 120 120 120 120 120 
##$TP= (0..7)
150 150 150 150 150 150 150 150 
##$TP07= 0
##$TPNAME0= <>
##$TPNAME1= <>
##$TPNAME2= <>
##$TPNAME3= <>
##$TPNAME4= <>
##$TPNAME5= <>
##$TPNAME6= <>
##$TPNAME7= <>
##$TPOAL= (0..7)
0.5 0.5 0.5 0.5 0.5 0.5 0.5 0.5 
##$TPOFFS= (0..7)
0 0 0 0 0 0 0 0 
##$TUNHIN= 0
##$TUNHOUT= 0
##$TUNXOUT= 0
##$USERA1= <user>
##$USERA2= <user>
##$USERA3= <user>
##$USERA4= <user>
##$USERA5= <user>
##$V9= 5
##$VALIST= <valist>
##$VCLIST= <CCCCCCCCCCCCCCC>
##$VD= 0
##$VDLIST= <DDDDDDDDDDDDDDD>
##$VPLIST= <PPPPPPPPPPPPPPP>
##$VTLIST= <TTTTTTTTTTTTTTT>
##$WBST= 1024
##$WBSW= 4
##$XGAIN= (0..3)
0 0 0 0 
##$XL= 0
##$YL= 0
##$YMAX_a= 227640
##$YMIN_a= -232989
##$ZGOPTNS= <>
##$ZL1= 120
##$ZL2= 120
##$ZL3= 120
##$ZL4= 120
##$ABSF1= 20.99879
##$ABSF2= -3.070341
##$ABSG= 5
##$ABSL= 3
##$ALPHA= 0
##$AQORDER= 0
##$ASSFAC= 0
##$ASSFACI= 0
##$ASSFACX= 0
##$ASSWID= 0
##$AUNMP= <proc_1d>
##$AZFE= 0.1
##$AZFW= 0.1
##$BCFW= 0
##$BC_mod= 2
##$BYTORDP= 0
##$COROFFS= 0
##$CY= -3
##$DATMOD= 1
##$DC= 0
##$DFILT= <>
##$DTYPP= 0
##$F1P= 0
##$F2P= 0
##$FCOR= 1
##$FTSIZE= 16384
##$FT_mod= 6
##$GAMMA= 0
##$GB= 0
##$INTBC= 1
##$INTSCL= 3.70164e-10
##$ISEN= 128
##$LB= 0.24
##$LEV0= 0
##$LPBIN= 0
##$MAXI= 10000
##$MC2= 0
##$MEAN= 0
##$ME_mod= 0
##$MI= 1.114404
##$NCOEF= 0
##$NC_proc= -7
##$NLEV= 6
##$NOISF1= 3.799351
##$NOISF2= 2.8
##$NSP= 0
##$NTH_PI= 0
##$NZP= 0
##$OFFSET= 20.99879
##$PC= 1
##$PHC0= -26351.71
##$PHC1= 19.98743
##$PH_mod= 1
##$PKNL= yes
##$PPARMOD= 0
##$PSCAL= 0
##$PSIGN= 0
##$REVERSE= no
##$SF= 200.130005990183
##$SI= 16384
##$SIGF1= 3
##$SIGF2= 2
##$SINO= 5.538805
##$SIOLD= 16384
##$SREGLST= <1H.CDCl3>
##$SSB= 0
##$STSI= 16384
##$STSR= 0
##$SW_p= 4816.95568400771
##$SYMM= 0
##$S_DEV= 0
##$TDeff= 16384
##$TDoff= 0
##$TI= <>
##$TILT= no
##$TM1= 0
##$TM2= 0
##$TOPLEV= 0
##$USERP1= <user>
##$USERP2= <user>
##$USERP3= <user>
##$USERP4= <user>
##$USERP5= <user>
##$WDW= 1
##$XDIM= 16384
##$YMAX_p= 331038006
##$YMIN_p= -676707
$$ End of Bruker specific parameters
$$ ---------------------------------
##NTUPLES= NMR SPECTRUM
##VAR_NAME=  FREQUENCY,     SPECTRUM/REAL,   SPECTRUM/IMAG
##SYMBOL=    X,             R,               I
##VAR_TYPE=  INDEPENDENT,   DEPENDENT,       DEPENDENT
##VAR_FORM=  AFFN,          ASDF,            ASDF
##VAR_DIM=   16384,         16384,           16384
##UNITS=     HZ,            ARBITRARY UNITS, ARBITRARY UNITS
##FACTOR=    0.29402158847633, 1,            1
##FIRST=     4202.48811677628, 0,            0
##LAST=      -614.467567231426, 0,           0
##MIN=       -614.467567231426, -676707,     0
##MAX=       4202.48811677628, 331038006,    0
$$ Real data points
##PAGE= N=1
##DATA TABLE= (X++(R..R)), XYDATA
$$ [...]
6000A503111o4641K9037O3464J99581k93794j66658M4412J30584k6713p3777l28842
$$ 1503111 1438470 1467507 1530971 1730552 1436758 1270100 1314512 1445096 1418383 1344606 1015764
5989A015764R5180K47902j84021K24356l87490j66121L6911K67419P624j07898
$$ 1015764 1110944 1358846 1174825 1399181 1011691 845570 882481 1149900 1157524 1049626
5979A049626r1555J41083L06690J52437j45873j71989K42510P8308j01846r6173
$$ 1049626 958071 1099154 1405844 1558281 1412408 1240419 1482929 1561237 1459391 1363218
5969A363218K53477K96091J5396k73270K48695Q6214q3114J93560o8988L6911
$$ 1363218 1616695 1912786 1928182 1654912 1903607 1989821 1906707 2100267 2031279 2068190
5959B068190q5908J59382J02843K16709M34709L54424J8327M49398N22944L18417
$$ 2068190 1982282 2141664 2244507 2461216 2895925 3250349 3268676 3718074 4241018 4559435
5949D559435L57211M23727K31467L4951k07399o6173N285K37709K56146l56435
$$ 4559435 4916646 5340373 5571840 5606791 5399392 5333219 5338504 5576213 5832359 5475924
5939E475924o28419m63459m5017m20611l30547l79911j67779j92680j56264L62673
$$ 5475924 4847505 4384046 4339029 3918418 3587871 3207960 3040181 2847501 2691237 3053910
5929C053910r0176k67053j57220J5328K06643J49030o7297K46753l0684J50022
$$ 3053910 2963734 2696681 2539461 2554789 2761432 2910462 2843165 3089918 3059234 3209256
5919C209256p803J31113j78489J70026K74736k15864J76067l4066k96485M28596
$$ 3209256 3201453 3332566 3154077 3324103 3598839 3382975 3559042 3524976 3228491 3657087
5909C657087L741J57J73642J13064Q7890K23004K93672j58111Q415J55398N06534
$$ 3657087 3660828 3660985 3834627 3947691 4035581 4258585 4552257 4394146 4402561 4557959 5064493
5898E064493M61857j1722M31156O20251L01150J13890L29271P20416N86595P89602
$$ 5064493 5526350 5514628 5945784 6566035 6867185 6981075 7310346 8030762 8617357 9406959
5888I406959N09935M68115O4172l35025k15307N9765K7245L73085k59729m09160
$$ 9406959 9916894 10385009 10449181 10114156 9898849 9958614 9985859 10358944 10099215 9690055
5878I690055o06273l38801m64489k26334k96412j65700p9053l51397m59108K29791
$$ 9690055 9083782 8744981 8280492 8054158 7757746 7592046 7512993 7161596 6702488 6932279
5868F932279j62454j55789k76303r7869n4623k4051J7479J63646J72759j0165
$$ 6932279 6769825 6614036 6337733 6239864 6185241 6161190 6178669 6342315 6515074 6504909
5858F504909J17633J54751l59333M51648M44451K03468K51321M84611J44859k09249
$$ 6504909 6622542 6777293 6417960 6869608 7314059 7517527 7768848 8253459 8398318 8189069
5848H189069M41060k41887j9969k33083j00049j44974n3128j09903k22891j87815
$$ 8189069 8630129 8388242 8368273 8135190 8035141 7890167 7837039 7727136 7504245 7316430
5838G316430m04006l82613o7070Q7630q0726n36424r5334L3711m02051l42164
$$ 7316430 6912424 6529811 6462741 6550371 6469645 5933221 5837887 5871598 5469547 5127383
5828E127383K55375j07852k22634Q398j91690l0243N7791L4267j24201n46272
$$ 5127383 5382758 5274906 5052272 5060670 4868980 4838737 4896528 4930795 4806594 4260322
5818D260322R9874p8808J13874N113q0012J449k2593K05500k96136L061O7228
$$ 4260322 4360196 4281388 4395262 4400375 4320363 4321812 4299219 4504719 4208583 4211644 4278872
5807D278872j10721j03513j8298k78842J8082J17227m12198J00718q5006K31017
$$ 4278872 4168151 4064638 4046340 3767498 3785580 3902807 3490609 3591327 3506321 3737338
5797C737338j253o2982j6542j09712K01174q9407k38076L1763Q1942p066N2719
$$ 3737338 3736085 3673103 3656561 3546849 3748023 3658616 3420540 3452303 3534245 3527179 3579898
5786C579898K12449l62605r3514J73155m4106o1514J84034J42957o3081M5374
$$ 3579898 3792347 3429742 3336228 3509383 3465277 3403763 3587797 3730754 3667673 3713047
5776C713047M04422K55705L23355O54416L50071J77459k95532q5850K24839L28647
$$ 3713047 4117469 4373174 4696529 5350945 5701016 5878475 5582943 5497093 5721932 6050579
5766F050579q3752j26270k57794o97319n10192j67803p76428J15253L7489r8579
$$ 6050579 5966827 5840557 5582763 4885444 4375252 4207449 3431021 3546274 3583763 3485184
5756C485184j69484l71436K47598K10113k12007j93768o795K9577J0918j61756
$$ 3485184 3315700 2944264 3191862 3401975 3189968 2996200 2989405 3018982 3029900 2868144
5746B868144M48506l05024L336K85678R3315k6252p7192l8576M13830L01526K15812
$$ 2868144 3316650 3011626 3014962 3300640 3393955 3367703 3290511 3251935 3665765 3967291 4183103
5735D183103J33552M28267J07689L33706J76253n0407n7844j40068N89500J36007
$$ 4183103 4316655 4744922 4852611 5186317 5362570 5312163 5254319 5114251 5703751 5839758
5725E839758j91956l95720j76813m32907m11986l96018j66498m5583n58849m35190
$$ 5839758 5647802 5252082 5075269 4642362 4230376 3834358 3667860 3622277 3063428 2628238
5715B628238q3836M29236o5252j59281J63239j39488J81293M0536K40277M50708
$$ 2628238 2544402 2973638 2908386 2749105 2912344 2772856 2954149 2994685 3234962 3685670
5705C685670K30957q7034o72197m55616k38195m83454r851L9538n12246L9237
$$ 3685670 3916627 3829593 3157396 2701780 2463585 1980131 1970280 2009818 1497572 1536809
5695A536809L91452k68511M2204l03857j77621j3764j69786o4563j16295k0435
$$ 1536809 1928261 1659750 1701954 1398097 1220476 1206712 1036926 972363 856068 835633
5685H35633J72980r3120L1742k8636J32775k15417R1810J58763m2170j49341R1535
$$ 835633 1008613 915493 947235 918599 1051374 835957 927767 1086530 1044360 895019 986554
5674I86554R9528n1804l17416m1126m8982k66419M31472M4269K26347P5030r4991
$$ 986554 1086082 1034278 716862 675736 626754 360335 791807 836076 1062423 1137453 1042462
5663A042462O1615k58626j41180k27917r6759K20406n8272j03374J29911K23183
$$ 1042462 1104077 845451 704271 476354 379595 600001 541729 438355 568266 791449
5653G91449k59287k7310j33346j39258j99630J52955L17246o8006J33773k60016
$$ 791449 532162 504852 371506 232248 32618 185573 502819 434813 568586 308570
5643C08570j16177N2526J951q6372K99249n6466J51592j88526n71934L27488K02562
$$ 308570 192393 244919 246870 160498 459747 403281 554873 366347 -205587 121901 324463
5632C24463J65785j20832m1426J40098J51524k14026l60027J93620n653j84815
$$ 324463 490248 369416 327990 468088 619612 405586 45559 239179 233526 48711
5622D8711L71186q2283P2694M5390j41434L26229k42231l2379o0323J58099k5387
$$ 48711 419897 337614 410308 455698 314264 640493 398262 365883 305560 463659 438272
5611D38272j72005J86495L68570N2546l07983N60171J38240k51702j75426m95876
$$ 438272 266267 452762 821332 873878 565895 1126066 1264306 1012604 837178 341302
5601C41302n0994Q7334l0009K18742k1451k55375m885K37069k31440r5644j10767
$$ 341302 290308 377642 347633 566375 544924 289549 284664 521733 290293 194649 83882
5590H3882r638l7067K33017P0814j04204K37857N9259j21874q9328R4242n6320
$$ 83882 74244 37177 270194 341008 236804 474661 533920 412046 322718 416960 360640
5579C60640n9672J55553q3579n6813j5149R4392k1441j61719N6068j03617K06403
$$ 360640 300968 456521 372942 316129 300980 395372 373931 212212 268280 164663 371066
5568C71066j09884l88593J819Q1477K48556j74081J71921J58291j39128k9118
$$ 371066 261182 -127411 -125592 -44115 204441 30360 202281 360572 221444 192326
5558A92326j14986j11130P8836Q9041J14336P0874j58158k4983j342K41640k13744
$$ 192326 77340 -33790 45046 134087 248423 319297 161139 136156 134814 376454 162710
5547A62710l15353l94300j3859L39725K65307l5553k01064J50457l68006j6894
$$ 162710 -152643 -546943 -560802 -221077 44230 8677 -192387 -41930 -409936 -426830
5537d26830m3050P1599K80908L20743m5770O4658L6273k9367r9725J9925K8892
$$ -426830 -469880 -398281 -117373 203370 157600 222258 258531 229164 129439 149364 178256
5526A78256j47945k8750o8588K2717J8514P5899q5654J52804J14439M0601m9217
$$ 178256 30311 1561 -67027 -44310 -25796 50103 -35551 117253 231692 272293 223076
5515B23076p159j82399j44105j2570L18888j55050k34117L87885P0391k78907
$$ 223076 215917 33518 -110587 -123157 195731 40681 -193436 194449 264840 -14067
5505a4067J20417M03873j80589J36334k07272k85096J15021l8047K29038j27229
$$ -14067 106350 510223 329634 465968 258696 -26400 88621 50574 279612 152383
5495A52383k75189K30676l975J11331K34525k98540J30241k5647j87930j74775
$$ 152383 -122806 107870 103895 215226 449751 151211 281452 255805 67875 -106900
5485a06900J3601K49823J22948q6402M4464j27768Q8029j3306M3704K29438Q8694
$$ -106900 -93299 156524 279472 193070 237534 109766 197795 184489 228193 457631 546325
5474E46325r4819k58314K11436k10531m3946J56245M4731Q9083q9230J42090m17351
$$ 546325 451506 193192 404628 194097 150151 306396 351127 440210 350980 493070 75719
5463G5719j95091M20139o4120k90910K93541j31513J57728K08046l7444J9196
$$ 75719 -119372 300767 236647 -54263 239278 107765 265493 473539 436095 455291
5453D55291J72268k36450K00091K40173M5099J30475M4132j47019k95739P7166
$$ 455291 627559 391109 591200 831373 876472 1006947 1051079 904060 608321 685487
5443F85487q4547p1497j38872J19976j5951l24751j84397L55903k8827Q7148J07418
$$ 685487 600940 529443 390571 510547 494596 169845 -14552 341351 312524 399672 507090
5432E07090M4147k3398J97643k8460K39519J60381J06275L259j72713l90790J7582
$$ 507090 551237 527839 725482 697022 936541 1096922 1203197 1206456 1033743 642953 660535
5421F60535L4359m6451K86911k73003j33293l6909M4065J69863l3868M4766j02815
$$ 660535 694894 648443 935354 662351 529058 492149 536214 706077 672209 716975 614160
5410F14160L42584P5780Q2555k1690J85084K33338k72079J74697k6712n6957k41411
$$ 614160 956744 1032524 1115079 1093389 1278473 1511811 1239732 1414429 1387717 1330760 1089349
5399A089349R5989k80591Q8368L8038j82576K7458Q2869j64933o9448J76549J7724
$$ 1089349 1185338 904747 993115 1031153 848577 876035 958904 793971 724523 901072 918796
5388I18796j15404K53600N1728O3218L57638K16698m55133k64231K36562o01723
$$ 918796 803392 1056992 1108720 1171938 1529576 1746274 1291141 1026910 1263472 661749
5378F61749K40454K12898k91443o6264j0599J49565j78870j54647M01528J31821
$$ 661749 902203 1115101 823658 757394 746795 896360 717490 562843 964371 1096192
5368A096192Q4626p1577R984j01687N4855O4641j31165j51755K1597Q1408j33218
$$ 1096192 1180818 1109241 1119225 1017538 1072393 1137034 1005869 854114 875711 957119 823901
5357H23901J70448j62831j27108j37108j22762K09257K53092m7369k32204L4119
$$ 823901 994349 831518 704410 567302 444540 653797 906889 859520 627316 661435
5347F61435L450n724K31606l52587L47800k81983J1578P9401J29526l51023m1505
$$ 661435 664885 659161 890767 538180 885980 603997 615575 694976 824502 473479 431974
5336D31974M40558L4601l81141J64411K66088k09911l49129R4373K39724j26415
$$ 431974 872532 907133 525992 690403 956491 746580 397451 491824 731548 605133
5326F05133k95135J86871K30854m05287L9468n5232N2228l5294M46876r7895J9614
$$ 605133 309998 496869 727723 322436 361904 306672 358900 323606 770482 672587 692201
5315F92201m61243K34107p2178J9585K25087j47226j87041K90734K54538r5985
$$ 692201 230958 465065 392887 412472 637559 490333 303292 594026 848564 752579
5305G52579p0700K61574Q6104k33705k85633J64653k11833J67898J44821p4175
$$ 752579 681879 943453 1029557 795852 510219 674872 463039 630937 775758 701583
5295G01583j38367j85828K98892N568j55228N2347P879k12372P4000K56592j67430
$$ 701583 563216 377388 676280 681848 526620 578967 586846 374474 448474 705066 537636
5284E37636k72699M95721K89759J05456j06242m10238K31070k03468K28550J4382
$$ 537636 264937 760658 1050417 1155873 1049631 639393 870463 666995 895545 909927
5274I09927k93325K63709L6480j40629J22993K79858o19971J54475M5095l1955
$$ 909927 616602 880311 916791 776162 899155 1179013 559042 713517 758612 726657
5264G26657L60474K30385p7763m1172k65550o8144j31950K9205M5057k09525K25908
$$ 726657 1087131 1317516 1239753 1198581 933031 864887 732937 762142 807199 597674 823582
5253H23582n2947K75166o9489k59015J24853q4831j69414k24M04996J54428R7964
$$ 823582 770635 1045801 976312 717297 842150 757319 587905 587681 992677 1147105 1245069
5242A245069j82932K18101k6369q4572K81306k99626k05103K135J01101K84285
$$ 1245069 1062137 1280238 1253869 1169297 1450603 1150977 945874 948009 1049110 1333395
5232A333395q3184j5298J81129k63159l395J38031m0641K00999l9676n0294l3488
$$ 1333395 1250211 1234913 1416042 1152883 1149488 1287519 1246878 1447877 1408201 1357907 1324419
5221A324419n2422J70130q7178k38098J52839R4410k22416m5874K85917J20675
$$ 1324419 1271997 1442127 1354949 1116851 1269690 1364100 1141684 1095810 1381727 1502402
5211A502402J84893k76948J84852j83838k53069J04229J85354q555j80492K02073
$$ 1502402 1687295 1410347 1595199 1411361 1158292 1262521 1447875 1439320 1258828 1460901
5201A460901j95056J04646j59469n28879J62332K08472J32986j64859l08695J89320
$$ 1460901 1265845 1370491 1211022 682143 844475 1052947 1185933 1021074 712379 901699
5191I01699m0141Q0267L65419p7636n12674J81927J52898p4090J97919j32541
$$ 901699 861558 941825 1307244 1229608 716934 898861 1051759 977669 1175588 1043047
5181A043047j3555j55500m2923J77498o2955j72636m16898M77222l3440l9999
$$ 1043047 1029492 873992 831069 1008567 945612 772976 356078 833300 799860 759861
5171G59861L1941J80504J15921j15329m8277J09192k0183m7604J73279M4973k8325
$$ 759861 791802 972306 1088227 972898 924621 1033813 1013630 966026 1139305 1184278 1155953
5160A155953m0252K5355j28822N0248j76883M9168j02057J27802J86460j64043
$$ 1155953 1115701 1141056 1012234 1062482 885599 934767 832710 960512 1146972 982929
5150I82929O9957J11727j50104o6240J89803J02062k03420N2482N1007K42609
$$ 982929 1052886 1164613 1014509 948269 1138072 1240134 1036714 1089196 1140203 1382812
5140A382812l39986k57628J87176j70950J67249j13390Q4010J53540k40333J38844
$$ 1382812 1042826 785198 972374 801424 968673 855283 939293 1092833 852500 991344
5130I91344J03903j04806l672j11287K60084R2534j34972J61046J60932j60607
$$ 991344 1095247 990441 986769 875482 1135566 1228100 1093128 1254174 1415106 1254499
5120A254499k2068j95063l94074L82990k3179l43839N83241j02326j52825L0844
$$ 1254499 1232431 1037368 643294 1026284 1003105 659266 1242507 1140181 987356 1018200
5110A018200L08123O031l29559N9420K56090k144j25234J35246j92206k76086
$$ 1018200 1326323 1332354 1002795 1062215 1318305 1316161 1190927 1326173 1133967 857881
5100H57881K87041K28869J87286R6296J81907L6639J16765Q2319j57338L79649
$$ 857881 1144922 1373791 1561077 1657373 1839280 1875919 1992684 2075003 1917665 2297314
5090B297314k28560N8398J22532J91146m0460j26583J16174J94089J12803J28084
$$ 2297314 2068754 2127152 2249684 2440830 2400370 2273787 2389961 2584050 2696853 2824937
5080B824937j28753J7183K32995K70083Q5585m29576N81383J87497J45877L19579
$$ 2824937 2696184 2713367 2946362 3216445 3302030 2872454 3453837 3641334 3787211 4106790
5070D106790J68526k11983j79407M6958J6676M26068K53306R6819L20755R8441
$$ 4106790 4275316 4063333 3883926 3930884 3947560 4373628 4626934 4723753 5044508 5142949
5060E142949L9459K79698O6810K13834R2133Q1702K27117J76689K35955L65354
$$ 5142949 5182408 5462106 5528916 5742750 5834883 5916585 6143702 6320391 6556346 6921700
5050F921700L28178N4020J74466N79335K55025P43534l4677L07058M41449M49800
$$ 6921700 7249878 7303898 7478364 8057699 8312724 9056258 9021581 9328639 9770088 10219888
5040A0219888M34111P20653O62915M81250N19126N11006M59690Q31574O61274
$$ 10219888 10653999 11374652 12037567 12518817 13037943 13548949 14008639 14840213 15501487
5031A5501487N39288M99155Q29014M64681N14978N03966J1226M04913J01177K71559
$$ 15501487 16040775 16539930 17368944 17833625 18348603 18852569 18863795 19268708 19369885 19641444
5021A9641444O28473L82056L70487Q59466R43316O92907Q26942N97061N71625
$$ 19641444 20269917 20651973 21022460 21881926 22825242 23518149 24345091 24942152 25513777
5012B5513777M72048J45642K39556n06351m71600q15270p13533p12150l85571
$$ 25513777 25985825 26131467 26371023 25864672 25393072 24577802 23864269 23152119 22766548
5003B2766548l13897J08714n74135J1253J5321Q2106K87301j58390j16605j59956
$$ 22766548 22452651 22561365 21987230 21998483 22013804 22095910 22383211 22224821 22108216 21948260
4993B1948260l12627q25098o59123m34637p78291n90680m63581m84531n56399
$$ 21948260 21635633 20810535 20151412 19716775 18938484 18347804 17884223 17399692 16843293
4984A6843293m77007m59458k33906m11374j43621p6841P6161L0598k41140r5146
$$ 16843293 16366286 15906828 15672922 15261548 15117927 15041086 15117247 15147845 14906705 14811559
4974A4811559R6134J98049l21679J5692K47700j3876J21097L4207j15149L71677
$$ 14811559 14907693 15105742 14784063 14799755 15047455 15033579 15154676 15188883 15073734 15445411
4964A5445411M34171N34237N54853M09712N79521M22199Q78469J155357Q31897
$$ 15445411 15879582 16413819 16968672 17378384 17957905 18380104 19258573 20413930 21245827
4955B1245827J226821R91925Q02784O90013J08775J90525l30049p2023j13562
$$ 21245827 22472648 23464573 24267357 24957370 25066145 25256670 24926621 24854598 24741036
4946B4741036L97939M46570L75524P18371M51834R69007J354719J446212J440200
$$ 24741036 25138975 25585545 25961069 26679440 27131274 28100281 29455000 30901212 32341412
4937C2341412J343522J517729J392500Q00202m59747j229097j080427j449677
$$ 32341412 33684934 35202663 36595163 37395365 36935618 35706521 34626094 33176417
4929C3176417j222584r03907n07902l10068J50117l6201l5308j9126q3719j2225
$$ 33176417 31953833 31049926 30542024 30231956 30382073 30345872 30310564 30291438 30207719 30195494
4919C0195494K29280l5092k7407R9570m48913r73248j774401j657078j174328
$$ 30195494 30424774 30389682 30362275 30461845 30012932 29039684 27265283 25608205 24433877
4910B4433877j369479j293194j057075n93734m01355o20386n26913p75260o36845
$$ 24433877 23064398 21771204 20714129 20120395 19719040 19098654 18571741 17796481 17159636
4901A7159636n91753m14549m17648o24647m44185p81172l41688o38903p01142
$$ 17159636 16567883 16153334 15735686 15111039 14666854 13885682 13543994 12905091 12203949
4892A2203949m48944m50541o93595o9319k91104k41208l35077q9708j90791l65444
$$ 12203949 11755005 11304464 10610869 10541550 10250446 10009238 9674161 9584453 9393662 9028218
4882I028218l48884j66233j399j17780j74649l30081J15434M5380O4901q8879
$$ 9028218 8679334 8513101 8511702 8393922 8219273 7889192 8004626 8050006 8114907 8026028
4872H026028j37584N5196k58165J20911N83857R0160J60989P9380j6818N13183
$$ 8026028 7888444 7943640 7685475 7806386 8390243 8480403 8641392 8720772 8703954 9217137
4862I217137K77673j91928J2962k30982j94459k78176k6320M26007J80884n5560
$$ 9217137 9494810 9302882 9315844 9084862 8890403 8612227 8585907 9011914 9192798 9137238
4852I137238P9230L64404K46746J68919L02484N991L20328J36103L66268N23610
$$ 9137238 9216468 9580872 9827618 9996537 10299021 10305012 10625340 10761443 11127711 11651321
4842A1651321M52359J69751m17139m89029o79185l58159n29543j6063k57625J42354
$$ 11651321 12103680 12273431 11856292 11367263 10688078 10329919 9800376 9784313 9526688 9669042
4832I669042j22848J20885l2856R9676j34048k41333l63313L10486N51830L63688
$$ 9669042 9546194 9667079 9634223 9733899 9599851 9358518 8995205 9305691 9857521 10221209
4822A0221209P71131L80362J18303r20554q20988p56257l41104l04954k74992
$$ 10221209 10992340 11372702 11491005 10570451 9749463 8993206 8652102 8347148 8072156
4813H072156m80674M366K6691J82464o14602j26965j84784o2106j62970J56421
$$ 8072156 7591482 7595848 7622539 7805003 7190401 7063436 6878652 6816546 6653576 6809997
4803F809997O8284L11014O81539L42254k87520l86432p77554p73602k12750k84149
$$ 6809997 6878281 7189295 7870834 8213088 7925568 7539136 6761582 5987980 5775230 5491081
4793E491081J63216q1637K20052J36998r6157j90734m9679k94536k18194l84938
$$ 5491081 5654297 5572660 5792712 5929710 5833553 5642819 5593140 5298604 5080410 4695472
4783D695472P0390J21732L03288J92426j31349n3888k78326p2983o5352J01553
$$ 4695472 4765862 4887594 5190882 5383308 5251959 5198071 4919745 4846762 4781410 4882963
4773D882963P4381J3320m57062J0185K31613M3272L5813j71852m7291J19087J04750
$$ 4882963 4957344 4970664 4513602 4523787 4755400 4798672 4834485 4662633 4615342 4734429 4839179
4762D839179k17559m2375J32563Q5358m09044p8246J27469j1358j30103j58216
$$ 4839179 4621620 4579245 4711808 4797166 4388122 4309876 4437345 4425987 4295884 4137668
4752D137668J12632k8376k59585m08031K79392L24545m93878j57953J75399J05601
$$ 4137668 4250300 4221924 3962339 3554308 3833700 4158245 3664367 3506414 3681813 3787414
4742C787414L78326k03520p9780j06689P7832j67832p218j21616r9236J17940
$$ 3787414 4165740 3962220 3882440 3775751 3853583 3685751 3678533 3556917 3457681 3575621
4732C575621n6683K14847K97602j24826J82098L05678J41985J95936k47005r5512
$$ 3575621 3518938 3733785 4031387 3906561 4088659 4394337 4536322 4732258 4485253 4389741
4722D389741M8203L58204J05430m34222J82667L26271l91125m17195j50563K08402
$$ 4389741 4437944 4796148 4901578 4467356 4650023 4976294 4585169 4167974 4017411 4225813
4712D225813K2559r5693Q7364J24041k18255K62727J02680K4039k50049j30566
$$ 4225813 4248372 4152679 4240043 4364084 4145829 4408556 4511236 4535275 4285226 4154660
4702D154660K58984J93605K02709K95863j57961q3803J40996K28536J63235o404
$$ 4154660 4413644 4607249 4809958 5105821 4947860 4864057 5005053 5233589 5396824 5390420
4692E390420J28118N2312j46566L84007l18822N6962L38010k74306K16192M2756
$$ 5390420 5518538 5570850 5424284 5808291 5489469 5546431 5884441 5610135 5826327 5869083
4682E869083r885L91570M85757n8650k88089l1749N67853K15058M04202J18627
$$ 5869083 5859198 6250768 6736525 6677875 6389786 6358037 6925890 7140948 7545150 7663777
4672G663777q7925R9947j37120L18691K88547K56237N45019j33471J87074J01462
$$ 7663777 7575852 7675799 7538679 7857370 8145917 8402154 8947173 8813702 9000776 9102238
4662I102238K57544N92693N17086J49613J09355L75075M13017P09145K91875L34781
$$ 9102238 9359782 9952475 10469561 10619174 10728529 11103604 11516621 12225766 12517641 12852422
4652A2852422L69656K88040J09545R89653R99825N98512M33383O29806J061996
$$ 12852422 13222078 13510118 13619663 14609316 15609141 16207653 16641036 17270842 18332838
4643A8332838J318114N30539N64448M21460K12553N01062M38567K81221Q23636
$$ 18332838 19650952 20181491 20745939 21167399 21379952 21881014 22319581 22600802 23424438
4634B3424438P48522R48817M82963J111691J305827J152221Q75047M88992R55699
$$ 23424438 24172960 25121777 25604740 26716431 28022258 29174479 30049526 30538518 31494217
4625C1494217M13579k52312j02757m00293l64761l00056j82157K61431L44662
$$ 31494217 31907796 31655484 31552727 31152434 30787673 30487617 30305460 30566891 30911553
4616C0911553N75560O53564J354107J129970J877435J152941R96512K47554K98565
$$ 30911553 31487113 32140677 33494784 34624754 36502189 37655130 38651642 38899196 39197761
4607C9197761n65306m57072n42564k26952k75127o6969L38773Q95174N30622N60160
$$ 39197761 38632455 38175383 37632819 37405867 37130740 37063771 37402544 38297718 38828340 39388500
4597C9388500M0862k48287k7430l30643O8985L87827P32398L38380L00797P66399
$$ 39388500 39429362 39181075 39153645 38823002 38891987 39279814 40012212 40350592 40651389 41417788
4587D1417788Q23029N13093L81167J72786P28914J105835J783259R89410M77229
$$ 41417788 42240817 42753910 43135077 43307863 44036777 45142612 46925871 47915281 48392510
4578D8392510m23385j188873j538454j506368j154100q95390p67213l78442L10013
$$ 48392510 47969125 46780252 45241798 43735430 42581330 41685940 40918727 40540285 40850298
4569D0850298N36241O05354P88899R86173Q82378Q05839J049444J153376N30475
$$ 40850298 41386539 41991893 42780792 43766965 44649343 45455182 46504626 47658002 48188477
4560D8188477P06333L99009R2683k11823N8893Q50951J071546J095266J475989
$$ 48188477 48894810 49293819 49386502 49174679 49233572 50084523 51156069 52251335 53727324
4551E3727324J752713J949532K306376J666542J615053J230623M65509m30866
$$ 53727324 55480037 57429569 59735945 61402487 63017540 64248163 64713672 64282806
4543F4282806j090272j526797j237418j624697j425719j352496j314555j272069
$$ 64282806 63192534 61665737 60428319 58803622 57377903 56025407 54710852 53438783
4535E3438783n32450o27340o82265m98840k78263q18339n49146j20247j75900
$$ 53438783 52906333 52278993 51596728 51097888 50819625 50001286 49452140 49331893 49155993
4526D9155993l24594K52482L23183O08588Q94323Q99102J292670J222985J081407
$$ 49155993 48831399 49083881 49407064 50015652 50909975 51809077 53101747 54324732 55406139
4517E5406139J092741J565003J502486J148214J523183P37560N41063k29031j154232
$$ 55406139 56498880 58063883 59566369 60714583 62237766 62975326 63516389 63287358 62133126
4508F2133126j452897j698582j205392j399649r74956q79512r36045j051050j65072
$$ 62133126 60680229 58981647 57776255 56376606 55401650 54522138 53586093 52535043 52369971
4499E2369971l37918p6051l38963l28261p729L26227K28025J01805M62179M46689
$$ 52369971 52032053 51956002 51617039 51288778 51281049 51607276 51835301 51937106 52399285 52845974
4489E2845974O80751J89088J58829N49833j37995k98504o31968q90862m91336
$$ 52845974 53526725 53715813 53874642 54424475 54286480 53987976 53356008 52465146 51973810
4480E1973810p54409o88800k95520q34323n05941o0706l19759L55875J013731
$$ 51973810 51219401 50530601 50235081 49400758 48894817 48834111 48514352 48870227 49883958
4471D9883958Q05129R73743J070418J447075Q36913K02567n19063j080827q68747
$$ 49883958 50689087 51662830 52733248 54180323 55017236 55219803 54700740 53619913 52751166
4462E2751166r75308q78242k59635J82088L38742L84240Q09220M64132Q16069
$$ 52751166 51775858 50897616 50637981 50820069 51158811 51543051 52352271 52816403 53632472
4453E3632472J59450J80952M51166K34289k93297o07879j500311j686531j606848
$$ 53632472 53791922 53972874 54424040 54658329 54365032 53757153 52256842 50570311 48963463
4444D8963463j905327j705689j153261q37375p68005n63224o37629m64183j55814
$$ 48963463 47058136 45352447 44199186 43361811 42593806 42030582 41392953 40928770 40772956
4435D0772956P5545p8441j08691j50034m41037o29972r22246q30403K02284R41972
$$ 40772956 40848501 40770060 40661369 40511335 40070298 39440326 38518080 37687677 37889961 38831933
4425C8831933J117065p64544l190148l804580k618768k168571j719712j966559
$$ 38831933 39948998 39184454 35994306 32189726 29570958 27402387 25682675 23716116
4417B3716116r41355j093276j014976q80666r29058o14199o70839l47498o17498
$$ 23716116 22774761 21681485 20666509 19785843 18856785 18242586 17571747 17224249 16606751
4408A6606751o12421l97094l93378l96580n33255k71546K05084m6524m95086m95230
$$ 16606751 15994330 15597236 15203858 14807278 14274023 14002477 14207561 14161037 13665951 13170721
4398A3170721j81223J14632l07212m77814M3046j08441j52622O4750l08384j05536
$$ 13170721 12989498 13104130 12796918 12319104 12362150 12253709 12101087 12165837 11857453 11751917
4388A1751917q3110n00358k27207K90453k411l53927l47933q4905j66450l0006
$$ 11751917 11668807 11168449 10941242 11231695 11229284 10875357 10527424 10442519 10276069 10246063
4378A0246063J76147j87155n64966k41246M9319J11987m01950Q3993k2138j5248
$$ 10246063 10422210 10235055 9670089 9428843 9478162 9590149 9188199 9272192 9250054 9234806
4368I234806J2481k89409n7709Q844J05663p9358l94882o83829K32302l58015
$$ 9234806 9247287 8957878 8900169 8909013 9014676 8935318 8540436 7856607 8088909 7730894
4358G730894j61784k05336k31636j57280Q2314k96002k14378r1557k42340k76489
$$ 7730894 7569110 7363774 7132138 6974858 7057172 6761170 6546792 6455235 6212895 5936406
4348E936406j81728M494J02786k26426l3289J66386m21764Q433k15459j6428Q5647
$$ 5936406 5754678 5759172 5861958 5635532 5602243 5768629 5346865 5355298 5139839 5123411 5209058
4337E209058J2357k41321j91203J32804j71951m14053J43750R8035j15529L8251
$$ 5209058 5221415 4980094 4788891 4921695 4749744 4335691 4479441 4577476 4461947 4500198
4327D500198K10499l81869k2701J02122j93744k15126J2984L340n5518O530J13001
$$ 4500198 4710697 4328828 4306127 4408249 4214505 3999379 4012363 4015703 3960185 3966715 4079716
4316D079716Q578O2922l613j55024j1679j90400J05591J78639l04404k1888K7399
$$ 4079716 4088294 4151216 4147603 3992579 3980900 3790500 3896091 4074730 3770326 3748438 3775837
4305C775837o2399M1984q8314l69282L4100J78019j59077K04797k592K04880k11865
$$ 3775837 3713438 3755422 3667108 3297826 3331926 3509945 3350868 3555665 3553073 3757953 3546088
4294C546088k31422j71549J76079J04836L7379j03179q5400j04873J71438j05509
$$ 3546088 3314666 3143117 3319196 3424032 3461411 3358232 3272832 3167959 3339397 3233888
4284C233888l01918J00116K95006j21194j98149J05550p4088k4313j37627j75308
$$ 3233888 2931970 3032086 3327092 3205898 3007749 3113299 3039211 3014898 2877271 2701963
4274B701963J6661M3285J98630J2871m31984K96354r6899J12072j85438M3820
$$ 2701963 2718624 2761909 2960539 2973410 2541426 2837780 2740881 2852953 2667515 2711335
4264B711335K1107O2252L49341K6471o774m2915k14107P9699l19253j55544K00038
$$ 2711335 2732442 2794694 3144035 3170506 3163732 3120817 2906710 2986409 2667156 2511612 2711650
4253B711650j35962k071J08515K66796j92066n8574J91689j51452M7820Q362k36777
$$ 2711650 2575688 2573617 2682132 2948928 2756862 2698288 2889977 2738525 2786345 2794707 2557930
4242B557930J29406K33186j84074K6313o7468J06775O6682n7294j1745l123o2406
$$ 2557930 2687336 2920522 2736448 2762761 2695293 2802068 2868750 2811456 2799711 2796588 2734182
4231B734182k21962K83713J65338l8720j87057N2326L08791n1610j17214L122
$$ 2734182 2512220 2795933 2961271 2922551 2735494 2787820 3096611 3045001 2927787 2930909
4221B930909l234J86123m627J08733j68967K02391J80133l8231J00856K63234
$$ 2930909 2927675 3113798 3109171 3217904 3048937 3251328 3431461 3393230 3494086 3757320
4211C757320k80183M9349m6665J88369k75889J13916M05931k62350J39180r1405
$$ 3757320 3477137 3526486 3479821 3668190 3392301 3506217 3912148 3649798 3788978 3697573
4201C697573m5150m5843j03380J44925J22981J3496j29384K39391J68457j24304
$$ 3697573 3652423 3606580 3503200 3648125 3771106 3784602 3655218 3894609 4063066 3938762
4191C938762L21899k8370L4564l8029q7214K98472J2558j5386j66237m3937J3014
$$ 3938762 4260661 4232291 4266855 4228826 4141612 4440084 4452642 4437256 4271019 4227082 4240096
4180D240096R9191M3359k19753k07439L52546k13131R4396j24221M7698j98817
$$ 4240096 4339287 4382646 4162893 3955454 4308000 4094869 4189265 4065044 4112742 3913925
4170C913925K58252L76842j83562K86226k11081l12526J33949K26155j52430L14150
$$ 3913925 4172177 4549019 4365457 4651683 4440602 4128076 4262025 4488180 4335750 4649900
4160D649900K43724P8825l52090J22360j10040l11265M89969R6272J88395o4546
$$ 4649900 4893624 4972449 4620359 4742719 4632679 4321414 4811383 4907655 5096050 5031504
4150E031504L28530k38966l69141M3068J36211M25144k60031K199K65209m8233
$$ 5031504 5360034 5121068 4751927 4794995 4931206 5356350 5096319 5098518 5363727 5315494
4140E315494Q2621J32047J11382K82556K98777J65223K76056L34135J87986j2170
$$ 5315494 5398115 5530162 5641544 5924100 6222877 6388100 6664156 6998291 7186277 7174107
4130G174107O894O19137p9097L33702L9355L76230M68182L13003K03155P68180
$$ 7174107 7181001 7800138 7721041 8054743 8094098 8470328 8938510 9251513 9454668 10222848
4120A0222848N71424O67630J021788R07107P68795J461936J555075J770175J977537
$$ 10222848 10794272 11461902 12483690 13390797 14159592 15621528 17176603 18946778 20924315
4111B0924315J710472P02963l80031j324408j222608j397987j280606j221216
$$ 20924315 22634787 23337750 22957719 21633311 20410703 19012716 17732110 16510894
4103A6510894p66858n96880q08285m86487p16012j83438K0278n43599l39538l27707
$$ 16510894 15744036 15147156 14338871 13852384 13136372 12952934 12973212 12429613 12090075 11762368
4093A1762368j36874k32288l51300O9097K49143K02697J18262K07047j5135J2142
$$ 11762368 11625494 11393206 11041906 11111003 11360146 11562843 11681105 11888152 11873017 11885159
4083A1885159K05824L44620L40118M86169L45368L64485r2157N88873K68735K22657
$$ 11885159 12090983 12435603 12775721 13261890 13607258 13971743 13879586 14468459 14737194 14959851
4073A4959851M52666Q36888L22106M43740N60492O88611K14090P77760O63293
$$ 14959851 15412517 16249405 16571511 17015251 17575743 18264354 18478444 19256204 19919497
4064A9919497P19794Q64896K68378Q07740J000305J400934J096877J240800Q06493
$$ 19919497 20639291 21504187 21772565 22580305 23580610 24981544 26078421 27319221 28125714
4055B8125714J054007J194321R59875J226983J009750O88870P56423J063404P31569
$$ 28125714 29179721 30374042 31333917 32560900 33570650 34259520 35015943 36079347 36810916
4046C6810916J086411J527608J169411J100606J459332Q34165J075764J335790
$$ 36810916 37897327 39424935 40594346 41694952 43154284 43988449 45064213 46400003
4038D6400003N72086O59658N50568M58905M81344P24683Q88838N56416k69729
$$ 46400003 46972089 47631747 48182315 48641220 49122564 49847247 50736085 51292501 51022772
4029E1022772p30316j310347r07598j353071j584904j323277k20437n01640k80324
$$ 51022772 50292456 48982109 48074511 46721440 45136536 43813259 43592822 43091182 42810858
4020D2810858k65255j1099o1183n44723j436446j980137j902948j896831j473863
$$ 42810858 42545603 42534504 42473321 41928598 40492152 38512015 36609067 34712236 33238373
4011C3238373j203339q80100q28810m62150m81588K47609j06450O4941j57081
$$ 33238373 32035034 31154934 30326124 29863974 29382386 29629995 29523545 29588486 29431405
4002B9431405J20539l46813J11086l14404o51138l43997n40322l74680o78382
$$ 29431405 29551944 29205131 29316217 29001813 28350675 28006678 27466356 27091676 26413294
3993B6413294j34760j50164j04215J7933n9321k01529k77051m56403J5961j14404
$$ 26413294 26278534 26128370 26024155 26042088 25982767 25781238 25504187 25047784 25063745 24949341
3983B4949341l73880p0420o6422L2589l83974J90764O7263L50187M58180Q55355
$$ 24949341 24575461 24505041 24438619 24471208 24087234 24277998 24345261 24695448 25153628 26008983
3973B6008983J091660L40396L86720L93737J1496k1972m32988k54777p32704j153294
$$ 26008983 27100643 27441039 27827759 28221496 28232992 28211020 27778032 27523255 26790551 25637257
3963B5637257j221097o63760r06301n69514q58007q84305o03148r25275p51961
$$ 25637257 24416160 23752400 22846099 22276585 21418578 20534273 19931125 19005850 18253889
3954A8253889o07270l11293n91035n60490m27564l79744k27093k49385p4020m50562
$$ 18253889 17646619 17335326 16744291 16183801 15756237 15376493 15149400 14900015 14825995 14375433
3944A4375433l99252k02302l69907j65211J40805l83793l43437Q1297k47589q8831
$$ 14375433 13976181 13773879 13403972 13238761 13379566 12995773 12652336 12733633 12486044 12397213
3934A2397213m15660m487k53525l38832k88320l01047P0718l04345k86385K71412
$$ 12397213 11981553 11977066 11723541 11384709 11096389 10795342 10866060 10561715 10275330 10546742
3924A0546742k22355j47982k5147j41487J69440j67215j10065J66193L39509k67080
$$ 10546742 10324387 10176405 10151258 10009771 10179211 10011996 9901931 10068124 10407633 10140553
3914A0140553j04969K50440J761L68344K72755J26267J84598K90248K41051K94722
$$ 10140553 10035584 10286024 10287785 10656129 10928884 11055151 11239749 11529997 11771048 12065770
3904A2065770J17693K88998P37820N02008J86046M81965N98986R36557N89139
$$ 12065770 12183463 12472461 13210281 13712289 13898335 14380300 14979286 15915843 16504982
3895A6504982N04780M37287R01985M05648N45473R63303N52734J086519J269892
$$ 16504982 17009762 17447049 18349034 18754682 19300155 20263458 20816192 21902711 23172603
3886B3172603J500095J284277P40056R55528L3959r3515J64731K17354K01570
$$ 23172603 24672698 25956975 26697031 27652559 27686518 27593003 27757734 27975088 28176658
3877B8176658L08173L72344K52403N91609L48631O91031J040241J225518J383010
$$ 28176658 28484831 28857175 29109578 29701187 30049818 30740849 31781090 33006608 34389618
3868C4389618R63195J033349J111060L72307l64007m00874p72353n54197l14533
$$ 34389618 35352813 36386162 37497222 37869529 37505522 37104648 36332295 35778098 35463565
3859C5463565l34409m4388j86377K41637q568M08400O10850Q83565J118737J086485
$$ 35463565 35129156 35084768 34898391 35140028 35131460 35539860 36150710 37034275 38153012 39239497
3849C9239497J098510J21501K84411M2760K51741L43725L06413O91438M17416
$$ 39239497 40338007 40459508 40743919 40786679 41038420 41382145 41688558 42379996 42797412
3840D2797412N40014P63538Q56786J083835J901451K182148K281183L016858L589641
$$ 42797412 43337426 44100964 44957750 46041585 47943036 50125184 52406367 55423225 59012866
3831E9012866M352248N195432N751282O965056P250133O327635L593773j784225
$$ 59012866 63365114 68560546 74311828 81276884 88527017 94854652 98448425 96664200
3823I6664200n209343n722902m504080l785779l241181k960481k540735k315460
$$ 96664200 91454857 85731955 81227875 77442096 74200915 71240434 68699699 66384239
3815F6384239j768845j395206q36076l26204N6865m29656j225280j407848j349598
$$ 66384239 64615394 63220188 62384112 62057908 62114773 61685117 60459837 59051989 57702391
3806E7702391j637167j988838k133280k957561l205384k967630k561037k687124
$$ 57702391 56065224 54076386 51943106 48985545 45780161 42812531 40251494 37564370
3798C7564370k455609k322801j838969j714303j505539j227077j397972j261462
$$ 37564370 35108761 32785960 30946991 29232688 27727149 26500072 25102100 23840638
3790B3840638j312285r29218o94218j130312l20549p22786n92080l22187n75618
$$ 23840638 22528353 21599135 20904917 19774605 19454056 18731270 18139190 17817003 17241385
3781A7241385n66314k78520j58805m34648q15j46594o2612m57636M4308J04041
$$ 17241385 16675071 16396551 16237746 15803098 15802283 15655689 15593077 15135441 15179749 15283790
3771A5283790n19350J01633K24256j97725J2639K56371L63858L82314K05230K14315
$$ 15283790 14764440 14866073 15090329 14892604 14905243 15161614 15525472 15907786 16113016 16327331
3761A6327331N03806l21045n04920p0482k18910k20897r1329J22135k01163M28751
$$ 16327331 16831137 16510092 16005172 15934690 15715780 15494883 15403554 15525689 15324526 15753277
3751A5753277L44292M08904K91322N86025J04792J27949o13286m04627m43599
$$ 15753277 16097569 16506473 16797795 17383820 17488612 17616561 17003275 16598648 16155049
3742A6155049p23263l27809m31815o49719j98661k71366m26788k74297J15472
$$ 16155049 15431786 15103977 14672162 14022443 13823782 13552416 13125628 12851331 12966803
3733A2966803L22345l07081N0705L6304k57626o54419m99208p10023n73246p27139
$$ 12966803 13289148 12982067 13032772 13069076 12811450 12157031 11657823 10947800 10374554 9647415
3723I647415l16709l06103l46610l05410l46745k99312k83868j47925j76978k3310
$$ 9647415 9330706 9024603 8677993 8372583 8025838 7726526 7442658 7294733 7117755 7094445
3713G094445q6266m04616J24815j41845k07284J29639J9070k00743l71837j16938
$$ 7094445 7008179 6603563 6728378 6586533 6379249 6508888 6527958 6327215 5955378 5838440
3703E838440J62463m0751q6902P963L16318l78350m43115K63556o9148j82551
$$ 5838440 6000903 5960152 5873250 5881213 6197531 5819181 5376066 5639622 5570474 5387923
3693E387923l5722J14374M577M1321j22556k50642m69020R9710L04186Q5452k03896
$$ 5387923 5352201 5466575 5471152 5512473 5389917 5139275 4670255 4769965 5074151 5159603 4955707
3682D955707J34736j97941j61900P6634J98124k67309P6017K50128k17900R6576
$$ 4955707 5090443 4892502 4730602 4807236 5005360 4738051 4814068 5064196 4846296 4942872
3672D942872o4360o0872J86396J81264k56136p1420J16801J70862K87995j86047
$$ 4942872 4878512 4817640 5004036 5185300 4929164 4857744 4974545 5145407 5433402 5247355
3662E247355j03397L5505R0442p5143k4381Q6194N1859l49579L54809K44701K89026
$$ 5247355 5143958 5179463 5269905 5194762 5170381 5256575 5308434 4958855 5313664 5558365 5847391
3651E847391J15747P0513n64638q4898K18219j21132L36302k36466Q6854m25340
$$ 5847391 5963138 6033651 5469013 5384115 5602334 5481202 5817504 5581038 5667892 5242552
3641E242552J36500l1329R0277q8665l78313M94892K69522J41059J68458r3290
$$ 5242552 5379052 5347723 5438000 5349335 4971022 5465914 5735436 5876495 6044953 5951663
3631E951663n9147J22685J14736J0949M6105j9000P6079r0905N2074J65867K21509
$$ 5951663 5892516 6015201 6129937 6140886 6186991 6167991 6244070 6153165 6205239 6371106 6592615
3620F592615r4515L74384j21552J47558j07038N0541K36551J47293K10194R1832
$$ 6592615 6498100 6872484 6750932 6898490 6791452 6841993 7078544 7225837 7436031 7527863
3610G527863K93255L22501M9573k72847L72399L12544R1569L41014K40635M68296
$$ 7527863 7821118 8143619 8193192 7920345 8292744 8605288 8696857 9037871 9278506 9746802
3600I746802K73510K33540q517P4772J86441O47184K59876K73534M24510Q2592
$$ 9746802 10020312 10253852 10245335 10320107 10506548 11153732 11413608 11687142 12111652 12194244
3590A2194244P46773J28775M52536L77915L46536M01717R38063Q46156m2421M70018
$$ 12194244 12941017 13069792 13522328 13900243 14246779 14648496 15586559 16432715 16390294 16860312
3580A6860312Q98287M14131O58001Q93203Q26387P68668P59405J372698Q11496
$$ 16860312 17758599 18172730 18830731 19723934 20550321 21318989 22078394 23451092 24262588
3571B4262588J433935J492755J474809J255616J403932K000293K047705K539005
$$ 24262588 25696523 27189278 28664087 29919703 31323635 33323928 35371633 37910638
3563C7910638K559276K454580J654414J147803O03093k20249l03019m64142l7785
$$ 37910638 40469914 42924494 44578908 45726711 46329804 46109555 45806536 45342394 45304609
3554D5304609K52789N00091N70763P17887N02294J006403M31393J72360J49824
$$ 45304609 45557398 46057489 46628252 47346139 47848433 48854836 49286229 49458589 49608413
3545D9608413J25457k39366p34625p62488r63818r82036p54133n05395p91082
$$ 49608413 49733870 49494504 48759879 47997391 47033573 46051537 45297404 44792009 44000927
3536D4000927n39551m16498k63430j90052j41196j25841K35703j179m0320N09868
$$ 44000927 43461376 43044878 42781448 42591396 42450200 42324359 42560062 42558883 42518563 43028431
3526D3028431M08371J67482N37683K50513R68521P08977N79513J202675N16683
$$ 43028431 43436802 43604284 44141967 44392480 45361001 46069978 46649491 47852166 48368849
3517D8368849O97718J240256J108644J620072J489598J578515J694026J578909
$$ 48368849 49066567 50306823 51415467 53035539 54525137 56103652 57797678 59376587
3509E9376587J480239J771643J713902J717652J600829K440716K230330K066359
$$ 59376587 60856826 62628469 64342371 66060023 67660852 70101568 72331898 74398257
3501G4398257K369116K387778K484557K694940K556847K108960K336341K519407
$$ 74398257 76767373 79155151 81639708 84334648 86891495 89000455 91336796 93856203
3493I3856203J922386K389944K153401K215518K124246J897523K251666J602262
$$ 93856203 95778589 98168533 100321934 102537452 104661698 106559221 108810887 110413149
3485A10413149J515727J502560J096096J505942J269251J601612J566437J651281
$$ 110413149 111928876 113431436 114527532 116033474 117302725 118904337 120470774 122122055
3477A22122055J881868J642115J059105R0577k14951q36663j598748k493696k048613
$$ 122122055 124003923 125646038 126705143 126795720 126580769 125744106 124145358 121651662 119603049
3468A19603049k238413k510188k659374k416001k813693k956844l744870l784287
$$ 119603049 117364636 114854448 112195074 109779073 106965380 104008536 100263666 96479379
3460I6479379l593419l506874m449674l588202l169347l357480k711559k997944
$$ 96479379 92885960 89379086 84929412 81341210 78171863 74814383 72102824 69104880
3452F9104880k782185k463278j944354j548673j660752r96671j019695n28654
$$ 69104880 66322695 63859417 61915063 60366390 58705638 57708967 56689272 56160618
3444E6160618k08539O17972J043078J020241J052982n64529k102482l923486m176184
$$ 56160618 55952079 56570051 57613129 58633370 59686352 59121823 57019341 53095855 48919671
3435D8919671l892323l157686l205902k536834j835022k046624j716775j113901
$$ 48919671 45027348 41869662 38663760 36126926 34291904 32245280 30528505 29414604
3427B9414604j267838r15562q80083o75422p07979j95098m53422m07952l55797
$$ 29414604 28146766 27231204 26351121 25675699 24967720 24772622 24319200 23911248 23555451
3418B3555451n6590l42658j37753k79996n07391m89654n33087n18023l69695j57759
$$ 23555451 23498861 23156203 23018450 22738454 22231063 21741409 21208322 20690299 20320604 20162845
3408B0162845l0628n93283k74039l70788o41186m93242n47987m14242q1525l39755
$$ 20162845 20132217 19538934 19264895 18894107 18252921 17759679 17211692 16797450 16715925 16376170
3398A6376170r28620j66868k01107j52740m76251j32374L544J33808l93972k19152
$$ 16376170 15447550 15280682 15079575 14926835 14450584 14318210 14321754 14455562 14061590 13842438
3388A3842438J04069l3486J04882k78382m87741M61529J30672n21096M2684p9640
$$ 13842438 13946507 13913021 14017903 13739521 13251780 13713309 13843981 13322885 13365569 13285929
3378A3285929l70160J22726k04029p9002j91977l35617J57994l01152P1858m04718
$$ 13285929 12915769 13038495 12834466 12755464 12563487 12227870 12385864 12084712 12156570 11751852
3368A1751852j40292J27607n65156Q8719K30208K4942r1067J89955j45599J54164
$$ 11751852 11611560 11739167 11174011 11262730 11492938 11517880 11426813 11616768 11471169 11625333
3358A1625333J36945J96265J37106M38460J13596K49275K49601K23889M17204
$$ 11625333 11762278 11958543 12095649 12534109 12647705 12896980 13146581 13370470 13787674
3349A3787674J93210J27003N64022J59581L58640O44043N28928L89664J80547
$$ 13787674 13980884 14107887 14671909 14831490 15190130 15834173 16363101 16752765 16933312
3340A6933312j10231j34499k1189m21435k07523p0021Q4607Q3078J43679L0040
$$ 16933312 16823081 16688582 16667393 16245958 16038435 15968414 16053021 16136099 16279778 16309818
3330A6309818k45937m26645m75899j45377o16337l48386j71246N8745j07866J0149
$$ 16309818 16063881 15637236 15161337 15015960 14399623 14051237 13879991 13938736 13830870 13841019
3320A3841019J83704J69880K20969K17770L28367J70373K48304L17918K01679
$$ 13841019 14024723 14194603 14415572 14633342 14961709 15132082 15380386 15698304 15899983
3311A5899983L69484N56200O37507N10493K61358N25041R2085O93878L64036L02350
$$ 15899983 16269467 16825667 17463174 17973667 18235025 18760066 18852151 19546029 19910065 20212415
3301B0212415M46845N29559M57953L25587O73777K73893N25315K88272q1773M67042
$$ 20212415 20659260 21188819 21646772 21972359 22646136 22920029 23445344 23733616 23651843 24118885
3291B4118885M25148M1221J03092N49580N40857L05458L33994K06770M62478J13267
$$ 24118885 24544033 24585254 24688346 25237926 25778783 26084241 26418235 26625005 27087483 27200750
3281B7200750K61728P36465M92740o3623J28687O87537N06277M82602N82136J071242
$$ 27200750 27462478 28198943 28691683 28628060 28756747 29444284 29950561 30433163 31015299 32086541
3271C2086541Q92120Q56721R85361J282085J127867J255653J268263J558737J415024
$$ 32086541 32978661 33835382 34820743 36102828 37230695 38486348 39754611 41313348 42728372
3262D2728372J476812K026684J824099K460034K073952K545912L110939K840428
$$ 42728372 44205184 46231868 48055967 50516001 52589953 55135865 58246804 61087232
3254F1087232L405503L177836L467083L297981L278470K976304K554625L029909
$$ 61087232 64492735 67670571 71137654 74435635 77714105 80690409 83245034 86274943
3246H6274943K795743K669383K611243K964455K629353K385650K263830J760733
$$ 86274943 89070686 91740069 94351312 97315767 99945120 102330770 104594600 106355333
3238A06355333J663166J316514J396486J053790O47181Q95874O94347L10569J02750
$$ 106355333 108018499 109335013 110731499 111785289 112432470 113328344 114022691 114333260 114436010
3229A14436010K93383M37735M97315P44708Q73495J046242K38650O91642L96037
$$ 114436010 114729393 115167128 115664443 116409151 117282646 118328888 118567538 119259180 119655217
3220A19655217L34891P24235J150467J556784J907815K510305L198117L500062
$$ 119655217 119990108 120714343 121864810 123421594 125329409 127839714 131037831 134537893
3212A34537893L501680L608958L538697L752702L821731M012976M879853N416683
$$ 134537893 138039573 141648531 145187228 148939930 152761661 156774637 161654490 167071173
3204A67071173O034807O190999O353344N622610N843497N597124M721601M591809
$$ 167071173 173105980 179296979 185650323 191272933 197116430 202713554 207435155 212026964
3196B12026964M731896M195846L377926L466411L116042K293308J755759J817834
$$ 212026964 216758860 220954706 224332632 227799043 230915085 233208393 234964152 236781986
3188B36781986J779194J098784Q40360M40294P34988Q65253N77525N78351Q75660
$$ 236781986 238561180 239659964 240500324 240940618 241675606 242540859 243118384 243696735 244572395
3179B44572395J366510K193929K714587L668049N004698O882379R629169J1564553
$$ 244572395 245938905 248132834 250847421 254515470 259520168 266402547 276031716 287596269
3171B87596269J2151045J1592019J0021600O764661K912412j653077m525795n422081
$$ 287596269 299747314 311339333 321360933 328125594 331038006 329384929 324859134 319437053
3163C19437053n354448m414837l571309l713537l853238n745871r303534j2810235
$$ 319437053 314082605 309667768 306096459 302382922 298529684 292783813 283480279 270670044
3155B70670044j5543532j7233201j7756935j6957386j5516969j3706457j1367102
$$ 270670044 255126512 237893311 220136376 203178990 187662021 173955564 162588462
3148A62588462r729639q238933p475155o060300n210409m643842l743360l268110
$$ 162588462 152858823 144619890 137144735 131084435 125874026 121230184 117486824 114218714
3140A14218714l470329k680464k387612k442180j968484j962107j968413j595929
$$ 114218714 110748385 108067921 105680309 103238129 101269645 99307538 97339125 95743196
3132I5743196j607064j037021j170357j073718j025831j028841j224365r86309
$$ 95743196 94136132 93099111 91928754 90855036 89829205 88800364 87575999 86589690
3124H6589690q95659j085448r42895j339121j101974q78244l67223o99125n55795
$$ 86589690 85694031 84608583 83665688 82326567 81224593 80346349 79979126 79280001 78724206
3115G8724206o06984o12713m78098m90512j04900j34545k31223j27215J5591l31740
$$ 78724206 78117222 77504509 77026411 76535899 76430999 76296454 76065231 75938016 75953607 75621867
3105G5621867J14942M40504O17559R70248R48100R80030J691100J900158K042620
$$ 75621867 75736809 76177313 76794872 77765120 78713220 79693250 81384350 83284508 85327128
3096H5327128K380873K051364K194567K463668J940442K001804K112299K601022
$$ 85327128 87708001 89759365 91953932 94417600 96358042 98359846 100472145 103073167
3088A03073167L148128L405035L584376L339868L324856K707375J412935n8308
$$ 103073167 106221295 109626330 113210706 116550574 119875430 122582805 123995740 123937432
3080A23937432j103384j702622k311459k689034k273901j833880k503337k080373
$$ 123937432 122834048 121131426 118819967 116130933 113857032 112023152 109519815 107439442
3072A07439442k768425l812002m096609m770086n410901n462351n677247m867896
$$ 107439442 104671017 100859015 96762406 91992320 86581419 81119068 75441821 70573925
3064G0573925m272792l817107l569788l201442k963089k308461k017123k038554
$$ 70573925 66301133 62484026 58914238 55712796 52749707 50441246 48424123 46385569
3056D6385569j668407j557990j614284j677851j442623j502257p83794j132920
$$ 46385569 44717162 43159172 41544888 39867037 38424414 36922157 36138363 35005443
3048C5005443q68999j064456p27544p14387j113645q19870o00962m10752p06991
$$ 35005443 34136444 33071988 32344444 31630057 30516412 29696542 29095580 28684828 27977837
3039B7977837o40287n15270o63950j84938n88217l68752n15132m58035k55781
$$ 27977837 27337550 26822280 26158330 25973392 25385175 25016423 24501291 24043256 23787475
3030B3787475k23269o12810l84371k57508n01939k00860k30690l13386k54043
$$ 23787475 23564206 22951396 22567025 22309517 21807578 21606718 21376028 21062642 20808599
3021B0808599m16204j87429m01943l42202k52507J7238j67144m81657k31848j72154
$$ 20808599 20392395 20204966 19803023 19460821 19208314 19225552 19058408 18576751 18344903 18172749
3011A8172749j01992n5945j83464J89486k78806o9145J33470r4345k68471j54482
$$ 18172749 18070757 18014812 17831348 18020834 17742028 17672883 17806353 17712008 17443537 17289055
3001A7289055K85192P3371q744K63767J48249J74542L47176O39787K80015Q75580
$$ 17289055 17574247 17647618 17638874 17902641 18050890 18225432 18572608 19212395 19492410 20367990
2991B0367990R96814J265459J543374J136466J52026q89267n85783o12533o54712
$$ 20367990 21364804 22630263 24173637 25310103 25462129 24572862 23987079 23374546 22719834
2982B2719834o93006m26738n94466l29382J49862M4203l34580J07525K62718J42068
$$ 22719834 22026828 21600090 21005624 20676242 20826104 20870307 20535727 20643252 20905970 21048038
2972B1048038N15441M66309J217671J209913J405009J286562O02628J27282p56844
$$ 21048038 21563479 22029788 23247459 24457372 25862381 27148943 27751571 27878853 27122009
2963B7122009m67770q97870k40444j59308k87967K1162J88498J74122M83711M62907
$$ 27122009 26654239 25756369 25515925 25356617 25068650 25089812 25278310 25452432 25936143 26399050
2953B6399050O69470J060089J153166R77442J379173J297741J454875J252320
$$ 26399050 27068520 28128609 29281775 30259217 31638390 32936131 34391006 35643326
2945C5643326P8128j23986m56937q77858r09159r02721p93839q50471j68181k05569
$$ 35643326 35721454 35597468 35140531 34262673 33353514 32450793 31656954 30806483 30638302 30432733
2935C0432733k66277j90900L072M82462M97691R46342J046443J165835J638840
$$ 30432733 30166456 29975556 29978628 30461090 30958781 31905123 32951566 34117401 35756241
2926C5756241J924972J909803K425110K391598K780535K810061L982195N864181
$$ 35756241 37681213 39591016 42016126 44407724 47188259 49998320 53980515 59844696
2918E9844696Q193189J0615946N452508j672807n575103p241609p363533p263596
$$ 59844696 68037885 78653831 84106339 82433532 76858429 69616820 62253287 54989691
2910E4989691n307503l418189k484953j958570r84180l40163j01324M43030R30284
$$ 54989691 49682188 46263999 43779046 41820476 40836296 40496133 40394809 40837839 41768123
2901D1768123K033654K973486M266222O018738Q129798Q704532L021623l209066
$$ 41768123 43801777 46775263 51041485 57060223 65190021 73894553 76916176 73707110
2893G3707110o046790p019397p483086p382214n717203m290056l482004k665900
$$ 73707110 67660320 60640923 53157837 45775623 40058420 35768364 32286360 29620460
2885B9620460k154452k067356j604981j393899j314738j113279n57217p09684
$$ 29620460 27466008 25398652 23793671 22399772 21085034 19971755 19414538 18704854
2877A8704854n02188q62199n26745j63669k51715l25374l90533n79444n12286
$$ 18704854 18202666 17340467 16813722 16650053 16398338 16072964 15682431 15102987 14590701
2868A4590701o75540n81724m82659n98933l11089l41090l93941k19275j40622
$$ 14590701 13915161 13333437 12850778 12251845 11940756 11599666 11205725 10986450 10845828
2859A0845828k35345j06116m06393L0344k24626J94504K23085q5699K3647l02840
$$ 10845828 10610483 10504367 10097974 10128318 9903692 10098196 10321281 10235582 10259229 9956389
2849I956389m25495o66321l11345j32442k93069r5694m56231l69868J1929j32119
$$ 9956389 9530894 8864573 8553228 8420786 8127717 8032023 7575792 7205924 7217853 7085734
2839G085734k32501k90447j11432K48862k94874k68831L1898k71845k1928n2169
$$ 7085734 6853233 6562786 6451354 6700216 6405342 6136511 6168409 5896564 5874636 5822467
2829E822467k82462p9709n47136L44978j37592k41510M40588j81150j00846M305
$$ 5822467 5540005 5460296 4913160 5258138 5120546 4879036 5319624 5138474 5037628 5041933
2819E041933J08511j34039n4508j44747j77159k84926k4622j71668k50932K08542
$$ 5041933 5150444 5016405 4961897 4817150 4639991 4355065 4330443 4158775 3907843 4116385
2809D116385J33609k8786k32375o2025J64691k24451R971l13210L0593L11649
$$ 4116385 4249994 4221208 3988833 3926808 4091499 3867048 3877019 3563809 3594402 3906051
2799C906051j56628J8244j57224l17253J40077k74078j07160J90264J23951k0793
$$ 3906051 3749423 3767667 3610443 3293190 3433267 3159189 3052029 3242293 3366244 3345451
2789C345451j94459j47584m68605J57574P2976j4028J52541L2879l9473l67391
$$ 3345451 3150992 3003408 2534803 2692377 2765353 2751325 2903866 2936745 2897272 2529881
2779B529881P5830J41200k95910K65128o7494o8305J70467q6531k7853Q4419n0357
$$ 2529881 2605711 2746911 2451001 2716129 2648635 2580330 2750797 2664266 2636413 2720832 2670475
2768B670475j40910j10856p5615q7131j7883J94693P606r6319M7583L575K06729
$$ 2670475 2529565 2418709 2343094 2255963 2238080 2432773 2440379 2344060 2391643 2395218 2601947
2757B601947l78625M02418r403j64301K14082J07672j29031l70496k5914k26981
$$ 2601947 2223322 2625740 2616337 2452036 2666118 2773790 2644759 2274263 2248349 2021368
2747B021368M14118j59630k05618j8489P7194L69210j32310R7537J41249J08298
$$ 2021368 2435486 2275856 2070238 2051749 2128943 2498153 2365843 2463380 2604629 2712927
2737B712927k34694j12586K29352L1199r5309m1182L1920k69073L36006j11556
$$ 2712927 2478233 2365647 2594999 2626198 2530889 2489707 2521627 2252554 2588560 2477004
2727B477004m32637j57003M8110M16179N15989N855r2589j05992K29458L24594
$$ 2477004 2044367 1887364 1935474 2351653 2867642 2873497 2780908 2674916 2904374 3228968
2717C228968o009l17151N2300k40459K08280Q2450k7724j566p9193K89137L14300
$$ 3228968 3222959 2905808 2958108 2717649 2925929 3008379 2980655 2979089 2899896 3189033 3503333
2706C503333k4331j3551j21323k16599L11341J89993J51511K37682m6867j54534
$$ 3503333 3479002 3465451 3344128 3127529 3438870 3628863 3780374 4018056 3971189 3816655
2696C816655L74465j97127K62645Q0447p6903J10307r2692k86357m7919J55464
$$ 3816655 4191120 3993993 4256638 4337085 4260182 4370489 4277797 3991440 3943521 4098985
2686D098985j60120j06797K93683j72328k23049J6186J03468L92407k81580j48299
$$ 4098985 3938865 3832068 4125751 3953423 3730374 3746560 3850028 4242435 3960855 3812556
2676C812556J8295N7197K23979j27790k14858J1470L57925j77993l90873K68911
$$ 3812556 3830851 3888048 4112027 3984237 3769379 3780849 4138774 3960781 3569908 3838819
2666C838819Q204l33525k03245k1607M726k34445r7853j99757L78273P8937l19451
$$ 3838819 3847023 3513498 3310253 3288646 3293372 3058927 2961074 2761317 3139590 3218527 2899076
2655B899076R8145Q4860j27069M298q9710J41613k1961l34303m7865j33993J8691
$$ 2899076 2997221 3082081 2955012 2959310 2869600 3011213 2989252 2654949 2607084 2473091 2491782
2644B491782r4213K6123p0082l17847j5783m0663n8899k38045k34134L00156K82578
$$ 2491782 2397569 2423692 2353610 2035763 2019980 1979317 1920418 1682373 1448239 1748395 2030973
2633B030973j34580j89084k25376J29941J71103r7615j00290k28322J29633n7375
$$ 2030973 1896393 1707309 1481933 1611874 1782977 1685362 1585072 1356750 1486383 1429008
2623A429008O6385K0200O9755k13490j94376r1843J56342J11152k96276K04080
$$ 1429008 1495393 1515593 1585348 1371858 1177482 1085639 1241981 1353133 1056857 1260937
2613A260937r0931j08725l7331k37125k42044j7534M44592l9133M7397l62650
$$ 1260937 1170006 1061281 1023950 786825 544781 527247 971839 932706 980103 617453
2603F17453n2206M34915J938n5652P6892l45734j1274K92824j18811Q3293n3549
$$ 617453 565247 1000162 1002100 946448 1023340 677606 666332 959156 840345 923638 870089
2592H70089j09997j41354k9260L19496M1976r1508K37747k13758k55917j11142
$$ 870089 760092 618738 589478 908974 950950 859442 1097189 883431 627514 516372
2582E16372J86024J94892j46769m7737J84602j87939n5434J57089j80793n0656
$$ 516372 702396 897288 750519 702782 887384 699445 644011 801100 620307 569651
2572E69651K58238j20748K36649j39799r4226j65554K6515k43212J93748J79300
$$ 569651 827889 707141 943790 803991 709765 544211 570726 327514 521262 700562
2562G00562N7411l21791K07952K17930l60426j20893j7616M3593J6436r9806J12519
$$ 700562 757973 436182 644134 862064 501638 380745 363129 406722 423158 323352 435871
2551D35871R6004p5920P811r1064J81530r4725L5145n7O0595l930Q5558k95540
$$ 435871 531875 455955 463766 372702 554232 459507 494652 494595 555190 551260 636818 341278
2539C41278j27457k29933K56129J39277K85329r8276j31335N240R9421l82103
$$ 341278 213821 -16112 240017 379294 664623 566347 435012 440252 539673 157570
2529A57570K5623K0320J56474o117K55549j57022J3783J40332J92188k69459l01354
$$ 157570 183193 203513 359987 353870 609419 452397 466180 606512 798700 529241 227887
2518B27887K74395j68396J70799l09936J29082K67718J4387l74988k5213K43140
$$ 227887 502282 333886 504685 194749 323831 591549 605936 230948 205735 448875
2508D48875q1622K08272j48026k41770K74853j98818N4271k3837l8945J53620
$$ 448875 367253 575525 427499 185729 460582 261764 316035 292198 253253 406873
2498D06873j11326p6905J10800r1244J40112j37276k08613J78711J0168r0236
$$ 406873 295547 218642 329442 238198 378310 241034 32421 211132 221300 131064
2488A31064j52349L92304N8747j72101P3884q5243j34649K46825q0587m4592k82937
$$ 131064 -21285 371019 429766 257665 331549 246306 111657 358482 277895 233303 -49634
2477d9634J68138R5300m6025j06404j7836K83r1303Q8906L51323J02772m13251
$$ -49634 118504 213804 167779 61375 43539 43822 -47481 41425 392748 495520 82269
2466H2269J02191P0474k61050L10307K12103k96321J71785k81002J36642K26682
$$ 82269 184460 254934 -6116 304191 516294 219973 391758 110756 247398 474080
2456D74080K50910q5535k91105j68956J59706J24585j70603J15410j62541L0516
$$ 474080 724990 639455 348350 179394 339100 463685 293082 408492 245951 276467
2446B76467O0729k48748J278K92311j5281j92951M3504j85680K380J59848l776
$$ 276467 337196 88448 89726 382037 366756 173805 217309 31629 34009 193857 190081
2435A90081l1160L6127K72466j33699l40821K95380j20078k6036M1044K05554
$$ 190081 158921 195048 467514 333815 -7006 288374 168296 142260 183304 388858
2425C88858l64165j27063K32552K39856o8271r785k47619p6052o69j8895p6709
$$ 388858 24693 -102370 130182 370038 301767 291982 44363 -31689 -32358 -51253 -127962
2414a27962O8461j6341L13689k8071j31622P4718N7314J61348j12326K4335K50663
$$ -127962 -59501 -75842 237847 209776 78154 152872 210186 371534 259208 283543 534206
2403E34206k21260m40812J65903O8932J3511r489j15184N7057j36818o150l9669
$$ 534206 312946 -127866 38037 106969 120480 110991 -4193 52864 -83954 -90104 -129773
2392a29773l0638L39508N5583J62881l44604j98220K79118J28000K26219q7690
$$ -129773 -160411 179097 234680 397561 52957 -145263 133855 261855 488074 400384
2382D00384j43990J03272R4755k36822p8247p994l9483k5043P2501j04880Q1079
$$ 400384 256394 359666 454421 217599 139352 131358 91875 66832 139333 34453 115532
2371A15532J20086J40596k10038j08604K72411n9060L4820k84394j30121P0807
$$ 115532 235618 376214 166176 57572 329983 270923 305743 21349 -108772 -37965
2361c7965J4896q8940R8225k14819K3359K9990J95012K4323K64371n3581J98703
$$ -37965 -23069 -112009 -13784 -228603 -205244 -175254 19758 44081 308452 254871 453574
2350D53574k23638r0898N0102o7436p4879J64575n2703K38735J11081n4395r9109
$$ 453574 229936 139038 189140 121704 46825 211400 158697 397432 508513 454118 355009
2339C55009M6563K34197l23913j11225k61836j33153K19628J42340r7270n9369
$$ 355009 401572 635769 311856 200631 -61205 -194358 25270 167610 70340 10971
2329A0971J76090j98763P6861K23304m5083J55844j5531j13839Q7273J32170l27231
$$ 10971 187061 -11702 65159 288463 243380 399224 383693 269854 357127 489297 162066
2318A62066k20803K4131J44667Q4641O348j25765j4938L18002j67047J47286R7968
$$ 162066 -58737 -34606 110061 194702 201050 75285 60347 378349 211302 358588 456556
2307D56556k65805J05921L7169m6791k32435j09152K12626P4412q108p3987R5033
$$ 456556 190751 296672 333841 287050 54615 -54537 158089 232501 224393 150406 245439
2296B45439J41148j19445N5887J67487j22759K83579j04090Q7507j30188l3567
$$ 245439 386587 267142 323029 490516 367757 651336 547246 634753 504565 470998
2286D70998l3575m44294k9104P2137J44606j8954k3267q609J64574j55998p4968
$$ 470998 437423 -6871 -35975 36162 180768 161814 138547 129938 294512 138514 63546
2275F3546j4657K04851K7166j11624k28658j65706J32310L87692l46423q338M52356
$$ 63546 48889 253740 280906 169282 -59376 -225082 -92772 294920 -51503 -59841 392515
2264C92515J30783k81502j84045p2626O3119K3448J94391m5055r0667K5422N7473
$$ 392515 523298 241796 57751 -14875 48244 71692 266083 221028 130361 155783 213256
2253B13256k65843n8644J83914J18743J72451k03962P2366k13849k39368M26961
$$ 213256 -52587 -111231 72683 191426 363877 159915 232281 18432 -220936 206025
2243B06025p9179p0269L9266M7523K6260o6021L0905p2752J70680k11827K75020
$$ 206025 126846 56577 95843 143366 169626 103605 134510 61758 232438 20611 295631
2232B95631j25390j65319L21855O4299M48q3307j22543L05072l05291P5083J88935
$$ 295631 170241 4922 326777 391076 391524 308217 185674 490746 185455 260538 449473
2221D49473k03293j5847P3336k71133j0955J25351o8306J81934n8751m9341m12330
$$ 449473 246180 230333 303669 32536 21581 146932 78626 260560 201809 152468 -259862
2210b59862L43768j52313k79369M93640L09189k21079j92480j21234K89599p2188
$$ -259862 83906 -68407 -347776 145864 455053 233974 41494 -79740 209859 137671
2200A37671m7751Q8849l13061J55479J54060J66361k06478R5742j19728n4851
$$ 137671 89920 178769 -134292 21187 175247 341608 135130 230872 111144 56293
2190E6293J47365P7985j72610Q478p6468n4021J85295Q3742k42790K15061K26603
$$ 56293 203658 281643 109033 117511 41043 -12978 172317 256059 13269 228330 454933
2179D54933R4555l41453l623N8278p7404Q2235K4817O7603j38201R6577n726J1806
$$ 454933 549488 208035 204412 262690 185286 267521 292338 359941 221740 318317 312591 324397
2167C24397p4993J84080R5558J47968M1593J76512p24633K77772P5367J45511
$$ 324397 249404 433484 529042 677010 718603 895115 170482 448254 523621 669132
2157F69132k88463k5591M27518L8716J3758n2844J64450P5067j22184m3788J14494
$$ 669132 380669 355078 782596 821312 835070 782226 946676 1021743 899559 855771 970265
2146I70265J06715K33891o1821k09884K23759o5364P7571M12310L6924K85750
$$ 970265 1076980 1310871 1249050 1039166 1262925 1197561 1275132 1687442 1724366 2010116
2136B010116J4949j9685j287K42085j29292L31738j39728M27948L54508j815Q2388
$$ 2010116 2025065 2005380 2004093 2246178 2116886 2448624 2308896 2736844 3091352 3089537 3171925
2125C171925k48134K82311N45856J24684K09821M11326J70265K9729L09634O72108
$$ 3171925 2923791 3206102 3751958 3876642 4086463 4497789 4668054 4697783 5007417 5679525
2115E679525L09393K65430M42747K71146K79267N48121M27075N72928N66057P34799
$$ 5679525 5988918 6254348 6697095 6968241 7247508 7795629 8222704 8795632 9361689 10096488
2105A0096488J039231J113899J283386R39378J438871J288764J210676K717589
$$ 10096488 11135719 12249618 13533004 14472382 15911253 17200017 18410693 21128282
2097B1128282K856764L695446N030591P255020R547792J2519809O168811n725414
$$ 21128282 23985046 27680492 32711083 39966103 49513895 62033704 68202515 62477101
2089F2477101j1942639j0349352p014379n484770l757108k846763k254329j909228
$$ 62477101 50534462 40185110 33170731 27685961 23928853 21082090 18827761 16918533
2081A6918533j273874j336778j113020j262177j295923j082428q72455o50376
$$ 16918533 15644659 14307881 13194861 11932684 10636761 9554333 8681878 8031502
2073H031502k68618r94625m20144m09802k07745R3779o00506m41874j50435k85643
$$ 8031502 7762884 6768259 6348115 5938313 5730568 5824347 5223841 4781967 4631532 4345889
2063D345889k71408o98929J28139J76507k10945k62047j58049L5580l55676k98408
$$ 4345889 4074481 3375552 3503691 3680198 3469253 3207206 3049157 3084737 2729061 2430653
2053B430653j33272l5642j7642l7167J35328k4485q7665j00873L0991j45930j16695
$$ 2430653 2297381 2261739 2244097 2206930 2342258 2317773 2230108 2129235 2160226 2014296 1897601
2042A897601k32251K71526M8904o9886m62530l4333m1035j6660j61643o2972n4425
$$ 1897601 1665350 1936876 1985780 1915894 1453364 1419031 1377996 1361336 1199693 1136721 1082296
2031A082296R2592L62828n8982l98275N2977Q6584J2977J63463l36000k58426
$$ 1082296 1174888 1537716 1478734 1080459 1133436 1220020 1232997 1396460 1060460 802034
2021H02034J47770J29830j88233K35638k05323l3183o5064J84662L209K28321
$$ 802034 949804 1079634 891401 1127039 921716 888533 823469 1008131 1011340 1239661
2011A239661l15774l78384N1230J65877k3464k45152R6378K00266K4602k16012
$$ 1239661 923887 545503 596733 762610 739146 493994 590372 790638 815240 599228
2001E99228k04807J30792O326r8182j02204K67803k03863o6548J51876J46689
$$ 599228 394421 525213 531539 433357 331153 598956 395093 328545 480421 627110
1991F27110P9763j71307l0425p4829K5919p0144L1604l3797r3250K10025l10273
$$ 627110 706873 535566 505141 430312 456231 386087 417691 383894 290644 500669 190396
1980A90396o1673K59820J43169j73907J41706k87149L4099M723K91076n4567j84461
$$ 190396 128723 388543 531712 357805 499511 212362 246461 251184 542260 487693 303232
1969C03232K12488l27403K18131r6943J9581K55396k64981P076j17190k77386
$$ 303232 515720 188317 406448 309505 329086 584482 319501 326577 209387 -67999
1959f7999L35317j75788N5581J70568p6330r577N0701k01106P9870J31949q9422
$$ -67999 267318 91530 147111 317679 241349 231772 282473 81367 161237 293186 203764
1948B03764k29439L63125k43171L0424K59382J9590M7858j82269l8466R5258k46578
$$ 203764 -25675 337450 94279 124703 384085 403675 451533 269264 230798 326056 79478
1937G9478M561J89408l4358n6212k02306j5549K67308r2397L21106Q5872l34070
$$ 79478 84039 273447 239089 182877 -19429 -34978 232330 139933 461039 546911 212841
1926B12841L2099L4133j31789j047J23849k79408N500N0309Q1630J71960j33490
$$ 212841 244940 279073 147284 146237 270086 -9322 -3822 46487 128117 300077 166587
1915A66587j58630J73737k12298J38716M9990J89188j18295k28638p7098n5198
$$ 166587 7957 181694 -30604 108112 158102 347290 228995 357 -76741 -131939
1905a31939j52083L95660r8074k07470K28648J03606P177n4916M4755K71224k27549
$$ -131939 -284022 111638 13564 -193906 34742 138348 145525 90609 135364 406588 179039
1894A79039l80221K81521L90393J04480J93291k07692k82447J1714J03082q063
$$ 179039 -201182 80339 470732 575212 768503 560811 278364 290078 393160 385097
1884C85097k46192k12317r4549K26252J30370K18942j91830p4887J98582o8116
$$ 385097 138905 -73412 -167961 58291 188661 407603 215773 140886 339468 271352
1874B71352m79606K50878L47308r9583j04969J68877j70836k41056O8936n5064
$$ 271352 -208254 42624 389932 290349 185380 354257 183421 -57635 11301 -43763
1864d3763M9875r100J23772k41801j60307J1533K50358p7642j09852O17760j50
$$ -43763 6112 -2988 120784 -121017 -281324 -269791 -19433 -97075 -206927 410833 410683
1853D10683j98321Q074j16268j6125j36864O3516O6734P2144n5643j01075J43445
$$ 410683 212362 220436 104168 88043 -48821 14695 81429 153573 97930 -3145 140300
1842A40300m21855K35871Q5159j44613J43897J0798J63189l50817k03759K0187
$$ 140300 -281555 -45684 39475 -105138 38759 49557 212746 -138071 -341830 -321643
1832c21643J99446K25501j20624K17512j12116k75742k42953K31375N1603M0745
$$ -321643 -122197 103304 -17320 200192 88076 -187666 -430619 -199244 -147641 -106896
1822a06896O6629o1065L21801k52723j9692N9676J02731j02826l56941J27520
$$ -106896 -40267 -101332 220469 -32254 -51946 7730 110461 7635 -349306 -221786
1812b21786J03948L2826J29637J65091l76467J86770j64620K00910j93698p3735
$$ -221786 -117838 -85012 44625 209716 -166751 20019 -144601 56309 -137389 -211124
1802b11124K12639o02p6171k33318J96797J48428K40869q6413l12997j46827J51842
$$ -211124 1515 913 -75258 -308576 -111779 36649 277518 191105 -121892 -268719 -116877
1791a16877J37719N2737j17451l393j7592q3622j99711L44037L0521L3644J16475
$$ -116877 20842 73579 -43872 -47265 -64857 -148479 -348190 -4153 26368 60012 176487
1780A76487j58913k66854M8344J29122j12159K83740O3165L4160J7813k23826
$$ 176487 17574 -249280 -200936 -71814 -183973 99767 162932 197092 214905 -8921
1770h921M45909j83260m4627l36658J46446J59416j98574p1107j68348J84784
$$ -8921 436988 253728 209101 -127557 18889 178305 -20269 -91376 -259724 -74940
1760g4940j89161J86377P5094J37277l08885j12271L21270K17988j24954j64035
$$ -74940 -264101 -77724 -2630 134647 -174238 -286509 34761 252749 127795 -36240
1750c6240k83191m106L0257K48376q9470j25065J94241K36252J42854j49650l97284
$$ -36240 -319431 -323537 -293280 -44904 -134374 -259439 -65198 171054 313908 164258 -233026
1739b33026r5189j52853J77267N5953R6910L6339k75104L98023J57033M8279j90068
$$ -233026 -328215 -481068 -303801 -247848 -150938 -114599 -389703 8320 165353 213632 23564
1728B3564K14649j72149j29622k95281J14301m833J01821K64004l74313R7388
$$ 23564 238213 66064 -63558 -358839 -244538 -249371 -147550 116454 -257859 -160471
1718a60471k48682L10893K07729k27818m4340J8025K57953L12949m62243l63560
$$ -160471 -409153 -98260 109469 -118349 -162689 -144664 113289 426238 -36005 -399565
1708c99565J8274K26375J56456j94164j53855O8011L47354j38058j9104K6421
$$ -399565 -381291 -154916 1540 -192624 -346479 -278468 68886 -69172 -88276 -61855
1698f1855J52291k0932l60526n7573K16197K2170j79449J69486J23970j95876
$$ -61855 90436 69504 -291022 -348595 -132398 -110228 -289677 -120191 3779 -192097
1688a92097L6623R4951J06191l04051K65243K8536M1741n1654M0705m37328J58823
$$ -192097 -155474 -60523 45668 -258383 6860 35396 77137 25483 66188 -371140 -212317
1677b12317J89635o8963j67812k64505Q1922K18601j08808J07153R9747k23283
$$ -212317 -22682 -91645 -259457 -523962 -442040 -223439 -332247 -225094 -125347 -348630
1667c48630J60703J41091j66751m0421L10481l25892P7348K19927j75907m0010
$$ -348630 -187927 -46836 -213587 -254008 56473 -269419 -192071 27856 -148051 -188061
1657a88061J09474j01121J22076r2625K91099l30729l9477P659j24394L38355
$$ -188061 -78587 -179708 -57632 -150257 140842 -189887 -229364 -221705 -346099 -7744
1647g744j65487J93917k69826M3131K4254n6565K95385k21159K26894o4851k85418
$$ -7744 -173231 20686 -249140 -206009 -181755 -238320 57065 -164094 62800 -2051 -287469
1636b87469K28094m2154r0170J71618l1390r3598J80247Q1618k6856m6451j72619
$$ -287469 -59375 -101529 -191699 -20081 -51471 -145069 35178 116796 89940 43489 -129130
1625a29130o1895j33687L33886N0241r1808J11774r5366j8475p7190Q7035J25754
$$ -129130 -191025 -324712 9174 59415 -32393 79381 -15985 -34460 -111650 -24615 101139
1614A01139l91737K64926P8411j11840q7744K06735L8715n9345p3889K7081j9895
$$ 101139 -290598 -25672 52739 -59101 -146845 59890 98605 39260 -34629 -7548 -27443
1603b7443p0857Q8254K20275k08858m00553J1831K80430L37022J12708j31137
$$ -27443 -98300 -10046 210229 1371 -399182 -387351 -106921 230101 342809 211672
1593B11672j1493l7442l88879m9050K2125j34856J34930K14249P0125J08578k97658
$$ 211672 200179 162737 -226142 -275192 -253067 -387923 -252993 -38744 31381 139959 -157699
1582a57699K169J49904k73065P9570J68686l6433L92371m16982j33609K21702
$$ -157699 -155530 -5626 -278691 -199121 -30435 -66868 325503 -91479 -225088 -3386
1572c386j83983O356L6865j61952j18571M3126K12435L22934K2545j08820J76170
$$ -3386 -187369 -181013 -144148 -306100 -424671 -381545 -169110 153824 176369 67549 243719
1561B43719k5008k42401j37720J71249m4203J8710J29435j56404N0461j47826
$$ 243719 218711 -23690 -161410 9839 -34364 -15654 113781 -42623 7838 -139988
1551a39988J44184k37299n2008K1104O8122J35611P0774M19103l47377k50197
$$ -139988 4196 -233103 -285111 -264007 -195885 -60274 10500 429603 82226 -167971
1541a67971m3182K26806n1904j28933N9199J8593o2899J53041m6049q5061j21752
$$ -167971 -211153 15653 -36251 -165184 -105985 -87392 -150291 2750 -43299 -128360 -250112
1530b50112K55835j58298Q683K48487l17475n7968L45724M2405k67894p4967L76228
$$ -250112 5723 -152575 -143892 104595 -212880 -270848 74876 117281 -150613 -225580 150648
1519A50648M4729m09494K28644J68425k00107o5515P4627J6854j83928L4014R8632
$$ 150648 195377 -214117 14527 182952 -17155 -82670 -8043 8811 -175117 -141103 -42471
1508d2471k72542m3823J83046J00424j02267P6659J17982L21803k67719j42222
$$ -42471 -315013 -358836 -175790 -75366 -177633 -100974 17008 338811 71092 -71130
1498g1130j46010J86127M0884k90600J66941j17107L2255j51222N36700k66616
$$ -71130 -217140 -31013 9871 -280729 -113788 -230895 -198640 -349862 186838 -79778
1488g9778m8956L80824k31866o6315j32734J01334j31823P8784j75927j38750
$$ -79778 -128734 252090 20224 -46091 -178825 -77491 -209314 -130530 -306457 -445207
1478d45207K06345L43950j67219K08250q2829k24523K41604o2249J7873L2231
$$ -445207 -238862 105088 -62131 146119 63290 -161233 80371 18122 35995 68226
1468F8226j6162n7779n7806l2831j92778K00820L1443O0178R2955J04621m24505
$$ 68226 52064 -5715 -63521 -96352 -289130 -88310 -56867 3311 96266 200887 -223618
1457b23618p2710n1392J05147P0173O4847K17956J25357k43813j38582k08560
$$ -223618 -296328 -347720 -242573 -172400 -107553 110403 235760 -8053 -146635 -355195
1447c55195m0021L77829J81388k2153k61726J00161K23161k6425m94413N06499
$$ -355195 -395216 -17387 164001 141848 -119878 -19717 203444 177019 -317394 189105
1437A89105l24752j14233J26855J72222n40962L30212O7387k49136L31931J72949
$$ 189105 -135647 -249880 -123025 49197 -491765 -161553 -94166 -343302 -11371 161578
1427A61578p1605p2292j52992R2396M3311j22690j40132J5702L65172j72685J06307
$$ 161578 89973 17681 -135311 -42915 396 -122294 -262426 -246724 118448 -54237 52070
1416E2070L855m9258r4561L21403j10061k71676m68206K76692J37123K28878P0878
$$ 52070 55925 6667 -87894 233509 123448 -148228 -616434 -339742 -202619 26259 97137
1405I7137j39297j57485K80220l06627R675N2549J46926J35984n4237j71268Q4348
$$ 97137 -42160 -199645 80575 -226052 -216377 -163828 -16902 119082 64845 -106423 -22075
1394b2075J08302m72777L31337k54819j69083L16173J4353P0062J15464m48574
$$ -22075 86227 -386550 -55213 -310032 -479115 -162942 -148589 -78527 36937 -411637
1384d11637J86995M3965k5383L07332J71209l22955l5956J01649q3851j60847
$$ -411637 -224642 -180677 -206060 101272 272481 -50474 -86430 15219 -68632 -229479
1374b29479j20650K85856K11181l08343j53611N2207l9709L0845K63880k013l5614
$$ -229479 -350129 -64273 146908 -161435 -315046 -262839 -302548 -271703 -7823 -9836 -45450
1363d5450j89246N0472J3319J52152j57468J5443J03618m554j47783j12638K26872
$$ -45450 -234696 -184224 -170905 -18753 -176221 -160778 -57160 -61714 -209497 -322135 -95263
1352i5263J916j52276j51523K12689J57412R7877j83029j17154o0439L79018j5041
$$ -95263 -93347 -245623 -397146 -184457 -27045 70832 -112197 -229351 -289790 89228 74187
1341G4187j99591J8002J74400q0127J16791o1892k20041R4419J43299j58285L4875
$$ 74187 -125404 -107402 66998 -13129 103662 41770 -178271 -83852 59447 -98838 -63963
1330f3963J67386j22669J29566K7016J06511j33060j70606j03285k14464n4211
$$ -63963 103423 -19246 110320 137336 243847 110787 -59819 -163104 -377568 -431779
1320d31779K70111j5675L82566k53601j60516J29726RJ10869M9394K440l19653
$$ -431779 -161668 -177343 205223 -48378 -208894 -79168 -79159 31710 81104 83544 -236109
1309b36109j30133K93147R1390L04529j70685j58904P9696K4325k60468j05653
$$ -236109 -366242 -73095 18295 322824 152139 -6765 72931 97256 -163212 -268865
1299b68865q2805M57972j21495j12017L09881k82588k07166L53624j12963l55398
$$ -268865 -351670 106302 -15193 -127210 182671 -99917 -307083 46541 -66422 -421820
1289d21820M47811o5558k0912K700J55721j73122J15965n6921n8502J67727J7868
$$ -421820 25991 -39567 -60479 -57779 97942 -75180 40785 -16136 -74638 93089 110957
1278A10957k58841N4179J61099Q3031k84359j69629L46641K55628l26026j07714
$$ 110957 -147884 -93705 67394 150425 -133934 -303563 43078 298706 -27320 -135034
1268a35034j40707L86829J08284m65429K78200J28431l5648q6386l09703J19853
$$ -135034 -275741 111088 219372 -246057 32143 160574 124926 38540 -271163 -151310
1258a51310J02038J49264j30425L1348j3228J59861k27841M754j2680Q0882J58709
$$ -151310 -49272 99992 -30433 915 -12313 147548 -80293 -75539 -88219 -7337 151372
1247A51372j46677r583o7267p7012m274L9876l9083R6743j4634p3764j93703J33292
$$ 151372 4695 -4888 -72155 -149167 -153441 -113565 -152648 -55905 -70539 -144303 -338006 -204714
1235b04714N04266j44404m4960L2481O2226N0248k30116O5568J6347j1614l0986
$$ -204714 299552 155148 110188 142669 204895 255143 25027 90595 106942 95328 64342
1224F4342J17729J3510p6659j50846K32843j69271l96602K46017J8519m3344q6292
$$ 64342 182071 195581 118922 -31924 200919 31648 -364954 -118937 -100418 -143762 -230054
1213b30054m7390M50217k34937M3443J03147L883j08269j79820Q7049J65662J72616
$$ -230054 -277444 172773 -62164 -18721 84426 88309 -19960 -199780 -112731 52931 225547
1202B25547J1707l6170k86600n4057O965j7512J92239J2410J33167k67395N3764
$$ 225547 237254 201084 -85516 -139573 -132608 -150120 42119 54529 187696 -79699 -25935
1191b5935K379p3189o8329m9118L08152J03174k20178j16127o4410K46843R0446
$$ -25935 -23556 -96745 -165074 -214192 93960 197134 -23044 -139171 -203581 43262 133708
1180A33708p3879j11712l67778K53776O8974l2085k13429K27147q1936J34173
$$ 133708 59829 -51883 -419661 -165885 -96911 -128996 -342425 -115278 -197214 -63041
1170f3041n5515l4515J23200l06544J0856L32638L20132J7385o3764j86827j77137
$$ -63041 -118556 -153071 -29871 -336415 -325559 7079 327211 344596 280832 94005 -83132
1159h3132k81337J03333J37018P4328J48269p7962J09387J84888M773r7448j15119
$$ -83132 -364469 -261136 -124118 -49790 98479 20517 129904 314792 319565 222117 106998
1148A06998O2952k73857j57452Q505J28399K28764j8521l7957j09371k9644k11391
$$ 106998 169950 -103907 -261359 -252854 -124455 104309 85788 47831 -61540 -91184 -302575
1137c02575J96636K66601p6193N1078j8823L45723k09504l10755N037K54277k28306
$$ -302575 -105939 160662 84469 135547 116724 462447 252943 -57812 -52775 201502 -26804
1126b6804K5838r7057K96313L4614n1023j5026k15268j02455j27666R0076K69097
$$ -26804 -966 -98023 198290 232904 181881 166855 -48413 -150868 -278534 -188458 80639
1115H0639r7917p7491J77200q9589r1397q5387O0206l8622M382K93254o0309k88826
$$ 80639 -17278 -94769 82431 -7158 -98555 -183942 -123736 -162358 -157976 135278 74969 -213857
1103b13857J50715k85848J35376L14055p8835j85973j08885o4085J61486J60811
$$ -213857 -63142 -348990 -213614 100441 21606 -164367 -273252 -337337 -175851 -15040
1093a5040J02556m7267p4731M9765J92263j55079j80025q5291K27612k03256P5320
$$ -15040 87516 40249 -34482 15283 207546 52467 -127558 -212849 14763 -188493 -113173
1082a13173L31092l8602K31667l78795k53579K06700o6115M1553j26768k24071
$$ -113173 217919 179317 410984 32189 -221390 -14690 -80805 -39252 -166020 -390091
1072c90091J07400j44841K75729M59497j28906k61301k6065J13734j86996J87003
$$ -390091 -282691 -427532 -151803 307694 178788 -82513 -108578 5156 -181840 5163
1062E163K23505j38506j21030m1381M9530j96675K80186j70204P9083J64067J62368
$$ 5163 228668 90162 -30868 -72249 -22719 -219394 60792 -109412 -30329 133738 296106
1051B96106l2657p4603j9737k70302k51933q6850K63533K10330L6637K46820l5463
$$ 296106 263449 188846 169109 -101193 -353126 -439976 -176443 33887 70524 317344 281881
1040B81881k31792L0089r0934j66810K8431r5M5851j14808j6374k0415j55410
$$ 281881 50089 80178 -10756 -177566 -149135 -149230 -103379 -218187 -234561 -254976 -410386
1029d10386M37801j51059p2441R6532J93887k46745J08224K41411k33295J40991
$$ -410386 27415 -123644 -196085 -99553 94334 -152411 -44187 197224 -36071 104920
1019A04920O2204j87171l3065M8817K20712j98140l2259j34101n6052J58945K48805
$$ 104920 167124 -20047 -53112 -4295 216417 18277 -13982 -148083 -204135 -45190 203615
1008B03615n73893J07448L7541L7984l2889K03492J76896j47743k22787L00414
$$ 203615 -370278 -262830 -225289 -187305 -220194 -16702 160194 12451 -210336 90078
998I0078j45011r0912Q452j67714L68963j40500K1080L587J99571j7111k88982
$$ 90078 -54933 -145845 -137393 -305107 63856 -76644 -55564 -51977 147594 130483 -158499
987a58499j57747K12826L72896m8216k55204q2313j1461J22186J67691j46392
$$ -158499 -316246 -103420 269476 221260 -33944 -116257 -127718 -5532 162159 15767
977A5767k06283n5480l21103L41082J10762K1995m3717L0942j10940K20253l2666
$$ 15767 -190516 -245996 -567099 -226017 -115255 -93260 -136977 -106035 -216975 3278 -29388
966b9388j05266M1600j72413J97959J8100j72445J58233l5537j21724j3970L70523
$$ -29388 -134654 -93054 -265467 -67508 -49408 -221853 -63620 -99157 -220881 -234851 135672
955A35672j91745o1340j15208L53111j22465j68370K90489m6583k62510o0046
$$ 135672 -56073 -117413 -232621 120490 -1975 -170345 120144 73561 -188949 -248995
945b48995M27737J09431m164j98782o7867j1423j24813P9365N5028j24912L1342
$$ -248995 178742 288173 284009 85227 17360 5937 -118876 -39511 15517 -109395 -78053
934g8053L07708j47187j91263n8854j50533p584Q2227K65180m2343J39883k66443
$$ -78053 229655 82468 -108795 -167649 -318182 -325766 -243539 21641 -20702 119181 -147262
923a47262j78001J98919n2400j17560N115J19776k1973L16866N7817k39747j41922
$$ -147262 -325263 -126344 -178744 -296304 -291189 -171413 -193386 123480 181297 -58450 -200372
912b00372M78401j52992j29013n7473n7953j92401m5286K92274K80222k28262
$$ -200372 278029 125037 -3976 -61449 -119402 -311803 -357089 -64815 215407 -12855
902a2855j14795j94813J18552J69984k8522J566j55079J06181J1321L12420l00514
$$ -12855 -127650 -322463 -203911 -33927 -62449 -60883 -215962 -109781 -98460 213960 -86554
891h6554J2390J3171j75452l6165J68185J62168l3731j24231K4078j5237Q3929
$$ -86554 -74164 -60993 -236445 -272610 -104425 57743 24012 -100219 -76141 -91378 -7449
880g449j22616M58163m8735l4548n0086k53149N5476n0845r572P511J70961J83801
$$ -7449 -130065 328098 279363 244815 194729 -58420 -2944 -53789 -63361 -55850 115111 298912
868B98912l14370l26849J72500N0596J06231o3265p0683L45448p248K23905k16476
$$ 298912 -15458 -342307 -169807 -119211 -12980 -76245 -146928 198520 191272 415177 198701
857A98701j94320k24361J52467J04060K39554k07355n21717J40156K68738j7306
$$ 198701 4381 -219980 -67513 36547 276101 68746 -452971 -312815 -44077 -61383
847f1383k5376Q7779M1900J17895J81734m02433K3219L63181L0967k55206l86370
$$ -61383 -86759 1020 42920 160815 342549 -59884 -36665 326516 357483 102277 -284093
836b84093o7495J94465K61184L74K26823j17956k06425o4953l687J98542l01881
$$ -284093 -351588 -157123 104061 104435 331258 213302 6877 -58076 -61763 136779 -165102
825a65102j96028J85576J45514J74314o7736l18621n7056L43600J41060j38500
$$ -165102 -361130 -175554 -30040 144274 76538 -242083 -299139 44461 185521 47021
815D7021r9176P8424o1961j1491k6892j3781m4228K3638Q1954K95283M1927k19870
$$ 47021 -52155 26269 -35692 -47183 -74075 -87856 -132084 -108446 -26492 268791 310718 90848
803I0848m41451L8486K51555k7347N1783R7994R093j29311p1720R3167Q5059J94639
$$ 90848 -350603 -312117 -60562 -87909 -36126 61868 70961 -58350 -130070 -36903 48156 242795
791B42795k61453J21651j1815o7306k87055j96552L36019O9659k3514K31278N5427
$$ 242795 -18658 102993 91178 23872 -263183 -459735 -123716 -54057 -77571 153707 209134
780B09134j08442J05620k53938o439K43971k59750N1082O3572L0604j86227J01770
$$ 209134 100692 206312 -47626 -54065 189906 -69844 -18762 44810 75414 -110813 -9043
769i043J68524l4104J88460L7436m3597q6784k59949R9940j86423K17879N9406
$$ -9043 159481 125377 313837 351273 307676 220892 -39057 60883 -125540 92339 151745
758A51745j51112n78625M63757J65986M3278K09494j20184R4237l92992M1052
$$ 151745 633 -577992 -114235 51751 95029 304523 184339 278576 -114416 -73364
748g3364J63135n1567j79543J06386J63374q5248q3548j39477P6936K8666j72908
$$ -73364 89771 38204 -141339 -34953 128421 43173 -40375 -179852 -102916 -74250 -247158
737b47158J66468j78589q1952J76222K51652O3988n9599l98077p876l9781j27685
$$ -247158 -80690 -259279 -341231 -165009 86643 150631 91032 -307045 -314921 -354702 -482387
726d82387M17328R8132J60436J76589l28606m9121j15642J39939j04725P286j94991
$$ -482387 -65059 33073 193509 370098 41492 -7629 -123271 16668 -88057 -80771 -275762
715b75762M70696j01282j38230K99991j13785L4055q5745J86394j75467p1268
$$ -275762 194934 93652 -44578 255413 141628 175683 89938 276332 100865 29597
705B9597j3799k31083Q1934K64231L08634l16502j57586J68558q9482j95766J28340
$$ 29597 15798 -215285 -133351 130880 439514 123012 -34574 133984 44502 -151264 -22924
694b2924M7166q5521R5769k88970n9966K71111J63867J6147j45776J84973q7061
$$ -22924 24242 -61279 34490 -254480 -314446 -43335 120532 136679 -9097 175876 88815
683H8815m9318k62269m3793J04701J59098j30032o180J35887m7904j29020K35650
$$ 88815 39497 -222772 -266565 -161864 -2766 -132798 -138978 -3091 -50995 -180015 55635
672E5635j85569K761J32082r3789j53584J03753k2162k5140K05372m6180M36286
$$ 55635 -129934 -127173 4909 -88880 -242464 -138711 -160873 -186013 19359 -26821 409465
661D09465p0675k41381J66153j58618j6178k48793k10887J58768K25J30171O4570
$$ 409465 338790 97409 263562 104944 88766 -160027 -370914 -212146 -211921 -81750 -17180
650a7180J76846l61419J27761J03020j81624O5648P8003O5062o6124L21805j43111
$$ -17180 159666 -201753 -73992 29028 -152596 -86948 -8945 56117 -10007 311798 168687
639A68687L4206k73473K2522j26366j7099K26853r4325K06382L4551j97451j807
$$ 168687 202893 -70580 -48058 -174424 -191523 35330 -58995 147387 181938 -15513 -17320
628a7320O0147k62592K8163K4956L52740r3242k5215l73297J65021J23162l4081
$$ -17320 42827 -219765 -191602 -166646 186094 92852 67637 -305660 -140639 -17477 -51558
617e1558N0618J70151m2670o89r3469J33225M5708K0994j2140m25875J1453K49879
$$ -51558 -940 169211 126541 125852 32383 165608 211316 232310 220170 -205705 -194252 55627
605E5627j06342N4681J72510J40514R1892j14487J85369N0276j43335k46868j59032
$$ 55627 -50715 3966 176476 316990 408882 294395 479764 530040 386705 139837 -19195
594a9195L6287q4937P8929o5470O1734Q2265j01415p2408L14091j64318K030J03563
$$ -19195 17092 -67845 11084 -54386 7348 89613 -11802 -84210 229881 65563 67593 171156
582A71156J00847j45192o8397J51954J84j20232k3154l5418n2282j24980j41716
$$ 171156 272003 126811 58414 210368 210552 90320 67166 31748 -20534 -145514 -287230
571b87230M39021K51487k0296m29717J4971m739r4550j18844j0240L70070k59979
$$ -287230 151791 403278 382982 -46735 -31764 -36503 -131053 -249897 -260137 109933 -150046
560a50046J58049K25990m6081J27347M3946k00683j20245n7762j78471k9948L9638
$$ -150046 8003 233993 187912 315259 359205 158522 38277 -19485 -197956 -227904 -188266
549a88266p0023R3029N8072k8118M18242j22491j12804L3557j23984l1163K21405
$$ -188266 -258289 -165260 -107188 -135306 282936 160445 47641 81198 -42786 -73949 147456
538A47456K50996k62596k77561O6495K10330j90625J67472J11112k10173Q2389
$$ 147456 398452 135856 -141705 -75210 135120 -55505 111967 223079 12906 95295
528I5295J99223r0929k33512J2125P2019J38097L9206K43189R0706k23884j74076
$$ 95295 294518 203589 -29923 -17798 54221 192318 231524 474713 565419 341535 167459
517A67459l9400n4350j85356j84471K24582J92972J81871k21716k0827j2253J4611
$$ 167459 128059 73709 -111647 -296118 -71536 121436 303307 81591 60764 48511 63122
506F3122j88090R246K7350P4945M4236J0190J17424j8916o2668m2457L3654P6237
$$ 63122 -124968 -115722 -88372 -13427 30809 40999 158423 139507 76839 34382 68036 144273
494A44273j66144J71897m6467j04274k94475K18321K98660l40981K99852k37666
$$ 144273 -21871 150026 103559 -715 -295190 -76869 221791 -119190 180662 -57004
484e7004J13230J67777l5679j57410M888K3911K3719R4725j13519M6842J65396
$$ -57004 56226 224003 188324 30914 35802 59713 83432 178157 64638 111480 276876
473B76876l2165m76728J33519J59402J79266k74208J76614r4002O1569K27740
$$ 276876 244711 -232017 -98498 60904 240170 -34038 142576 48574 110143 337883
463C37883k84249k66064K66448O2324l1055j51403j73503J83409K25221K38043
$$ 337883 53634 -212430 54018 116342 85287 -66116 -239619 -56210 169011 407054
453D07054m1729j95478j9693J64992Q972j68778j51611M21302L5749l60819K64827
$$ 407054 365325 169847 150154 315146 324118 155340 3729 425031 460780 99961 364788
442C64788k4783j68597k8065r7842P0091l4576J32328j47605j72872L00773Q3421
$$ 364788 340005 171408 143343 45501 115592 81016 213344 65739 -107133 193640 277061
431B77061p528k94506J00462L33209o5945L9267m3377J22847k95878j8879M5889
$$ 277061 269533 -24973 75489 408698 342753 382020 338643 461490 165612 146733 192622
420A92622n0969J90712j87201m23841J93978M9942m6762J51457L07259l47538
$$ 192622 141653 332365 145164 -278677 -84699 -34757 -81519 69938 377197 29659
410B9659J13215j13702J80705n8675k09753L28185q0207J19008Q9237m61835J64529
$$ 29659 142874 29172 209877 151202 -58551 269634 189427 308435 397672 -64163 100366
399A00366O3278J82087j21715q0817J97826j0139o9708l63223J0646J97282j23254
$$ 100366 163644 345731 224016 143199 341025 330886 261178 -102045 -91399 105883 -17371
388a7371J0966K8333o0241n5951q9584m1532M34223n9502M1812j2519k33869M92404
$$ -17371 -6405 21928 -38313 -94264 -183848 -225380 208843 149341 191153 178634 -55235 437169
376D37169l17206J23023j86097p6137J14898J6797M0305P5389P4479p1828J13273
$$ 437169 119963 242986 56889 -19248 95650 112447 152752 228141 302620 230792 344065
365C44065j36704k6355J75302M239k46948k87786K4794K60518J37202k30681J85852
$$ 344065 207361 181006 356308 360547 113599 -174187 -149393 111125 248327 17646 203498
354B03498O0326q0192l59846R923K88387j83091K45809j55430K10236j30019j43385
$$ 203498 263824 183632 -176214 -166291 122096 -60995 184814 29384 239620 109601 -33784
343c3784K70212M0090p914j83618R9635r8870j25231J24015j1798J53969k84827
$$ -33784 236428 276518 268604 84986 184621 85751 -39480 84535 72737 226706 -58121
332e8121Q7895k2728K3709j16576j70542N12449k63555k42765J69032L58178k59079
$$ -58121 29774 7046 30755 -85821 -256363 256086 -7469 -250234 -81202 276976 17897
321A7897J26974q0973L53896K65104k63537k95849l440k02919N3561J75470r2562
$$ 17897 144871 63898 417794 682898 419361 123512 120072 -82847 -29286 146184 53622
310E3622J95136j74252K818j0907k2209P7118m5812J91150J38777k23101J70968
$$ 53622 248758 74506 77324 66417 44208 121326 75514 266664 405441 182340 353308
299C53308k48073M714n7922Q4158K36095K2130j62204R8665p086k04456P6708
$$ 353308 105235 109949 52027 136185 372280 394410 232206 330871 323785 119329 196037
288A96037k0572k5301M6246J37669j92688L7874O998J22601k01557J54380k16433
$$ 196037 175465 150164 196410 334079 141391 179265 186263 308864 107307 261687 45254
277D5254J5717K25155n3288j03661K10774M0314j07646j87382j39030R7064J93530
$$ 45254 60971 286126 232838 129177 339951 380265 272619 85237 -53793 43271 236801
266B36801L66766k08208k30946j0000K03097K4889l50099J10456K42367j74782
$$ 236801 603567 395359 164413 154413 357510 382399 32300 142756 385123 210341
256B10341Q2959l65844J41056R1138K00250J58644m62466j52202K46273L78116
$$ 210341 293300 -72544 68512 159650 359900 518544 56078 -96124 150149 528265
246E28265l07428k16988L90788J55695n2653j04712k55789J51662k17468j40220
$$ 528265 220837 3849 394637 550332 497679 392967 137178 288840 71372 -68848
236f8848J52325Q1788J30964l35199P9810J61046m4810j93886j97502j04351J98272
$$ -68848 83477 165265 296229 -38970 40840 201886 157076 -36810 -234312 -338663 -140391
225a40391K34074O8333k47414J42886L08068k97544k32134L17512P9406j86126
$$ -140391 93683 162016 -85398 57488 365556 68012 -164122 153390 232796 46670
215D6670q6216o0989m6012L1631Q9517P1734N434K35767r0297r9256K64937P811
$$ 46670 -39546 -100535 -146547 -114916 -25399 46335 51769 287536 197239 97983 362920 370731
203C70731j54516J2635J6439q1745k16772L6889J80737l6499N5812j045m2299
$$ 370731 216215 228850 245289 163544 -53228 -16339 164398 127899 183711 182666 140367
192A40367J45935m3339k31572J67944J60472j20723J18451l4216k12752N5559
$$ 140367 286302 242963 11391 179335 339807 219084 337535 303319 90567 146126
182A46126r0985N9271l0852j72217k2747J03286N6520M2920J52794k03320J71775
$$ 146126 55141 114412 83560 -88657 -111404 -8118 48402 91322 244116 40796 212571
171B12571j10277j3939J70204m94083K04444m1657J47692J28521k96321L27265
$$ 212571 102294 88355 258559 -235524 -31080 -72737 74955 203476 -92845 234420
161B34420o7765P0615j09326l45036M32333J76330J63524o5596k68715K9609l50945
$$ 234420 166655 237270 127944 -217092 215241 391571 555095 489499 220784 250393 -100552
150a00552j24868M18490o1045j39426M7528P3366N2004J05087k8423J49802l11669
$$ -100552 -225420 193070 132025 -7401 40127 113493 165497 270584 242161 391963 80294
139H0294K17900J2493j11053K33635k25226k2141M02376o3463j6098J82992j30545
$$ 80294 298194 310687 199634 433269 208043 185902 588278 524815 508717 691709 561164
$$ [...]
##END NTUPLES=NMR SPECTRUM
##END=
