##TITLE=1H_EC-3334(III-1)
 CDCl3
 8 sc, 
 31.10.2024
##JCAMPDX= 6.0         $$ Bruker NMR JCAMP-DX V2.0
##DATA TYPE= NMR SPECTRUM
##DATA CLASS= NTUPLES
##ORIGIN= UXNMR, Bruker Analytische Messtechnik GmbH
##OWNER= root
$$ XWIN-NMR		Version 3.5
$$ Thu Oct 31 13:49:21 2024 Russian Standard Time (UT+4h)  she@DPX200
##.OBSERVE FREQUENCY= 200.1318
##.OBSERVE NUCLEUS= ^1H
##.ACQUISITION MODE= SIMULTANEOUS
##.ACQUISITION SCHEME= undefined
##.AVERAGES= 8
##.DIGITISER RES= 18
##SPECTROMETER/DATA SYSTEM= spect
##.PULSE SEQUENCE= zg30
##.SOLVENT NAME= CDCl3
##.SHIFT REFERENCE= (INTERNAL, CDCl3, 0, 20.9988)
##AUDIT TRAIL= $$ (NUMBER, WHEN, WHO, WHERE, WHAT)
$$ ##TITLE= Audit trail, XWIN-NMR		Version 3.5
$$ ##JCAMPDX= 5.01
$$ ##ORIGIN= Bruker BioSpin GmbH
$$ ##OWNER= she
$$ F:/spectra/data/she/nmr/H-F/1/pdata/1/auditp.txt
$$ ##AUDIT TRAIL=  $$ (NUMBER, WHEN, WHO, WHERE, WHAT)
(   1,<2024-10-31 13:46:37.90 +0400>,<she>,<DPX200>,
      <created by zg, POWCHK disabled, PULCHK disabled
       configuration hash MD5:
       00 E9 B6 7A A2 85 ED C7 34 08 36 98 17 FE 4E 26
       data hash MD5: 16K
       61 6E 6C EF 90 6F B3 85 DB 33 77 F6 AA 05 A9 C1>)
(   2,<2024-10-31 13:46:40.20 +0400>,<she>,<DPX200>,
      <Start of raw data processing
       efp BC_mod = 2 LB = 0.24 FT_mod = 6 PKNL = 1 PHC0 = -26356.27 PHC1 = 23.78743 SI = 16K 
       data hash MD5: 16K
       50 FE 12 AB 64 C2 75 5D E3 06 E6 89 1A 24 72 5B>)
(   3,<2024-10-31 13:47:00.42 +0400>,<she>,<DPX200>,
      <pk PHC0 = 1.730713 PHC1 = 0 
       data hash MD5: 16K
       12 EE 82 72 78 2B 3B 02 F8 A2 54 59 39 98 2B D8>)
(   4,<2024-10-31 13:47:04.21 +0400>,<she>,<DPX200>,
      <abs ABSG = 5 
       data hash MD5: 16K
       00 3D 6C 51 8A B8 DC E5 96 05 38 20 C4 B3 77 1C>)
$$ ##END=
$$ 
$$ hash MD5
$$ 17 7D 6D 16 DE 90 36 87 7D 53 CF DD 1C E2 9B AB
##$RELAX= 
##$RELAX= 
##$RELAX= 
##$RELAX= 
##$RELAX= 
##$RELAX= 
$$ Bruker specific parameters
$$ --------------------------
##$DU= <F:/spectra>
##$EXPNO= 1
##$NAME= <H-F>
##$PROCNO= 1
##$TYPE= <nmr>
##$USER= <she>
##$AMP= (0..31)
100 100 100 100 100 100 100 100 100 100 100 100 100 100 100 100 100 100 
100 100 100 100 100 100 100 100 100 100 100 100 100 100 
##$AQSEQ= 0
##$AQ_mod= 1
##$AUNM= <au_zg>
##$AUTOPOS= <>
##$BF1= 200.13
##$BF2= 200.13
##$BF3= 200.13
##$BF4= 200.13
##$BF5= 200.13
##$BF6= 200.13
##$BF7= 200.13
##$BF8= 200.13
##$BYTORDA= 1
##$CFDGTYP= 0
##$CFRGTYP= 5
##$CHEMSTR= <none>
##$CNST= (0..31)
1 1 145 1 1 1 1 1 1 1 1 1 1 1 1 1 1 1 1 1 1 1 1 1 1 1 1 1 1 1 1 1 
##$CPDPRG= <>
##$CPDPRG1= <>
##$CPDPRG2= <>
##$CPDPRG3= <>
##$CPDPRG4= <mlev>
##$CPDPRG5= <mlev>
##$CPDPRG6= <mlev>
##$CPDPRG7= <mlev>
##$CPDPRG8= <mlev>
##$CPDPRGB= <>
##$CPDPRGT= <>
##$D= (0..31)
0 1.2 0 0 0 0 0 0 0 0.06 0 0.03 0 0 0 0 0.0002 0 0 0 0 0 0 0 0 0 0 0 0 
0 0 0 
##$DATE= 1730367997
##$DBL= (0..7)
120 120 120 120 120 120 120 120 
##$DBP= (0..7)
150 150 150 150 150 150 150 150 
##$DBP07= 0
##$DBPNAM0= <>
##$DBPNAM1= <>
##$DBPNAM2= <>
##$DBPNAM3= <>
##$DBPNAM4= <>
$$ [...]
##$SUBNAM3= <"">
##$SUBNAM4= <"">
##$SUBNAM5= <"">
##$SUBNAM6= <"">
##$SUBNAM7= <"">
##$SUBNAM8= <"">
##$SUBNAM9= <"">
##$SW= 24.0689170037331
##$SWIBOX= (0..15)
0 0 2 0 0 0 0 0 0 0 0 0 0 0 0 0 
##$SW_h= 4816.95568400771
##$TD= 16384
##$TD0= 1
##$TE= 0
##$TE2= 300
##$TE3= 300
##$TEG= 300
##$TL= (0..7)
0 120 120 120 120 120 120 120 
##$TP= (0..7)
150 150 150 150 150 150 150 150 
##$TP07= 0
##$TPNAME0= <>
##$TPNAME1= <>
##$TPNAME2= <>
##$TPNAME3= <>
##$TPNAME4= <>
##$TPNAME5= <>
##$TPNAME6= <>
##$TPNAME7= <>
##$TPOAL= (0..7)
0.5 0.5 0.5 0.5 0.5 0.5 0.5 0.5 
##$TPOFFS= (0..7)
0 0 0 0 0 0 0 0 
##$TUNHIN= 0
##$TUNHOUT= 0
##$TUNXOUT= 0
##$USERA1= <user>
##$USERA2= <user>
##$USERA3= <user>
##$USERA4= <user>
##$USERA5= <user>
##$V9= 5
##$VALIST= <valist>
##$VCLIST= <CCCCCCCCCCCCCCC>
##$VD= 0
##$VDLIST= <DDDDDDDDDDDDDDD>
##$VPLIST= <PPPPPPPPPPPPPPP>
##$VTLIST= <TTTTTTTTTTTTTTT>
##$WBST= 1024
##$WBSW= 4
##$XGAIN= (0..3)
0 0 0 0 
##$XL= 0
##$YL= 0
##$YMAX_a= 740151
##$YMIN_a= -664936
##$ZGOPTNS= <>
##$ZL1= 120
##$ZL2= 120
##$ZL3= 120
##$ZL4= 120
##$ABSF1= 21.00173
##$ABSF2= -3.067404
##$ABSG= 5
##$ABSL= 3
##$ALPHA= 0
##$AQORDER= 0
##$ASSFAC= 0
##$ASSFACI= 0
##$ASSFACX= 0
##$ASSWID= 0
##$AUNMP= <proc_1d>
##$AZFE= 0.1
##$AZFW= 0.1
##$BCFW= 0
##$BC_mod= 2
##$BYTORDP= 0
##$COROFFS= 0
##$CY= -3
##$DATMOD= 1
##$DC= 0
##$DFILT= <>
##$DTYPP= 0
##$F1P= 0
##$F2P= 0
##$FCOR= 1
##$FTSIZE= 16384
##$FT_mod= 6
##$GAMMA= 0
##$GB= 0
##$INTBC= 1
##$INTSCL= 3.70164e-10
##$ISEN= 128
##$LB= 0.24
##$LEV0= 0
##$LPBIN= 0
##$MAXI= 10000
##$MC2= 0
##$MEAN= 0
##$ME_mod= 0
##$MI= 1.114404
##$NCOEF= 0
##$NC_proc= -6
##$NLEV= 6
##$NOISF1= 3.799351
##$NOISF2= 2.8
##$NSP= 0
##$NTH_PI= 0
##$NZP= 0
##$OFFSET= 20.99879
##$PC= 1
##$PHC0= -26354.54
##$PHC1= 23.78743
##$PH_mod= 1
##$PKNL= yes
##$PPARMOD= 0
##$PSCAL= 0
##$PSIGN= 0
##$REVERSE= no
##$SF= 200.130005990137
##$SI= 16384
##$SIGF1= 3
##$SIGF2= 2
##$SINO= 5.538805
##$SIOLD= 16384
##$SREGLST= <1H.CDCl3>
##$SSB= 0
##$STSI= 16384
##$STSR= 0
##$SW_p= 4816.95568400771
##$SYMM= 0
##$S_DEV= 0
##$TDeff= 16384
##$TDoff= 0
##$TI= <>
##$TILT= no
##$TM1= 0
##$TM2= 0
##$TOPLEV= 0
##$USERP1= <user>
##$USERP2= <user>
##$USERP3= <user>
##$USERP4= <user>
##$USERP5= <user>
##$WDW= 1
##$XDIM= 16384
##$YMAX_p= 305735457
##$YMIN_p= -782219
$$ End of Bruker specific parameters
$$ ---------------------------------
##NTUPLES= NMR SPECTRUM
##VAR_NAME=  FREQUENCY,     SPECTRUM/REAL,   SPECTRUM/IMAG
##SYMBOL=    X,             R,               I
##VAR_TYPE=  INDEPENDENT,   DEPENDENT,       DEPENDENT
##VAR_FORM=  AFFN,          ASDF,            ASDF
##VAR_DIM=   16384,         16384,           16384
##UNITS=     HZ,            ARBITRARY UNITS, ARBITRARY UNITS
##FACTOR=    0.29402158847633, 1,            1
##FIRST=     4202.48811677532, 0,            0
##LAST=      -614.467567232392, 0,           0
##MIN=       -614.467567232392, -782219,     0
##MAX=       4202.48811677532, 305735457,    0
$$ Real data points
##PAGE= N=1
##DATA TABLE= (X++(R..R)), XYDATA
$$ [...]
5929A1408019j92202l41392m05887o2249j36711q0473P567J19102J58139J57490
5919A0631403J2762K29787J70937J73967J36654M2989L30565K03931K25604J87666
5909A2346265J58711L62385J08351K84540L67747L65940J19772M22091N52048
5900A5087850N16078O99405N61680Q30093P89148P47559J101776J241315J410745
5891B2985649J736537J836423J811665J191489M05566k10545k19276M29275M70145
5882C0436928L29134n19184j246342j560578j511455j477734j099067j090742
5874B2260960n98042q73749n37438n95207l14009l99873n90108l54424k96896
5865A7701214l07353m44204j75859j08216j56898j12199J15649j08356K12918
$$ plain form
5929 11408019 11215817 10874425 10468538 10406289 10269578 10189105 10196672 10315774 10473913 10631403
5919 10631403 10644165 10873952 11044889 11218856 11355510 11398499 11729064 11932995 12158599 12346265
5909 12346265 12504976 12867361 12975712 13260252 13627999 13993939 14113711 14535802 15087850
5900 15087850 15603928 16303333 16865013 17695106 18484254 19231813 20333589 21574904 22985649
5891 22985649 24722186 26558609 28370274 29561763 29967329 29756784 29537508 29966783 30436928
5882 30436928 30766062 30246878 29000536 27439958 25928503 24450769 23351702 22260960
5874 22260960 21662918 20789169 20251731 19656524 19342515 18942642 18352534 17998110 17701214
5865 17701214 17393861 16949657 16773798 16665582 16508684 16396485 16512134 16403778 16616696
5856A6616696M43553L04396J3794K6797J15374L74457O4129p4033R8463j81259
5846A7802367r6972j4040Q2392L5839l59403k26002M6430m6208j39630o6853l76394
5835A6641526p9441J28175l58842k58762m91569l15294k04033m14541m4789k53524
5825A4348906j96688m34040l81049j44953M6510l15219k49124p5897O0808K41018
5815A2900272q1249k80501O4138o7673N409m1579k11928n4479p8004j21581k33132
5804A1799693R943l155L4377K00058J3801L10892J91601K62434L03752L02020
5794A3425416K15694M3438P8675j32601N9650j625J2794k7271J69031j14032j18978
5783A3610191p8733j50601P8153L12459M02331L06147L34124K55510O76961P04525
$$ plain form
5856 16616696 17060249 17364645 17378439 17405236 17520610 17895067 17959196 17885163 17983626 17802367
5846 17802367 17705395 17691355 17773747 17809586 17450183 17224181 17270611 17224403 17084773 17017920 16641526
5835 16641526 16562085 16690260 16331418 16072656 15581087 15265793 15061760 14647219 14602430 14348906
5825 14348906 14152218 13718178 13337129 13192176 13238686 12923467 12674343 12598446 12659254 12900272
5815 12900272 12819023 12538522 12602660 12534987 12540396 12498817 12286889 12232410 12154406 12032825 11799693
5804 11799693 11809636 11806481 11840858 12040916 12054717 12365609 12557210 12819644 13123396 13425416
5794 13425416 13641110 13684548 13763223 13630622 13690272 13688647 13701441 13674170 13843201 13729169 13610191
5783 13610191 13531458 13380857 13459010 13771469 14173800 14479947 14814071 15069581 15746542 16451067
5773A6451067J129422J207514J512471J529396J642434J265042L79670R1456k54416
5764B4954056j50309J90335l38844o11274r33034j500710j289346j118211q09278
5755A8393385r97460r33076n28528o29350l73672k12908k00744k73350j72074
5746A4072223l35455k75382k38816p0284P3190r6516K30853K67477L34869M27466
5736A4389625N34599M24740Q67242R26026Q95488J269478J478302J224385O71699
5727B2681584L08451Q427j58489K4619o708k57715p35348j051326j524096j587248
5717A7702151j125896p16013o84219m17648k30475l15167k6883K40657j06877
5708A4319630J46829Q60668J612117J521471J726431N17624r52877k005675k259242
$$ plain form
5773 16451067 17580489 18788003 20300474 21829870 23472304 24737346 25117016 25208472 24954056
5764 24954056 24803747 24994082 24655238 24043964 23110930 21610220 20320874 19202663 18393385
5755 18393385 17395925 16462849 15934321 15304971 14931299 14718391 14517647 14244297 14072223
5746 14072223 13736768 13461386 13222570 13152286 13225476 13128960 13359813 13627290 13962159 14389625
5736 14389625 14924224 15348964 16216206 17142232 18037720 19307198 20785500 22009885 22681584
5727 22681584 22990035 22998462 22839973 22864592 22857884 22600169 21864821 20813495 19289399 17702151
5717 17702151 16576255 15860242 15176023 14758375 14527900 14212733 14185850 14426507 14319630
5708 14319630 14466459 15327127 16939244 18460715 20187146 20704770 19751893 17746218 15486976
5699A5486976k095889j560107j301089r61490q05971o14573l68409o81956m08488
5690F689004k47686k48758j57152k21502k30355j62550j06977L572l44048n7976
5680D915572k11244k29414P4584M5773j30114j22311l1418j34396l32871k00800
5670C643361r2056J59191k35636k29623j38020j78418m3168m0810J47841L1638
5660C024300q2947O0183K02746j07571k64448r548j38979j63577j5912j18433
5650B385814j60190J02693m878k12408r84p4021j52675j78166j10270K68969m0119
5639A823765k61617m1408p8266O487J37763l1092q6074o4237J25904p3678j38048
5628A319499l0327j17837Q3609J92733k15501l2430K0027P9280k43073j04270
$$ plain form
5699 15486976 13391087 11830980 10529891 9568401 8762430 8147857 7779448 7097492 6689004
5690 6689004 6441318 6192560 6035408 5813906 5583551 5421001 5314024 5317596 4973548 4915572
5680 4915572 4704328 4474914 4549498 4595271 4465157 4342846 4311428 4177032 3844161 3643361
5670 3643361 3551305 3710496 3474860 3245237 3107217 2928799 2885631 2844821 2992662 3024300
5660 3024300 2941353 3001536 3204282 3096711 2832263 2822715 2683736 2520159 2504247 2385814
5650 2385814 2225624 2328317 2323439 2111031 2110047 2036026 1883351 1705185 1594915 1863884 1823765
5639 1823765 1562148 1520740 1442474 1448961 1586724 1555632 1469558 1405321 1531225 1457547 1319499
5628 1319499 1289172 1171335 1254944 1447677 1232176 1199746 1219773 1299053 1055980 951710
5618I51710K06297p9576P3517J5441R7049P6969k04407R2176K18606j61370m3970
5607A242442j56495j16665K11220l6109p1322K0400m1260K46781p2620q2262K46181
5596A390291K2994j23438J53236j06537j86531j1955j17334J07939K2456j5153
5586A135968j01918j78368j38324L7202K5734m5320M0898K01325M0998K3874k13499
5575H28570j08281j56116N1585K19080P0426k66753N3600K00094k2524q9070o6041
5564G14570J93046j70350J65122K02161q8506j7029j14732k5853p5437j46640
5554F36352J12555J01312P0619J2266k18156N9590K0533k1810m3990M8306R7942
5543H75519j01696R601J31149N242q8568j1153n4501K7844j08074J85089J16511
$$ plain form
5618 951710 1158007 1078431 1151948 1167389 1264438 1341407 1137000 1229176 1447782 1286412 1242442
5607 1242442 1085947 969282 1180502 1144393 1073071 1093471 1052211 1298992 1226372 1144110 1390291
5596 1390291 1413285 1289847 1443083 1336546 1150015 1138060 1020726 1128665 1151121 1135968
5586 1135968 1034050 855682 717358 754560 780294 734974 775872 977197 1018195 1042069 828570
5575 828570 720289 564173 615758 834838 905264 638511 692111 892205 869681 780611 714570
5564 714570 907616 737266 902388 1104549 1016043 999014 884282 858429 782992 636352
5554 636352 748907 850219 920838 933104 714948 774538 795071 773261 729271 777577 875519
5543 875519 773823 783424 914573 919815 831247 820094 765593 793437 685363 870452 986963
5532I86963l9126J76163o8812j2658J69084k71032m3905K5047K1271J6266j5883
5521I43378J38633k5412p3638J12627r9607J79422j16579j03097R077k00736O3002
5510H27070r116M8807O0197O1133J50896J3513P4013j56128J6259J72362Q84J85323
5498A445213q8382j0680m608o6804R2006Q5226n5889P2124J58808k30279Q274
5487A405009M1030j2367N8579J66209l33642J2132l4406p8217L05472k76437k7827
5476A225535r6619P4349K66774j18402L0281O3023m8185P1609L603N4620Q3562
5465A610150O2113o984J5572L061J16623K6982Q177K27221k4925K08487K3738
5454B270215n3274J41940L53772J83670J8418L82118L58652M73087K92871L40395
$$ plain form
5532 986963 947837 1124000 1055188 1042530 1211614 940582 896677 921724 942995 959261 943378
5521 943378 1082011 1056599 982961 1095588 995981 1175403 1058824 955727 964804 764068 827070
5510 827070 817954 866761 926958 988091 1138987 1152500 1226513 1070385 1086644 1259006 1259890 1445213
5498 1445213 1356831 1346151 1341543 1274739 1366745 1451971 1396082 1468206 1627014 1396735 1405009
5487 1405009 1446039 1433672 1492251 1658460 1324818 1336950 1302544 1224327 1529799 1253362 1225535
5476 1225535 1128916 1203265 1470039 1351637 1381918 1444941 1396756 1468365 1471968 1526588 1610150
5465 1610150 1672263 1665279 1680851 1683912 1800535 1827517 1835694 2062915 2037990 2246477 2270215
5454 2270215 2216941 2358881 2712653 2896323 2914741 3296859 3655511 4128598 4421469 4761864
5444D761864j12306K7755k77957l98824l96950j50782j25060j35851p8575R0393
5434C203707K30247j07385j9174J89519J49949K18994L18998L33988O19476N32630
5424E670949M43398j99056k28791j16024l91084k06808l13943j26988l4661j93944
5414D303048J95679k97707K28557K1449Q2387J63148M16351K52465L11914P88637
5404F465928O41626K73945L9893m8172l88429l44423k99756l85479k48201l27754
5394E379178j97275o4149k19834j51818Q6454J38036k8662M3721K11654K08652
5384E405957L61669N68908L34808J46560P9698m3391m53949j20075l13062l41796
5374E625327k27250k97804m40396j37223j71566j00748n6883m0573J983J03106
$$ plain form
5444 4761864 4649558 4677313 4399356 4000532 3603582 3452800 3327740 3191889 3113314 3203707
5434 3203707 3433954 3326569 3307395 3496914 3646863 3865857 4184855 4518843 5138319 5670949
5424 5670949 6114347 5915291 5686500 5570476 5179392 4972584 4658641 4531653 4496992 4303048
5414 4303048 4498727 4201020 4429577 4451026 4533413 4696561 5112912 5365377 5677291 6465928
5404 6465928 7107554 7381499 7421392 7373220 6984791 6640368 6340612 5955133 5706932 5379178
5394 5379178 5181903 5117754 4897920 4746102 4832556 4970592 4941930 4985651 5197305 5405957
5384 5405957 5767626 6336534 6671342 6817902 6897600 6854209 6400260 6280185 5967123 5625327
5374 5625327 5398077 5100273 4659877 4522654 4351088 4250340 4193457 4152884 4154867 4257973
5364D257973m1916K68375L39780Q2681J50948J21945L389k35186j7914j55940
5354D774135l40188j84j12627k78027q3167j26820k86165q0759N8144n3382j65195
5343C305765J73390o9508j16225k01313K01533J65271j56479K40836J2881j91010
5333C365141R9534Q5543Q1601l7481J67755K53184J15379j59613j26169r5458
5323C749416k32956j64333n9782J3861k18438J0205m4460j43282N3496j67046
5313B796681k2841O8911R5399J59744j9505m367j77692k3551K57924q3359j58469
5302B888875J83305J46494n6874l9872J81373N2715o4604j40848K1466J61515
5292C333545l9249l863o7807j41094K16844r9590r4575J7080L3092m283L4002
$$ plain form
5364 4257973 4216057 4484432 4824212 4906893 5057841 5179786 5183175 4947989 4930075 4774135
5354 4774135 4433947 4433763 4321136 4043109 3959942 3833122 3546957 3466198 3524342 3470960 3305765
5343 3305765 3479155 3409647 3293422 3092109 3293642 3458913 3302434 3543270 3556151 3365141
5333 3365141 3464675 3550218 3631819 3594338 3762093 4015277 4130656 3971043 3844874 3749416
5323 3749416 3516460 3352127 3292345 3306206 3087768 3097973 3053513 2910231 2963727 2796681
5313 2796681 2773840 2842751 2938150 3097894 3078389 3074022 2896330 2872779 3130703 3047344 2888875
5302 2888875 3072180 3218674 3161800 3121928 3303301 3356016 3291412 3150564 3172030 3333545
5292 3333545 3294296 3290433 3222626 3081532 3298376 3198786 3104211 3121291 3154383 3150100 3184102
5281C184102k16734k05273j30023m6199L0383j40632l5715M1715K31858J00770
5271B814252j85113P5414j44606k7859R959J17823J24237j5754j34359K35250
5261B869244N6226m7868J11879n3322J29170R2233Q9733J23403l5078j7317K9159
5250C347462P8197k04791Q996K29821p0380L0112J95742M1901j07791q031L20052
5239C861290J11078Q8646J92271j79552R6383J90037j24808K5292Q0580j67871
5229D173346r4428J4106q0234j53375n1895O2714J40607n2991P622J52799o346
5218D111925J55863j542r8853m8798K2180L45114K04624K53631K61988K27467
5208E433599J05953j6837P1236j28986k06752j29088k09019j24424k05953l6571
$$ plain form
5281 3184102 2967368 2762095 2632072 2585873 2616256 2475624 2439909 2481624 2713482 2814252
5271 2814252 2629139 2704553 2559947 2532088 2542047 2659870 2784107 2768353 2633994 2869244
5261 2869244 2925470 2877602 2989481 2936159 3065329 3157562 3247295 3370698 3335620 3318303 3347462
5250 3347462 3425659 3220868 3229864 3459685 3389305 3419417 3615159 3657060 3549269 3541238 3861290
5239 3861290 3972368 4061014 4253285 4073733 4170116 4360153 4235345 4260637 4341217 4173346
5229 4173346 4078918 4093024 4012790 3859415 3807520 3870234 4010841 3957850 3965472 4118271 4111925
5218 4111925 4267788 4266246 4167393 4118595 4140775 4485889 4690513 4944144 5206132 5433599
5208 5433599 5539552 5522715 5593951 5464965 5258213 5129125 4920106 4795682 4589729 4553158
5198D553158k75904l9703k40811k21487Q2949m7220p9099j11716J96191K2641
5188C838999N6132m3553L9596Q8961O5449j31901M890J98025J4328k00784J56523
5177D086665P2283j26486K52069m9604O21j34796o3090M1145n1421r3486R6038
5166D029938J37327j25001k4557k18654J79581K05777l1037J17513j17405J1702
5156D165184L6753K45420j32690N9025k7719K2543J79942j42694n1242o1873L7794
5145D330443o1417L247J17651L9811k1797N0948k29580j93186P5428k12356j18212
5134C780980J87376L0341k53187j26927K34547j35286K228K1331m1364j45696
5124C554343P4307J99173o1104n1678m1672K38204n6564k8927j413K24951J29180
$$ plain form
5198 4553158 4277254 4237551 3996740 3775253 3858202 3810982 3731883 3620167 3816358 3838999
5188 3838999 3895131 3851578 3891174 3980135 4045584 3913683 3918573 4116598 4130926 3930142 4086665
5177 4086665 4158948 4032462 4284531 4234927 4235548 4100752 4037662 4078807 4027386 3933900 4029938
5166 4029938 4167265 4042264 4017707 3799053 3978634 4184411 4153374 4270887 4153482 4165184
5156 4165184 4201937 4447357 4314667 4373692 4345973 4368516 4548458 4405764 4354522 4292649 4330443
5145 4330443 4269026 4272273 4389924 4429735 4407938 4458886 4229306 4036120 4111548 3899192 3780980
5134 3780980 3968356 3998697 3745510 3618583 3853130 3717844 3720072 3741403 3700039 3554343
5124 3554343 3628650 3827823 3766719 3715041 3673369 3911573 3855009 3826082 3824669 4049620 4178800
5113D178800j30303L9202J75017j48213Q0147N2588o5838o726R1950R9071P4043
5102D439738O8255J31456l7416r0935K25204J78335J18975K54303L8002p2905
5092E253012L5533M906J36927J95690K03936K08988m0295K35616J23583l4013
5082F323883K67073J29904K59960K13224J79736R0067L84067K08061J09264K35277
5072H400516N6924K91325J70763J34319M35661K10419L42727L09137K27250K58465
5062A0837506K43119M09853M78186M12751M14311K93018M55926L52556O58669
5053A4555895N00513M56960P04519L64938M59609P40523O83285P24494Q33564
5044B0024300Q70490O62126P90044J008778J017581J044538Q61500R03240J253209
$$ plain form
5113 4178800 4048497 4087699 4262716 4114503 4194650 4247238 4181400 4174674 4266624 4365695 4439738
5102 4439738 4507993 4639449 4602033 4511098 4736302 4914637 5033612 5287915 5325917 5253012
5092 5253012 5288545 5293451 5430378 5626068 5830004 6038992 5998697 6234313 6357896 6323883
5082 6323883 6590956 6720860 6980820 7194044 7373780 7463847 7847914 8055975 8165239 8400516
5072 8400516 8457440 8748765 8919528 9053847 9489508 9699927 10042654 10351791 10579041 10837506
5062 10837506 11080625 11490478 11968664 12381415 12795726 13088744 13544670 13897226 14555895
5053 14555895 15056408 15513368 16217887 16582825 17042434 17782957 18466242 19190736 20024300
5044 20024300 20894790 21556916 22346960 23355738 24373319 25417857 26279357 27182597 28435806
5035B8435806J481581J073553J386719J344828J332982J541761J931174J866243
5027D0394647J948126K506566K462726K419973K481809K267250J895187J285402
5019E7661686P66356O95438M39488M18125O72834Q10069J084729J230147J429969
5010F5208841K008099K281015K527060K592361K267539J706962P43890m26004
5002G8909763j094127j570018k242345k217907k311951k045614j509698j161815
4994F4756288p31364o61325l53548J14474M2750k76891m96692j240654j464765
4985E9688273k383956k317521k459166j985986j921698k033851j652655j588661
4977D3344779j399361r29939q65016j093242r05394q05730o93225o05724k28722
$$ plain form
5035 28435806 29917387 30990940 32377659 33722487 35055469 36597230 38528404 40394647
5027 40394647 42342773 44849339 47312065 49732038 52213847 54481097 56376284 57661686
5019 57661686 58428042 59123480 59562968 59981093 60653927 61463996 62548725 63778872 65208841
5010 65208841 67216940 69497955 72025015 74617376 76884915 78591877 79335767 78909763
5002 78909763 77815636 76245618 74003273 71785366 69473415 67427801 65918103 64756288
4994 64756288 64024924 63363599 63010051 63124525 63167275 62890384 62393692 61153038 59688273
4985 59688273 57304317 54986796 52527630 50541644 48619946 46586095 44933440 43344779
4977 43344779 41945418 41015479 40150463 39057221 38151827 37346097 36652872 36047148 35818426
4968C5818426m83693l79149k29965j81548l46745j95474k10921J8671k4706M7501
4958C3832397L92402L97256L47635O53050Q66363Q24835Q86883R93771Q26334
4949D0020926P58615P74943M85644J5311j61367k67495k27259p8940K95482N03739
4939D2119599P75090R68827J037331J109300J014046J411396R68140P71383j46095
4930E0029017n02243p12547j107917r46398r11945r27420q42827m55637o23675
4921D2998408k10286K59614K66653L50913N95482L10196k53492j69324o10550
4912D3537614r98496j392466j361228j205387j246714j253782j459249q81040
4904C3739252r40288o13762o48880j76084m07125l20139m23877l57862k56024
$$ plain form
4968 35818426 35334733 34955584 34725619 34544071 34197326 34001852 33790931 33809602 33784896 33832397
4958 33832397 34224799 34622055 34969690 35622740 36489103 37313938 38200821 39194592 40020926
4949 40020926 40779541 41554484 42040128 42055439 41894072 41626577 41399318 41320378 41615860 42119599
4939 42119599 42894689 43863516 44900847 46010147 47024193 48435589 49403729 50175112 50029017
4930 50029017 49526774 48814227 47706310 46759912 45847967 44920547 44077720 43622083 42998408
4921 42998408 42788122 43047736 43314389 43665302 44260784 44570980 44317488 44148164 43537614
4912 43537614 42539118 41146652 39785424 38580037 37333323 36079541 34620292 33739252
4904 33739252 32798964 32185202 31536322 31360238 30953113 30632974 30209097 29851235 29595211
4895B9595211l34318o06930p74521o96970r06070n55167q56504p58384r62121
4886B3144226o91492q72115q00747n92696o12175m74376p43896m50935l57286
4877A7548508m18817m27619j97639k84107j45244j26538k83187k29815k10050
4868A5225492j70987k23657J3814j54164J65868n5482j84761p8170K48544L96947
4858A5183444j6400J77669L63287M79515M82519O07073N85722J62852k32354o31282
4848A7162045n04948n05472l4869k64552k91845J94906J09563J86688M804M21837
4838A6478157N10230L11945O82300R10105J200204J465624J550783J278410P3584
4829B4461342q46711j232321j552787j264853j202308q51894m75936l46947k3815
$$ plain form
4895 29595211 29260893 28653963 27879442 27182472 26276402 25721235 24864731 24106347 23144226
4886 23144226 22452734 21580619 20779872 20187176 19575001 19100625 18356729 17905794 17548508
4877 17548508 17129691 16702072 16504433 16220326 16075082 15948544 15665357 15435542 15225492
4868 15225492 15054505 14830848 14844662 14690498 14856366 14800884 14616123 14537953 14786497 15183444
4858 15183444 15167044 15344713 15708000 16187515 16670034 17277107 17862829 18025681 17793327 17162045
4848 17162045 16657097 16151625 16116756 15852204 15560359 15755265 15864828 16051516 16056320 16478157
4838 16478157 16988387 17300332 17982632 18892737 20092941 21558565 23109348 24387758 24461342
4829 24461342 23614631 22382310 20829523 19564670 18362362 17510468 17034532 16687585 16663770
4820A6663770k58697K90799J44019K32537N47523P67899Q47249J318280K133794
4811B2687173K035791J461229R4643j052487j947206k243062j784071j253787
4803A7998223r59287q61540n45755l82702k89363k16350k61020J24394L00434
4794A4907034L98519O39330J040839J332348J557855J197471k6302q87485j460201
4785A8699408j613926j504733r19077p98791n94064n34051m03080k17822l57660
4776A1756204j48627l10820O6742Q760K58195L19783L53496N89865M59727R2156
4766A3445481l37679n84691q24732n70636l67582m82330j73202k398k51177j68456
4756I682598n2616j83261L222j32745J07979J77321J29368J92929K67896J39978
$$ plain form
4820 16663770 16405073 16695872 16839891 17072428 17619951 18387850 19235099 20553379 22687173
4811 22687173 24722964 26184193 26278836 25226349 23279143 21036081 19252010 17998223
4803 17998223 17038936 16177396 15631641 15248939 14959576 14743226 14482206 14606600 14907034
4794 14907034 15305553 15944883 16985722 18318070 19875925 21073396 21047094 20159609 18699408
4785 18699408 17085482 15580749 14661672 13862881 13268817 12734766 12331686 12113864 11756204
4776 11756204 11607577 11296757 11363499 11372259 11630454 11950237 12303733 12893598 13353325 13445481
4766 13445481 13107802 12523111 11698379 11127743 10760161 10277831 10104629 10102231 9851054 9682598
4756 9682598 9629982 9446721 9449943 9317198 9425177 9602498 9731866 9924795 10192691 10332669
4746A0332669N1937m4812k86784Q31k70607k48498m7133L5880j45061r5997j48961
4735I133464K97029q1838j12341O3377K7089O8941K8176Q5490J15226q7770j3111
4724I523732L32963K11024p3751l2363l253m11747J04926R4777L4309J8209j47793
4713I651033J01438K06937q4896R2977J24310N5367m9854L35747Q5256n3033o7633
4702A0397649J24714n774K21924N1001J29941J64143O723K23673K27529J18655
4692A1660178J48410K17081K61431K18793J46017L09418L29971M07289M16447
4683A4115035L77336L54688K79779J80543K12179J16335N61061O15529N16082
4674A7328567M80394L74392N18556O65977N62216N42519N26364O94335N79572
$$ plain form
4746 10332669 10384606 10339794 10053010 10053841 9783234 9534736 9487603 9523483 9378422 9282425 9133464
4735 9133464 9430493 9348655 9236314 9299691 9326780 9395721 9423897 9509387 9624613 9536843 9523732
4724 9523732 9856695 10067719 9993968 9961605 9958352 9546605 9651531 9746308 9780617 9798826 9651033
4713 9651033 9752471 9959408 9874512 9967489 10091799 10147166 10097312 10433059 10518315 10465282 10397649
4702 10397649 10522363 10516589 10738513 10789514 10919455 11083598 11090321 11313994 11541523 11660178
4692 11660178 11808588 12025669 12287100 12505893 12651910 12961328 13291299 13698588 14115035
4683 14115035 14492371 14847059 15126838 15307381 15519560 15635895 16196956 16812485 17328567
4674 17328567 17808961 18183353 18701909 19367886 19930102 20472621 20998985 21693320 22272892
4665B2272892P16630N27455O89082R13534J142595Q49813O22699Q96622J050883
4656B9682205J206653J272024J333165J493792J340733J560023J692040J858474
4648D1439109J749808J889306K198633K218879K445547K576034K574992K551060
4640E9643368K673363J939926J104273O86047M23108M49526N93269Q30317J512933
4631F9856130J429187K068986K633807L177095L382576L707525M005830L592174
4623I3853310K872415J528750j21973j952289k887983l365800l265595k746063
4615H3914772j596654j284172o46881P0966M71682R92967J321095J402794J554951
4606H6201520J425458P76230K18710m04649q64793o71934j89045P30313R28210
$$ plain form
4665 22272892 22989522 23516977 24206059 25119593 26262188 27112001 27734700 28631322 29682205
4656 29682205 30888858 32160882 33494047 34987839 36328572 37888595 39580635 41439109
4648 41439109 43188917 45078223 47276856 49495735 51941282 54517316 57092308 59643368
4640 59643368 62316731 64256657 65360930 66046977 66470085 66919611 67512880 68343197 69856130
4631 69856130 71285317 73354303 75988110 79165205 82547781 86255306 90261136 93853310
4623 93853310 96725725 98254475 98132502 96180213 93292230 89926430 86660835 83914772
4615 83914772 82318118 81033946 80387065 80458031 80929713 81922680 83243775 84646569 86201520
4606 86201520 87626978 88403208 88621918 88217269 87352476 86680542 86491497 87221810 88150020
4597H8150020o08854j852718k386063l107811k640522k038121j345508r92229
4589G3178194l30067j36064L01689L04588L54703O09568L75602o963k55068l58174
4579G4038008n3950L04381Q99028J686800K501444K654548K38358q42175j903082
4570G9523360k767479k094134j323169r23872p27130r9341K62635K94043L43860
4561G2488773M63523M55308Q31209J258808J127732J276708J224907J305298J515557
4552H1947823J545449J069644O75605m65587r85302j646328j721023j758914j526878
4543G7134489j521089j182014j046048q26556q34216m57584n09868k91290m9880
4534G0415944j93671l0402K03028K71898K55507P09669O31702Q89508R48789J111706
$$ plain form
4597 88150020 87541166 85688448 83302385 80194574 77554052 75515931 74170423 73178194
4589 73178194 72848127 72712063 73013752 73318340 73673043 74282611 74658213 74651250 74396182 74038008
4579 74038008 73984058 74288439 75187467 76874267 79375711 82030259 82268617 81426442 79523360
4570 79523360 76755881 74661747 73338578 72414706 71687576 71588235 71850870 72144913 72488773
4561 72488773 72952296 73407604 74238813 75497621 76625353 77902061 79126968 80432266 81947823
4552 81947823 83493272 84562916 85238521 84772934 83787632 82141304 80420281 78661367 77134489
4543 77134489 75613400 74431386 73385338 72558782 71724566 71266982 70757114 70465824 70415944
4534 70415944 70222273 70191871 70394899 70666797 70922304 71631973 72263675 73153183 74101972 75213678
4524G5213678J301939J521098J768651J848354J835547K192560K337312K769299
4516I0788438K875485L012565K993611K687672K263775J817205J992752J641357
4508A10072860J900982J585368J131229J195793O02543k68477o31005j018464
4500A14570829r12328l02193Q5840N30260J035039J297556J514233K200723K324294
4491A22344253K159340J661186J012084N29907q1326j002282j230407j708312
4483A23684443k004229k068985k410358k649865k220273j812282j721585j312541
4475A07484325q51733p40023p58135j489519k179000k586115k786783k783108
4467I3309909k605541j927910k155070j790365j771878j628937j317915j163060
$$ plain form
4524 75213678 76515617 78036715 79805366 81653720 83489267 85681827 88019139 90788438
4516 90788438 93663923 96676488 99670099 102357771 104621546 106438751 108431503 110072860
4508 110072860 111973842 113559210 114690439 115886232 116488775 116220298 115589293 114570829
4500 114570829 113658501 113356308 113442148 113972408 115007447 116305003 117819236 120019959 122344253
4491 122344253 124503593 126164779 127176863 127706770 127625444 126623162 125392755 123684443
4483 123684443 121680214 119611229 117200871 114551006 112330733 110518451 108796866 107484325
4475 107484325 106632592 105892569 105134434 103644915 101465915 98879800 96093017 93309909
4467 93309909 90704368 88776458 86621388 84831023 83059145 81430208 80112293 78949233
4459G8949233j179349j272398q49426q43910n46374o23426m79302m86014j223770
4450G1445264j590507j837814k141927j772687j462874j242704j384474r44181
4442E9068096p10133r22096p40621o33819p91355q97457q22895o12520p49634
4433E2187566o38946p06777n35040n73470m18706l84709n9322m75280k54925J22384
4423D8262775K0577k08970m0267K21222O76424M65328Q98795J170853K078829
4414E3545566K468307L002683M232582O548671R104565J2073191R962859o95733
4406A00242691l280902p831344j1066372r655331p645869n540487m796008l534096
4398D6892282k693442k146551k017574j682997j412682j360096q53868p91985
$$ plain form
4459 78949233 77769884 76497486 75648060 74804150 74257776 73634350 73155048 72669034 71445264
4450 71445264 69854757 68016943 65875016 64102329 62639455 61396751 60012277 59068096
4442 59068096 58357963 57435867 56695246 56061427 55270072 54372615 53549720 52937200 52187566
4433 52187566 51548620 50841843 50306803 49733333 49314627 48929918 48870596 48395316 48140391 48262775
4423 48262775 48283352 48074382 48034115 48255337 48931761 49397089 50295884 51466737 53545566
4414 53545566 56013873 59016556 63249138 69797809 78902374 90975565 100938424 100242691
4406 100242691 96961789 89130445 78064073 68408742 60762873 55222386 50426378 46892282
4398 46892282 44198840 42052289 40034715 38351718 36939036 35578940 34725072 33933087
4390C3933087o19334n11275p34035m15869l86617l58292m93070m04030l34181
4381B9676384o22692n06435l24530k50858j67698l07318P3758l5235j37460J32788
4371B7530704L07539J63803L35205L15161J68953J61828R9066K08909J17353J41876
4361B9550397p4582k81529m33637r86562r64032j191342r82519r68106q29646
4352B2838442o04812o90067l55116n17848q45604o40084m95122k34193n01863
4343A7953733n02664m40967k66921k26989k6361n95149m81910l35968o37798n28211
4333A3910795l53201j41509l80134m56784m09487P9510l34792m38522j54197J3931
4323A1335610k9049k50481l94896j29145J12188n0770j12124j24632l11813j4338
$$ plain form
4390 33933087 33313753 32802478 32068443 31652574 31265957 30907665 30414595 30010565 29676384
4381 29676384 29053692 28547257 28222727 27971869 27804171 27496853 27570611 27535376 27397916 27530704
4371 27530704 27838243 28002046 28337251 28652412 28821365 28983193 29082259 29291168 29408521 29550397
4361 29550397 29475815 29194286 28760649 27774087 26810055 25618713 24636194 23668088 22838442
4352 22838442 22233630 21543563 21188447 20670599 19824995 19184911 18689789 18455596 17953733
4343 17953733 17451069 17010102 16743181 16516192 16489831 15894682 15412772 15076804 14439006 13910795
4333 13910795 13557594 13416085 13035951 12579167 12169680 12249190 11914398 11475876 11321679 11335610
4323 11335610 11306561 11056080 10661184 10532039 10644227 10593457 10481333 10356701 10044888 10030550
4313A0030550J62967k21747k67604q3736N42J31862j14724o9125k14917m655j01793
4302I247620k52815j12460J35087o6786k4513j03771L9370Q4454n7146O9101l514
4291H954627j79400j45465P3686M5358k8806j23564k14234M7584n2029q2065j16448
4280H179244m331r5382K2769N949j39338P4515j77942k32927R737M4103J04673
4269G791070j75444N3748J29749j86443m6671j40249m8896p90L4714j40370J42428
4258G412846l0944J09690j32665J04251J138j50651L4836K11400n5142j39532
4248G365227l2357L8052N5484r3446R9112J32179P9045j3296j04979M9785P9722
4237G654528j25994K13695K07653n2301j36118k02101k881J76186J75923J51973
$$ plain form
4313 10030550 10193517 9971770 9704166 9620430 9620972 9752834 9638110 9568985 9354068 9349413 9247620
4302 9247620 8994805 8882345 9017432 8950646 8926133 8822362 8861732 8946186 8889040 8958141 8954627
4291 8954627 8775227 8629762 8703448 8748806 8720000 8596436 8382202 8429786 8377757 8295692 8179244
4280 8179244 8174913 8079531 8102300 8108249 7968911 8043426 7865484 7632557 7642294 7686397 7791070
4269 7791070 7615626 7669374 7799123 7612680 7566009 7425760 7376864 7376074 7410788 7270418 7412846
4258 7412846 7381902 7491592 7358927 7463178 7464316 7313665 7348501 7559901 7504759 7365227
4248 7365227 7332870 7370922 7426406 7332960 7432072 7564251 7643296 7630000 7525021 7574806 7654528
4237 7654528 7528534 7742229 7949882 7897581 7761463 7559362 7556481 7732667 7908590 8060563
4227H060563j68153q0754K74159J90091j6762J10781j3157k41916M8109J82108
4217H345069L8829m2115j33314K74J84487J4395J02423J60304k2467J21131O7665
4206H836681J12863P8075J36295K10544J25207J851K7949J59130j989L0341J76370
4195I893317J74913K75672J75945R786M1885L06660K52356L11435L75724K7063
4185A1844756M4584p5185L06919J42039J33981O8290K37190K17676K57423L77087
4175A3554760Q5147J86365L55912K38739L79507M00739L00208N98902L67382L88989
4165A6856650L72104N18607N24490N55864N71017L78829N81920P13102O34603
4156B1707186O01051O98357J026791J026374Q85357J221894J063094J733138J712678
$$ plain form
4227 8060563 7892410 7811656 8085815 8275906 8259144 8369925 8356768 8114852 8162961 8345069
4217 8345069 8383898 8341783 8208469 8208743 8393230 8407625 8510048 8670352 8647885 8769016 8836681
4206 8836681 8949544 9027619 9163914 9374458 9499665 9501516 9529465 9688595 9686606 9716947 9893317
4195 9893317 10068230 10343902 10519847 10529633 10571518 10878178 11130534 11441969 11817693 11844756
4185 11844756 11889340 11814155 12121074 12263113 12397094 12465384 12702574 12920250 13177673 13554760
4175 13554760 13639907 13826272 14182184 14420923 14800430 15201169 15501377 16100279 16467661 16856650
4165 16856650 17228754 17747361 18271851 18827715 19398732 19777561 20359481 21072583 21707186
4156 21707186 22308237 23006594 24033385 25059759 25945116 27167010 28230104 29963242 31675920
4147C1675920K000126J998478K497304K951680L305727L502877L819310M849371
4139E6600793M957719M639884M374132L742044J702923n47186k683494m198215
4131F8588600m958905m843421m889153m504451l836223l196310l107807k603109
4123C6649221k147320k127196k039406j868407j500223j170005j058814q94676
4115B3843174q42693r14670p30303l87643n44959n22769l33680n3638n40059k91850
4105A8680910j92659k85778j50101j53315k11375J10650k23145p9492L6411r0784
4095A7441322n4601j62474L8932k26655J69227J58178Q6178R652O1824J56524
4085A7678107K49183J64591L3083M3401K63338L89246J46563L66375L57805L31017
$$ plain form
4147 31675920 33676046 35674524 38171828 41123508 44429235 47932112 51751422 56600793
4139 56600793 61558512 66198396 70572528 74314572 76017495 75470309 72786815 68588600
4131 68588600 63629695 58786274 53897121 49392670 45556447 42360137 39252330 36649221
4123 36649221 34501901 32374705 30335299 28466892 26966669 25796664 24737850 23843174
4115 23843174 23000481 22085811 21355508 20967865 20422906 19900137 19566457 19512819 18972760 18680910
4105 18680910 18488251 18202473 18052372 17899057 17687682 17798332 17575187 17495695 17532106 17441322
4095 17441322 17386721 17224247 17263179 17036524 17205751 17363929 17450107 17459759 17521583 17678107
4085 17678107 17927290 18091881 18124964 18168365 18431703 18820949 18967512 19333887 19691692 20022709
4075B0022709N34811K03393K55861M70276N45313O24344M22982J75910J81343
4066B3436942M79158M04015O10818N48976N34688M52380P65852P36174L91220
4057B8360223O52840Q88824R60911Q06337Q88448Q19325Q89788P37519O40392
4048C5644607O14603P86707P61588O85595R38825N62274M88091P75961O18927
4039D1877178M25633O35070N18409L75490L12886J3970p4646l31653q01304q68007
4029D2083026o29668p84555o92375n19807k01663l44761j35130J47246k09172
4020C8713141m74022q99370r89919r26514j087005r69832r11821o68467m11452
4011C1374739k10490j88157j97514j09930P2105O7215J98261K58042N2042j43796
$$ plain form
4075 20022709 20557520 20760913 21016774 21487050 22032363 22656707 23079689 23255599 23436942
4066 23436942 23916100 24320115 24930933 25479909 26014597 26466977 27232829 27969003 28360223
4057 28360223 29013063 29901887 30862798 31669135 32557583 33376908 34266696 35004215 35644607
4048 35644607 36259210 37045917 37807505 38493100 39431925 39994199 40482290 41258251 41877178
4039 41877178 42302811 42937881 43456290 43831780 44144666 44158636 44083990 43752337 42951033 42083026
4029 42083026 41453358 40668803 39976428 39456621 39254958 38910197 38775067 38922313 38713141
4020 38713141 38239119 37339749 36349830 35423316 34336311 33366479 32454658 31786191 31374739
4011 31374739 31164249 30976092 30778578 30668648 30740753 30807968 31006229 31264271 31316313 31172517
4001C1172517j88919m96072j5423k46759n70329k69293o1093l44144J6713J4588
3991B9011786j2348k37527p0483R7911k38324l0275k16821k72622k47231j06372
3981B7677694n7454l87582J16709j29689J33391K11836p7734K11841K83588K28571
3971B8211171J42483M25061K840K06435M09402j9520k41049N6758O1935j66442
3961B9089074k5937J06502q616L29411K22285J42533j98147l3366j04844n15348
3951B9003547n78718l25158k46509m24774k21446r5494j78035p8581j32733j74572
3941B6547527K06936L05522O6446K58373K39000K12352q8715j34188j66081J10940
3931B7558112l3001P945l523j97006k44473j41364j62773P039j00005K1317j13981
$$ plain form
4001 31172517 30983598 30487526 30472103 30225344 29655015 29385722 29324629 28980485 28997198 29011786
3991 29011786 28999438 28761911 28691428 28789339 28551015 28520740 28303919 28031297 27784066 27677694
3981 27677694 27620240 27232658 27349367 27219678 27353069 27564905 27487171 27699012 27982600 28211171
3971 28211171 28353654 28778715 28781555 28987990 29397392 29377872 29136823 29193581 29255516 29089074
3961 29089074 29063137 29169639 29161023 29490434 29712719 29855252 29657105 29623739 29518895 29003547
3951 29003547 28424829 28099671 27853162 27428388 27206942 27111448 26933413 26854832 26722099 26547527
3941 26547527 26754463 27059985 27126431 27384804 27623804 27836156 27747441 27613253 27447172 27558112
3931 27558112 27525111 27533056 27529533 27332527 27088054 26946690 26783917 26790956 26690951 26712268 26598287
3920B6598287O2038J11612k21919j85495j41311m7198j10154k12852n1777J29435
3910B5930666N3281m999O541K06147K2133j60958m1912o9962j06778o5771m5027
3899B5723361p8477j52258N5573R5753j21565M36717Q5022j55430k36103k83854
3889B5368739K3222j72523k55777j10593L398l08920k24528m5605r6457j11040
3879B4069916J23288O3014J06238K03911J76756q2999L6268J63209K57532L03374
3869B5420507N38415K21143N41548M02174N57900N81996O41511R36952P02424
3860C0544570N48089P22880Q42275R27482P39340N11458Q50056N73313R64764
3851C7224227R38905Q74481J034214R80279J128626Q98286J132530J117754J299696
$$ plain form
3920 26598287 26660325 26771937 26550018 26364523 26223212 26176014 26065860 25853008 25801231 25930666
3910 25930666 25983947 25978948 25985489 26191636 26213769 26052811 26010899 25940937 25834159 25768388 25723361
3899 25723361 25644884 25492626 25548199 25643952 25522387 25959104 26044126 25888696 25652593 25368739
3889 25368739 25391961 25219438 24963661 24853068 24856466 24547546 24323018 24277413 24180956 24069916
3879 24069916 24193204 24256218 24362456 24566367 24743123 24660124 24696392 24859601 25117133 25420507
3869 25420507 25958922 26180065 26721613 27123787 27681687 28263683 28905194 29842146 30544570
3860 30544570 31092659 31815539 32657814 33585296 34324636 34836094 35686150 36259463 37224227
3851 37224227 38163132 39037613 40071827 41052106 42180732 43079018 44211548 45329302 46628998
3842D6628998R52578J202717J094721J218004J211465J335128J259816J620696
3834E6524123J881166J853131K076584K714573L394753L569507M667879M919251
3826H1600967M217380J831811q37996k611384l754563l643720l012874k328847
3818G1460774j581799j012465n88424l54256j13074K341J32953K1432L21140P31679
3808F9020301J099617J257586J076168R73768O87850J40783k64388p57015j448801
3799G1785869j700747j854441j986449k111785j828496j328859j439140j059081
3791E8476871o92542k63999k94012N1215J90633M97514P30350Q83864J081937
3782F0661831R86883M84950J16751n03315q15162q52180j076387m35054l78886
$$ plain form
3842 46628998 47581576 48784293 49879014 51097018 52308483 53643611 54903427 56524123
3834 56524123 58405289 60258420 62335004 65049577 68444330 72013837 76681716 81600967
3826 81600967 85818347 87650158 86812162 84200778 80446215 76802495 73789621 71460774
3818 71460774 69878975 68866510 68278086 67923830 67810756 67813097 67946050 67967482 68288622 69020301
3808 69020301 70119918 71377504 72453672 73427440 74115290 74256073 73991685 73234670 71785869
3799 71785869 70085122 68230681 66244232 64132447 62303951 60975092 59535952 58476871
3791 58476871 57784329 57520330 57226318 57277533 57468166 57965680 58696030 59579894 60661831
3782 60661831 61648714 62133664 62250415 61747100 60931938 60079758 59003371 58568317 58189431
3773E8189431N7822L81628Q41427J028701J034691J054772R54129Q14990K70119
3764F4627710j98094m05151j078160j463989j887332j988323j970184j818630
3756E3817847j681872j164232q06931p29809k92747j16881l94155n90099j051341
3747D6989780j382778j694534k183364j982456k151692j538288j457091j644691
3739C2954886j463062j173436j342040r72364j178981q35725p49548p20493o98639
3730B3820598n59619n79363o04731n51033k16943k88652n63453l54950k53661
3721A9848193l43878l10018m46723j65192l13793j22823k57131k26147j15410
3712A7547078k75565p8475l04254j73865J9037j31928k77108p6213K0490j6427
$$ plain form
3773 58189431 58247253 58628881 59470308 60499009 61533700 62588472 63542601 64357591 64627710
3764 64627710 64429616 64024465 62946305 61482316 59594984 57606661 55636477 53817847
3756 53817847 52135975 50971743 50164812 49435003 49142256 49025375 48631220 48041121 46989780
3747 46989780 45607002 43912468 41729104 39746648 37594956 36056668 34599577 32954886
3739 32954886 31491824 30318388 28976348 28003984 26825003 25989278 25239730 24519237 23820598
3730 23820598 23260979 22681616 22076885 21525852 21308909 21020257 20456804 20101854 19848193
3721 19848193 19504315 19194297 18747574 18582382 18268589 18145766 17888635 17662488 17547078
3712 17547078 17271513 17193038 16888784 16714919 16733956 16602028 16324920 16248707 16269197 16252770
3702A6252770k0952Q5833k29162M2922J95663L8519m5323J1412j87962K69054
3692A6412774K25030q7159k89523o3305J54864o4435k32497R8161N8936J49858
3682A6362704o0666q5261p0241P7121J33744l0122j73822o1606K3242j71836Q9437
3671A6032694O8281j21386L2826l0358J3679N3339k28040k9923K0609J09833K17487
3660A6139041J63082q9347L2781J92065k9410J13169P4094r14L4399O9855j29093
3649A6569722J5547j18653j11017j66723O5657O3817P5564j27411j30175n7212
3639A6079116L04037P3966R6747K71430J127M87183N02041K38393J52520Q4038
3629A8290598K32532J75873n5535J75084J98370j77346j57756K07685o395N1219
$$ plain form
3702 16252770 16231818 16317651 16088489 16131411 16327074 16365593 16320270 16331682 16143720 16412774
3692 16412774 16637804 16550645 16261122 16197817 16352681 16288246 16055749 16153910 16212846 16362704
3682 16362704 16302038 16216777 16146536 16223657 16357401 16327279 16153457 16091851 16115093 15943257 16032694
3671 16032694 16100975 15979589 16012415 15982057 15995736 16049075 15821035 15791112 15811721 15921554 16139041
3660 16139041 16302123 16212776 16245557 16437622 16408212 16521381 16595475 16594561 16628960 16698815 16569722
3649 16569722 16585269 16466616 16355599 16188876 16254533 16318350 16393914 16266503 16136328 16079116
3639 16079116 16383153 16457119 16553866 16825296 16826423 17313606 17815647 18054040 18206560 18290598
3629 18290598 18523130 18699003 18643468 18818552 19016922 18839576 18681820 18889505 18883110 18934329
3619A8934329J13581R3274N9133Q2725J54280K81098L89019J56654K69275L26536
3609B0859904L94926K86792K87520J83802N63645L19340K24329O28431M86164
3600B4234853N10894M15790J8375J16395M61132N10865N23614L25838O55754M68681
3590B8242191N23955N38911Q65162P95523O98115P04260Q68867P51172P79222
3581C4767378Q36471J126736J016950R42892J071409R29089J080773R03773J120132
3572D3795603J031998J327357J349796J652868J950339K050363K315910K108747
3564E7582981K396794K551369K661120L278292L448102L376191L480039K892109
3556H1666997K493785J824102J487460J349114J562569J827301J732377K156780
$$ plain form
3619 18934329 19047910 19141184 19200317 19283042 19437322 19718420 20107439 20264093 20533368 20859904
3609 20859904 21254830 21541622 21829142 22012944 22576589 22895929 23120258 23748689 24234853
3600 24234853 24745747 25161537 25179912 25296307 25757439 26268304 26791918 27117756 27773510 28242191
3590 28242191 28766146 29305057 30170219 30965742 31663857 32368117 33236984 33988156 34767378
3581 34767378 35603849 36730585 37747535 38690427 39761836 40690925 41771698 42675471 43795603
3572 43795603 44827601 46154958 47504754 49157622 51107961 53158324 55474234 57582981
3564 57582981 59979775 62531144 65192264 68470556 71918658 75294849 78774888 81666997
3556 81666997 84160782 85984884 87472344 88821458 90384027 92211328 93943705 96100485
3548I6100485K466087K457186K187942J623417J267776Q11309L07734K37732o5467
3539A07394201l27699l14903O9743k26051q3440K22613L93357N17411O37764J177653
3529A09460649J247599J511501J421401J956120J965946K165414K219488K126433
3521A24074551K269567K284803K227096K061050K083710K404808K353538K343614
3513A42102737K273981K222053K193276J781359J174921N68112l89382q47134
3505A51079923j409336j460911j430601j199932j272159j193082j258934j374527
3497A40480441j379396j280337j118334r05046o57579l88580l5657p4957k2434
3488A34618121Q2550M85419P26915R19836J561755J964792K598623L620610M179318
$$ plain form
3548 96100485 98566572 101023758 103211700 104835117 106102893 106914202 107221936 107459668 107394201
3539 107394201 107066502 106751599 106821342 106595291 106511851 106734464 107127821 107645232 108282996 109460649
3529 109460649 110708248 112219749 113641150 115597270 117563216 119728630 121948118 124074551
3521 124074551 126344118 128628921 130856017 132917067 135000777 137405585 139759123 142102737
3513 142102737 144376718 146598771 148792047 150573406 151748327 152316439 151927057 151079923
3505 151079923 149670587 148209676 146779075 145579143 144306984 143113902 141854968 140480441
3497 140480441 139101045 137820708 136702374 135797328 135139749 134751169 134715512 134640555 134618121
3488 134618121 134700671 135186090 135913005 136832841 138394596 140359388 142958011 146578621 150757939
3479A50757939N466879O514064Q060136R293283J1181494J3186103J5076971J6292455
3471B35829324J6442251J5327468J2855800Q749829M815482J440832j455295l028824
3463B90976867l569239l785247l824137m105816n267786o906457q545055j0435372
3455B44537758j1504604j1793043j1646731j0453383q766639p313609n492865
3448A77566884l666740j963674M43749K974066N210198P263170P434734M177054
3440A99439441j411503p375437j2071768j4001593j3795324j2478610j1004524
3433A27300682r118042p847485o570703n514188n096087m221809l561443l147154
3425H2223771k723263k058201j583774j156501q15449l45342L97837O20934R48873
$$ plain form
3479 150757939 156224818 162738882 170799018 180092301 191273795 204459898 219536869 235829324
3471 235829324 252271575 267599043 280454843 289204672 294020154 295460986 294005691 290976867
3463 290976867 287407628 283622381 279798244 275692428 270424642 263518185 254973130 244537758
3455 244537758 233033154 221240111 209593380 199139997 190373358 183059749 177566884
3448 177566884 173900144 171936470 172380219 175354285 180564483 187827653 195262387 199439441
3440 199439441 198027938 190652501 178580733 164579140 150783816 138305206 127300682
3433 127300682 118182640 110335155 103764452 98250264 93154177 88932368 85370925 82223771
3425 82223771 79500508 77442307 75858533 74702032 73886583 73541241 73939078 74560012 75508885
3416G5508885J210304J456620J441738O73533J83868n33063r77737j062341j067615
3407G6834192j119789j262862q51235j026328j306530j682220j839043k300838
3399F5445347k669856k860357k474061k335548k027368j810853j605794j425616
3391D8235894j067485r46479j076163p54204o31888q64190j021600q01596p38933
3382D0333356o37541p45632o08224m14882m41059n21348n34606p48886p60527
3373C4920651o41086o13500o30598n55832p98414o13864m12656o23479l38245
3364B9692977j91204m28545j80890j70431j22958k74394R7762R546j54747r646
3354B8267470J00054r8012K10281N18249K48003K09272M58418M59161N72776P33642
$$ plain form
3416 75508885 76719189 78175809 79617547 80291080 80474948 79941885 78964148 77901807 76834192
3407 76834192 75714403 74451541 73600306 72573978 71267448 69585228 67746185 65445347
3399 65445347 62775491 59915134 57441073 55105525 53078157 51267304 49661510 48235894
3391 48235894 47168409 46221930 45145767 44391563 43759675 42895485 41873885 41072289 40333356
3382 40333356 39695815 38950183 38341959 37927077 37486018 36964670 36430064 35681178 34920651
3373 34920651 34279565 33666065 33035467 32479635 31681221 31067357 30654701 30031222 29692977
3364 29692977 29501773 29073228 28892338 28721907 28598949 28324555 28422317 28431863 28277116 28267470
3354 28267470 28367524 28269512 28479793 28998042 29246045 29455317 29913735 30372896 30945672 31679314
3344C1679314Q41759Q95993J113216J395266J577573J634847K118854J877550
3336D3134372J561457J367005N60458L75928J61239n5575l63756j71974p7242
3327D6491912j90503l94407o38866o16769j096122j362334j649424j755257j997202
3318C6791028j570267j416566j107529j018487p90222n72085m31560o07853m60865
3309B8815594j11407j95134j1423J91060N8731J24915J04344M66336K42669K68385
3299B9954070K48440K26705M15654K18462L91920L38922L91647M03127N58519
3290C3147466M45432L03886L87976M68731K36994L94359M17014O03899N51697
3281C6957454M67370M93148Q74372N53293Q38681P74837Q16456R18039Q84297
$$ plain form
3344 31679314 32521073 33417066 34530282 35925548 37503121 39137968 41256822 43134372
3336 43134372 44695829 46062834 46623292 46999220 47160459 47104884 46741128 46569154 46491912
3327 46491912 46301409 45907002 45268136 44651367 43555245 42192911 40543487 38788230 36791028
3318 36791028 35220761 33804195 32696666 31678179 30887957 30315872 29884312 29276459 28815594
3309 28815594 28704187 28509053 28497630 28688690 28747421 28872336 28976680 29443016 29685685 29954070
3299 29954070 30202510 30429215 30844869 31063331 31455251 31794173 32185820 32588947 33147466
3290 33147466 33592898 33896784 34284760 34753491 34990485 35384844 35801858 36405757 36957454
3281 36957454 37424824 37917972 38792344 39345637 40184318 40959155 41775611 42693650 43577947
3272D3577947R31904J092843J317820J066178J113858J400127J565277J569184
3264E3635138J583116J801668J778023J980019K037486K078138K664986K491341
3256G0049915K981091L201441L363296L599946L812340M116657M218023M372129
3248I9714838M542650M700562N275393N638384N973611O353222O277954O194016
3240A44670630O242393O013527N850710O291498O882558P779415Q810207J0019470
3232B02560408J0746809J1443900J1251146R909883Q183315N663622L902810L593039
3224B67254932M278554N733442O900985P454536P077067N107525J928416j722171
3216C04013286n146844p396164q688330r282679r212018q242526p841948p381894
$$ plain form
3272 43577947 44509851 45602694 46920514 47986692 49100550 50500677 52065954 53635138
3264 53635138 55218254 57019922 58797945 60777964 62815450 64893588 67558574 70049915
3256 70049915 73031006 76232447 79595743 83195689 87008029 91124686 95342709 99714838
3248 99714838 104257488 108958050 114233443 119871827 125845438 132198660 138476614 144670630
3240 144670630 150913023 156926550 162777260 169068758 175951316 183730731 192540938 202560408
3232 202560408 213307217 224751117 236002263 245912146 254095461 259759083 263661893 267254932
3224 267254932 271533486 277266928 284167913 291622449 298699516 303807041 305735457 304013286
3216 304013286 298866442 291470278 282781948 273499269 264287251 256044725 248202777 240820883
3208B40820883p568314q553385r846510j0938245j1909357j2190926j1609057
3201A68205089j0647886r411044p977225p098266o346841n994151n451528m964512
3193A10313636m628370m194005l703418l140825k859006k672689k395443k197839
3185H4522041j925925j729706j718309j400298j434303j419911j256762j352086
3177G2284741j195779j179572j110680j026403j265548j214630j323646j217419
3169F2751064j098695j017041j185033j261925j063394j112338j225713j440089
3161E3346836j065451j065511j083125j027629j135064r10177r42143j003188
3153D5114548q32159p68796p16630o33779n38476n52211n60796m02908l59300
$$ plain form
3208 240820883 233252569 224699184 214852674 203914429 192005072 179814146 168205089
3201 168205089 157557203 148146159 140168934 133070668 126723827 120729676 115278148 110313636
3193 110313636 105685266 101491261 97787843 94647018 91788012 89115323 86719880 84522041
3185 84522041 82596116 80866410 79148101 77747803 76313500 74893589 73636827 72284741
3177 72284741 71088962 69909390 68798710 67772307 66506759 65292129 63968483 62751064
3169 62751064 61652369 60635328 59450295 58188370 57124976 56012638 54786925 53346836
3161 53346836 52281385 51215874 50132749 49105120 47970056 47059879 46117736 45114548
3153 45114548 44282389 43513593 42796963 42163184 41624708 41072497 40511701 40108793 39749493
3144C9749493k14535k91235o0622o1711J9270n6161J26156J8331J19510J61609
3134C9510105K11842K53452M31390M14892M73410O06453M94819N04600K60529
3125D3161492K87696K63275l2136j4871l10869k87353n17957m42382o11537q12848
3115D0682510o68435p68989r48406r25415j046105j213394r55422j093286r22607
3106C2140451j000039r28904r25087q34654q53469r03249o49856q30869q69595
3097B4344729o10090o78492n49800o84078n17565l00538l80018o69588j85415
3088A9769145j42776l21674l21637l81083j13156l78129l03954j79820k0826k76498
3078A7329592k61115k61425p6243k37437j52064j94871m8479j06928k08667k0539
$$ plain form
3144 39749493 39534958 39243723 39183101 39121390 39140660 39084499 39210655 39228986 39348496 39510105
3134 39510105 39721947 39975399 40406789 40821681 41295091 41901544 42396363 42900963 43161492
3125 43161492 43449188 43712463 43680327 43665456 43354587 43067234 42549277 42106895 41495358 40682510
3115 40682510 40014075 39245086 38296680 37371265 36325160 35111766 34156344 33063058 32140451
3106 32140451 31140412 30211508 29286421 28451767 27598298 26695049 26045193 25214324 24344729
3097 24344729 23734639 23056147 22506347 21822269 21304704 21004166 20624148 19954560 19769145
3088 19769145 19626369 19304695 18983058 18601975 18488819 18110690 17806736 17626916 17606090 17329592
3078 17329592 17068477 16807052 16730809 16493372 16341308 16146437 16097958 15991030 15782363 15761824
3068A5761824p6629j73913j3572q4886k83707j10009k18895l4383k62103m4317
3058A4459410M3939k1186K8800j27382j74328R6791M3844O6460N7191J07214K18717
3047A4799470M8707K77161O7279J92476O6647j37832O8829Q5713n2349r928K06951
3036A5613124L31421J05057r265n7349M26758L40774N4174P4287M49978J86906
3026A7515865L10138K31195M54782K96842J55062N71558N52911M25463K71001
3017B0784817N70330L71995N74191O65427O26563N23185O49233O64078Q00119
3008B6229938O12301Q17248P88344P33568O84994P47283R52178J026843J246773
2999C3839470J268391J204299J692743J751967K028694K229609K741977K780830
$$ plain form
3068 15761824 15685195 15511282 15497710 15412824 15129117 15019108 14800213 14765830 14503727 14459410
3058 14459410 14503349 14482163 14510963 14383581 14209253 14306044 14349888 14416348 14473539 14580753 14799470
3047 14799470 14848177 15125338 15192617 15385093 15451740 15313908 15382737 15468450 15416101 15406173 15613124
3036 15613124 15944545 16049602 16040337 15982988 16409746 16750520 16804694 16878981 17328959 17515865
3026 17515865 17826003 18057198 18511980 18808822 18963884 19535442 20088353 20513816 20784817
3017 20784817 21355147 21727142 22301333 22966760 23593323 24116508 24765741 25429819 26229938
3008 26229938 26842239 27659487 28447831 29181399 29866393 30613676 31565854 32592697 33839470
2999 33839470 35107861 36312160 38004903 39756870 41785564 44015173 46757150 49537980
2991D9537980L187675L908946M789022N928364P331997P815879M522827J732470
2983H8755160p15948l215818l647044l262477k732729j963812r25908k08104J71675
2974G2254995Q53234J308422J800888J995870K682175L489023M486485O088583
2966I4959675P262193Q381684O445083L085558P26125j869391k553052j874457
2958A14563418j042945j36838J276951K296939K754602L555913M305810N003071
2950A32576921N584271O321727O493385O145330M529655J571214j107790l309629
2942A58805084n053396n232298m923050l926126k796729j082347l90085R65586
2934A36366639n63735k811212l182742m027442k934043j440058P5440J482598
$$ plain form
2991 49537980 52725655 56634601 61423623 67351987 74683984 82499863 87022690 88755160
2983 88755160 88039212 84823394 81176350 77913873 75181144 73217332 72291424 72083320 72254995
2974 72254995 73108229 74416651 76217539 78213409 80895584 84384607 88871092 94959675
2966 94959675 102221868 110603552 117048635 120134193 120860318 118990927 116437875 114563418
2958 114563418 113520473 113383635 114660586 116957525 119712127 123268040 127573850 132576921
2950 132576921 138161192 144482919 150976304 157121634 161651289 163222503 162114713 158805084
2942 158805084 153751688 148519390 143596340 139670214 136873485 135791138 135401053 136366639
2934 136366639 135802904 132991692 129808950 125781508 122847465 121407407 121482847 122965445
2926A22965445K593822K761137J904116J528190J737678K655198M133527O267909
2918A46547022Q527810J2394195J7488886K3059132K4407506R962242N35182m703273
2910B38218702j2167394r547888j2420963j5736718j4451338j3993325j0757101
2903A49143975q009039m999897k883936j409447M33238K414171M444875P943021
2895A47076961J2622952J7554111K0556124O398606m911594j0477131j2756603
2888A76063426o925120q889731j1275465j3118302j4439902j3317142j0774280
2881I7323484q300870o788865n527482m574854l948422l313352l143281k879730
2873E8846628k215355j809232j399786p34029j265816j641308j880547k374053
$$ plain form
2926 122965445 125559267 128320404 130224520 131752710 133490388 136145586 140279113 146547022
2918 146547022 155074832 167469027 184957913 208017045 232424551 242386793 242921975 238218702
2910 238218702 226051308 216503420 204082457 188345739 173894401 159901076 149143975
2903 149143975 141134936 136135039 133251103 131841656 132274894 134689065 139133940 147076961
2895 147076961 159699913 177254024 197810148 204208754 199297160 188820029 176063426
2888 176063426 169138306 160248575 148973110 135854808 121414906 108097764 97323484
2881 97323484 89022614 82233749 76706267 72131413 68182991 64869639 61726358 58846628
2873 58846628 56631273 54822041 53422255 52688226 51422410 49781102 47900555 45526502
2865D5526502j925131j940423j737524j458390j347845r96403j006873r85376
2857C4128537n35881k48646m32287m38387n28417k26094J08792J85936O26587
2848C2640140j32491q51288j159500j475574j355754j260360j060520r54047q04274
2839B3586332o55519n47795o00605m19583l01584k79275n15926m53047n46442
2830A9266556l87035m63696n89043o25167j48913m38731l47202k23275k24397
2821A5819097k93615l09259m52065m13082q6064j99537k92230k25784k95549l50712
2811A2901200k60650r0607k54185j45276j12972j82074k73009o8002k17404j02499
2801A1194522j16250j10246k31045Q8800k30664l25071k52246m9030m1464j65588
$$ plain form
2865 45526502 43601371 41660948 39923424 38465034 37117189 36120786 35113913 34128537
2857 34128537 33592656 33344010 32911723 32473336 31944919 31718825 31827617 32013553 32640140
2848 32640140 32507649 31656361 30496861 29021287 27665533 26405173 25344653 24390606 23586332
2839 23586332 22930813 22383018 21782413 21362830 21061246 20781971 20266045 19812998 19266556
2830 19266556 18879521 18415825 17826782 17201615 17052702 16613971 16266769 16043494 15819097
2821 15819097 15525482 15216223 14764158 14351076 14265012 14065475 13773245 13547461 13251912 12901200
2811 12901200 12640550 12549943 12295758 12150482 12037510 11855436 11582427 11514425 11297021 11194522
2801 11194522 11078272 10968026 10736981 10825781 10595117 10270046 10017800 9968770 9927306 9761718
2791I761718j96811k45597j14650k43037j8433l56939p5772L1506r4580l16978
2781H130427J31661J16112p7540j18257l1931j74696o649R751K09079j31591m7163
2770H009203j91962L6637J1494j15323j7277M1413j82099M4196k23103j35070
2760G278109J22049L9054K21449R9992j49539r3706R2431O2157j08753K62327
2750G825570J82216J49558j68507J74468K60715m6919j7845K46744N7880Q556
2740H672436L0208R5790k0492K716J01791k2348K83822K56652p598J53046K02969
2729I748992K33090J87923K32630K74949J42855M61199M14826M81223N07101L56450
2719A3041238N73710M43390L88824M78947N26435O43468M94830J91113K62188
$$ plain form
2791 9761718 9564907 9319310 9204660 8961623 8943190 8586251 8510479 8541985 8447405 8130427
2781 8130427 8262088 8378200 8300660 8182403 8150472 7975776 7969127 7978878 8187957 8056366 8009203
2770 8009203 7817241 7853878 7865372 7750049 7732772 7774185 7592086 7636282 7413179 7278109
2760 7278109 7400158 7439212 7660661 7760653 7611114 7517408 7609839 7671996 7563243 7825570
2750 7825570 8007786 8157344 7988837 8163305 8424020 8377101 8359256 8606000 8663880 8672436
2740 8672436 8702644 8798434 8777942 8780658 8882449 8860101 9143923 9400575 9392977 9546023 9748992
2729 9748992 9982082 10170005 10402635 10677584 10820439 11281638 11696464 12177687 12684788 13041238
2719 13041238 13614948 14058338 14447162 14926109 15452544 16096012 16590842 16781955 17044143
2710A7044143K58686M24794M06746R6575K16133K07928M46404N46675K44780O49719
2700B0542583Q14688M59675R14870R74540J010656J063876P47505R68096R63739
2691B8460228O70901O80575p1489m89878q00143r02403r18873o07444n49808j84424
2681B5287242j49185K71723M95395J97084K38332N09125L73426O81608N32643
2672B8437393L55057J8561J18178o6455l70964m86496j017603r08165j036069
2663B5043437q33789q65908r09194p71933m43048j12313l04200j97325j91889
2654B0413838j02329k26553m92079k60990m60033p16150p93933o01751p56851
2645A6003169r15891o17927p65427p14855p67675n75822n08219j96314m06945
$$ plain form
2710 17044143 17302829 17727623 18134369 18230944 18447077 18655005 19101409 19648084 19892864 20542583
2700 20542583 21357271 21816946 22731816 23706356 24717012 25780888 26528393 27496489 28460228
2691 28460228 29131129 29811704 29740215 29250337 28450194 27547791 26628918 26021474 25471666 25287242
2681 25287242 25138057 25409780 25905175 26102259 26340591 26849716 27223142 27904750 28437393
2672 28437393 28792450 28811011 28929189 28862734 28491770 28005274 26987671 26079506 25043437
2663 25043437 24209648 23343740 22434546 21662613 21219565 21107252 20803052 20605727 20413838
2654 20413838 20311509 20084956 19592877 19331887 18871854 18155704 17361771 16760020 16003169
2645 16003169 15087278 14469351 13703924 12989069 12221394 11645572 11137353 10941039 10534094
2636A0534094l65281r6859k81456l80799m37729k76682r9660l42027l42198k35151
2626G676252l32926l05973j32181k22482j51064o6558k05602l38611j71825k40035
2616E508995k00827j89799k2732k33335j00953J07753k13288j59905j83497k641
2606D309771O6815j21545k20066N7006k58650k9280J30704m9747j56185j67798
2596C561025j45282r6548k36153j3417N8689j21420m0358r6610j12313R5462k71274
2585B581801j76555R4010M8192o6326l664j59821j3196k5826r2701Q9002j51715
2574B123201n5704n8597J4438k0423j24142K09867j42235j55713p3221P7647R1211
2563A886329k6686j57693k3642l3004j09328r6379R2481k67699J75495j17169
$$ plain form
2636 10534094 10168813 10071954 9790498 9409699 8971970 8695288 8595628 8253601 7911403 7676252
2626 7676252 7343326 7037353 6905172 6682690 6531626 6465068 6259466 5920855 5749030 5508995
2616 5508995 5308168 5118369 5095637 4862302 4761349 4869102 4655814 4495909 4312412 4309771
2606 4309771 4376586 4255041 4034975 4091981 3833331 3804051 3934755 3885008 3728823 3561025
2596 3561025 3415743 3319195 3083042 3069625 3128314 3006894 2966536 2869926 2757613 2853075 2581801
2585 2581801 2405246 2499256 2547448 2481122 2477458 2317637 2304441 2278615 2185914 2274916 2123201
2574 2123201 2067497 2008900 2023338 2002915 1878773 2088640 1946405 1790692 1717471 1795118 1886329
2563 1886329 1859643 1701950 1678308 1645304 1535976 1439597 1532078 1264379 1439874 1322705
2553A322705J9984J79981k76959r7870J56801j8626k2188K1557m5293j24094J55373
2542A271371R4082l1437L228j98903k1566l4782J46293q6317O7004k47184j02773
2531H59016O1763J26705q9994p236o6387J24103J80016l10743Q7240K75960k29002
2520A011441O9256P0873j03631j66159k44890R224l4874q9104J96136J20712Q6343
2509I25327r0155J6272k232m3129J34484j42960p0793j17900n483K03228r9126
2498G07533J5227q8542L7630O5870K8245j0932O4120R5252j13431j02549j31546
2487E66877q0137r1830J17443K10892K4734j08419l6999J20825j59351L3037L6941
2476F34013n8426J30295K5572r5788j13617J27520n9362j43331J12316n2480L3248
$$ plain form
2553 1322705 1342689 1522670 1245711 1147841 1304642 1286016 1263828 1285385 1240092 1115998 1271371
2542 1271371 1365453 1334016 1337244 1138341 1116775 1081993 1228286 1141969 1208973 961789 859016
2531 859016 920779 1047484 957490 950254 883867 1007970 1187986 877243 964483 1240443 1011441
2520 1011441 1080697 1151570 1047939 881780 636890 646114 611240 522136 718272 838984 925327
2509 925327 835172 851444 849212 806083 940567 797607 726814 608914 603431 806659 707533
2498 707533 722760 634218 671848 737718 765963 755031 819151 914403 800972 698423 566877
2487 566877 486740 394910 512353 723245 747979 639560 602561 723386 564035 597072 634013
2476 634013 575587 705882 731454 635666 522049 649569 590207 446876 559192 506712 539960
2465E39960N3729K2775k0919j49692k9060o0469K09938N6684K1382O3474O5879
2454G73681j19027N8386k23157j95386P1566J13570J16310r8624l6188o1874R5529
2443D94786n7001o3353P9836J31179q9093j42292M4350o4167j24927J55674R4174
2432D59166o6012j81295K33639j82225o4483P5876l5598R5380p8652K2303j61795
2421A16304J14876M228j14918J41757n2734l1918L0889Q6414J05410j71092Q1125
2410C10341p9637m2413j7214l3287R3434R9579j16499Q0489j24705O7102j61356
2399G5834j9121J24339J36428L3651l9613o9412q1348o4353J56774K0039j0881
2388B62337l8393n1343L011J7198K01493j69820k9553q1374n364J42517R7046
$$ plain form
2465 539960 593689 616464 595545 445853 416793 356324 566262 622946 644328 707802 773681
2454 773681 654654 713040 489883 294497 366063 479633 595943 497319 461131 399257 494786
2443 494786 437785 374432 454268 585447 496354 354062 398412 334245 209318 364992 459166
2432 459166 393154 211859 445498 263273 198790 274666 239068 334448 255796 278099 116304
2421 116304 231180 235408 120490 262247 209513 177595 208484 294898 400308 229216 310341
2410 310341 230704 188291 171077 137790 231224 330803 214304 294793 170088 237190 75834
2399 75834 56713 181052 317480 351131 311518 242106 160758 96405 253179 273218 262337
2388 262337 223944 172601 175612 192810 394303 224483 194930 113556 108192 250709 347755
2377C47755j07778p5169n3074q6773O0293J80942j67774R4385j43943J63573j44947
2366F7490L6130K616p0312o2669L252P8147l6556J90646j26758j17026O4469m737
2354B4692O095j35627J05111p6685p7529K21166J1161o1939o0265Q2581o44L3828
2342G1945r6220J47210k1002k18258J77334k06196J07204J55281j58858k763P3588
2331B9265L34524J24129k13862k70825q6781L1907J5720J11142l1970r9681Q8156
2320C1724l6646K2107m4289m3048j15025L12924j60533Q0752j16637q6970L0747
2309a24894J24760k25762J11261j7899L4902J58617j22913N0614j12769m6578
2299a70661J15955L7085L6359j05316p9376L7938K04401j37745j62557K31913
$$ plain form
2377 347755 239977 164808 111734 24961 85254 266196 98422 192807 48864 212437 67490
2366 67490 103620 106236 35924 -26745 -23493 54654 18098 208744 81986 -35040 29429 24692
2354 24692 30787 -104840 271 -76414 -153943 67223 78384 16445 -43820 38761 38117 71945
2342 71945 -24275 122935 101933 -116325 61009 -145187 -37983 117298 -41560 -44323 29265
2331 29265 363789 487918 274056 3231 -83550 -51643 -35923 75219 43249 -56432 31724
2320 31724 -4922 17185 -27104 -70152 -185177 127747 -32786 47966 -68671 -155641 -124894
2309 -124894 -134 -225896 -114635 -132534 -97632 60985 -61928 -11314 -124083 -170661
2299 -170661 -54706 -17621 18738 -86578 -165954 -128016 76385 -61360 -223917 7996
2289G996M0897N5696j88535k3047K31387J17668Q953p3008j31535p2854j69874
2278a96256J62804j83349J30606r1864k6404K07718L6719K0728J8227o0445l0251
2267a1767q6154N6815L9563J34739k66728q4537J96917J9872l4493o9407j0445
2256a15625K0593j04890J23987j5804L0575k3913j42995J01239J5421n8502J78263
2245H349p2269j1517j92782j12904R8731J71581p5367N1997j35620J28050Q6207
2234e5544L9743N1008J1113O9902k70717L3459n8819n1760K8211K6832J01588
2223g4984k8571M6274j09186J6658K3638o9316o9831R1039K69738m20522Q4254
2212b40809P5063r2496L6390L6613J62581J27124q7153k67583j98333K07146K01635
$$ plain form
2289 7996 48893 104589 -83946 -106993 124394 242062 251015 178007 46472 -26382 -196256
2278 -196256 -33452 -216801 -86195 -178059 -204463 3255 39974 60702 78929 18484 -11767
2267 -11767 -97921 -41106 -1543 133196 -133532 -218069 -21152 -1280 -35773 -105180 -115625
2256 -115625 -95032 -199922 -75935 -91739 -61164 -85077 -228072 -126833 -111412 -169914 8349
2245 8349 -63920 -75437 -268219 -381123 -282392 -110811 -186178 -134181 -269801 -141751 -55544
2234 -55544 -15801 35207 46320 116222 -154495 -121036 -179855 -231615 -203404 -176572 -74984
2223 -74984 -103555 -57281 -166467 -149809 -126171 -195487 -265318 -174279 95459 -325063 -240809
2212 -240809 -165746 -258242 -221852 -185239 -22658 104466 17313 -250270 -448603 -241457 -39822
2201c9822l7265p9741P3357j44666J87514q1117P4556N0039j70080J8494J91251
2190D2520j0033p9890r7362J58510J99738r5651k15283K8949O4175J29836q9845
2179C5664o0542j5275L1465J00165Q6130N536j17969j33102J7708q4956K83132
2168A47956k1310p9486J09331K4946n0185r2386J99370m8675K9326J42056L5553
2157C96496j04351j54132J6223J44179R7969j90172R8901J47612r5573L6919J35243
2146E29314q3983J18399J92032n5935l8693L3227Q0892J14564J03680J1831n4779
2135I50549l7897O4760J69261j7306j26660J87856J8280L3566J41743K16069j0222
2124A589999P1265P1830K36803K7442j38469K60240K90360K78774l7492J9221
$$ plain form
2201 -39822 -77087 -156828 -83471 -228137 -40623 -121740 -47184 2855 -167225 -148731 42520
2190 42520 32487 -47403 -144765 13745 213483 117832 -97451 -68502 -4327 125509 35664
2179 35664 -24878 -40153 -8688 91477 177607 183143 65174 -67928 -50220 -135176 147956
2168 147956 126646 47160 156491 181437 131252 38866 238236 189561 218887 360943 396496
2157 396496 292145 138013 154236 298415 396384 206212 305113 452725 357152 394071 529314
2146 529314 445331 563730 755762 699827 661134 694361 775253 889817 993497 1005328 950549
2135 950549 912652 977412 1146673 1129367 1002707 1190563 1208843 1242409 1384152 1600221 1589999
2124 1589999 1661264 1733094 1969897 1997339 1858870 2119110 2409470 2688244 2650752 2669973
2114B669973J82589J87508J64230J43812K71917L64148K22658L48816M78336K23940
2104E257927M23878O55463N82709Q33425O63990R57445J366979J216131K205022
2095A4162969K469777L856608N395664O167927P78662j809347m129811n271562
2087B1620887l882428l092450k439289j700069j075955j113251m68142o35541
2079G213762q11352p95692l77571o35452n17579l20501k40567l42950r6227l20719
2069B755152k75715j11990j56475j28626M3448j93843L392k05724o8656P3821
2059A734784o366l40430L3445j21280q1784n774J8775k11919j46336p1647J28371
2048I29839P1999j14583j21307J47140l28l6408o2235k716j54792j9945J09346
$$ plain form
2114 2669973 2852562 3040070 3204300 3348112 3620029 3984177 4206835 4555651 5033987 5257927
2104 5257927 5681805 6337268 6919977 7753402 8417392 9374837 10741816 11957947 14162969
2095 14162969 16632746 20489354 25885018 32052945 32831607 31022260 26892449 21620887
2087 21620887 17738459 14646009 12206720 10506651 9430696 8317445 7849303 7213762
2079 7213762 6402410 5606718 5229147 4593695 4076116 3755615 3515048 3172098 3075871 2755152
2069 2755152 2479437 2367447 2210972 2082346 2125794 1931951 1935343 1729619 1660963 1734784
2059 1734784 1728418 1387988 1421433 1300153 1218369 1212595 1231370 1019451 873115 801468 929839
2048 929839 1001838 887255 765948 913088 912760 876352 814117 811401 656609 636664 746010
2037G46010o6686p0051l3204o7924k01152J29610q5231N0957k1403j8949K51039
2026F13016N0498r5101o9698j02496k30630L7858Q3937l257j27630P2604K03851
2015D32952k02644n8469k3869o2347J86346j47277r6119J03438j11030J99176
2005B20157j24562n4972J71800K5696j02099J6230j06257J48514j09256r2555
1995g304q5605J82498l0754k1766O1118l1974l9736J1126k0022j33881J76657
1984F0357n034M9945k11139J58539j7828K830N1596J42968m6513j38586Q4833
1973A31968j13948r0902J05297m2142j38537J31201o2087m5105j9717J44067q1567
1962h1472r8648o8292K00236J21144j08156J17404O3856j07958j54690j3880j08094
$$ plain form
2037 746010 679324 609273 576069 508145 306993 436603 351372 402329 380926 361977 613016
2026 613016 663514 568413 498715 396219 165589 203447 287384 284127 156497 229101 432952
2015 432952 230308 171839 147970 85623 271969 124692 28573 132011 20981 220157
2005 220157 95595 40623 212423 238119 136020 152250 45993 194507 85251 -7304
1995 -7304 -92909 89589 58835 37069 98187 66213 26477 37603 17581 -116300 60357
1984 60357 55323 105268 -105871 52668 34840 37670 89266 232234 185721 47135 131968
1973 131968 18020 -72882 32415 -9727 -148264 -17063 -79150 -124255 -143972 95 -81472
1962 -81472 -180120 -248412 -48176 72968 -35188 82216 146072 38114 -116576 -130456 -238550
1951b38550J70395K6346l5617O367j23238O6483J88985j7905j94591R6719p309
1940f1915j36051K6535J53759k68633L4944J0391J57313P0689j11409q0886j227
1929b06490K04292j76726J14511j0503J29207o3765k3075k85956J01898p5340
1919b91947R4025J2044M6373j90908J13770L1846q9686J11934r6535J08739J5845
1908a34500k56219n2587J00332J59032J15601p2616q8206J01670J05836j49774
1898a71431J10038j25374j5469J39184J87527m1102p1565n1405L0784r0721n9962
1887a59496J63894q5980j20333K01913j85336J56206n5613N0342R3492p6815k2753
1876d0479j8085o8897L9064p4128J33681j02108m766J75981o3327j6184m0407
$$ plain form
1951 -238550 -68155 -41809 -77426 -71059 -194297 -127814 61171 43266 -151325 -54606 -61915
1940 -61915 -197966 -171431 -17672 -286305 -251361 -240970 -83657 -12968 -124377 -205263 -206490
1929 -206490 -2198 -178924 -64413 -74916 54291 -9474 -32549 -318505 -216607 -291947
1919 -291947 -197922 -185878 -139505 -330413 -216643 -184797 -274483 -162549 -259084 -150345 -134500
1908 -134500 -390719 -443306 -342974 -183942 -68341 -140957 -229163 -127493 -21657 -171431
1898 -171431 -61393 -186767 -202236 -63052 124475 83373 11808 -39597 -8813 -99534 -159496
1887 -159496 4398 -81582 -201915 -2 -185338 -29132 -84745 -34403 59089 -17726 -40479
1876 -40479 -58564 -127461 -88397 -162525 -28844 -130952 -135718 40263 -23064 -39248 -79655
1865g9655k35146m0368o010K37268J63941q8385k11504k4461J39756k0728K41685
1854G6393k31711k7982p3920k6385J41759n2269n1880p0077J63969k7056J90885
1843A1726J9927k93346O6543J56368j39477M7196o6131K3860J09370j05532K322
1832a67174j90216J17373M5384J26654J3917j29648M3867n7550o9929l7933J56760
1821a48495Q8085j08992k7076n9579k0779J30205M0394l8153L506Q6058K32383
1810A77557j72061j67225j4920N5926j12658K5438O2939N9951J6098K9976l4983
1799g3962j13725q8821P3663p0544j32640K16285j79505q7381K48461r3629N4465
1788b47333J72782J20470n0789j71759r3865j5186j877N5312j25423J04534p4352
$$ plain form
1865 -79655 -314801 -355169 -361179 -123911 40030 -48355 -259859 -284320 -144564 -165292 76393
1854 76393 -155318 -183300 -257220 -283605 -141846 -194115 -245995 -316072 -152103 -179159 11726
1843 11726 31653 -261693 -195150 -38782 -178259 -131063 -197194 -173334 -63964 -169496 -167174
1832 -167174 -357390 -240017 -194633 -67979 -54062 -183710 -139843 -197393 -267322 -305255 -148495
1821 -148495 -60410 -169402 -196478 -256057 -276836 -146631 -106237 -144390 -140884 -54826 177557
1810 177557 5496 -161729 -176649 -120723 -233381 -207943 -145004 -85053 -68955 -38979 -73962
1799 -73962 -187687 -276508 -202845 -273389 -406029 -189744 -369249 -456630 -208169 -301798 -247333
1788 -247333 -74551 45919 -4870 -176629 -270494 -285680 -287557 -232245 -357668 -253134 -327486
1777c27486R6896O7724O6096Q0850p0252j43371K2968J62278j27294P497k00738
1766c64832J06840q1864J80783P7594M7269j23980J9633N5418j64402j07768K18043
1755a37266O5073k11485O7638r4769R5470m0821Q6251O2200q6627q8657o534k44587
1743e34114Q3946J35946K08583J38655J57654j36601k77490L3488r9880L6604
1733b53209j02910K39941P1685k35802Q0661q0592o5737Q2770L9747J70143q9525
1722a42828N0380p8647J10334n2102k7450O1822M2040k13086k015q6182N3842
1711b83892J13135n6662J70691Q3394p6772p5347o9874l8217Q5133o9090K2763
1700a94738J94252j650p2890J12928O517J73864j88644k21253J03310J85586k01680
$$ plain form
1777 -327486 -230590 -162866 -96770 -15920 -86172 -229543 -206575 -44297 -171591 -164094 -364832
1766 -364832 -257992 -339856 -159073 -81479 -34210 -158190 -138557 -83139 -247541 -355309 -137266
1755 -137266 -72193 -283678 -216040 -310809 -215339 -256160 -169909 -107709 -194336 -282993 -289527 -534114
1743 -534114 -450168 -314222 -105639 33016 190670 54069 -223421 -189933 -289813 -253209
1733 -253209 -356119 -116178 -44493 -280295 -199634 -280226 -345963 -263193 -223446 -53303 -142828
1722 -142828 -92448 -171095 -60761 -112863 -140313 -78491 -36451 -249537 -251552 -337734 -283892
1711 -283892 -170757 -227419 -56728 26666 -50106 -125453 -195327 -233544 -148411 -217501 -194738
1700 -194738 -486 -2136 -75026 37902 44419 218283 29639 -191614 -88304 97282 -104398
1689a04398p905M6177j36895K55447r1810j29717L1743j98998m3478P4442P4352
1678b31040J27704K26220k87503M7832K03702k23214j945P2071P4202J3191l30129
1667c08909J78885P3527n4936J51165k65463P8994O6028M4695j76982M04k8232
1656b40824Q7913k9020k0168N7655K6170M2631k816k5612k09067k5041M1067J6488
1644b80624r1342m892Q7832J13512j9847k2000J09646j89045q5151K55095N7562
1633f9254j67334j29956J98150O210P3067J7785j27141l0604J495j03960l7369
1622c68911R4672P4520J20994J24146k25790o883O3970N3722Q6655k15953L4333
1611a64525P26m8201J57385j23693k57095J97034J3977k53395J50147k06606J98538
$$ plain form
1689 -104398 -112303 -66126 -203021 52426 -39384 -169101 -137358 -336356 -379834 -305392 -231040
1678 -231040 -103336 122884 -164619 -116787 86915 -136299 -138244 -66173 8029 21220 -308909
1667 -308909 -130024 -56497 -111433 39732 -225731 -146737 -80709 -36014 -212996 -212592 -240824
1656 -240824 -152911 -181931 -202099 -144444 -118274 -75643 -78459 -104071 -313138 -338179 -297112 -280624
1644 -280624 -371966 -376858 -289026 -175514 -195361 -217361 -107715 -296760 -381911 -126816 -69254
1633 -69254 -236588 -366544 -168394 -162184 -89117 -71332 -198473 -229077 -227582 -331542 -368911
1622 -368911 -274239 -199719 -78725 45421 -180369 -187252 -123282 -69560 17095 -198858 -164525
1611 -164525 -163799 -212000 -54615 -178308 -435403 -238369 -224392 -477787 -327640 -534246 -335708
1600c35708J48986J4021K5739j62742R9909M7248j74786K8270J36865j14116Q4038
1589b02276j41483O4944J28039o4861J32901j20362m4520K14655l15625J92349
1579a56239n5477j06225J43915K35906q5948j10373j16794j2341J00845j8987
1569a81718K4846l0696o973j33769J02140J35743r7526q6865Q8019k3422J7102
1558a93119J76353j52038Q8814M0722j22727R8173j55306j53512J65268N9003
1548a48369j04149N0478R0602j0252q705Q9187k19283N3809J1918K3008p7786
1537b49542M5122N3709m1101M7148r025n9224R2803K5255J7308n9808K0230j16562
1525b33687O1805J32423p1621L416o0409J11398J5590o639k9758j58756j36674
$$ plain form
1600 -335708 -186722 -172701 -146962 -309704 -209795 -162547 -337333 -309063 -172198 -286314 -202276
1589 -202276 -343759 -278815 -150776 -215637 -82736 -203098 -247618 -32963 -348588 -156239
1579 -156239 -211716 -317941 -174026 61880 -24068 -134441 -251235 -263576 -162731 -181718
1569 -181718 -156872 -187568 -194541 -328310 -226170 -90427 -187953 -274818 -186799 -210221 -193119
1558 -193119 -16766 -168804 -79990 -39268 -161995 -63822 -219128 -372640 -207372 -148369
1548 -148369 -252518 -202040 -111438 -121690 -130395 -41208 -260491 -206682 -194764 -171756 -249542
1537 -249542 -204420 -150711 -191812 -144664 -153689 -212913 -120110 -94855 -77547 -137355 -117125 -233687
1525 -233687 -171882 -39459 -111080 -107664 -168073 -56675 -41085 -47724 -77482 -236238 -372912
1514c72912K42582N051n8381j54778J10556J31318k10852K89371k6171R641j26490
1503a61065N9109Q2405j97586Q8742N4485k66N5931N5618R2865k00658n9260o8756
1491a98436j22679J54244m4948L6107K02469j86726m3658L3667j13013n3224r9655
1480d35852J01056Q4544J23027P1982l3837M6783n1386j49029K4764j09181L5392
1469b91737K47453L0505k8649q9348m4619m5390r393o5569N3659J88674j15502
1458a69916P135M5400k1880M8266K69593o8451l26643n3255K35449R2173j9339
1447C8532j54212m1290r727Q8279k36482n4040J97035K6054O5948o0730j93200
1436c33833O4786o8223J40408K55496j18045k6532L6946O8241M7290j22040l2290
$$ plain form
1514 -372912 -130330 -125279 -183660 -338438 -227882 -96564 -307416 -18045 -44216 -34575 -161065
1503 -161065 -101956 -19551 -217137 -128395 -73910 -74176 -18245 37373 130238 -70420 -129680 -198436
1491 -198436 -321115 -166871 -211819 -175712 26757 -159969 -203627 -169960 -282973 -336197 -435852
1480 -435852 -334796 -250252 -127225 -55243 -89080 -42297 -93683 -242712 -217948 -327129 -291737
1469 -291737 -44284 -13779 -42428 -131776 -176395 -221785 -231178 -296747 -243088 -54414 -169916
1458 -169916 -162781 -117381 -139261 -90995 178598 110147 -216496 -269751 -34302 57871 38532
1447 38532 -115680 -156970 -166697 -78418 -314900 -368940 -171905 -145851 -79903 -140633 -333833
1436 -333833 -269047 -337270 -196862 58634 -59411 -85943 -48997 19244 66534 -55506 -87796
1425h7796N3232l3253o4734n7544K2992N4232K601j29795j03963j67439K08641
1414c02826K46174l1726K49817l12730p4190L0768n5781k204j05982o305R3422
1403b71563J17958R4502m999J18946R5038k07392j12150L0987n4243Q9891P2974
1392c0051p5266k0482J20293N5870j7306L717o1633j91180P1652M3229o8717N5930
1380a13944k58285J31878K17886j66675K4759O3335j17512q9816P5454O5715j62719
1369c29924P6729K26311m6027j08881j06832J21637J27811j96200j090J02123
1359a34343O6296j20632J06945n7394K4074J28391M9204j65704K03968m7991j05687
1348e2873j32076J5191l5427Q1677k41613J49028j32842K92362m138j31717J92041
$$ plain form
1425 -87796 -34564 -67817 -132551 -190095 -167103 -112871 -110270 -240065 -344028 -511467 -302826
1414 -302826 -56652 -88378 161439 -151291 -225481 -194713 -250494 -252698 -358680 -364985 -271563
1403 -271563 -153605 -59103 -64102 54844 149882 -57510 -169660 -138673 -192916 -103025 -30051
1392 -30051 -105317 -125799 -5506 50364 33058 36775 -24858 -216038 -144386 -101157 -169874 -113944
1380 -113944 -372229 -240351 -22465 -189140 -164381 -101046 -218558 -308374 -232920 -167205 -329924
1369 -329924 -253195 -26884 -72911 -181792 -288624 -166987 -39176 -235376 -236466 -134343
1359 -134343 -68047 -188679 -81734 -139128 -115054 13337 62541 -103163 100805 52814 -52873
1348 -52873 -184949 -169758 -205185 -123508 -365121 -216093 -348935 -56573 -60711 -192428 -387
1337c87j78622N4784n6934o7037J19804Q1550O0977r6911l9088N254J6269o3069
1325a63410J20057p1824M8217Q4880L6791p1925j56082k6991j07185Q7833O0496
1314a59143J00023p9038j37171Q807J63523J7492o2843J74518p4881j45043Q2099
1303a11657j1185J5266p6978Q1035k0783Q5895j85405Q3972J6368Q9340k01192
1292b35324J97783K5643r6589r3883J69662p0031n0407R8709o5163j93921M2462
1281b71059J80152J85932L5627r6911q5647j28339Q509M3741j30915K00223K1747
1270c6940k0634Q9126J2492j19345O7332j19898J51528j28054k04231J63403J02387
1259d2834q6856m2580l8372j50602R3665L8054P1187J26296M4734p3348L2978
$$ plain form
1337 -387 -179009 -124225 -181159 -248196 -128392 -46842 14135 -82776 -121864 -116610 -100341 -163410
1325 -163410 -43353 -115177 -66960 17920 54711 -17214 -173296 -200287 -307472 -219639 -159143
1314 -159143 -59120 -138158 -275329 -266522 -102999 -85507 -148350 26168 -48713 -193756 -111657
1303 -111657 -122842 -107576 -184554 -103519 -124302 -38407 -223812 -139840 -123472 -34132 -235324
1292 -235324 -37541 -11898 -108487 -202370 -32708 -102739 -153146 -54437 -119600 -313521 -271059
1281 -271059 -90907 95025 130652 33741 -51906 -180245 -171736 -127995 -258910 -58687 -36940
1270 -36940 -57574 31552 44044 -75301 -7969 -127867 23661 -104393 -308624 -145221 -42834
1259 -42834 -129690 -172270 -210642 -361244 -267579 -229525 -158338 -32042 12692 -60656 -27678
1248b7678o8296l8528j51548J21623L1257j2265Q9957k1687K5676J48275k79878
1237a83092n1934J37042L2596P145J7455j95990J63310j5683m2843n5723R4463
1226i3254j578k10145K31981J75587k00172j96587J88019N0059q9463k8363N3910
1215a20006N0515J1119r5962P4500Q495N6531p3927j56643K48165l2428L0527
1204H86o7170O2593K07667l41091L8287J15294n408o0687R1827n2425P2716Q245
1192G0734k11302Q6954j27503N5793M0971k9432N8659j0555O7490R2131j88882
1181i4942j69538J20572p060L1361K31702p7677n166j66909J37875p1172j3442
1170h4396L8626n6750J96813m0795J4571n5926j2213q7232j91073Q5952J97880
$$ plain form
1248 -27678 -95974 -134502 -286050 -164427 -133170 -145435 -55478 -77165 -51489 96786 -183092
1237 -183092 -235026 -97984 -65388 -58243 -40788 -236778 -73468 -89151 -131994 -187717 -93254
1226 -93254 -94832 -304977 -72996 102591 -97581 -294168 -106149 -56090 -145553 -173916 -120006
1215 -120006 -69491 -58372 -154334 -79834 -71339 -14808 -88735 -245378 2787 -29641 886
1204 886 -66284 -3691 203976 -137115 -98828 16466 11058 -49629 42198 -10227 62489 70734
1192 70734 -140568 -53614 -181117 -125324 -84353 -113785 -55126 -65681 1809 93940 -94942
1181 -94942 -264480 -143908 -150968 -119607 112095 34418 29252 -137657 218 -70954 -84396
1170 -84396 -45770 -102520 94293 53498 68069 12143 -70 -87302 -278375 -192423 5457
1159E457j03709p4046p3459L8562J85556j23250Q646J08804q9483n7398q5126
1148b59446K7184R8981J61381k6127k16867O0079J7324J23869k76588O8324K38586
1137A6700K1004m8047m3172m2345N9907m661l0648J49075r2458l4588J2319K6957
1125i957K7391j26205j11188Q41j83026K0251K86018J38221j79485p0j1784m0608
1113a89601Q1179m9194R0611N1774p0119p2229j6585J9167J843N5475O291L02837
1101B11449n1057j77259p7093J30290M4331o1031j67184q0643J13746j03666J33809
1090h4308J8129j9652J8945P0649m8459j51253m846J3287J48744J55218j77855
1079f1401r3075K52975K8408K2084j14093n2257J08686j29761n9488M3200q0518
$$ plain form
1159 5457 -98252 -172298 -245757 -207195 -21639 -144889 -136243 -27439 -116922 -174320 -259446
1148 -259446 -232262 -133281 28100 1973 -214894 -154815 -137491 -13622 -290210 -221886 16700
1137 16700 37704 -10343 -53515 -95860 -35953 -40614 -71262 77813 -14645 -49233 -36914 -9957
1125 -9957 17434 -108771 -219959 -219118 -402144 -381893 -95875 42346 -137139 -137209 -148993 -189601
1113 -189601 -108422 -157616 -67005 -15231 -85350 -157579 -174164 -154997 -153154 -97679 -91388 211449
1101 211449 160392 -16867 -93960 36330 80661 19630 -147554 -228197 -114451 -218117 -84308
1090 -84308 -66179 -85831 -66886 3763 -44696 -195949 -200795 -187508 -38764 116454 -61401
1079 -61401 -154476 98499 126907 148991 34898 -17359 91327 -38434 -97922 -54722 -135240
1068a35240j10674j21864K40620O2615N8214J61184m3471j64693P8776L9325p2493
1057g701J26727j06419k00375P5731J26526m32j91992L0576k3296P1471J36937
1046C7753l1563j1361k17434J67592J7025o023q3352j96969K07555K52967k24822
1035h8632L4540j30465J0182J2496j1299J45943J15199k32842R8736N1895r9926
1024i4173r7209J4040J14831O8781Q4321q9786m6243J4843J15678o0993K1210
1013D5300j04865J26429o1525l2187M9807j28658K10889M3419m4935o4863p5787
1002c6976J4170r0246Q6360J6150n7966M2874k3319j92797K49774k42008P2710
991a61274K08651p0005L2423j97614k6606J48189J098n2492J10746p8497j29324
$$ plain form
1068 -135240 -245914 -367778 -127158 -64543 -6329 154855 111384 -53309 25467 64792 -7701
1057 -7701 119026 12607 -187768 -112037 14489 14057 -177935 -147359 -170655 -99184 37753
1046 37753 6190 -5171 -222605 -55013 -37988 -44011 -127363 -324332 -116777 136190 -88632
1035 -88632 -54092 -184557 -174375 -161879 -173178 -27235 87964 -144878 -46142 5753 -94173
1024 -94173 -191382 -177342 -62511 6270 90591 805 -45438 -30595 85083 24090 45300
1013 45300 -59565 66864 5339 -26848 22959 -105699 105190 148609 103674 38811 -36976
1002 -36976 -22806 -113052 -26692 -10542 -68508 -25634 -48953 -241750 8024 -233984 -161274
991 -161274 47377 -22628 9795 -187819 -214425 -66236 -65138 -117630 -6884 -85381 -214705
980b14705L5166J34305o8452n5533K2758K2889p8099J33586J89965m9514l2179
969D0187r8372o5394Q4752j00506R4795J17202n0913L2764n7412J61075O897J2379
957A77454j1323o3906k06730j0281R7956J22763q867j41497j47037K08081n0335
946c3722r9999K0041p0371L13449p5481r0102o526J3276j14106j0906m4368J72566
934b6249J37974P8911j6239j71842O0481J07018r3057r9006L6641j08452M4101
923d9719J47852P8486j37967k3091N768m804o731m8997M9249j16044Q1414J70002
911A45418j83863K24958O6231r5749j2165r0448j14782K8319M8083J17464j06240
900B7226j04429l31l6214P3815n7845N8734O3544n3265P9182j0589j37949J23047
$$ plain form
980 -214705 -179539 -45234 -113686 -169219 -146461 -123572 -201671 -68085 121880 72366 40187
969 40187 -58185 -123579 -38827 -139333 -44538 72664 21751 54515 -2897 158178 165075 177454
957 177454 166131 102225 -104505 -114786 -16830 105933 97066 -44431 -191468 16613 -33722
946 -33722 -133721 -113680 -184051 129398 53917 -36185 -42711 -29435 -143541 -154447 -198815 -26249
934 -26249 111725 190636 174397 2555 63036 170054 76997 -22009 14632 -93820 -49719
923 -49719 98133 176619 38652 15561 21329 16525 9794 -39203 10046 -105998 -24584 145418
911 145418 -38445 186513 252744 156995 144830 54382 -60400 -32081 16002 133466 27226
900 27226 -77203 -77534 -113748 -39933 -97778 -39044 24500 -28765 50417 39828 -98121 24926
888B4926K9834l1081m5114K25111k91770K08078j54735Q6138p6910o028R4603
877F3052k2088J3200j78758J38431O2416j15014J3411j5054J933j859Q2039M875
865D6584O1628o6752j80946O1346m8157K49039l09390J37109J08006P9369n1893
854H5943n4460q5830M2151P770r7903O0875R0440J07991r0290j49930M5566J20436
842H2759j41060r384K9228j39754J78719j02034J5315O8622o5042J60417j12017
831c4231k05939M4298J21319J52803j2963R1053j48696o6663M4670p3921N7579
820c0691J13914J5418O3939Q7891k09600j22714J34680l5649M9430j48641p7620
809a59643J42708L3674J28547j69819J17325k29490O8998J23410j2484j44402
$$ plain form
888 24926 54760 23679 -21435 203676 -88094 119984 -34751 51387 -25523 -31551 63052
877 63052 40964 54164 -124594 13837 76253 -38761 -25350 -40404 -38471 -40330 41709 46584
865 46584 108212 41460 -139486 -78140 -126297 122742 -186648 -49539 58467 137836 85943
854 85943 31483 -54347 -12196 -4426 -102329 -41454 48986 156977 66687 -83243 -37677 82759
842 82759 -58301 -67685 -38457 -178211 508 -101526 -86211 -17589 -82631 77786 -34231
831 -34231 -240170 -195872 -74553 78250 65287 156340 7644 -59019 -14349 -88270 -30691
820 -30691 83223 98641 162580 250471 40871 -81843 52837 17188 66618 -82023 -159643
809 -159643 -16935 16739 145286 -24533 92792 -136698 -67700 55710 43226 -101176
799a01176m4294J31609K35772k25074k24220J40496n8223p6813L64799J31315
789B74191L1910j48149j26065j02102p5446K94804O3127q9718n594k078n2831
778F2049P990k3368o0237k0083l3449q6201J23042Q8899M2177R2080k02462P264
766b299j5071k4509J24166j8079j76948O8257J51154L4994K3870j60080J65772
755A71227j24841m2462L9037N0854r6105J78975O1401j38699K6475q087o5790
744E1985m3585l3232J13419J14772k04880j0875J11959j13942M7238j21919J07408
733A8348K6605k3234J1418O8129L1292L4996j32700M1442m4819Q3928j41478j84102
721b10175K45117j50283K94674j31682l4700Q5203L8929l1505J16700j96017j4360
$$ plain form
799 -101176 -145470 -13861 221911 -3163 -227383 -86887 -145110 -221923 142876 274191
789 274191 306101 157952 31887 -70215 -145661 149143 212270 122552 116958 114880 62049
778 62049 70039 46671 -13566 -33649 -67098 -153299 -30257 58642 100819 192899 -9563 -2299
766 -2299 -17370 -41879 82287 64208 -112740 -44483 106671 141665 165535 5455 171227
755 171227 46386 3924 42961 93815 -2290 176685 238086 99387 125862 117775 51985
744 51985 8400 -24832 88587 203359 -1521 -12396 99563 -14379 32859 -89060 18348
733 18348 44953 21719 33137 101266 132558 167554 34854 76296 31477 115405 -26073 -210175
721 -210175 34942 -115341 179333 47651 12951 98154 137083 105578 222278 26261 11901
710A1901P6378J02538K1966j17399k32545q6292P9206R160J12045M4098Q5958
699A07014n1368p8617J1705J49640j7537J35696k8192k5220r7480J55520p4286
688A86875l5274j52856l4982l0279R3838L4576j37158J3256J66461j48770r4614
677a38927J21439R4769J19044j55125M0814l3551M8299O317m9335p8299O1873
666C7318n6494O4345J39625K5169j24798Q6123j9469r7460J13501N4501j29140
655I3221j68660O0568o0999K05232R9241K7879J11005j00863j44579j2296J30229
644B39978j0628j22240O4270m3877j22951q5970J28104j4077L3634J4715J55153
633B36111j95192j5857m732q3343K06652J2562M7826q3305l5905j13389J66843
$$ plain form
710 11901 88279 190817 212783 95384 -137161 -223453 -144247 -135087 -23042 21056 107014
699 107014 55646 -22971 -11266 138374 120837 256533 228341 203121 105641 261161 186875
688 186875 151601 -1255 -36237 -66516 27322 61898 -75260 -62004 104457 -44313 -138927
677 -138927 -17488 77281 196325 41200 82014 48463 96762 103079 53744 -24555 37318
666 37318 -19176 45169 184794 209963 85165 171288 151819 54359 167860 222361 93221
655 93221 -75439 -14871 -75870 129362 228603 256482 367487 266624 122045 109749 239978
644 239978 229350 107110 171380 127503 4552 -81418 46686 32609 66243 80958 236111
633 236111 40919 25062 20330 -63013 143639 156201 204027 120722 84817 -28572 138271
622A38271J74548r552k40708P7877j14951K50144R7935m7403j37759p9351J00309
611B09360r8962j83055l0330K76072K0556M0046n7389m2995q2888L6894M7055
600A34364o4818K3864k8522J73825j04361r6916R5200p5710k83965J05453K7798
589i3788J82149J00921j49652J36259O9224m5564l2390J1594k19165J4495j45247
578a71164K9728K14989p3659o1156J16243l8425L8826M5042j78377n2834M5769
567h5018J49600j636J1529p7600J18615n3051J22811J4831q0836J44375K8272
556B91892j50326J31069n2984j15442j95488J13353j8780o3392j3788J12189K26949
545B65252j20950N8146L4022M4008Q4152k6395q3619j28374q0369p3275J6196
$$ plain form
622 138271 312819 303267 62559 140436 25485 275629 373564 326161 188402 109051 209360
611 209360 110398 -72657 -102987 173085 193641 233687 176298 133303 50415 87309 134364
600 134364 69546 93410 64888 238713 134352 37436 132636 56926 -227039 -121586 -93788
589 -93788 88361 189282 39630 175889 245113 199549 167159 178753 -40412 -25917 -171164
578 -171164 -141436 73553 -106 -61262 54981 16556 55382 100424 -77953 -130787 -85018
567 -85018 64582 62946 74475 -3125 115490 62439 185250 200081 119245 263620 291892
556 291892 141566 272635 219651 104209 -91279 22074 3294 -60098 -73886 38303 265252
545 265252 144302 202448 236470 280478 364630 338235 254616 126242 45873 -27402 -11206
534a1206Q0230q7217J89547j18084L9602m7789J42402j63969l3141J20244p2893
523C7726r095Q080O4955q1513J37745J60263l8793J0972j71863P9307o2663O9962
511B05083p3584l0347J34540J46685k08261o0533K25852j51996k6931K7547J7469
500B05524j95398o5181l3453J87370q5356Q4116l1778k08031Q5756p8193J11882
489b2742l5050J91868o3580K5862J00262r5893m7291J25516j48953m5904J28188
478A12283J1115N3817j35197j15542J28902J27762l2108J017j38766Q7942J8960
467A20185K0657Q0444p5356j86662J06057K13762j8438k02983J42469j19454L7029
456A17710L4618N615n9170p432Q5324Q3632L1467j51929P0359Q7059q3245o0492
$$ plain form
534 -11206 69024 -18193 171354 53270 92872 45083 187485 23516 -9625 110619 37726
523 37726 28631 36711 101666 20153 157898 318161 279368 290340 118477 197784 135121 205083
511 205083 131499 101152 235692 382377 174116 113583 339435 187439 160508 188055 205524
500 205524 10126 -55055 -88508 98862 13506 97622 65844 -142187 -56431 -134624 -22742
489 -22742 -57792 134076 70496 96358 196620 100727 53436 178952 29999 -15905 112283
478 112283 123398 177215 42018 -73524 55378 183140 151032 152049 13283 101225 120185
467 120185 140842 221286 145930 -40732 65325 279087 260649 57666 200135 80681 117710
456 117710 152328 157943 98773 91341 176665 260297 291764 139835 210194 297253 214008 153516
444A53516J11587p2147k5200r5282J41306k1939l1407k41429J2162K97359N9943
433B88469k19567j3918J34850r1593J68580j73793j00804J86489k3149O8550j72805
422E1309j1169J54568R5799k86564K05133p2708n8839K05849k2231N2617O7245
411C81009P1096j69566r0223q0243L9952J81346p5069J34508k38134q9748Q9068
400A53996o2757Q4543Q5391p8968j30892J47415j1606R1020j00177L5003j40920
389G2048N2313j50441l216J10620r052q1064J84472l3835r8472q6734J55169O9825
377A81633p728j6463p1472j44435R1440J90654j2844P0186j81024k74020K69791
366I5718K21541q5641n0001r8858k0162J15348m3722M5614n1328j40963L3285
$$ plain form
444 153516 265103 192956 167756 72474 213780 191841 160434 -80995 -68833 228526 288469
433 288469 68902 54984 189834 98241 266821 93028 -7776 178713 155564 224114 51309
422 51309 40140 194708 290507 3943 209076 136368 77529 283378 261147 313764 381009
411 381009 452105 282539 192316 112073 152025 333371 258302 392810 154676 64928 153996
400 153996 91239 175782 261173 182205 51313 198728 187122 278142 177965 212968 72048
389 72048 124361 -26080 -29296 81324 72272 -8792 175680 141845 43373 -43361 111808 181633
377 181633 173905 157442 85970 -58465 32975 223629 210785 280971 99947 -174073 95718
366 95718 317259 231618 181617 82759 62597 177945 134223 179837 128509 -12454 20831
355B0831P5385j6107J92931m6199k11418J51329m3407P859J26365j69792r7858
344a0081J13960r145K78916k27030P434o2190j33054J81021m645K8673J16154
333B80013p294m1624Q486j58223r05J18675J0415K3724M4885n3400p8534J53480
321B99698P555N445o4145j3094o7030m6747O6369R7445j44075q7774R9994Q3864
309B37505j24466J27694J08429j85922P1531M3095j78574q3686J86894j20422
299H2078K3028K8105O0665m0604K75309l18932n0571R5859k31443j36390J63576
288d9320K01084r4093n792J2587q6411N6367K66204j12778P5505L2249k0047q404
276B67151k11103L6868J53913l7881l4393n245J0629l984j7192q8855P1878K17592
$$ plain form
355 20831 96216 80109 273040 226841 15423 166752 123345 131204 257569 87777 -10081
344 -10081 103879 94734 373650 146620 154054 91864 -41190 139831 135186 163859 280013
333 280013 272719 231095 239581 81358 80453 199128 209543 233267 278152 224752 146218 299698
321 299698 307253 312698 248553 235459 168429 121682 188051 285496 141421 53647 153641 237505
309 237505 113039 240733 349162 163240 234771 277866 99292 15606 202500 82078
299 82078 105106 133211 193876 153272 428581 109649 59078 154937 -76506 -212896 -49320
288 -49320 151764 57671 51879 64466 -21945 34422 300626 187848 263353 295602 275555 267151
276 267151 56048 92916 246829 208948 174555 169310 179939 175955 158763 69908 141786 359378
264C59378k44665J05594J08240k51263l3904p863m8225J4427l7635k3674K3724
253c5866O7840R9755o458K07815o1623j11590O30P3356j7375n5816j18498l3983
241H187J24860k6312p1867K20331r1569N3844p4686L5281R6383l7068l3427j07530
229I6427O2688J07875q8456k3472J0741K3403P8724m1195p6210J06484j27554
218A29455o8053J25113l8372k11978L3432K11109O45l4824j28197J49160l7515
207A29975j14436O1862J42505k5104r5942N5625l7330J03701l7643O1005j13531
196A30687j43448J06588L1348n2322q5249J50201j52779L4838K1768j10824J07832
185C8640j0476J11456J21802q1471k22927J64041r8963R8072J2259m1533j9175
$$ plain form
264 359378 114713 220307 328547 77284 43380 35517 -12708 1719 -35916 -59590 -35866
253 -35866 31974 131729 125271 333086 271463 159873 160503 233859 216484 160668 42170 8187
241 8187 133047 106735 34868 255199 163630 217474 142788 178069 274452 237384 203957 96427
229 96427 159115 266990 178534 155062 165803 189206 267930 226735 150525 257009 129455
218 129455 61402 186515 148143 -63835 -30403 180706 181351 146527 18330 167490 129975
207 129975 15539 77401 219906 194802 98860 154485 117155 220856 183213 244218 130687
196 130687 -12761 93827 125175 72853 -12396 137805 -14974 19864 41632 -69192 38640
185 38640 28164 139620 261422 179951 -42976 121065 22102 120174 132433 90900 71725
$$ [...]
##END NTUPLES=NMR SPECTRUM
##END=
