##TITLE=1H_EC-3334(4)
 CDCl3
 8 sc, 
 26.11.2024
##JCAMPDX= 6.0         $$ Bruker NMR JCAMP-DX V2.0
##DATA TYPE= NMR SPECTRUM
##DATA CLASS= NTUPLES
##ORIGIN= UXNMR, Bruker Analytische Messtechnik GmbH
##OWNER= root
$$ XWIN-NMR		Version 3.5
$$ Tue Nov 26 13:49:00 2024 Russian Standard Time (UT+4h)  she@DPX200
##.OBSERVE FREQUENCY= 200.1315
##.OBSERVE NUCLEUS= ^1H
##.ACQUISITION MODE= SIMULTANEOUS
##.ACQUISITION SCHEME= undefined
##.AVERAGES= 8
##.DIGITISER RES= 18
##SPECTROMETER/DATA SYSTEM= spect
##.PULSE SEQUENCE= zg30
##.SOLVENT NAME= D2O
##.SHIFT REFERENCE= (INTERNAL, D2O, 0, 19.5679)
##AUDIT TRAIL= $$ (NUMBER, WHEN, WHO, WHERE, WHAT)
$$ ##TITLE= Audit trail, XWIN-NMR		Version 3.5
$$ ##JCAMPDX= 5.01
$$ ##ORIGIN= Bruker BioSpin GmbH
$$ ##OWNER= she
$$ F:/spectra/data/she/nmr/H-F/1/pdata/1/auditp.txt
$$ ##AUDIT TRAIL=  $$ (NUMBER, WHEN, WHO, WHERE, WHAT)
(   1,<2024-11-26 13:47:42.46 +0400>,<she>,<DPX200>,
      <created by zg, POWCHK disabled, PULCHK disabled
       configuration hash MD5:
       00 E9 B6 7A A2 85 ED C7 34 08 36 98 17 FE 4E 26
       data hash MD5: 16K
       D9 FC 9C 2C AA 2E 46 06 E3 22 09 3B E1 F7 B9 2E>)
(   2,<2024-11-26 13:47:50.57 +0400>,<she>,<DPX200>,
      <Start of raw data processing
       efp BC_mod = 2 LB = 0.24 FT_mod = 6 PKNL = 1 PHC0 = -26870.16 PHC1 = 20.18744 SI = 16K 
       data hash MD5: 16K
       B9 5F 1A AF FC 04 4C 6A 72 68 B0 86 E3 ED 5E 9E>)
(   3,<2024-11-26 13:48:10.89 +0400>,<she>,<DPX200>,
      <pk PHC0 = 4.211153 PHC1 = -5.8 
       data hash MD5: 16K
       65 2E B4 ED 07 4D 71 20 19 59 F4 45 0D B2 D6 56>)
(   4,<2024-11-26 13:48:14.53 +0400>,<she>,<DPX200>,
      <abs ABSG = 5 
       data hash MD5: 16K
       FE 7E 98 5F 26 1A CD 76 1F 91 49 8E EC 20 00 C9>)
$$ ##END=
$$ 
$$ hash MD5
$$ 4E 7A 7C 02 D4 5A 39 16 0F 3B 90 42 33 4C 7B D7
##$RELAX= 
##$RELAX= 
##$RELAX= 
##$RELAX= 
##$RELAX= 
##$RELAX= 
$$ Bruker specific parameters
$$ --------------------------
##$DU= <F:/spectra>
##$EXPNO= 1
##$NAME= <H-F>
##$PROCNO= 1
##$TYPE= <nmr>
##$USER= <she>
##$AMP= (0..31)
100 100 100 100 100 100 100 100 100 100 100 100 100 100 100 100 100 100 
100 100 100 100 100 100 100 100 100 100 100 100 100 100 
##$AQSEQ= 0
##$AQ_mod= 1
##$AUNM= <au_zg>
##$AUTOPOS= <>
##$BF1= 200.13
##$BF2= 200.13
##$BF3= 200.13
##$BF4= 200.13
##$BF5= 200.13
##$BF6= 200.13
##$BF7= 200.13
##$BF8= 200.13
##$BYTORDA= 1
##$CFDGTYP= 0
##$CFRGTYP= 5
##$CHEMSTR= <none>
##$CNST= (0..31)
1 1 145 1 1 1 1 1 1 1 1 1 1 1 1 1 1 1 1 1 1 1 1 1 1 1 1 1 1 1 1 1 
##$CPDPRG= <>
##$CPDPRG1= <>
##$CPDPRG2= <>
##$CPDPRG3= <>
##$CPDPRG4= <mlev>
##$CPDPRG5= <mlev>
##$CPDPRG6= <mlev>
##$CPDPRG7= <mlev>
##$CPDPRG8= <mlev>
##$CPDPRGB= <>
##$CPDPRGT= <>
##$D= (0..31)
0 1.2 0 0 0 0 0 0 0 0.06 0 0.03 0 0 0 0 0.0002 0 0 0 0 0 0 0 0 0 0 0 0 
0 0 0 
##$DATE= 1732614461
##$DBL= (0..7)
120 120 120 120 120 120 120 120 
##$DBP= (0..7)
150 150 150 150 150 150 150 150 
##$DBP07= 0
##$DBPNAM0= <>
##$DBPNAM1= <>
##$DBPNAM2= <>
##$DBPNAM3= <>
##$DBPNAM4= <>
##$DBPNAM5= <>
$$ [...]
##$SUBNAM3= <"">
##$SUBNAM4= <"">
##$SUBNAM5= <"">
##$SUBNAM6= <"">
##$SUBNAM7= <"">
##$SUBNAM8= <"">
##$SUBNAM9= <"">
##$SW= 24.0689530833862
##$SWIBOX= (0..15)
0 0 2 0 0 0 0 0 0 0 0 0 0 0 0 0 
##$SW_h= 4816.95568400771
##$TD= 16384
##$TD0= 1
##$TE= 0
##$TE2= 300
##$TE3= 300
##$TEG= 300
##$TL= (0..7)
0 120 120 120 120 120 120 120 
##$TP= (0..7)
150 150 150 150 150 150 150 150 
##$TP07= 0
##$TPNAME0= <>
##$TPNAME1= <>
##$TPNAME2= <>
##$TPNAME3= <>
##$TPNAME4= <>
##$TPNAME5= <>
##$TPNAME6= <>
##$TPNAME7= <>
##$TPOAL= (0..7)
0.5 0.5 0.5 0.5 0.5 0.5 0.5 0.5 
##$TPOFFS= (0..7)
0 0 0 0 0 0 0 0 
##$TUNHIN= 0
##$TUNHOUT= 0
##$TUNXOUT= 0
##$USERA1= <user>
##$USERA2= <user>
##$USERA3= <user>
##$USERA4= <user>
##$USERA5= <user>
##$V9= 5
##$VALIST= <valist>
##$VCLIST= <CCCCCCCCCCCCCCC>
##$VD= 0
##$VDLIST= <DDDDDDDDDDDDDDD>
##$VPLIST= <PPPPPPPPPPPPPPP>
##$VTLIST= <TTTTTTTTTTTTTTT>
##$WBST= 1024
##$WBSW= 4
##$XGAIN= (0..3)
0 0 0 0 
##$XL= 0
##$YL= 0
##$YMAX_a= 721592
##$YMIN_a= -934209
##$ZGOPTNS= <>
##$ZL1= 120
##$ZL2= 120
##$ZL3= 120
##$ZL4= 120
##$ABSF1= 19.49447
##$ABSF2= -4.574661
##$ABSG= 5
##$ABSL= 3
##$ALPHA= 0
##$AQORDER= 0
##$ASSFAC= 0
##$ASSFACI= 0
##$ASSFACX= 0
##$ASSWID= 0
##$AUNMP= <proc_1d>
##$AZFE= 0.1
##$AZFW= 0.1
##$BCFW= 0
##$BC_mod= 2
##$BYTORDP= 0
##$COROFFS= 0
##$CY= -3
##$DATMOD= 1
##$DC= 0
##$DFILT= <>
##$DTYPP= 0
##$F1P= 0
##$F2P= 0
##$FCOR= 1
##$FTSIZE= 16384
##$FT_mod= 6
##$GAMMA= 0
##$GB= 0
##$INTBC= 1
##$INTSCL= 2.524811e-10
##$ISEN= 128
##$LB= 0.24
##$LEV0= 0
##$LPBIN= 0
##$MAXI= 10000
##$MC2= 0
##$MEAN= 0
##$ME_mod= 0
##$MI= 1.114404
##$NCOEF= 0
##$NC_proc= -4
##$NLEV= 6
##$NOISF1= 3.799351
##$NOISF2= 2.8
##$NSP= 0
##$NTH_PI= 0
##$NZP= 0
##$OFFSET= 19.56792
##$PC= 1
##$PHC0= -26865.95
##$PHC1= 14.38744
##$PH_mod= 1
##$PKNL= yes
##$PPARMOD= 0
##$PSCAL= 0
##$PSIGN= 0
##$REVERSE= no
##$SF= 200.129992349924
##$SI= 16384
##$SIGF1= 3
##$SIGF2= 2
##$SINO= 5.538805
##$SIOLD= 16384
##$SREGLST= <1H.CDCl3>
##$SSB= 0
##$STSI= 16384
##$STSR= 0
##$SW_p= 4816.95568400771
##$SYMM= 0
##$S_DEV= 0
##$TDeff= 16384
##$TDoff= 0
##$TI= <>
##$TILT= no
##$TM1= 0
##$TM2= 0
##$TOPLEV= 0
##$USERP1= <user>
##$USERP2= <user>
##$USERP3= <user>
##$USERP4= <user>
##$USERP5= <user>
##$WDW= 1
##$XDIM= 16384
##$YMAX_p= 285850963
##$YMIN_p= -296498
$$ End of Bruker specific parameters
$$ ---------------------------------
##NTUPLES= NMR SPECTRUM
##VAR_NAME=  FREQUENCY,     SPECTRUM/REAL,   SPECTRUM/IMAG
##SYMBOL=    X,             R,               I
##VAR_TYPE=  INDEPENDENT,   DEPENDENT,       DEPENDENT
##VAR_FORM=  AFFN,          ASDF,            ASDF
##VAR_DIM=   16384,         16384,           16384
##UNITS=     HZ,            ARBITRARY UNITS, ARBITRARY UNITS
##FACTOR=    0.29402158847633, 1,            1
##FIRST=     3916.12781695584, 0,            0
##LAST=      -900.827867051874, 0,           0
##MIN=       -900.827867051874, -296498,     0
##MAX=       3916.12781695584, 285850963,    0
$$ Real data points
##PAGE= N=1
##DATA TABLE= (X++(R..R)), XYDATA
$$ [...]
7398A7607L9882l2545j2810K8949k1768j0251K024j554N616M2045m3770j7517
7386d092J765r197L4045J2134k745l0366p226j5726J9705J8534k7027L679R175
7373B658L7772k8563L680n77Q970j6406m734j1141J751M2975j5448l0982J1773
7360A728J4953N935j2119K8806j0817J1235m616k248k1575N948N268P736J7538
7347D7772N247Q175j9072j9888K53J9694m3208J639r701L6515l252l0876J3737
7334G035K478K8821j6803K793R153r28r013q980M919Q399j9502n723R090M990
7320A6729j303J535K651n028J9046n933j980n517k407J3352j2858j463P006J6893
7306D0723J7768m0682j5301J5603N029m279M166l319j6580n162R826j1376J2386
$$ plain form
7398 17607 57489 24944 12134 41083 19315 9064 11088 9534 15150 57195 13425 -4092
7386 -4092 -2327 -11524 22521 34655 31910 1544 -5682 -21408 -1703 16831 -10196 -6517 2658
7373 2658 40430 11867 15547 14970 23940 7534 2800 -8341 -6590 36385 20937 -10045 1728
7360 1728 16681 22616 10497 39303 28486 39721 35105 32857 11282 17230 22498 30234 47772
7347 47772 53019 61194 42122 22234 22487 42181 -1027 612 -9089 27426 24174 -6702 7035
7334 7035 9513 38334 21531 24324 33477 32549 23536 14556 19475 27874 8372 2649 11739 16729
7320 16729 15426 16961 19612 14584 33630 27697 25717 20200 17793 31145 18287 16824 23830 40723
7306 40723 58491 17809 2508 18111 23140 18861 23027 19708 3128 -2034 7792 -3584 8802
7293H802K6386r911j8674j373J7473j3150j7884k601J4820k3828j1935J7183J1328
7280c364O74j842k2419J2122K5511m0677J6754m661K4193K764j4982o989J544
7267a1372J7859k943l0966J8025J4810J1475j6408l5601j0917K6547L29J3097
7255f065l830o084R325o094j1750J5817O145k7435K0569K398J12k6906J9395J7799
7241C396Q354M271j7635j6169n487J5048J2475j9491j2079J9127o011p34k85j0473
7227b5693K7461J5337k1528M022k263K154o194J2154k0312j7924J8045J9307j2529
7214g963q232j461O832N05J7104j2483o193L288k8189J7737K2539j6541K359J1751
7200A053k2217J322o432Q73K3061N513J2394n199P107k1595Q761J4146n237Q48
$$ plain form
7293 8802 35188 25277 6603 5230 22703 9553 -8331 -10932 3888 -19940 -31875 -14692 -3364
7280 -3364 -2690 -4532 -26951 -14829 10682 -29995 -13241 -17902 6291 9055 -5927 -12916 -11372
7267 -11372 6487 3544 -27422 -9397 5413 16888 480 -35121 -46038 -19491 -19162 -6065
7255 -6065 -9895 -15979 -6654 -12748 -24498 -8681 -2536 -29971 -9402 -7004 -6892 -33798 -14403 3396
7241 3396 11750 16021 -1614 -17783 -23270 -8222 4253 -15238 -27317 -8190 -14201 -14935 -15220 -25693
7227 -25693 1768 17105 -4423 -401 -2664 -510 -6704 5450 -14862 -32786 -14741 4566 -7963
7214 -7963 -16195 -17656 -10824 -10319 6785 -5698 -11891 -8603 -36792 -19055 3484 -13057 -10698 1053
7200 1053 -21164 -19842 -26274 -25401 -2340 3173 15567 10368 17475 -4120 4641 18787 13550 14398
7186A4398N002r733P40j1878Q928K9868j6645l218r294J7556p009k985L767j5162
7172D335J7489J2189r341k835k0580O27m892J5970k8031Q464J4059j5713K2096
7159A3837j9997J8681n421J7346j0240r84k291Q868L5206j4480j4254j5399k2915
7146a2043k3114N4474P80L2771l003j6977J4743p613l361l951q868j0619L092
7133A6311L5416O254o093L4329K1316J119k127j5765q345P579L727O485J4556
7120A14762j2436L3642r770R816Q774K298j4689J4189m818k9000M0128K3248k768
7107A73376O052J3415J2579J0768O94Q862J7380M3115K3851j1109j2910J0002
7095B96075L3666K1533K3096N560J3795K3030L3598L2309r403j2726K8836M2989
$$ plain form
7186 14398 19400 9667 10407 -1471 7457 37325 20680 17462 8168 25724 18715 15730 19497 4335
7172 4335 21824 34013 24672 21837 1257 1884 -3008 12962 -15069 -6605 7454 -8259 13837
7159 13837 -6160 12521 7100 24446 14206 13222 10931 19799 55005 40525 26271 10872 -12043
7146 -12043 -35157 19317 20097 52868 49865 32888 47631 40018 36657 32706 23838 13219 16311
7133 16311 51727 57981 51888 86217 107533 108652 106525 90760 82415 89994 93721 100206 114762
7120 114762 102326 135968 126198 136014 144788 147086 132397 146586 141768 112768 152896 176144 173376
7107 173376 179428 192843 205422 216190 216884 225746 243126 286241 310092 298983 286073 296075
7095 296075 329741 351274 374370 379930 393725 416755 450353 482662 473259 460533 489369 532358
7083E32358K9895K4295L8874M0212p65L3643L0770O514Q007O963R693K1854k1540
7070G60773j314J2715o51k999k3527J0971J2816k39J7706k434K240L7595P379
7057H31031l166K4568J851j7457m532k2418J7998j9382l4418k5429l6984N103
7045G16765l5303l5519J6187K7978j326J7813O009p679M8026M8434q800N794O946
7032H05325J0445J2083J2695p673N883q877k613j1905j7746k1552k5257J6085
7020G66893K5942j0249N865O642J1041k9108q780J3891k7115j2590J6505m997
7008G53940m6013K7135J4020j4967j5921o00J6494j456J728J4567p138N302J3175
6995G60266j8360l2412j777r368k6543m0278j0674l9954j3207m976l2622k0629
$$ plain form
7083 532358 562253 586548 625422 665634 664869 698512 729282 735796 743803 750766 760459 782313 760773
7070 760773 759459 772174 771523 768524 744997 755968 768784 768545 786251 783817 786057 823652 831031
7057 831031 827865 852433 854284 836827 832295 809877 827875 808493 774075 748646 711662 716765
7045 716765 681462 645943 662130 690108 688782 706595 712604 704925 752951 801385 792585 798379 805325
7032 805325 815770 827853 840548 832875 838758 829881 827268 815363 797617 776065 750808 766893
7020 766893 792835 782586 788451 795093 806134 777026 768246 782137 755022 742432 758937 753940
7008 753940 707927 735062 749082 734115 718194 717594 734088 732632 734360 748927 741789 747091 760266
6995 760266 741906 709494 707717 698349 671806 631528 620854 580900 567693 562717 530095 509466
6983E09466j8947J77j4914K8566J1370J5415p397L299L492J7724M651r494j0491
6970E32917L920K267k6245m862Q232k2761m9989j0030l0066j3813k768k100j7272
6957C67430k0246K3033J366Q535K6082j2921o201J5240L4261J4132o783N353Q851
6944D58132M9237J7506n237J6455Q807J9817L5856J9462L0659M1959K9022J0958
6932G32633N8079M9497P4822P7724N3322J20019J23635J54224J75193K11196K41440
6921B071784K28487J40533J23244O7227L3287Q8289M4809k0890r7008j00621j84426
6910B394715k02957j95937k06351k08111j88101j20757r9723p3671j03603m8189
6900I47315n7248l4051j8580l6064K793k9349j1545K657k7803j1977J2966l4137
$$ plain form
6983 509466 490519 490696 475782 504348 515718 531133 523736 527035 530527 548251 552902 543408 532917
6970 532917 536837 539104 512859 507997 516229 493468 443479 433449 403383 389570 386802 384702 367430
6957 367430 347184 370217 371583 380118 406200 393279 387078 402318 436579 450711 443928 449281 458132
6944 458132 507369 524875 519638 536093 544900 564717 600573 620035 650694 692653 721675 732633
6932 732633 790712 840209 915031 992755 1046077 1166096 1289731 1443955 1619148 1830344 2071784
6921 2071784 2300271 2440804 2564048 2631275 2664562 2752851 2797660 2776770 2679762 2579141 2394715
6910 2394715 2191758 1995821 1789470 1581359 1393258 1272501 1172778 1099107 995504 947315
6900 947315 890067 856016 837436 801372 804165 774816 763271 765928 738125 726148 739114 704977
6888G04977k276J7766K3077J8571l073N029K8559J0641L1145Q048k4121K9875
6876H48218K3183J9212K5599M2559O0380M5064L7334N7560Q4940O4251J07494
6865A415794J46051J52341J64168J84189K10782J64436J14771P0857N1589N2155
6855B727133O8444k9674m4855p2292r4404j19230j67968j64800j61435j48802
6845A792117j15241p1828q8230q4807m5374m1383k5839p2684k4324n4794m0176
6834A127437M887j9435l4488j3660k8606J173R694J3620j855l116j0214L085L2167
6821A080689L6418K0005R362k433J5845J4058r333J4462Q83L1461K6800r517k9070
6808A199630K6490j8516L380J3653q536j3920r532j1397m189k5601k0334j6908
$$ plain form
6888 704977 702701 720467 743544 762115 759042 764071 792630 803271 834416 842464 818343 848218
6876 848218 871401 890613 916212 958771 1019151 1064215 1101549 1159109 1244049 1308300 1415794
6865 1415794 1561845 1714186 1878354 2062543 2273325 2437761 2552532 2623389 2674978 2727133
6855 2727133 2795577 2765903 2721048 2648756 2554352 2435122 2267154 2102354 1940919 1792117
6845 1792117 1676876 1605048 1516818 1432011 1386637 1345254 1319415 1246731 1222407 1167613 1127437
6834 1127437 1132324 1112889 1078401 1064741 1036135 1037308 1047002 1060622 1058767 1055651 1045437 1048522 1080689
6821 1080689 1117107 1137112 1146474 1144041 1159886 1173944 1164611 1179073 1179956 1211417 1238217 1228700 1199630
6808 1199630 1226120 1207604 1210984 1224637 1216101 1202181 1192649 1181252 1177063 1151462 1131128 1114220
6796A114220l610n611j7926j1567k4234k7771j168O074l1822J6316J1316J392
6784A025609O289M485R133N338N762j1153J7987K1446K1303j2982J2100j1387
6772A093930J0094J6934J5154j8869J6221L2607N0463k312L4050J8903j7438K4747
6760A274484l142N3249M2248K6609j0270j1775o682p630J8756K5185K4797N9012
6748A484841P4676J09492J47126J70349K39542K62855J67043J08202J10067L0626
6738B904819L1715Q0543j6621r3091j00301j13788j80282j66649j50422j89483
6728B006440j36776j15816j14135n3985q3732j3922m1931j9196j7417r610j1595
6717A388325l6062P098J8776o327K9376J8251l2482L5662O9587P4508J15317J32661
$$ plain form
6796 1114220 1110610 1104999 1087073 1075506 1051272 1023501 1022333 1028407 996585 1012901 1024217 1025609
6784 1025609 1031898 1036383 1045516 1050854 1056616 1045463 1063450 1084896 1106199 1093217 1105317 1093930
6772 1093930 1104024 1120958 1136112 1117243 1133464 1166071 1216534 1214222 1248272 1267175 1249737 1274484
6760 1274484 1271342 1324591 1366839 1393448 1383178 1371403 1364721 1357091 1375847 1401032 1425829 1484841
6748 1484841 1559517 1669009 1816135 1986484 2226026 2488881 2655924 2764126 2874193 2904819
6738 2904819 2936534 3017077 3000456 2907365 2807064 2693276 2512994 2346345 2195923 2006440
6728 2006440 1869664 1753848 1639713 1585728 1501996 1488074 1446143 1426947 1409530 1399920 1388325
6717 1388325 1352263 1359361 1378137 1371810 1401186 1419437 1386955 1422617 1492204 1566712 1682029 1814690
6705A814690J38973J90000J83736J43470J02495M0244M7005M2596M3002k1167
6695B725044j23167q6282j57831j72319j45355j58225j89709j71503j26346q4953
6685A309354j14244n7362p4523o2029m4552m4571J0925l2983j8280j7786r061
6674H44888j6918P475J3552M0957j0030l8573Q321o7337m5749m4572o1988n3175
6662E76851m7122m8692k5759P815m1161k7159j3597l3395o826l0965j3831k0224
6650B75935r641j3597J3520K1340j4915L223j4600R723j0420m950R564j7344j4044
6637B33794N644J518O564l5304q563j8181l0013J3904j284k3935k846j2742j8772
6624A09784j0310J1924l66m450r061j5818J5702J0944l1172n838j409K8246k5659
$$ plain form
6705 1814690 1953663 2143663 2327399 2470869 2573364 2613608 2660613 2703209 2746211 2725044
6695 2725044 2601877 2515595 2357764 2185445 2040090 1881865 1692156 1520653 1394307 1309354
6685 1309354 1195110 1137748 1063225 1001196 956644 912073 922998 890015 871735 853949 844888
6674 844888 827970 835445 848997 889954 879924 841351 849672 782335 736586 692014 630026 576851
6662 576851 529729 481037 455278 463093 421932 394773 381176 347781 340955 309990 296159 275935
6650 275935 266294 252697 266217 287557 272642 275865 261265 270988 260568 255618 265182 247838 233794
6637 233794 239438 240956 247520 212216 203653 185472 155459 169363 168079 144144 141298 128556 109784
6624 109784 99474 111398 111032 106582 97521 81703 97405 108349 77177 71339 69930 98176 72517
6611G2517j4381N0274j4738k2472J0122M70k1123J8912l2382K3965j455O655J2007
6598H8371l7512O335j096J1454j6041l8959M2718L10N063K1440j8967k4021R463
6585D8558K6343P986j3647j8323l7306J4098l231J5642p59j874O351j8789L288
6572B8337J2098O054r151n911K693j5469J099L3985k9166j5199J3915J8596l728
6559C8153j136N541j0087q773R847j925J5512L025p757j1651k324L647l034o735
6545B2303j0881K652l763J5559J8975j9548K1261j126N782m210j4003l199j5276
6532A4526J1460n111K2878Q228m4289J5863m561N674k816k572k2380q02L4212
6519C0310j6631J8450j1571l150k875m634J1916k6583L3297m413j5021J961j071
$$ plain form
6611 72517 58136 108410 93672 71200 81322 81792 60669 79581 47199 71164 69709 76364 88371
6598 88371 50859 57194 56098 67552 51511 12552 55270 55580 60643 82083 63116 39095 48558
6585 48558 74901 82887 69240 50917 13611 27709 24478 40120 39361 37487 43838 25049 28337
6572 28337 40435 46489 37338 31427 34120 18651 19750 53735 24569 9370 23285 41881 38153
6559 38153 37017 42558 32471 23698 33545 31620 47132 50157 42400 30749 28425 32072 29038 22303
6545 22303 11422 14074 10311 25870 44845 25297 46558 45432 51214 47004 33001 29802 14526
6532 14526 25986 20875 43753 51981 7692 23555 18994 24668 21852 19280 -3100 -3902 30310
6519 30310 13679 32129 20558 17408 14533 9899 21815 -4768 28529 24116 9095 11056 9985
6506I985K0443k4087P644J0118k3731L5640j2158R994K7927J122m3789M702j580
6493B2230r020J8817j0671J6539m076p985o992p937K3644r198j2415J760J0308
6480B5004R42k3708J2679J2195k9206l213J5161l044L321j687l372M205L677J0828
6466B3782J7223j6214O10J997J941j2064N857N473j7044l76J3214Q057k1476p166
6452C814K2984J1628j1696j1563J7559k2366K119o743J0334p397j3228L3057j6976
6439A1526k1570K4867l46J0325O27N555n455n606Q361J351O387L3051j7666K0029
6425G1436k4878k7136j3307K7477n411k8955J515J6654J4204J1448k5750N935
6413B3232P343j4417k0887l164K4741J2008j7850j0138P627r525J9049P71J9938
$$ plain form
6506 9985 30428 6341 13985 24103 372 36012 23854 33848 61775 62897 19108 23810 22230
6493 22230 13210 32027 21356 37895 33819 25834 18842 10905 34549 25351 12936 14696 25004
6480 25004 25946 2238 14917 27112 -2094 -5307 9854 6810 10131 8444 5072 9277 12954 23782
6466 23782 41005 24791 25401 27398 29339 17275 23132 28605 11561 11185 24399 32456 10980 3814
6452 3814 26798 38426 26730 15167 32726 10360 12479 5736 16070 8673 -4555 28502 11526
6439 11526 -10044 14823 14477 24802 25429 30984 25529 19923 28284 29635 36022 69073 51407 71436
6425 71436 46558 19422 6115 33592 28181 -774 741 17395 31599 43047 17297 23232
6413 23232 30575 16158 -4729 -7893 16848 28856 11006 868 8495 -1030 18019 18790 38728
6400C8728n4470O223n267J1938J678j332J4245M914l3780r98J8802l864j6416
6387a9599O577p756K496K8185J3235l952j5837k0488J2789P878q88R400R45r602
6373C383J3330q28J3933k606r683J4613l4463L1184j7508j8882M5454M941J7439
6360F0307l6100J2607K5004l6455J749j1813J3415j6901J2964M897q578k706J4133
6347C2523n053r416L2813j1784k7094o636K5352j2601o350K2609j842q070k486
6334B1965K096O540L0833l0481j1431K7306k5624n477j6182L747N300K523K3619
6321C4734k5739k180N968Q681R615l722k863r379O412J8725j8782m737R058J0063
6307C5854J3779L486M863L5176k4824j0747J3698r75p932j1832r335N790r529
$$ plain form
6400 38728 -15742 -9519 -14786 -2848 -1170 -2502 11743 16657 -17123 -18121 681 -3183 -19599
6387 -19599 -13022 -20778 -18282 9903 23138 19186 3349 -17139 -4350 3528 2640 12040 12985 3383
6373 3383 16713 15885 29818 27212 17529 32142 -2321 28863 11355 -7527 37927 42868 60307
6360 60307 24207 36814 61818 25363 27112 15299 28714 11813 24777 29674 21096 18390 32523
6347 32523 27470 18054 50867 39083 11989 5353 30705 18104 11754 34363 32521 24451 21965
6334 21965 24061 30601 61434 30953 19522 46828 21204 15727 -455 3292 8592 11115 34734
6321 34734 8995 6815 12783 21464 31079 27357 24494 15115 21527 40252 21470 16733 25791 35854
6307 35854 49633 53119 57982 93158 68334 57587 71285 70310 62378 50546 41211 47001 37472
6294C7472l701q172J9557L1321l2401j1902j0151J1518j0343q277K7547j0125
6282C2343r037N793o160J8621n441p568J6980p480j9497j962J3524J5753k5544
6269B0325K7860k0709J5032J015J338N372L10r240j236j0629K2520K692m241j2863
6255C7546M445K9035o931p366m718L087j209R304J4018O267j4321K4073J2215
6242A05445l1139j3806L6472j236j5677j1124L0516J885j4645M913P469J3356
6230A12429j3735j6154J1219J767K2672j3041J7755K1460q437j1245j2466k903
6218A09321J0013L0337j7576l016J474r102M7461R295k2783J5114l4720R374j5530
6205A29662J402J4025k1232J3126p221R821k745J9092k410k4712J988M963N9j009
$$ plain form
6294 37472 33771 25599 45156 76477 44076 32174 22023 33541 23198 14921 42468 32343
6282 32343 23306 29099 22939 41560 36119 28551 45531 38051 18554 16592 30116 45869 20325
6269 20325 48185 27476 42508 43523 44861 50233 50543 41303 40067 29438 51958 54650 50409 37546
6255 37546 41991 71026 64095 56729 52011 55098 53889 63193 77211 83478 69157 93230 105445
6242 105445 74306 60500 96972 95736 80059 68935 99451 101336 86691 91604 99073 112429
6230 112429 98694 82540 93759 95526 118198 105157 122912 144372 135935 124690 112224 109321
6218 109321 119334 149671 132095 129079 130553 121451 168912 178207 155424 170538 135818 145192 129662
6205 129662 131064 145089 123857 136983 129762 139583 136838 155930 153520 128808 130796 135759 135818 134809
6191A34809J997l983O235j3748P859K926j902j3569j3461q7L943m9393M7577K9740
6177A38943j5757N636k0641M44N205o045k3116l150J356K9934l9070K16J5998
6164H9953J1930j1909j4715j6545J7885J469J967J0176J0654K8996j6347J6729
6152A30243j1744j6438j8206r26J4218j6309K6879q48j2088p328J4333R201k6973
6139H4014L1879Q28n816j7952k037L5241k0550K1085r168k9668N845Q219l410
6126I8510J5433R262N068N839J7707j2779k849k3071R185k931o144L0237L405
6113A46872J791K4647m755j0188L0508O928M744k8216j1474J8360K705q499M79
6100A73902Q508J8088j6645K9687r622m620J9782P137R737R449J5295k0505j5820
$$ plain form
6191 134809 136806 132823 139058 125310 133169 136095 134193 120624 107163 107076 111019 61626 109203 138943
6177 138943 123186 128822 108181 108625 113830 107785 84669 81519 82875 112809 73739 73955 89953
6164 89953 101883 89974 75259 58714 76599 78068 80035 90211 100865 129861 113514 130243
6152 130243 118499 102061 83855 82929 97147 80838 107717 106869 94781 87453 101786 110987 84014
6139 84014 115893 116721 110905 92953 90916 126157 105607 126692 117524 87856 93701 101920 98510
6126 98510 113943 123205 128273 134112 151819 139040 136191 113120 122305 119374 113230 143467 146872
6113 146872 148663 173310 168555 158367 188875 195803 200547 172331 160857 179217 181922 173423 173902
6100 173902 182410 200498 183853 213540 203918 199298 219080 226217 235954 245403 260698 240193 224373
6087B24373p165J4349Q496J0107o49K3529j0347K184k573j6096J1300P107j8649
6074B45966k518Q228M373o11J0569K5195k0339P784J0741k5893K9878J3676N913
6061C12962j7323R918P108K2941l998k5192K2753J2121K6695j3329k654K1851
6049C73853J7579n114K5092Q684J9274l564K8646K2566k778N161L2277M5810K8749
6036E96235O404J3736M2435J5012k640K5608K4579L7055L2294J1188M5894L7300
6024H85100L9457J4650L5922Q3168N4561O4754j1529O6457O5256N9341O2939R9293
6012A519369N8434Q0830R0048R0724J03736J01238J30318J19996J48607J94385
6002B637685J80837K21183K45057K58897K97693K83497K62791K20863J54385J33524
$$ plain form
6087 224373 217208 231557 240053 250160 249511 273040 262693 264877 262304 246208 257508 264615 245966
6074 245966 243448 251676 256049 255438 266007 291202 270863 278647 289388 263495 293373 307049 312962
6061 312962 295639 305557 312665 335606 331608 306416 329169 341290 367985 354656 352002 373853
6049 373853 391432 386318 411410 420094 439368 435804 464450 487016 484238 489399 521676 567486 596235
6036 596235 602639 616375 658810 673822 671182 696790 721369 758424 790718 801906 847800 885100
6024 885100 924557 939207 975129 1058297 1112858 1177612 1166083 1232540 1297796 1357137 1420076 1519369
6012 1519369 1577803 1658633 1748681 1839405 1943141 2044379 2174697 2294693 2443300 2637685
6002 2637685 2818522 3039705 3284762 3543659 3841352 4124849 4387640 4608503 4762888 4896412
5992D896412J17937J2203j761N0356M0490N8902J23648J33010K11575K46701K93066
5981F182539L25195K65076K47549J69916K8060k842j22605j77656j80628k32400
5971F502204k21637j47174r5753j05613q4140J9399K5699M7573P3684K1235o992
5960F028485p7611j08651k10649k20515k67867k96373k53221k72163k52246k28701
5950C840488j54852j91647j49199r6715q9380p4825q0859n5417n6517o0686m3185
5939B787206m5037k9006p9347m7880l4749m5148l8097l3022n9287j5887m8832
5928B310914k6691R651L889M8084j9235J9128N5069K8010N3561k441k614L7129
5916B514454R195j9224k4611J134m558n542J0972j4943L9634M9852M1940K0018
$$ plain form
5992 4896412 5014349 5026552 5024791 5075147 5115637 5174539 5298187 5431197 5642772 5889473 6182539
5981 6182539 6507734 6772810 7020359 7190275 7218335 7215493 7092888 6915232 6734604 6502204
5971 6502204 6280567 6133393 6037640 5932027 5847887 5867286 5892985 5940558 6014242 6035477 6028485
5960 6028485 5950874 5842223 5631574 5411059 5143192 4846819 4593598 4321435 4069189 3840488
5950 3840488 3685636 3493989 3344790 3248075 3158695 3083870 3003011 2947594 2891077 2830391 2787206
5939 2787206 2742169 2713163 2633816 2585936 2551187 2506039 2467942 2434920 2375633 2359746 2310914
5928 2310914 2284223 2293874 2297763 2345847 2326612 2345740 2400809 2428819 2482380 2479939 2477325 2514454
5916 2514454 2523649 2504425 2479814 2480948 2476390 2470848 2481820 2466877 2506511 2556363 2598303 2618321
5904B618321L1364K4052J3187L6957K6313R018K3363J0071j9986N375j4710L323
5892B766648l690M8899J0160J4992J5732K3133M1969O577N850Q761l6739m3828
5880B858464j8714o5790p2941p6758n8825p8630n9047o3867o0156n3037m9010
5869B201689l8351l4785l4232l7700l3917o0244r580m6341o3685q3495p6773l4791
5857A647795o4105n3925q1152m6157m9274o4412m3625m7651n2319m3249p052k8643
5845A066231l7345j6049j4524j4410J1483j7479p689N85J4623n39M683J65J1096
5832A000831j7003k4250J4814J3883L3482k381L933K5595n614J725K0734K1238
5820A086987K7610K5329M0789O0426M5083P360Q502k0745L2662j5382l095K3017
$$ plain form
5904 2618321 2649685 2673737 2686924 2723881 2750194 2759212 2782575 2792646 2772660 2778035 2763325 2766648
5892 2766648 2762958 2811857 2822017 2837009 2852741 2875874 2917843 2924420 2930270 2939031 2902292 2858464
5880 2858464 2839750 2773960 2701019 2624261 2565436 2486806 2427759 2363892 2303736 2250699 2201689
5869 2201689 2163338 2128553 2094321 2056621 2022704 1962460 1952880 1906539 1842854 1759359 1682586 1647795
5857 1647795 1583690 1529765 1448613 1402456 1353182 1288770 1245145 1197494 1145175 1101926 1094874 1066231
5845 1066231 1028886 1012837 998313 983903 995386 977907 970218 970803 985426 984887 989570 989735 1000831
5832 1000831 983828 959578 974392 988275 1021757 1019376 1023309 1048904 1043290 1045015 1065749 1086987
5820 1086987 1114597 1139926 1180715 1241141 1286224 1293584 1302086 1281341 1314003 1298621 1295526 1318543
5808A318543l4377q072Q554J6563r570l2125L6910m230J7472L4347M2605N1930
5796A438550O2985O3977K6919K0696j5129j8788q4503l3945o5486n4794o6050
5785A274432p1246j1637l5436j7246L5022j8974L963O0056O7685P5366J03039
5774A465024N2277j7636L5597q574p9796q7138o5762o0662r3315o9961n7494m5097
5762I67463n895k2061L505o170J3451N0665N6435N5623R4536L7094l2376L0922
5750A243192l7488m0507p4281l7212o3564o0862m3479m0675m4072k569K603l2099
5738G68987j9550J5989K9548J8743P199J0761J670J7022J808j5251n088O698q279
5725H30257k1398k5150P452J8469m9745N204l0127q854j6253m0027k3506J1216
$$ plain form
5808 1318543 1284166 1276094 1284648 1301211 1291641 1259516 1296426 1292196 1309668 1344015 1386620 1438550
5796 1438550 1501535 1565512 1592431 1613127 1597998 1579210 1494707 1460762 1395276 1340482 1274432
5785 1274432 1203186 1191549 1156113 1138867 1173889 1154915 1158878 1218934 1286619 1361985 1465024
5774 1465024 1517301 1499665 1535262 1526688 1446892 1359754 1293992 1233330 1140015 1070054 1012560 967463
5762 967463 961568 939507 943012 936842 950293 1000958 1057393 1113016 1207552 1244646 1212270 1243192
5750 1243192 1205704 1165197 1090916 1053704 990140 929278 885799 845124 801052 798483 801086 768987
5738 768987 749437 765426 794974 813717 820916 831677 833347 850369 852177 836926 831838 838536 830257
5725 830257 808859 783709 791161 809630 759885 765089 734962 726108 709855 669828 646322 657538
5713F57538j1908l1003k3700R798k9137J861m15q664k3184J1932K499j4052k171
5700E39394j411J2718l7525Q787J7244l8615L0181K048J3008J0146K116l804j664
5687E52623K1198j801j3436J5438k498J5714J1732K420J9868J6037j3825J5727
5675F39197N6419J2169j2578M238J2415K5604M4249K0749J2004j029J3295n775
5663H20957K1586J7103k380j0191O907k6581J9166Q941k156Q673K3628J5780R797
5650I11230L295J2868J7775L7628L5028K6396J7736M0122M4596M8704J8813K4526
5638A238717M9925M6221N7728N8518L8010P7438N6442M3634O0074N8986O8529
5627A854222P7684Q2298R0216J05026J51599J33265J24725J89459K06910K26721
$$ plain form
5713 657538 645630 614627 590927 600725 571588 573449 573034 564370 541186 553118 555617 541565 539394
5700 539394 537983 550701 513176 521963 539207 500592 530773 532821 545829 555975 558091 554287 552623
5687 552623 573821 572020 558584 574022 571524 587238 598970 601390 621258 637295 623470 639197
5675 639197 695616 707785 695207 699445 711860 737464 781713 802462 814466 813437 826732 820957
5663 820957 842543 859646 857266 847075 853982 827401 846567 855508 853352 862025 885653 901433 911230
5650 911230 914525 927393 945168 982796 1017824 1044220 1061956 1102078 1146674 1195378 1214191 1238717
5638 1238717 1288642 1334863 1392591 1451109 1489119 1566557 1622999 1666633 1726707 1785693 1854222
5627 1854222 1931906 2014204 2104420 2209446 2361045 2494310 2619035 2808494 3015404 3242125
5617C242125K38219K55604K77455K84362K87448K34188J81613J28808N5645M9588
5607E235055L1843K5973J1372J9595Q7873J76030K17702K63356L04535L60259
5597F733593L45235K64875K27004J22138J1953j15206j50474k10710k53255k21958
5587F753195k10805j27943j01605J1174P4788J58604K57297K27786J07741N0911
5577G201143J1895p9051j93705k48610k15470k72746k79906k51298j83808j20132
5567E368312j08794n5588R186L6201P1496J54940J93359K46787L08694M52214
5557F676807N74013N23097J51372R3201J01300q0726l16272k68107j54071l42565
5547F958049l79243k67440j91990j27967q6593l2420l177K5517P3233J57984K06461
$$ plain form
5617 3242125 3480344 3735948 4013403 4297765 4585213 4819401 5001014 5129822 5185467 5235055
5607 5235055 5266898 5292871 5304243 5323838 5411711 5587741 5805443 6068799 6373334 6733593
5597 6733593 7078828 7343703 7570707 7692845 7704798 7589592 7439118 7228408 6975153 6753195
5587 6753195 6542390 6414447 6312842 6324016 6398804 6557408 6814705 7042491 7150232 7201143
5577 7201143 7213038 7133987 6940282 6691672 6476202 6203456 5923550 5672252 5488444 5368312
5567 5368312 5259518 5203930 5213116 5249317 5320813 5475753 5669112 5915899 6224593 6676807
5557 6676807 7250820 7773917 7925289 8018490 8119790 8039064 7722792 7454685 7300614 6958049
5547 6958049 6578806 6311366 6119376 5991409 5904816 5872396 5869219 5894736 5967969 6125953 6332414
5536F332414K63566L44860M75905O05263M98037J03077J15793J12740j19878l20011
5526H411766k77227k38948m00396m59975l24760k18942j92045j52672j09044o9219
5516E968538l4307K4427J372P3552J14856R5228J36810K18244J34759N2472M0518
5505F826469M5944o0853q8657m7637k9902j43376j26006o7125n1653m7776l8630
5494F170798l3774r038l8678J6740P0830L1596M3976J16286J51690J32177J90977
5483F843580K00058K27439K43169K21941K14271J68207K01215J13806R1306J35754
5473H660746J39175J33327J27830J55922J69201Q3513Q2198Q4785M8068M4451
5463I729216M0067L2356R3044R7268J55726J91820K17480K57201K43204K32149
$$ plain form
5536 6332414 6595980 6940840 7416745 8022008 8520045 8623122 8738915 8851655 8731777 8411766
5526 8411766 8134539 7895591 7495195 7035220 6710460 6491518 6299473 6146801 6037757 5968538
5516 5968538 5934231 5958658 5960030 6033582 6148438 6243666 6380476 6598720 6733479 6785951 6826469
5505 6826469 6872413 6811560 6722903 6675266 6645364 6501988 6375982 6308857 6257204 6209428 6170798
5494 6170798 6137024 6127986 6089308 6106048 6176878 6208474 6252450 6368736 6520426 6652603 6843580
5483 6843580 7043638 7271077 7514246 7736187 7950458 8118665 8319880 8433686 8524992 8660746
5473 8660746 8799921 8933248 9061078 9217000 9386201 9469714 9551912 9636697 9684765 9729216
5463 9729216 9769283 9801639 9894683 9991951 10147677 10339497 10556977 10814178 11057382 11289531
5453A1289531J95965J14641J0930l2316j54841k55014k94049l61659l78002l64598
5443I770588l04891k80716k12790j69676r3594l2030l5414n4658n7305j34945
5433H394569j67928k40864k34043k48735k54047k53059k61232k11497j90946j72261
5423F159957j44455j46383j03852j14804j04500o2463q4369n8556l0620l8162
5413E271793l5101j6744n0543m0094j0614o8601q3635l8855o8822m6973k4500
5402D787311n7722n032k5837l0657j8592l0142m0048J420k8039n378J7140m5796
5390D518628q588j2396k8591J8738k3207j7696R295l841r370K0309L2364J7556
5378D513201L1978N9995R7493O5065J35983J56231J93651K40025L31418M18535
$$ plain form
5453 11289531 11485496 11600137 11611067 11578751 11423910 11168896 10874847 10513188 10135186 9770588
5443 9770588 9465697 9184981 8972191 8802515 8708921 8676891 8641477 8586819 8529514 8394569
5433 8394569 8226641 7985777 7751734 7502999 7248952 6995893 6734661 6523164 6332218 6159957
5423 6159957 6015502 5869119 5765267 5650463 5545963 5483500 5399131 5340575 5309955 5271793
5413 5271793 5236692 5219948 5169405 5129311 5118697 5050096 4966461 4927606 4858784 4811811 4787311
5402 4787311 4729589 4724557 4698720 4668063 4649471 4619329 4579281 4580701 4552662 4547284 4564424 4518628
5390 4518628 4510040 4497644 4469053 4487791 4464584 4446888 4456183 4452342 4442972 4463281 4495645 4513201
5378 4513201 4545179 4605174 4702667 4767732 4903715 5059946 5253597 5493622 5825040 6243575
5368F243575N64386O32202Q86392J113415J513630K155624K469270L26135K595
5359A5907224N91847k78090j324226j374432n57070j364476j863194j410209j006575
5350G320799p28001n99384n22934m15783l12272k71309k36676j32758j31236r6430
5340C874016p2891n9934l2754j9080j3580j6685k6842j3145j5716m7236o7120
5329C489033o3150j17228j11552q0008j86610j29070r7723j45607r2550j12551
5319B352984j15459p6945m8680r9962o0226q9765n9099p4647l2201m8887n3049
5308A594064m8746l5052l9415k1490m7273j0461j2415k5237l1932m0897k5686
5297A255460n8314k8747k5738l1510l3508j1011k8597l2717K5274k0605k2008
$$ plain form
5368 6243575 6807961 7440163 8326555 9439970 10953600 13109224 15578494 15904629 15907224
5359 15907224 16499071 16220981 14896755 13522323 12965253 11600777 9737583 8327374 7320799
5350 7320799 6592798 5993414 5470480 5054697 4742425 4471116 4234440 4101682 3970446 3874016
5340 3874016 3801125 3741191 3708437 3689357 3675777 3659092 3632250 3619105 3603389 3556153 3489033
5329 3489033 3425883 3308655 3197103 3117095 2930485 2801415 2703692 2558085 2465535 2352984
5319 2352984 2237525 2160580 2111900 2011938 1951712 1861947 1802848 1728201 1696000 1647113 1594064
5308 1594064 1545318 1510266 1470851 1449361 1402088 1391627 1379212 1353975 1322043 1281146 1255460
5297 1255460 1197146 1168399 1142661 1111151 1077643 1066632 1038035 1005318 1030592 1009987 987979
5286I87979k9399j750k0528k0599j3243j5151j1711L134K064j255q270K419q963
5273H64727j0368P129j5970R162J9921Q293J7347R66J8664L0673L8679N0798M9188
5260A089209Q7021J04897J44211N5354J2614K6964n2431p7884o8737j00369j31126
5249A089723q5933o0871n9733o0808m7998p060j9473l9044j7801l3482J2498m043
5237F65975m3593j4271j8789k1334O449k872J7789k0008J4255n354k2991L5126
5225E90382j4966k2376Q498M352l667J3028j802k9244m545P722M251Q652k9442
5212E30843K6680j3554j4436K8393k048m287R781j1225k4004L3617J748p874q860
5199E44774l344N006J3231m733K2315k07j0151J6942L106L809j5175P282J099
$$ plain form
5286 987979 958580 956830 936302 915703 902460 887309 875598 878732 880796 879541 871271 873690 864727
5273 864727 854359 861488 845518 854680 874601 882894 900241 901207 919871 950544 989223 1040021 1089209
5260 1089209 1176230 1281127 1425338 1480692 1493306 1520270 1467839 1389955 1321218 1220849 1089723
5249 1089723 1003790 942919 883186 822378 774380 767320 747847 708803 691002 657520 670018 665975
5237 665975 622382 608111 589322 567988 574437 571565 589354 569346 583601 578247 555256 590382
5225 590382 575416 553040 561538 565890 562223 575251 573449 544205 539660 547382 551633 560285 530843
5212 530843 557523 543969 529533 557926 555878 551591 561372 550147 526143 559760 561508 553634 544774
5199 544774 541430 546436 559667 554934 577249 577042 566891 583833 586939 590748 575573 582855 583954
5186E83954M700k807j5059r658M3741J0781q513P98P502l591O481K791j788P786
5172F27118R197M869P199n218K9402m491j217K6941p55Q721J8949L8434q11J0317
5158G68655K369q339L437J4069J771J1244n087J5029N750n778J9802K3894K249
5145H49065K5888K308L917R446j2554J5913L4332K7110J5835R103K9745L0203
5133A040311J5105K2684K2286L1018L0850N1528K0195M2952N6775L6279P8280
5122A448263M3310N6770O6665L6851L0231N2953P9414N8394P0024Q5260P8295
5111B106430J07136R5475R7239R1638J02471J36596R1472J20903J44217J52201
5101C245778J46466J88127J97168J79746J93216K24773K49081K62818K79596L12747
$$ plain form
5186 583954 588654 585847 570788 561130 604871 615652 607139 607937 615439 611848 618329 621120 619332 627118
5172 627118 636315 641184 648383 643165 672567 668076 666859 693800 693045 701766 720715 759149 758338 768655
5158 768655 771024 762685 766122 780191 781962 793206 788119 803148 808898 803120 822922 846816 849065
5145 849065 874953 877261 881178 890624 878070 893983 928315 955425 971260 980363 1010108 1040311
5133 1040311 1055416 1078100 1100386 1131404 1162254 1213782 1233977 1276929 1333704 1369983 1448263
5122 1448263 1491573 1548343 1615008 1651859 1682090 1735043 1814457 1872851 1942875 2028135 2106430
5111 2106430 2213566 2309041 2406280 2497918 2600389 2736985 2828457 2949360 3093577 3245778
5101 3245778 3392244 3580371 3777539 3957285 4150501 4375274 4624355 4887173 5166769 5479516
5091E479516L43083L74332M47871M99710N52421O27935P48974Q89686J014100
5082A0977628J136666J194945J181432J094609R08776P25478O13413O68566R18843
5073A9420356J345953J875528J434656Q29008l2427o46901j262643j688605j870438
5064A9404487k021355k127605k127436j616478j228501r49413q16994o29560n37255
5055G349890m59410l60169k73773k01600j86447j27189r8666r5046m0874j9809
5045E486907M13J854M1197M8290J9220P3025P9905O4518J16195J25135J36315
5034F192974K23476K47956L42303M18140N45409O46952Q70881J047889J429481
5025A1965461J907511K494798J997624J643343J230723k53694o57335r26911j565945
$$ plain form
5091 5479516 5822599 6196931 6644802 7144512 7696933 8324868 9073842 9963528 10977628
5082 10977628 12114294 13309239 14490671 15585280 16494056 17219534 17832947 18501513 19420356
5073 19420356 20766309 22641837 24076493 24905501 24873074 24226173 22963530 21274925 19404487
5064 19404487 17383132 15255527 13128091 11511613 10283112 9333699 8516705 7887145 7349890
5055 7349890 6890480 6530311 6256538 6054938 5868491 5741302 5642636 5547590 5506716 5486907
5045 5486907 5487320 5489174 5530371 5578661 5597881 5670906 5750811 5815329 5931524 6056659 6192974
5034 6192974 6416450 6664406 7006709 7424849 7970258 8617210 9488091 10535980 11965461
5025 11965461 13872972 16367770 18365394 20008737 21239460 20985766 20328431 19401520 17835575
5016A7835575j915629j691973j851281j585173j191892q78197o97093n96945m75933
5007F951459l79462l50555k99545k60605j81805j99455j62033j37753j42975j37634
4997D699637j07821q3882p0262j06009n9278p0312n5173m9833q7219k8558r7416
4986C883874r5791q4477r2961j14800j01604p3314o0560n1548p0315m1293k8751
4975C068460j9480l1161J0063M3737J8412K7703K6723P940L2643l6416k2305p254
4963C119065k4114j7190m7854k1199k7129j3959J4990J9144n24k545J1859N3931
4951C064475J8569J7243J4940K5269J3072K2222J0195M3303P8018N4372O9264
4940C430942P7445M2438J3655J0865j7099n6809p1023m1854q6771j02096j01589
$$ plain form
5016 17835575 15919946 14227973 12376692 10791519 9599627 8721430 8024337 7427392 6951459
5007 6951459 6571997 6221442 5921897 5661292 5479487 5280032 5117999 4980246 4837271 4699637
4997 4699637 4591816 4507934 4437672 4331663 4272385 4202073 4146900 4097067 4009848 3981290 3883874
4986 3883874 3788083 3703606 3610645 3495845 3394241 3320927 3260367 3208819 3138504 3097211 3068460
4975 3068460 3048980 3017819 3027882 3071619 3090031 3117734 3144457 3152397 3185040 3148624 3126319 3119065
4963 3119065 3094951 3077761 3029907 3008708 2981579 2967620 2982610 3001754 3001230 2998685 3010544 3064475
4951 3064475 3083044 3100287 3115227 3140496 3153568 3175790 3185985 3229288 3307306 3361678 3430942
4940 3430942 3508387 3550825 3564480 3575345 3558246 3501437 3430414 3388560 3301789 3199693 3098104
4929C098104j12563q8664j28634r1296r4348q9641q9497q2237j04280o3239p2536
4918B081169n0338n8800n0882m4696n6548n5923j0913k546p8821l6340m9571l3901
4906A551890j1836k4116l4015m6838j8946k5364m8417o72j0165n3738j4235j7386
4894A246162o589R65l6060J068o887k2213k3172k6733O424q30p629J730L412q697
4880A120951J0072q453l219J0892o809j1915L032k5778j2881K0861J8485k9831
4868A085407m865j3645K0030k3574r337K2318R677K4578J2745m1L7622J3400K6379
4855A200694L0876J1474R293J4275L3564K6446M280j439K7658J9989K811J1110
4843A391031L3282L6298J7711L7071o12N1943N3272N3495L2145L1888P0418K7204
$$ plain form
4929 3098104 2985541 2896877 2768243 2676947 2582599 2492958 2403461 2321224 2216944 2153705 2081169
4918 2081169 2030831 1972031 1921149 1876453 1819905 1763982 1753069 1750523 1671702 1635362 1585791 1551890
4906 1551890 1540054 1515938 1481923 1435085 1416139 1390775 1342358 1341686 1331521 1277783 1263548 1246162
4894 1246162 1239573 1240538 1204478 1205546 1198659 1176446 1153274 1126541 1132965 1132135 1124506 1126236 1129648 1120951
4880 1120951 1131023 1122570 1119351 1130243 1123434 1111519 1114551 1088773 1075892 1096753 1115238 1085407
4868 1085407 1080542 1066897 1086927 1063353 1054016 1076334 1086011 1110589 1123334 1123293 1160915 1174315 1200694
4855 1200694 1231570 1243044 1252337 1266612 1300176 1326622 1330902 1329463 1357121 1377110 1379921 1391031
4843 1391031 1424313 1460611 1478322 1515393 1514781 1566724 1619996 1673491 1705636 1737524 1807942 1835146
4831A835146O7395K5464M9172N6783O9704N6143O5092R9684N8349Q1730R5637
4820B560299J02365J07282M6704Q6815Q2020O4445M6166N6327O7321P9900O7074
4809C366718P3900O5889Q7241J31468J21375J15016J19897J64897J65610J25348
4799D537359J57046J45374J05247Q8972O4532J19666P7378O0446Q4977J43509
4789E584506J46622J37964J24926J03176R7749O2543N8314L4593O105L7374O8384
4778F462256Q7916J40649J34280J23206J46070M9396K9884o5054j63266k06879
4768F738458k93138k80833k78862k83427k97013k48647k13381j99424j61234j66671
4758D315828j25610j09964j41138p3206o1600l9522o0803l7994k298r94k3163
$$ plain form
4831 1835146 1902541 1928005 1977177 2033960 2103664 2159807 2224899 2324583 2382932 2464662 2560299
4820 2560299 2662664 2769946 2816650 2903465 2985485 3049930 3096096 3152423 3219744 3299644 3366718
4809 3366718 3440618 3506507 3593748 3725216 3846591 3961607 4081504 4246401 4412011 4537359
4799 4537359 4694405 4839779 4945026 5033998 5098530 5218196 5295574 5356020 5440997 5584506
4789 5584506 5731128 5869092 5994018 6097194 6194943 6257486 6315800 6350393 6356498 6393872 6462256
4778 6462256 6550172 6690821 6825101 6948307 7094377 7143773 7173657 7108603 6945337 6738458
4768 6738458 6445320 6164487 5885625 5602198 5305185 5056538 4843157 4643733 4482499 4315828
4758 4315828 4190218 4080254 3939116 3865910 3804310 3764788 3703985 3665991 3663693 3662699 3639536
4747C639536M6469M1512N3048M5267O8038N7224Q0727J56971J36935J48245K09416
4736D683388K13486K66753K31558K46677J73519J38425R5063P56m0916o7396l8113
4725E903200m4792K8335L2319J03811J71700J76140J93739J74216J36632Q4045
4715F959345O0029m1155j19705k06079k26294k24055k49457k21512j72881j76948
4705E381288j16112m2079n3914j4443q004m4198r4114j48759j86187k18008k15806
4694D239664k31228k26824k21509j74855j77527j66936j08425j46276j09583q6235
4684B590266p8704p1979q2566o6229p3795k9008n6668m9791p512n6230l5190m9355
4672A933239j3137m5447j8861l5723l9478m9928j8367j3841j6177n3786j8407
$$ plain form
4747 3639536 3686005 3727517 3780565 3825832 3893870 3951094 4031821 4188792 4325727 4473972 4683388
4736 4683388 4896874 5163627 5395185 5641862 5815381 5953806 6048869 6049625 6008709 5941313 5903200
4725 5903200 5858408 5886743 5919062 6022873 6194573 6370713 6564452 6738668 6875300 6959345
4715 6959345 7019374 6978219 6858514 6652435 6426141 6202086 5952629 5731117 5558236 5381288
4705 5381288 5265176 5223097 5169183 5154740 5146736 5102538 5008424 4859665 4673478 4455470 4239664
4694 4239664 4008436 3781612 3560103 3385248 3207721 3040785 2932360 2786084 2676501 2590266
4684 2590266 2511562 2439583 2357017 2290788 2216993 2187985 2131317 2081526 2074014 2017784 1982594 1933239
4672 1933239 1920102 1874655 1855794 1820071 1780593 1730665 1712298 1698457 1682280 1628494 1610087
4661A610087q652l9542n813l7387k0295k0689j9912k589k6128m0957k5260j3924
4649A348939R302P515k0621k4775L223J844j813R230j0190P498o280j726L0053
4636A352199L1843K2886K2441O707J4613K6272p654J9878L198J22P2830J6944
4624A582279J9102K8058N9431O999m592J5980K739k9204l6124l1239q080j6557
4612A588792m4811j3029r060q396K4875k0142P714o814K0044N4097K9333L1861
4600A654464j0066O216K3958k276k8573K7897j3788l5087p493N4579j2466J5720
4588A673085K648J1208O5280J0538J9417N2038m634K7113N5377M2131L3853M0688
4576B028742L9799J0947N0534M8553M8366K1032M2638K6070P0600L235N3061L4156
$$ plain form
4661 1610087 1601435 1561893 1556080 1518693 1498398 1477709 1457797 1455208 1429080 1388123 1362863 1348939
4649 1348939 1358241 1365756 1345135 1320360 1323583 1325427 1323614 1332844 1322654 1330152 1323872 1322146 1352199
4636 1352199 1384042 1406928 1429369 1436076 1450689 1476961 1469307 1489185 1492383 1492505 1565335 1582279
4624 1582279 1601381 1629439 1688870 1695869 1691277 1707257 1709996 1680792 1644668 1613429 1605349 1588792
4612 1588792 1543981 1530952 1521892 1513496 1538371 1518229 1525943 1519129 1539173 1593270 1622603 1654464
4600 1654464 1644398 1650614 1674572 1672296 1643723 1671620 1657832 1622745 1615252 1669831 1657365 1673085
4588 1673085 1675733 1686941 1752221 1762759 1782176 1834214 1829580 1856693 1912070 1954201 1988054 2028742
4576 2028742 2068541 2079488 2130022 2178575 2226941 2247973 2290611 2316681 2387281 2390516 2443577 2477733
4564B477733J6387Q0442K6003Q5921Q9994K1709P8685P3211Q7300Q4837O4238
4553C186460R3572O3631P8740M4740Q8124R1216Q7716R4522R3609J05105J32099
4542D159534J26659J16438J45890J54036J59526K18913J78520J87093K13007K37845
4532E897461K04440K24690K54581K27484K98170K60813K68145L02437L21280L28071
4522H587572L59471M24592M39391M30329M71078M53670M08381L95189K56752K25336
4512A2451761J61773N4744Q175l551j6544j5431M988P618O7546J39633J72771
4501A3033483K03242K94007L30904L71751M30427M69001N59828N93079O85234
4492A6970956P47013Q11739Q61810R02800J008640J082347J163641J268470J367966
$$ plain form
4564 2477733 2494120 2574562 2600565 2686486 2776480 2798189 2876874 2950085 3037385 3122222 3186460
4553 3186460 3280032 3343663 3422403 3467143 3555267 3646483 3734199 3828721 3922330 4027435 4159534
4542 4159534 4286193 4402631 4548521 4702557 4862083 5080996 5259516 5446609 5659616 5897461
4532 5897461 6101901 6326591 6581172 6808656 7106826 7367639 7635784 7938221 8259501 8587572
4522 8587572 8947043 9371635 9811026 10241355 10712433 11166103 11574484 11969673 12226425 12451761
4512 12451761 12613534 12668278 12676453 12672902 12656358 12640927 12645915 12653533 12721079 12860712 13033483
4501 13033483 13236725 13530732 13861636 14233387 14663814 15132815 15692643 16285722 16970956
4492 16970956 17717969 18529708 19391518 20294318 21302958 22385305 23548946 24817416 26185382
4483B6185382J502332J579148J634766J694393J769069J767067J792044J843348
4475C9767549J904490K006267K041578K069284K162249K196844K203322K170775
4467E6522358K059562J953632J892698J751264J641261J512980J416960J331329
4459G0082044J132835R35277P01113M23125J00615j26985l64087n80628p49264
4450G1554045r03193j044239j193966j392542j546798j714937j883799k028111
4442E9846460k163094k259543k266498k272384k241803k211649k161472k147746
4434D2122271k081666k047561j982544j911768j854566j754475j656959j544986
4426B7287746j387361j283693j160385j010429r13644p76062o66183n21107l75244
$$ plain form
4483 26185382 27687714 29266862 30901628 32596021 34365090 36132157 37924201 39767549
4475 39767549 41672039 43678306 45719884 47789168 49951417 52148261 54351583 56522358
4467 56522358 58581920 60535552 62428250 64179514 65820775 67333755 68750715 70082044
4459 70082044 71214879 72150156 72851269 73274394 73375009 73248024 72883937 72303309 71554045
4450 71554045 70650852 69606613 68412647 67020105 65473307 63758370 61874571 59846460
4442 59846460 57683366 55423823 53157325 50884941 48643138 46431489 44270017 42122271
4434 42122271 40040605 37993044 36010500 34098732 32244166 30489691 28832732 27287746
4426 27287746 25900385 24616692 23456307 22445878 21532234 20756172 20089989 19568882 19193638
4417A9193638k35052n0366J15565L30578N29608Q00420R82588J047638Q83460
4408B3598077M11007k5911m97431q80082j213634j356912j504098j504631j387867
4399A5638518j225039r90025q51982p55685o53062n21033n39871m51566l88886
4390I261369l30042k97211l10902k40920k51885k16926j91998j90083j80897j55054
4380F895451j44991j45604j35867j31912j15528j38606j34951r4088j19981r8632
4370E635291j13879r4883o7364j12643o9075l2176m8702m5500o3962l6085J6452
4359D967474O53l257j8582j0321M398j610m7493p364l9594m9311m3526l8794n7877
4346D654796p3259n8153o3101m5899p1460k6996o4101o7657o1160p1922o3994
$$ plain form
4417 19193638 18958586 18908220 19023785 19354363 19883971 20684391 21666979 22714617 23598077
4408 23598077 24009084 23983173 23485742 22605660 21392026 20035114 18531016 17026385 15638518
4399 15638518 14413479 13423454 12571472 11815787 11162725 10641692 10101821 9650255 9261369
4390 9261369 8931327 8634116 8323214 8082294 7830409 7613483 7421485 7231402 7050505 6895451
4380 6895451 6750460 6604856 6468989 6337077 6221549 6082943 5947992 5853904 5733923 5635291
4370 5635291 5521412 5426529 5359165 5246522 5177447 5145271 5096569 5051069 4987107 4951022 4967474
4359 4967474 4968127 4964870 4946288 4935967 4940365 4938755 4891262 4883898 4844304 4794993 4751467 4712673 4654796
4346 4654796 4581537 4523384 4460283 4414384 4342924 4315928 4251827 4184170 4123010 4051088 3987094
4335C987094n0986n8917k0755j5073k6513n800K4810l55l300l256K455O285n727
4322C829962M5298J3374N459K5711L8738K0883K2657M3212K5449K2448K8119p764
4310D113546L4505K2911k034K5188j0534L4645L2354L2002N0438J2531N1274O0823
4298D457649L0712N3771L9854O5741M5074N7976Q7375J01118J08001N7146J20051
4287E224468J17062J12419J24059J31742J31408J37576J22973J60318J24511J33050
4277F519586J01293J12694J24148J11570J06259J08240J43411J35603J26929R4570
4267G684303J25631J48704J22636R3506R1489J44880R4015J29709J82074J48313
4257H965260J45311J68069J89301J75548K04253K22490K33270K32401K56229K53543
$$ plain form
4335 3987094 3936108 3877191 3856436 3841363 3814850 3809050 3833860 3833505 3830205 3826949 3829404 3835689 3829962
4322 3829962 3875260 3888634 3894093 3919804 3958542 3979425 4002082 4045294 4070743 4093191 4121310 4113546
4310 4113546 4148051 4170962 4168928 4194116 4183582 4218227 4250581 4282583 4333021 4345552 4396826 4457649
4298 4457649 4488361 4542132 4581986 4647727 4692801 4750777 4838152 4939270 5047271 5104417 5224468
4287 5224468 5341530 5453949 5578008 5709750 5841158 5978734 6101707 6262025 6386536 6519586
4277 6519586 6620879 6733573 6857721 6969291 7075550 7183790 7327201 7462804 7589733 7684303
4267 7684303 7809934 7958638 8081274 8174780 8266269 8411149 8505164 8634873 8816947 8965260
4257 8965260 9110571 9278640 9467941 9643489 9847742 10070232 10303502 10535903 10792132 11045675
4247A1045675K82035K68377K92985L67413L57521L85054M28400M54006M74931
4238A4356397N20538N54373O14509O82654O82459P53441Q38652R42156J002028
4229B0947207J108016J174552J258171J361307J382630J396223J399936J405813
4221C1433855J353312J313431J303176J260344J238871J201253J216958J124518
4213D1445718R97911R13458P34991O45164N05035M10909L67988L15067L35102
4204D6671343L64147L73378M26213M74457N36906O51187P11380Q84987J009143
4195E2103141J208863J417845J687778J970937K281956K632894K971839L349056
4187F9624309L713756M098069M405261M689084M876519N051952N189876N332479
$$ plain form
4247 11045675 11327710 11596087 11889072 12256485 12614006 12999060 13427460 13881466 14356397
4238 14356397 14876935 15431308 16045817 16728471 17410930 18164371 19003023 19945179 20947207
4229 20947207 22055223 23229775 24487946 25849253 27231883 28628106 30028042 31433855
4221 31433855 32787167 34100598 35403774 36664118 37902989 39104242 40321200 41445718
4213 41445718 42443629 43357087 44092078 44737242 45242277 45653186 46021174 46336241 46671343
4204 46671343 47035490 47408868 47835081 48309538 48846444 49497631 50209011 51093998 52103141
4195 52103141 53312004 54729849 56417627 58388564 60670520 63303414 66275253 69624309
4187 69624309 73338065 77436134 81841395 86530479 91406998 96458950 101648826 106981305
4179A06981305N493890N663930N840483O036787O212189O341685O405688O391785
4171A55367742O315851O174634N901812N647233N467971N182962M924611M659112
4163A99641928M453388M299779M081453L863796L570168L207152K820135K402634
4155B28340433J861222J357021J047626Q15612P77501R80273J578303K450917
4147B39208908L775185N335904O563937P376473P560410O792994N211209L143170
4139B84968190Q82773j146249k798114l811869m292447m432850m552505n079900
4131B59737029o139684p728237r652475j1553112j3225405j4326970j4757559
4124A82353587j4656533j3932256j2725437j1383357j0010485q629442p400052
$$ plain form
4179 106981305 112475195 118139125 123979608 130016395 136228584 142570269 148975957 155367742
4171 155367742 161683593 167858227 173760039 179407272 184875243 190058205 194982816 199641928
4163 199641928 204095316 208395095 212476548 216340344 219910512 223117664 225937799 228340433
4155 228340433 230201655 231558676 232606302 233421914 234199415 235179688 236757991 239208908
4147 239208908 242984093 248319997 254883934 262260407 269820817 276613811 281825020 284968190
4139 284968190 285850963 284704714 281906600 278094731 273802284 269369434 264816929 259737029
4131 259737029 253597345 245869108 236216633 224663521 211438116 197111146 182353587
4124 182353587 167697054 153764798 141039361 129656004 119645519 111016077 103616025
4117A03616025o328628n494612m784582m208362l735653l365725l051407k939046
4109F9708010k774670k706469k587010k448362k370930k205264k132014k012373
4101E0470918j943338j937697j881258j826742j786412j779849j706916j652947
4093C5955759j586930j501445j413505j339135j222122j145908j067953j004088
4085B5674673r57075q74499q39273p70401p04687o93362o89566o31589o57797
4076A8856424n75040n69015n61077n14707m77216m82483m74427m64314m22097
4067A4316048m10193l88682m14090m08590l77284l57516l46360l38028l37919
4058A0937386l13908l15429k78898k72939k58336k38912k42015k12206k07559
$$ plain form
4117 103616025 97287397 91792785 87008203 82799841 79064188 75698463 72647056 69708010
4109 69708010 66933340 64226871 61639861 59191499 56820569 54615305 52483291 50470918
4101 50470918 48527580 46589883 44708625 42881883 41095471 39315622 37608706 35955759
4093 35955759 34368829 32867384 31453879 30114744 28892622 27746714 26678761 25674673
4085 25674673 24717598 23843099 23003826 22233425 21528738 20835376 20145810 19514221 18856424
4076 18856424 18281384 17712369 17151292 16636585 16159369 15676886 15202459 14738145 14316048
4067 14316048 13905855 13517173 13103083 12694493 12317209 11959693 11613333 11275305 10937386
4058 10937386 10623478 10308049 10029151 9756212 9497876 9258964 9016949 8804743 8597184
4049H597184k38685k18404j94759j93391j51794j73897j49182j43199j61207j53468
4039F819198j38034j36793j29918j40168j60711j04571j46367j53099j45031j22284
4029E442222q7956j06500q1193j13582q2167n6635p3187o4826p5139o8047q1800
4018D551190o8757m3174m7557o4101n0757q0757o0888l8644j8753m4928o2803
4007C970071k3354l4971l1602o22k4093o3679l9354j5964L552k9684n4363j2438
3995C643499j9610j8529m4375k5535l9477m0460l9578K521j7547j5995m7265m2156
3983C295493k1299k2047k9221k1550l4529P02o169q857k9624n944J303j4916j0003
3970C093339J0367J7376K1038K0665J6592N4237K8535R995J1638L3334K5902K9187
$$ plain form
4049 8597184 8358499 8140095 7945336 7751945 7600151 7426254 7277072 7133873 6972666 6819198
4039 6819198 6681164 6544371 6414453 6274285 6113574 6009003 5862636 5709537 5564506 5442222
4029 5442222 5354266 5247766 5166573 5052991 4970824 4914189 4841002 4776176 4701037 4632990 4551190
4018 4551190 4482433 4439259 4391702 4327601 4276844 4196087 4135199 4096555 4077802 4032874 3970071
4007 3970071 3946717 3911746 3880144 3879522 3855429 3791750 3752396 3736432 3739984 3710300 3655937 3643499
3995 3643499 3623889 3605360 3560985 3535450 3495973 3455513 3415935 3418456 3400909 3384914 3337649 3295493
3983 3295493 3274194 3252147 3222926 3201376 3166847 3167549 3161380 3152523 3122899 3116955 3118258 3103342 3093339
3970 3093339 3103706 3121082 3142120 3162785 3179377 3233614 3262149 3272144 3283782 3317116 3343018 3372205
3958C372205K0544L2251K1659M7112K3883k1046M1760K2700M7995N9491l175L7081
3946C702460M7215P7408M9604P1045L6741N2769N9780O6844N3427R5693O0407
3935D373393J24300J12730J16740J32462J33042J86228J83384J88656K40289K24864
3925F016088K01383K38136K73616K65551K65386K85143K84512K55219J76155R5756
3915H356945Q9091k705k2337m6585K153J2588J40713L14892N07515J82417n8117
3904I476570K4260j29317l26973k53764k00854l70373l76840j85666j50308p5360
3894G431375k1130K1760Q8960K13530K20934M07147M96459O83999Q28569J061147
3884A1432750J404750J810631J126753R31360J337107J218775L7530m88429j37147
$$ plain form
3958 3372205 3392749 3425000 3446659 3493771 3517654 3496608 3538368 3561068 3609063 3668554 3665379 3702460
3946 3702460 3749675 3827083 3876687 3947732 3984473 4037242 4097022 4163866 4217293 4312986 4373393
3935 4373393 4497693 4610423 4727163 4859625 4992667 5178895 5362279 5550935 5791224 6016088
3925 6016088 6217471 6455607 6729223 6994774 7260160 7545303 7829815 8085034 8261189 8356945
3915 8356945 8446036 8443331 8420994 8374409 8376562 8389150 8529863 8844755 9352270 9534687 9476570
3904 9476570 9500830 9371513 9044540 8790776 8589922 8219549 7842709 7657043 7506735 7431375
3894 7431375 7410245 7432005 7520965 7734495 7955429 8362576 8859035 9543034 10371603 11432750
3884 11432750 12837500 14648131 15774884 16706244 18043351 19262126 19299656 18811227 18674080
3875A8674080j170858j610179j288990r08401j321090j184721q32081n03499l15651
3866I538610j16179O075J26680K65328M74084P60209J174823J565119J518213
3857A5312962L43780q204p0879q46426j205522r97244j129824j557125j339286
3848H502232r75113p45774n83832n09031m39640l84531l43156l25944k40968k32799
3838C721444j81709j83957j51288j22994j36268j21582r3398p9244j16850q3079
3828B451075m7812p1127p0625q1115n5210l3261p7484q9691m7387o9393n7056
3817A750914o0846o0995l8637n2832n3191o6029j6247m3751l9897k0891o1835
3806A235763j9310j6267l1391l1083m5071k7548k8789r778m3768j9915j8466L473
$$ plain form
3875 18674080 17503222 15893043 14604053 13695652 12374562 11189841 10357760 9854261 9538610
3866 9538610 9422431 9428506 9555186 9820514 10294598 11054807 12229630 13794749 15312962
3857 15312962 15656742 15648538 15577659 14731233 13525711 12528467 11398643 9841518 8502232
3848 8502232 7527119 6781345 6197513 5688482 5248842 4864311 4521155 4195211 3954243 3721444
3838 3721444 3539735 3355778 3204490 3081496 2945228 2823646 2730248 2651004 2534154 2451075
3828 2451075 2403263 2332136 2261511 2180396 2125186 2091925 2014441 1924750 1877363 1807970 1750914
3817 1750914 1690068 1629073 1590436 1537604 1484413 1418384 1402137 1358386 1318489 1297598 1235763
3806 1235763 1216453 1200186 1168795 1137712 1092641 1065093 1036304 1026526 982758 962843 944377 947850
3794I47850l8629o855m1479l6945K6025k5360j3645m5296k3667n932J52N63q158
3781G28624k6949k7099p35l1116n219n045k5669j9209J0422k8772o949l0065n809
3768E26410R492K1987j830l2429N687J4005k4541k3618k2k8007p029Q07k8080
3755D32832k6170K0639J4801O738j9003j6966J5263j9472l13k1119L6832n666
3743D18396j9253j3339Q104K2722k2983k1152J6772k3417j3661k3462L5777l010
3731C61494J8474P823j1092k0360l293M0114k0863l6696k6878m858L457J4993
3719C22315J0450r555K4101J9285K759M332m3944K9272j0607J0849p936J9430
3707C70751m066M656J4750R374J277j4952o517N409J9762r233J8142j6817K1676
$$ plain form
3794 947850 909221 902366 860887 823942 849967 824607 810962 765666 741999 736067 736219 736782 728624
3781 728624 701675 674576 673841 642725 637506 632461 606792 587583 598005 569233 562284 532219 526410
3768 526410 535902 557889 556059 523630 529317 543322 518781 495163 495141 467134 460105 460912 432832
3755 432832 406662 427301 442102 448840 429837 412871 428134 408662 408349 387230 424062 418396
3743 418396 399143 385804 393908 416630 393647 372495 389267 365850 352189 328727 364504 361494
3731 361494 379968 387791 376699 356339 353046 393160 372297 335601 308723 303865 307322 322315
3719 322315 332765 323210 347311 366596 369355 373687 329743 359015 348408 359257 351321 370751
3707 370751 366685 371341 386091 395465 396742 381790 375273 380682 400444 391211 409353 392536 414212
3694D14212J0050J2823k874Q137M150Q131K4653J7747P479K3141k981p546K4851
3681E41973n280k331K4722P220p108O258J2068K2724P139k846L3125J9137L185
3668F59986K2446L7066M2048J5992J056J7364L5614j1122l5641q875k3952l6047
3656G15935j4309l5936j1474j5054j6974j4792j6k057J1295J8355L0443M272J6127
3643F85815j604k4708n477r185p377O675l6529m5838n999M28l888j3833l6226
3630E02254j0149J0651j1360L423o978j3358K5063Q799j6051k3099k6718k5735
3618D16742l4448q241l5364l669j9352m6600p263j3000Q61o095k565l2645k783
3605B05578j268k5327J3495n123l684l644q530r908n807m775j3183R588J663r960
$$ plain form
3694 414212 424262 437085 434211 442348 446498 454629 479282 497029 504508 527649 524668 517122 541973
3681 541973 536693 534362 559084 566304 559196 565454 577522 600246 607385 604539 637664 656801 659986
3668 659986 682432 719498 761546 777538 778594 795958 831572 820450 784809 775934 751982 715935
3656 715935 701626 665690 654216 639162 622188 607396 607380 605323 616618 634973 665416 669688 685815
3643 685815 684211 659503 654026 644841 637464 644139 607610 561772 555773 556201 552313 538480 502254
3630 502254 492105 502756 491396 494819 487841 474483 499546 508345 492294 469195 442477 416742
3618 416742 382294 374053 338689 335020 315668 269068 261805 248805 249666 243571 241006 208361 205578
3605 205578 204310 178983 192478 187355 183671 180027 171497 161589 155782 151007 137824 147412 149075 139115
3591A39115N626r152j569J5251N596k8953M563r000l023j4728O002j291r520J8614
3577A17531q406K637o123J2570l5868k5862Q428k8424J6513P999O268J3599j5294
3564F5568k0203m74o908N328J2019q627L993J2173j840k2619l810J1534j087P736
3550E2783k6716K2038O722l07j5263r138J2618j9018K754j6120L1169q456R818
3537D2884j5072J976l37j786K2645r259r841m28j6327J9114J391m372k0237K0631
3523C0982p128J0744O710j0161m821K289m300K284M56R831m68J3292R301j3339
3509D5672J3012k7226n221l520P383l801P070P927P074L830k8778j992k7999L2737
3495B6168l73J2638O8K605J2935j1165M174J096J0726k1550k3266K2456j1202
$$ plain form
3591 139115 144741 135589 134020 149271 154867 125914 130477 121477 118454 103726 109728 108437 98917 117531
3577 117531 109125 111762 105639 118209 82341 56479 64907 36483 52996 60995 67263 80862 65568
3564 65568 45365 44891 37983 43311 55330 46703 50696 62869 61029 38410 34600 46134 45047 52783
3550 52783 26067 48105 54827 54520 39257 30119 42737 23719 26473 10353 41522 33066 42884
3537 42884 27812 29788 29451 27665 50310 41051 31210 30782 14455 33569 34960 30588 10351 30982
3523 30982 23854 34598 41308 31147 26326 28615 24315 26599 27055 36886 36418 49710 59011 45672
3509 45672 58684 31458 26237 22717 30100 26299 33369 41296 48370 52200 23422 21430 -6569 26168
3495 26168 25795 38433 38501 41106 54041 42876 47050 48146 58872 37322 14056 36512 25310
3482B5310J4920k6719l0331K9548j1009N185J4675l222R18p913J229J2583k0279
3469D895J1105p163l512J6596J0992J2734M757l448J072k4591N120m122J690j1595
3455A4530K3859j4776O330l564J896l1072K077J3173K0572j5976l522m562l720
3442E245q719J5458q805N088L327J6907j3530J0656l5954o292R937P896q150Q39
3428f097K779K7121J519l1332J5140O273k1914Q687j1807p965K1817k4102J7070
3415b811O012q291k3061J9906n654q157J9338J6k6972N963k236J0821K2377J2415
3401A9666k8006L400L436J4067k6251R666K8314m902o297j9966K808q982k3133
3388c6180P983K0194o214P311Q869k0020j3001J5773J5996j5503m741M634j1025
$$ plain form
3482 25310 40230 13511 -16820 12728 1719 6904 21579 18357 19275 11362 12591 25174 4895
3469 4895 16000 8837 5325 21921 32913 45647 50404 46956 48028 23437 28557 24435 26125 14530
3455 14530 38389 23613 29943 26379 28275 -2797 -720 12453 33025 17049 13527 8965 5245
3442 5245 -3474 11984 3179 8267 11594 28501 14971 25627 -10327 -16619 -6682 1214 -6936 -6097
3428 -6097 -3318 23803 25322 -6010 9130 15403 -6511 2176 -9631 -17596 4221 -19881 -2811
3415 -2811 3201 -5090 -28151 -8245 -13899 -22056 -2718 -2702 -29674 -23711 -25947 -15126 7251 19666
3401 19666 -8340 -4940 -1504 12563 -13688 -4022 24292 19390 13093 -6873 -4065 -13047 -36180
3388 -36180 -28197 -8003 -14217 -6906 1963 -18057 -31058 -15285 711 -14792 -19533 -14899 -25924
3375b5924M121J294J1896K2005p8l6598m578J1781l997O67j5084o39J2205Q384
3361a4545n34K3763j1562n398j6263k801J6957k236l0340K2408k3957K6781R003
3348h724j7044J424Q147K900m327J2597Q510k2706j2902K1851K757j5919m143
3335b7579R610P750K872k2279O836j1697L252j0402O974K8622P07J938j3298p833
3321b4527L7034j7165m7274J0109k829K1822P037J2044l4890O317j4337k313J6253
3308c2719J6849j548L4814j3530l3801Q848J24q144q892K0041K2511j6631Q816
3295c262P648l5044J3197O633J923k0917k0946J4837K652N743K1547o596k8023
3282d0608J3446L7057j3006K0744l8019J2407j8772L471J7177j4827p882K7434
$$ plain form
3375 -25924 -21803 -20509 -8613 13392 13314 -23284 -27862 -16081 -20078 -19411 -34495 -35134 -22929 -14545
3361 -14545 -15079 8684 -2878 -8276 -24539 -27340 -10383 -12619 -42959 -20551 -44508 -17727 -8724
3348 -8724 -25768 -24344 -16197 -13297 -17624 -5027 3483 -19223 -32125 -10274 -7517 -23436 -27579
3335 -27579 -17969 -10219 -7347 -29626 -22790 -34487 -31235 -41637 -34663 -6041 -5334 -3396 -16694 -24527
3321 -24527 12507 -4658 -51932 -41823 -44652 -22830 -15793 -3749 -38639 -32322 -46659 -48972 -32719
3308 -32719 -15870 -17418 17396 3866 -29935 -21087 -20963 -29107 -37999 -17958 4553 -12078 -3262
3295 -3262 4386 -30658 -17461 -10828 -8905 -29822 -50768 -35931 -33279 -27536 -5989 -12585 -40608
3282 -40608 -27162 9895 -3111 17633 -20386 -7979 -26751 -23280 -6103 -20930 -28812 -1378
3270a378O407k2045J2597o865M018K875q843j2879J3668p737K0341o252k769K019
3256f843k8132P665J5307J0747k3410J6934l6365J8910K0840L879k3826R34R804
3243a3556J2939R899l3327n940J3027M170j2376L907j0915j2877K4477k837R698
3230a3711j1015K001N245J8719k1291j0033J5996r087J4452n306O18K5330m0835
3217b8917l011K9080J410K086k1330J0097J5337j1769j6072L4128L589M284l380
3204A5532k3024j3276J5873r386j2860Q219J7496M950l151r134P052j9384n773
3191b6866K4409j2296k639K7641j110l2094O833k983J2944j6700k1030K6188j6039
3178c3742J6993M798l1220M2518M620j3673j8044j7040K0836J1822N54n429J0333
$$ plain form
3270 -1378 5029 -17016 -4419 -11284 -7266 -4391 -13234 -26113 -12445 -20182 159 -6093 -8862 -6843
3256 -6843 -34975 -27310 -12003 -1256 -24666 -7732 -44097 -25187 -4347 -468 -24294 -23360 -13556
3243 -13556 -617 9282 -24045 -29985 -16958 -12788 -25164 -21257 -32172 -45049 -20572 -23409 -13711
3230 -13711 -24726 -22725 -17480 1239 -20052 -30085 -14089 -23176 -8724 -14030 -13412 11918 -28917
3217 -28917 -31928 -2848 -1438 648 -20682 -10585 4752 -7017 -23089 11039 14628 18912 15532
3204 15532 -7492 -20768 -4895 -14281 -27141 -18922 -1426 3524 373 -8761 -1709 -21093 -26866
3191 -26866 -2457 -14753 -17392 10249 9139 -22955 -16122 -19105 -6161 -22861 -43891 -17703 -33742
3178 -33742 -16749 -11951 -43171 -653 3967 -9706 -27750 -44790 -23954 -12132 -11578 -17007 -6674
3165f674R550J6189k0802Q372k4334m50K819k679L3381l649N966R418o853J9801
3151D0055l1149J769l9211K7161J1766j5734J0855Q140K293K719K325q316j2011
3138F62J4522l168p814J9411k6397R265l118K2163j3408j3693K2394j099J4637
3125C4357M112k2508j7103J4195j949N687J3548J0100J1266k144P511j1872J9716
3112F4916j1067p991K0366L7941j5744J6368n5J4572M483L697p255K5839K3876
3099A69946K433j2956J2968J5295r662K7469L7660R220R716O085L6980K5645M999
3086C35798J5922K3821L6607M199N079L4091L6508K8476N4358M5540N5604O2291
3074G38294O6040P6987J32963J10325J89531J72673L11705M23692N74267K35667
$$ plain form
3165 -6674 2876 19065 -1737 6635 -17699 -18149 -15330 -18009 15372 11723 17689 27107 20254 40055
3151 40055 8906 10675 -28536 -1375 10391 -5343 5512 13652 15945 18664 20989 12673 662
3138 662 15184 12016 4202 23613 -2784 6481 3363 25526 12118 -1575 20819 19720 34357
3125 34357 38469 15961 -1142 13053 11104 16791 30339 40439 51705 49561 57072 45200 64916
3112 64916 53849 45858 66224 104165 88421 104789 104734 119306 123789 127486 120231 146070 169946
3099 169946 172379 159423 172391 187686 178024 205493 243153 252373 262089 268174 305154 330799 335798
3086 335798 351720 375541 412148 416347 421426 455517 492025 520501 574859 620399 676003 738294
3074 738294 804334 881321 1014284 1124609 1314140 1486813 1798518 2222210 2796477 3032144
3064C032144J1369P0757k60348l07027k09781l69289l67017k51408j79512j29909
3054A039979j46817o8301q0309n5378r3493m0184m9001k5503n4344m1886l4984
3043C49779k3226j8793j4427j9121k323R125k8377n167p71k3445j2402r403k9732
3030A71717m048J7692j6188j7936J2637k0632k5450L351j6425j2552j3291K05
3018G9080M3528k0249M218R614r290k9948k2612J7484q11j3179O020r32O22j3931
3004D9614k4269J5293J3346m688j7906j2703j848o382L982J0124O18k807k0014
2991B360o391K3813P582J2613j2950k6901K2436J693K422j076m2020J4648K7820
2978B6049j0727m415o858k363L753j3243L2179l0467j4388J1099N856J8830r318
$$ plain form
3064 3032144 3043513 3114270 2853922 2546895 2337114 1967825 1600808 1349400 1169888 1039979
3054 1039979 893162 824861 744552 689174 595681 555497 506496 480993 426649 384763 349779
3043 349779 326553 307760 293333 274212 271889 281014 252637 247470 246699 223254 210852 201449 171717
3030 171717 167669 185361 169173 151237 163874 143242 117792 121143 104718 92166 78875 79080
3018 79080 122608 102359 106577 116191 106901 76953 54341 71825 71014 57835 63855 62923 63545 49614
3004 49614 25345 40638 53984 49296 31390 18687 16839 10457 14439 24563 25181 22374 2360
2991 2360 -4031 19782 27364 39977 27027 126 22562 24255 26677 25601 -16419 -1771 26049
2978 26049 15322 10907 4049 1686 5439 -7804 24375 -6092 -20480 -9381 -3525 15305 5987
2965E987O632R536p729j1614j1676J2314j0180J1358O114r665n018j0514J18N240
2951i097m96j272l975J0099M995N37r126j4483Q672O812j5602L765K8352k4505
2937a5324j7232L9390o509j9206J6474k3813J848M5686k355k3330K94L345m53
2924a185j5684j8233n053P163K1331J189Q519J5244j8179j426n703J59J9966l279
2910D829p433r438q69P933k0315r47O187K7552k4765N087K63J068K461J2723k252
2895B084l3934O651n788Q539J4676k3118K3671j7095P397J0662r156N666J3918
2882D173k2334J023j1393J6243j644p514J0170m356j3739K3162R620l5539k84
2869c2412r615K5305k146J8762n087O958r192K5956k0823N143n152J7395j0481
$$ plain form
2965 5987 12619 22155 14426 2812 -8864 3450 -6730 4628 10742 1077 -3941 -14455 -14337 -9097
2951 -9097 -9593 -10865 -14840 -4741 254 791 -8335 -22818 -14146 -7334 -22936 -19171 9181 -15324
2937 -15324 -32556 6834 325 -18881 -2407 -26220 -24372 21314 18959 -4371 -4077 -732 -1185
2924 -1185 -16869 -35102 -40155 -32992 -11661 -10472 -1953 13291 -4888 -6314 -12017 -11858 8108 4829
2910 4829 -2604 -12042 -12911 -4978 -25293 -26240 -20053 7499 -17266 -12179 -11916 -10848 -8387 4336 2084
2895 2084 -31850 -25199 -30987 -22448 -7772 -30890 -7219 -24314 -16917 -6255 -15411 -9745 4173
2882 4173 -18161 -17138 -28531 -12288 -13932 -21446 -11276 -15632 -29371 -6209 3411 -32128 -32412
2869 -32412 -42027 -16722 -18868 -106 -5193 1765 -7427 18529 -2294 2849 -2303 15092 4611
2856D611k3916O923j1730K6879k231k9403q679J8415J8759j5282K411K0301k1722
2843a4664R765l381J684K593k0668L353K9537r512m218Q61r497k2699N972J4368
2829a6506R711N327j1235q083k8110Q461K9151K9067m9461J3551m749j1568L0223
2816d221j2042q427R236M188o653K5150r304j592r787K0016j3185j2972j1104
2803c0697P291J6624p502n942J5797k260o554k0861j2609Q947l402L374n681J5273
2789b8202J5861r125q825J4579k451K016R15k8079j8505K6455K1951k0361J0932
2776b2839M913K3690k1490l5672K6426n814j8695J9493j6373L0883J3068J143
2764a267L211m0486K2875j7406Q960k237P700j4293L15j843Q109R708J2694L38
$$ plain form
2856 4611 -19305 -12382 -24112 2767 536 -28867 -37546 -19131 -372 -15654 -13243 7058 -14664
2843 -14664 -4899 -8280 -6596 -4003 -24671 -21318 8219 -1293 -5511 -4650 -14147 -36846 -30874 -16506
2829 -16506 -6795 -1468 -12703 -20786 -48896 -40435 -11284 17783 -31678 -18127 -22876 -34444 -4221
2816 -4221 -16263 -24690 -15454 -11266 -17919 7231 -2073 -3665 -13452 6564 -6621 -19593 -30697
2803 -30697 -23406 -6782 -14284 -20226 -4429 -6689 -13243 -34104 -46713 -37766 -41168 -37794 -43475 -28202
2789 -28202 -12341 -21466 -30291 -15712 -18163 -16147 -15232 -43311 -61816 -35361 -13410 -33771 -22839
2776 -22839 -17926 5764 -15726 -51398 -24972 -30786 -49481 -29988 -46361 -15478 -2410 -1267
2764 -1267 1944 -38542 -15667 -33073 -24113 -26350 -18650 -32943 -32628 -34471 -26362 -16654 -3960 -3622
2750c622j8501K431J7264j4732p36j7934j799J4787q477r487K8187J0489n966
2737h096J190j0980R414q671K6072q658r234J2765j5214j5088l08M01k632j765
2723c0804Q808j8108K3959o661j1506J0338m483J011J343K8230j0990J1047j9006
2710a6822j1234K2294N927j8593j6524L271J4144k4599j0930R524L3082l945P911
2697f494P947l2743K020O617L3320k7726j2532K2664K0051l180j8120Q565j2332
2684a1943j623J5060m6108J0712L4878k6848j0537k3011Q083J4874K3381Q50J0131
2671b101l0422J2210K3978p543o579k7827Q291M203L2380p582k326q225J2653
2658A110K1393l4243r963R607r59r75j1411J3380o0m201q969q511J5537k8782
$$ plain form
2750 -3622 -22123 -19692 -2428 -17160 -17896 -35830 -37629 -22842 -31319 -40806 -12619 -2130 -8096
2737 -8096 -6906 -17886 -8472 -17143 8929 271 -8963 3802 -11412 -26500 -26808 -26407 -29039 -30804
2723 -30804 -21996 -40104 -16145 -22806 -34312 -23974 -28457 -27446 -26103 2127 -8863 2184 -16822
2710 -16822 -28056 -5762 165 -18428 -34952 -31681 -17537 -42136 -53066 -43542 -10460 -14405 -6494
2697 -6494 1453 -31290 -29270 -22653 10667 -17059 -29591 -6927 13124 9944 -8176 389 -11943
2684 -11943 -13566 1494 -44614 -33902 976 -25872 -36409 -59420 -51337 -36463 -13082 -12232 -2101
2671 -2101 -32523 -20313 3665 -3878 -10457 -38284 -29993 -25790 6590 -992 -3318 -11543 1110
2658 1110 22503 -11740 -21703 -12096 -13055 -14030 -25441 -12061 -12121 -16322 -25291 -33802 -18265 -47047
2644d7047j2661L2654Q408K1428J3221j8033k0295j0420k0210K8968O883Q897
2632h207l628j2042N1172m413l4931J5483j3550L210j7483R252j1091j5914K4520
2619a7622J905K045m364n151J9212P992r726n06J49L104K185j3131K1297k95j6546
2604i452J7370r498J5125j948q008l858m5315N141J6134k197J1694j6674L51J2792
2590a8343j0412p752J4793O505J5670J4513K61j6789r300J0942p675m702j709
2577a3998j517j1644K1115M750k1967k1173L6448Q941P923Q250j4125l5961J6357
2564a6601J7536k8914K1475j6674m617J8126j8132K686J6291m590K625l393m146
2551a8328P4j5740r927R486R413N708j1607j657j3J0739J1862J3439Q310L43l1695
$$ plain form
2644 -47047 -59708 -27054 -18646 2782 16003 -2030 -22325 -32745 -52955 -23987 -17104 -8207
2632 -8207 -11835 -23877 27295 22882 -12049 3434 -10116 -6906 -24389 -15137 -26228 -42142 -17622
2619 -17622 -15717 -13672 -18036 -23187 -3975 4017 -5709 -6215 -6066 -2962 -777 -13908 7389 7094 -9452
2604 -9452 7918 -1580 13545 11597 3589 -269 -45584 -40443 -24309 -26506 -14812 -31486 -31135 -18343
2590 -18343 -28755 -36507 -21714 -15209 461 14974 15235 -1554 -10854 88 -7587 -12289 -13998
2577 -13998 -15515 -27159 -6044 -1294 -23261 -44434 -7986 955 8878 17128 3003 -32958 -16601
2564 -16601 935 -27979 -6504 -23178 -27795 -9669 -27801 -25115 -8824 -13414 -10789 -14182 -18328
2551 -18328 -18254 -33994 -43921 -34435 -25022 -19314 -30921 -32578 -32591 -21852 -9990 3449 11759 12102 -19593
2536a9593K3852j7203N230J5217J0336K746k0131j5839J5185k6291K7180J0206
2524A0895k4907p62q430Q017j7791j618K148q702L6951L980J0741J09M743L39
2510A5713k5055J2059l4355L427R624p54j1172L5925J6198Q093n988k6222l990
2497f497j7935J5171j1467k01K1168K1801P962j1641k6869j3707Q302K2285j402
2484F970N92j0067n399N518k3165o152k929J1359P597p375J410K586K4017k5733
2470b0771p716K836n500J5739l3055N631K2839K5088k2177L08K690j1578O788
2457a8878o212K9683J1817k6918j6349j1345J2117K1034K120J2510r735J6162
2445A6006k611r902K3758j1151j7311p775L42k1409J0367n738J3648o667j5132
$$ plain form
2536 -19593 4259 -12944 -7714 7503 17839 20585 454 -15385 -200 -26491 689 10895
2524 10895 -14012 -14774 -23204 -15187 -32978 -34596 -32448 -41150 -4199 -219 10522 10631 15374 15713
2510 15713 -9342 2717 -31638 -28211 -18587 -19341 -30513 5412 21610 29703 23715 -2507 -6497
2497 -6497 -24432 -9261 -20728 -20929 239 22040 30002 18361 -8508 -22215 -13913 8372 6970
2484 6970 7562 -2505 -7904 -2386 -25551 -31703 -34632 -23273 -15676 -23051 -21641 -19055 4962 -20771
2470 -20771 -28487 -25651 -31151 -15412 -48467 -42836 -19997 5091 -17086 -16778 -14088 -25666 -18878
2457 -18878 -25090 4593 16410 -10508 -26857 -38202 -26085 -5051 -2931 9579 -156 16006
2445 16006 13395 3493 27251 16100 -1211 -8986 -8644 -30053 -19686 -25424 -11776 -18443 -33575
2432c3575K1932o702O509J1626J116l750K484j814J039J9019l0760K1087j123
2419G088l8423K0406Q912P670p437J9298Q050k9616j6940L155K5874j1670j1021
2406a4654J2324p322J493J0271k109J3609j0956k0611n074j5102L7898J0673k357
2393H083L036j2921k4947N201r155j4206J4765j622J5294p716Q042M102j1135
2380b3179r898J8817j901k9348J3261K2081j097j8063J2382M408J9729k4142n059
2367b2009K9828l2461j8801J7770O683J022J8047k2935q718J1695J001J0934q961
2354a6905j108j0155P001J9583J8280k4775Q88J5707j7031p366J329J6003o497
2341e046K3176L347q431k1910J9581J1460k2997j1095J3193J4131j8365j4830
$$ plain form
2432 -33575 -11643 -18345 -11836 -210 906 -2844 -360 -2174 -1135 17884 -12876 8211 7088
2419 7088 -31335 -10929 -2017 5653 -1784 17514 25564 -4052 -20992 -17837 8037 -3633 -14654
2406 -14654 -2330 -9652 -8159 2112 3 13612 2656 -17955 -23029 -38131 -233 10440 8083
2393 8083 11119 -1802 -26749 -21548 -30703 -44909 -30144 -31766 -16472 -24188 -16146 -12044 -23179
2380 -23179 -33077 -14260 -16161 -45509 -32248 -10167 -11264 -29327 -16945 -12537 7192 -16950 -22009
2367 -22009 7819 -24642 -43443 -25673 -18990 -17968 79 -22856 -31574 -19879 -18878 -7944 -16905
2354 -16905 -18013 -28168 -21167 -1584 16696 -8079 -7191 8516 -8515 -15881 -14552 1451 -5046
2341 -5046 18130 21477 13046 -8864 10717 22177 -820 -11915 1278 15409 -2956 -17786
2329a7786J2932q359N414r254K896j990j999m447J0985K5182j1975k6713k696
2316b7810n258Q911N089l243r506L717K1610k246k6798K1538j0407K199J5540
2303f664j0395J1215j2423r827R557M90J0461k3799M392J6229q500m994K8608
2290D350p514l0208L1596K145N080j7584j2249J1125L4110L733l2525R537j1516
2277i920l0220L232J5456L1758m4017J0681n730M493K6956J957o202J6880r235
2264F089J7888l6298j5094O970J8868J6570j0608R28O131j920n507n546j2519
2251a4048j0110N884q456J9687O480j308K745J5644j129j8593r851L255J5760
2238E960k9645J5745M479J1145J1393k1937Q55O977j1283j8460P565J6992n821
$$ plain form
2329 -17786 -4854 -13213 -7799 -17053 -14157 -16147 -18146 -22593 -11608 13574 1599 -25114 -27810
2316 -27810 -33068 -24157 -19068 -22311 -31817 -28100 -6490 -8736 -35534 -13996 -24403 -22204 -6664
2303 -6664 -17059 -5844 -18267 -28094 -18537 -18047 -7586 -31385 -26993 -10764 -19264 -24258 4350
2290 4350 -3164 -33372 -1776 369 5449 -12135 -24384 -13259 20851 24584 -7941 1596 -9920
2277 -9920 -40140 -36908 -21452 10306 -33711 -23030 -28760 -24267 2689 4646 -1556 15324 6089
2264 6089 23977 -12321 -27415 -20445 -1577 14993 4385 5313 11444 9524 4017 -1529 -14048
2251 -14048 -24158 -18274 -26730 -7043 -563 -1871 874 16518 15389 -3204 -13055 -9800 5960
2238 5960 -23685 -7940 -3461 7684 19077 -2860 -2005 4972 -6311 -24771 -17206 -214 -6035
2225f035K510k2111K0950j4405j4450P267O012L6683k3492j9856R919j6836M041
2212b9803L2967k1022L0122j0529J391J4307Q090j6679l1880P154J9978k1617
2200a7521o228L457J3758J923r217N310r385K3985P583k5291j0195J813l32J1195
2186i145k508N203j3568q540j704K1381k3629J0643r303k050J295R667j2304K2159
2172a2403j0934P214K3033j5394j3156L425m509o384L0061J9407k7538k203j5849
2159b5230M437l308p706K5844N428k5680J7887J5114o670p803P197J2209O80r950
2145B449j4856P883k0272J4028J6801K0918j8149k5754l611J8302k445J0808M540
2132A0642l62j7781q287k01J3028J4255k2263J1918k959r653J9093k71Q88k2976
$$ plain form
2225 -6035 -3525 -25636 -4686 -19091 -33541 -26274 -20262 16421 -7071 -26927 -17008 -33844 -29803
2212 -29803 3164 -17858 12264 1735 3126 17433 25523 8844 -23036 -15882 4096 -17521
2200 -17521 -23749 -20292 -6534 -4611 -13828 -8518 -17903 6082 13665 -11626 -21821 -20008 -20340 -9145
2186 -9145 -11653 -6450 -20018 -28558 -30262 -8881 -32510 -21867 -31170 -33220 -31925 -22258 -34562 -12403
2172 -12403 -23337 -16123 6910 -8484 -21640 -18215 -22724 -29108 953 20360 -7178 -9381 -25230
2159 -25230 -20793 -24101 -31807 -5963 -535 -26215 -8328 6786 116 -7687 -490 11719 12399 2449
2145 2449 -12407 -4524 -24796 -10768 6033 26951 8802 -16952 -20563 -2261 -4706 6102 10642
2132 10642 10280 -7501 -15788 -15989 -2961 11294 -10969 949 -2010 -11663 7430 7159 8047 -14929
2118a4929L742J4246j8843K0605j622j7890O786k407N269J5303j6641p700K0188
2105F107R005k5361p316j3904J4430J1338j5622J9861j3386J3417O136l4425J5081
2092a4639J297q104L525J4490J8612J0743r722j9154j7379M948J6204Q070J7328
2079B6219j1195j0982k1480k743K2279o327k160k0644K2023R572n219O888K4888
2066C1119l3451R94j375j7834K8744j050O444J0981o095l2373l952o293J0661
2053a3480j9867L0757k3424Q604K094j605Q261J042p695j650R938J5418k5954
2040a7561q386J6093N298L1235R184k3516j1392N137J049k5508J9630K8121l3016
2027c632j1895k0541J49K1536K0909k1850J5954j0389l576K286J4684r665j0712
$$ plain form
2118 -14929 -11187 3059 -15784 4821 3199 -14691 -7905 -10312 -5043 10260 -6381 -14081 6107
2105 6107 15112 -10249 -17565 -31469 -17039 -5701 -21323 -1462 -14848 -1431 4705 -29720 -14639
2092 -14639 -13342 -21446 -17921 -3431 15181 25924 16202 -2952 -20331 -15383 821 8891 26219
2079 26219 15024 4042 -17438 -20181 2098 -4229 -6389 -27033 -5010 4562 -657 6231 31119
2066 31119 -2332 -1338 -2713 -20547 8197 7147 13591 24572 18477 -13896 -17848 -24141 -13480
2053 -13480 -33347 -2590 -26014 -17410 -15316 -16921 -8660 -7618 -15313 -16963 -7025 8393 -17561
2040 -17561 -25947 -9854 -4556 26679 35863 12347 955 6092 7141 -18367 1263 29384 -3632
2027 -3632 -15527 -36068 -35919 -14383 6526 -15324 630 -9759 -13335 -11049 3635 -6030 -16742
2014a6742q697J2534J5492O703j1252l0538J9562j0792j6878M024J1477M3123
2002A8016K784k6449p625K8174K2930j3420l2277M76J0660j1453K0139o150o489
1989f84N326P124l582K187p11J0019L0631j9337j2943k0216n803L676R876k2194
1975a6631o374R479k0785K7342q585K461Q537L752o796J9982j505j633j290M766
1961A2720Q805j8729m490J7583j5755N742j5168K0523m286J2551j3808j4403j0890
1948a9605J3962J9558j2353l627p509k2726K2693j599j8284K7416r302J2932j191
1935C65J2396r849j3910j078L514J827m16j6765J9368K831J451K2475j9597o300
1921c688J4224j2121J3810j1695j2956j2476K3673l990J1921J4751j2229k3050
$$ plain form
2014 -16742 -25439 -12905 2587 9290 -1962 -32500 -12938 -23730 -40608 -36584 -25107 18016
2002 18016 20800 -5649 -13274 14900 37830 24410 -7867 -7391 3269 -8184 11955 5805 -684
1989 -684 4642 11766 8184 10371 9660 19679 50310 30973 18030 -2186 -7989 -4313 5563 -16631
1975 -16631 -23005 -13526 -34311 -6969 -15554 -13093 -4556 -804 -7600 12382 10877 9244 7954 12720
1961 12720 21525 2796 -1694 15889 134 5876 -9292 11231 6945 19496 5688 -8715 -19605
1948 -19605 -5643 13915 1562 -2065 -9574 -32300 -9607 -11206 -29490 -2074 -11376 1556 365
1935 365 12761 2912 -10998 -12076 -8562 -6735 -7151 -23916 -4548 -1717 -266 22209 2612 -3688
1921 -3688 10536 -1585 12225 530 -12426 -24902 -1229 -5219 6702 21453 9224 -13826
1909a3826R785N470O943l2982p190J6879j3577J1811R619j7488K3087j4517j2385
1896b8371n770L3876j760L806Q126j9396J0901j1166m21L41J7713L927J5333k662
1882B4477k7849P729r769n174J1976M074q37j8700J3363k146J1836Q275q790j8676
1868a0211M280k519J8206m621j5045N66L336P000N019r079M792p495o717O25K485
1853i378J9840M619j3606j0648j2324N612J6237R89m685l231J1317J996J2689
1840A9427p743l523L161j7697J2481K1731j8108m1157L5095J6413l0053l134J6842
1827C735K229n552P211J2523l2739r732J9645j6458L463J4186J4129r191n873
1814b424J2724J526M622m643o765m970J0015j2768p32J6040j024K964J3845O068
$$ plain form
1909 -13826 -4041 1429 8372 -24610 -31800 -14921 -28498 -16687 -7068 -24556 -1469 -15986 -28371
1896 -28371 -34141 -265 -2025 1781 9907 -9489 1412 -9754 -10175 -9834 7879 11806 27139 24477
1882 24477 -3372 4357 -5412 -10586 1390 5464 4627 -14073 -710 -2856 8980 17255 8465 -10211
1868 -10211 -5931 -8450 9756 5135 -9910 -9344 -6008 992 6011 -3068 1724 -5771 -12488 -11863 -9378
1853 -9378 10462 15081 1475 -9173 -21497 -15885 352 1341 -3344 -6575 4742 6738 19427
1840 19427 11684 8161 11322 -6375 6106 27837 9729 -31428 3667 20080 -9973 -13107 3735
1827 3735 5964 412 7623 20146 -12593 -22325 -2680 -19138 -15675 -1489 12640 3449 -2424
1814 -2424 10300 11826 16448 11805 5040 70 10085 -2683 -3415 12625 11601 14565 28410 34478
1800C4478j7529j8856p348M8865k1386j8287M524j6917k3383J4999j594r78M606
1787a8806R834K4474k0641R719j6585N311J1766j2420J0546O017J0559j4282N771
1774A1263N536k2459J7220L260k2263R201p476R253Q709j4099M298J3236j557
1761A4122q139O624J7564K275l519k6979j5525K3939k0157K3059K89j6106j5877
1748a8430J9358L140L15j1479j4572K1416L4508r154k5789r609J2022M218J109
1735G053j6204j2465K2799K0070l1676J5417L597k830o977J2672K3406m4443m286
1722a3867Q749P297L7468k2947m0297R739J0495J9712k3881K1001o396k098j2779
1709g804P078J5609k194J4079o141j3616J4201p622K954j5743p008l829J2333
$$ plain form
1800 34478 16949 -1907 -9255 39610 18224 -63 4461 -12456 -35839 -20840 -22434 -23412 -18806
1787 -18806 -8972 15502 -5139 4580 -12005 -6694 5072 -7348 3198 9215 19774 5492 11263
1774 11263 16799 -5660 11560 14820 -7443 1758 -5718 3535 12244 -1855 2443 15679 14122
1761 14122 5983 12607 30171 32446 28927 1948 -13577 10362 -9795 13264 13553 -2553 -18430
1748 -18430 928 4068 4383 -7096 -21668 -252 34256 25102 -687 -10296 1726 5944 7053
1735 7053 -9151 -21616 1183 21253 -10423 4994 8591 5761 -1216 11456 34862 -9581 -13867
1722 -13867 -5118 2179 39647 16700 -23597 -13858 -3363 16349 -7532 13469 7073 4975 -7804
1709 -7804 -726 14883 12689 26768 20627 7011 21212 13590 16544 801 -6207 -10036 2297
1696B297P749p387J7753j9106k1793j738k0425M5109J3656j0719K133k5989k133
1683b0593m155M612J8084J7706p381k044R364j2401l220j5898l536m600p469K9576
1669a955J0917R428l296j5639J2604k158l4604J5679N893J8661r637k2007K1927
1656E813P045l1091K266K3311J6286r108k2210N302k0153L8215k5439L958K161
1643c644n988N776L8904n60j2894j2509r886l454J350O218j5265M42r623J3563
1629g570j0177J8708n457R643j899J934n138k092J9261M475p005J1233R913j1904
1615B3925j6261P116O738r120Q851J426l9766K0683K801m044K620m671R100r697
1601b99r431Q539P595K090j3402o147R412J9986O17l2306n122J9127l284r26M163
$$ plain form
1696 2297 10046 2659 20412 1306 -20487 -22225 -42650 2459 16115 5396 7529 -18460 -20593
1683 -20593 -24748 -20136 -2052 15654 8273 6229 15593 3192 -28 -15926 -19462 -24062 -31531 -1955
1669 -1955 8962 18390 15094 -545 12059 9901 -24703 -9024 -3131 15530 5893 -16114 5813
1656 5813 12858 -18233 -15967 7344 23630 14522 -7688 -2386 -22539 15676 -9763 -5805 -3644
1643 -3644 -9632 -3856 35048 34488 21594 9085 -801 -4255 -2905 3313 -11952 -11510 -21133 -7570
1629 -7570 -17747 961 -4496 5147 3248 5182 44 -2048 17213 21688 14683 25916 35829 23925
1615 23925 7664 14780 21518 12398 21249 22675 -17091 3592 6393 2349 4969 298 9398 -299
1601 -299 -9730 -1191 6404 8494 -4908 -11055 -1643 18343 18960 -13346 -18468 659 -2625 -3551 612
1586F12K0711k1494L81J4738L694j6375k31L480L181q242k0484J4243J0721J8880
1572B3815J6945k6875j9348J4066k0064k264l184J9851J1790o303j4496N685L966
1559C584J602k374J40K21l14o534k0036J5361J5997j7601k245j8580L0935K1643
1545B1799J0222n014l5636j773K3530J3166m0427N908J819j743O41M83Q076j7332
1531a6281P632J1953j0741J6194J2120k9386J925J7207j2481j8722N571J9221
1519D212j0524r550K3720L5265k3498n368K5683l250j5405q876J1344k2162M820
1506F411j0201K898J6794j0520k0149j139J8067Q399J042r215L167j7713J9332
1493G173K5604K366k2614j9090J5361P767J900r162k780N195r272K1025j2306
$$ plain form
1586 612 21323 -171 210 14948 18642 2267 2036 5516 8697 455 -20029 -5786 4935 23815
1572 23815 40760 13885 -5463 8603 -11461 -13725 -16909 2942 14732 8429 -6067 -382 3584
1559 3584 5186 2812 2952 3173 2859 -3675 -23711 -8350 7647 -9954 -12199 -30779 156 21799
1545 21799 32021 27007 -8629 -10402 13128 26294 -14133 -8225 -6406 -8149 -7508 -7025 1051 -16281
1531 -16281 -8649 3304 -7437 8757 20877 -8509 -6584 10623 -1858 -20580 -15009 4212
1519 4212 -6312 -15862 7858 43123 19625 14257 39940 36690 21285 12409 23753 1591 6411
1506 6411 -3790 -892 15902 5382 -14767 -15906 2161 10560 11602 2387 5554 -12159 7173
1493 7173 32777 35143 12529 -6561 8800 16567 18467 9305 6525 11720 2448 23473 11167
1480A1167j9575L8518O111o174j4550l604J0223j7883r847J2498j2629R517L017
1467F789J3417R253r344k2944J8008j0114K1106K2195j1511j9850j3546j5419
1455a1960L128k429K840J4132M296j496J5195j102q595N570L43j0949j3089K9518
1441B5402j4910j3702m176L0876O566j6178j6126J4199P013j5995j7729K00Q298
1428f262J1110K5904n141q718J6618R477k5082o345j9013M862p649j851M349n803
1414a3544J1565R206J756j0395M1398p657j1987k9488L696J4750R250k9664K2776
1401A1662J7045j6666k2858K4050M190k5088K307R157J0084m643k203l1466K043
1388b2386L1646J1619J4586j2418j2947j3165n787J4181r699m940J0659N616k3044
$$ plain form
1480 11167 -8408 30110 36221 30047 15497 11893 22116 4233 -5614 6884 -5745 3772 6789
1467 6789 20206 29459 20115 -2829 15179 5065 26171 48366 36855 17005 3459 -11960
1455 -11960 -8832 -11261 -8421 5711 10007 8511 23706 22604 14009 19579 19922 8973 -4116 25402
1441 25402 10492 -3210 -7386 23490 30056 13878 -2248 11951 18964 2969 -14760 -14560 -6262
1428 -6262 4848 30752 25611 16893 33511 42988 17906 11561 -7452 -2590 -10239 -12090 -7741 -13544
1414 -13544 -1979 7227 8983 -1412 39986 32329 20342 -9146 -5450 9300 18550 -11114 11662
1401 11662 28707 12041 -10817 13233 17423 -7665 -5358 3799 13883 9240 7037 -24429 -22386
1388 -22386 9260 20879 35465 23047 10100 -3065 -8852 5329 -4370 -9310 1349 6965 -16079
1375a6079K0524j006N591Q342r913J1970p893j1772Q542J1155k4605m903M186
1362e861o784J3477K0242j0619K390J7545l0885j3405Q94R742R461m911o994j227
1348f935k363J3377K7940l215l0591K8727J7648l8296K458Q578k0601N938J1998
1335A4663J2214l2553p183l916J0878K2208l9631K1089J9548j1321j1233K3547
1323A8310J39j6970K2316j3490K815O28j5558P768O289o056j5004L2453L483m9882
1309b2759k049J8488j2655Q689J2674Q90K9701j6120l1835J7304j2183K3759P511
1296B1415j1091o0j2147J8399J7206k3581J6055N315k4072j7739Q056J5297m956
1283H097K035k4257K2177L62J7534l614j7352R031J2172p909r265j0235J833J1481
$$ plain form
1375 -16079 4445 3439 9030 17372 7459 19429 11536 -236 8306 19461 -5144 -10047 -5861
1362 -5861 -12645 832 21074 10455 12845 30390 -495 -13900 -13006 -3264 6197 1286 -5708 -6935
1348 -6935 -9298 4079 32019 28804 -1787 26940 44588 6292 8750 17328 -3273 2665 14663
1335 14663 26877 -5676 -12859 -16775 -5897 16311 -23320 -2231 17317 5996 -5237 18310
1323 18310 18449 1479 23795 10305 13120 13748 -1810 5958 12247 6191 -8813 23640 27123 -22759
1309 -22759 -24808 -6320 -18975 -10286 2388 3278 32979 16859 -14976 2328 -9855 13904 21415
1296 21415 10324 10264 -1883 16516 33722 10141 26196 31511 7439 -10300 -2244 13053 8097
1283 8097 10132 -14125 8052 8414 25948 22334 4982 14013 26185 18276 9011 -1224 609 12090
1269A2090L642j5108j3597J9169j4027L092L2669n301p80j1486L097j3242J1151
1256A1369p724J4961j7607j2897k9135N498K7366Q930J8987J1069O005j5422o876
1243A4524j0997N30j6822N465N173L895Q938K519m598K021k7919L981l698J4993
1229a995K5920O791j4756m7513K3894O850l769r054K4683K2120j3204k649k9517
1216a2199P694P11o610q521J6771K581Q682j768o6m798O811J4747l0892J2134
1202E277J9340j0072r2j0690n565J9856K766Q403j9743L417K6979k8272k4175
1189a2571J2336K316j0154J7016j3131K2818p939M520j1255j8712K4355k8968
1177a9369K0858J519J724j5502j021J9080J5503j7221j0491l725j550L9298l4937
$$ plain form
1269 12090 15732 624 -12973 6196 -7831 -4739 27930 22629 21849 10363 13460 218 11369
1256 11369 3645 18606 999 -11898 -41033 -35535 -8169 761 19748 30817 36822 21400 14524
1243 14524 3527 4057 -12765 -7300 -2127 1768 10706 13225 8627 10648 -17271 -13290 -16988 -1995
1229 -1995 23925 30716 15960 -31553 -7659 -809 -4578 -13632 11051 33171 19967 17318 -12199
1216 -12199 -4505 -3794 -10404 -18925 -2154 427 9109 7341 7275 2477 9288 24035 -6857 5277
1202 5277 24617 14545 14453 3763 -1802 18054 20820 29223 9480 12897 39876 11604 -12571
1189 -12571 -235 2081 -8073 8943 -4188 18630 10691 15211 3956 -14756 9599 -19369
1177 -19369 1489 3008 4732 -10770 -11791 7289 22792 5571 -4920 -8645 -10195 29103 -5834
1164e834j5225J5004J3610o986N201J7550k0714J469K4305L402r675o974j1717
1151C416K240K7639J3325l980k4439R018o650k2365p292K7499J554N287j5736
1138I516K4816j8892K694j917l0374J1708p672j16J3482R359K613q023K339O083
1124A5616q803k398k191o572R708J664k654k367j8840K843M113k923P500j7852
1110b3156K055K2701K4875l605R382j0116m981j658l3429J9292j0629P728L339
1097A798m615N977j3113j7K3981k7008O17R705l549n39J942J7893q054K5836l3574
1082b720k1838J9626n05J8987j1457k2934N26M2054o552P657k1885O923r863J3484
1068A1503m1620P340L2296N437j4111J2753J4858j3067L432J854L417k0827m492
$$ plain form
1164 -5834 -21059 -6055 7555 569 5770 23320 2606 4075 28380 31782 22107 15133 3416
1151 3416 5656 33295 46620 42640 18201 27219 20569 -1796 -9088 18411 19965 25252 9516
1138 9516 34332 15440 18134 16217 -14157 -2449 -10121 -10237 3245 12604 15217 7194 9533 15616
1124 15616 6813 4415 2224 -4348 5360 7024 4370 2003 -16837 -13994 -9881 -12804 -5304 -23156
1110 -23156 -21101 1600 26475 22870 32252 22136 17155 15497 -17932 1360 -9269 -1541 1798
1097 1798 -2817 3160 -9953 -9970 14011 -12997 -12380 -2675 -6224 -6763 -4821 13072 5018 30854 -2720
1082 -2720 -24558 -4932 -5437 13550 2093 -20841 -20315 21739 15187 22844 959 7882 -1981 11503
1068 11503 -30117 -22777 9519 14956 845 13598 28456 15389 18821 20675 24092 3265 -1227
1055a227j528N689L984j1049j8586J9222N288j4930L5433J604q044p406O121m602
1041I969k1130j0588O375O014p233Q665J3913M140k1401J8296J0832j3758k388
1028A706K2290j2913K5603j1599M603J1338l0558j1433l510p305J3495J6345j2326
1015E736L1816k9495k794J9368j4342R258k2541j5366q955P498Q717R199q922
1002a0823j0449N073K362O260j5111P125Q063L7806L198l1784J7078j9922o808
989g932R636j2875N918M241J0970N861l64K743l381k1084J3354K2988k1084O367
975A5358k0764M954k4692J7372J4528J589q722n470M4235l6082n342K3267M283
962B4514q054r120j2015K0615J1852m766l188l6389J8891m571J4368j1917j409
$$ plain form
1055 -1227 -2755 2934 6918 -4131 -22717 -3495 1793 -13137 22296 23900 15856 8450 14571 9969
1041 9969 -11161 -21749 -15374 -9360 -16593 -7928 5985 10125 -11276 7020 17852 4094 1706
1028 1706 23996 11083 36686 25087 29690 41028 10470 -963 -4473 -11778 1717 18062 5736
1015 5736 37552 8057 5263 24631 10289 19547 -2994 -18360 -27315 -19817 -11100 -1901 -10823
1002 -10823 -21272 -16199 -13837 -7577 -22688 -15563 -7500 30306 33504 1720 18798 -1124 -7932
989 -7932 1704 -11171 -5253 -1012 9958 15819 15455 18198 14817 -6267 7087 30075 8991 15358
975 15358 -5406 -452 -25144 -7772 6756 8345 -377 -5847 38388 2306 -3036 20231 24514
962 24514 16460 7340 -4675 15940 27792 23026 19838 -16551 2340 -2231 12137 220 -1189
949a189k50P798L4867k4416J0132J293l4467K0080K5061l0031J9000j8178M375
936A4075Q6j1033j580L622j2052J8350k2769l510J5138k569J043p813J8261k702
922F547j5361J4079J4553k3399K6588p778Q55J246j1475k0161O832O790K6945
909B6261n808j4256k4346R015M734R739o657J6284J0078n258n393K649J7031q479
895B5594k0666J1074k1037m507J3863p685L733q45N123m119K5611j2568k1034
882g463J3569Q794J5116j2442j7593K477l460N742k7819O096K3980L2253n403
869C3847m5656k3361J9214R038J0790M69P739n919K826p520r891K917J6603P30
855A1826q759K2525K126j4442q985j655o675m0234K6774K7377J3576J5373j3803
$$ plain form
949 -1189 -1439 6359 41226 16810 26942 28235 -6232 13848 38909 8878 27878 9700 14075
936 14075 14161 3128 1548 5170 -6882 11468 -11301 -14811 327 -2242 -1199 -9012 9249 6547
922 6547 -8814 5265 19818 -3581 23007 15229 16084 17330 5855 -14306 -7474 -684 26261
909 26261 20453 6197 -18149 -9134 -4400 5339 -1318 14966 25044 19786 14393 17042 34073 25594
895 25594 4928 16002 -5035 -9542 4321 -3364 369 -476 4647 528 26139 13571 -7463
882 -7463 6106 14900 30016 17574 -19 2458 -1002 4740 -23079 -16983 6997 39250 33847
869 33847 -11809 -35170 -15956 -6918 3872 4341 12080 6161 8987 1467 -8424 -5507 11096 11826
855 11826 3067 25592 27718 13276 4291 2636 -4039 -44273 -17499 9878 23454 38827 25024
842B5024k9158J161r096J6496p92j8936J3595j1605m347o475K2578N972n147J6925
828A6195J769l805k680k108l259J1782J25m891j1878j6908n598R795K0289J722
814A0550r75q086J4605l421J872J385k4755M381j9224L255K4817K4419L041L375
800C5239j3632k0756r5q214J1693l0309k279O824L2172M075j3893j3939j3918
787b7032L6921k581K2673j8506j742L486m340K6018l2562J5123O484N940k6722
774C160k8579P784K6604j6807j7522J6272o741Q606P365J4225l2971j0511J3752
761a5363J0997J9906J026j089l427m748j2674O537J8866k5178P176j2000K2673
748A2702Q506k6111q267j1142K5797q986k0928K2629K8390Q35p129k5793N116
$$ plain form
842 25024 -4134 -2973 -12069 4427 3635 -15301 -1706 -13311 -17658 -24133 -1555 4417 -730 16195
828 16195 17964 14159 11479 9371 6112 17894 18019 13128 1250 -15658 -21256 -11461 8828 10550
814 10550 9575 1489 16094 12673 14545 15930 -8825 -4444 -23668 -20413 4404 28823 31864 35239
800 35239 21607 851 756 -7458 4235 -26074 -28353 -21529 10643 14718 825 -13114 -27032
787 -27032 9889 7308 29981 11475 9733 13219 8879 34897 2335 17458 23942 29882 3160
774 3160 -25419 -17635 8969 -7838 -25360 -9088 -15829 -7223 142 14367 -18604 -29115 -15363
761 -15363 -4366 15540 16566 15477 12050 7302 -5372 1165 20031 -5147 2029 -9971 12702
748 12702 21208 -4903 -13170 -24312 1485 -7501 -28429 -5800 22590 23425 16296 -9497 -4381
735d381o415N221j6537J0019N866J2355k3538J3214J245j0991K4578o211j1298
722f873k855J3541o956J0505j344j7251J7053j7703J0467m785L416Q982r929N23
708c209l8830K8001j3869K1695J2954J3981m508j2105O844m953j658k1984K2056
695D415J684Q467o128J041K146m682J9576l2807k7579k122N451q704K4931O884
681g427j939J4338J5858k1302k2936J7055K6592j534k0265M608K3249p919j2209
668F169p043J6238k0975q237L718J1396L0012j9603p598r63k210j867J8737j8970
654a196Q815R868k0267J626n751j2467J0465m978J849K830N684L0860l4890L995
640c557j3631K413J2470j1839k016j030K694J8879J8808q038n288J1723j533j0702
$$ plain form
735 -4381 -10796 -5575 -22112 -12093 -6227 6128 -17410 -4196 -2951 -13942 10636 4425 -6873
722 -6873 -9728 3813 -3143 7362 6018 -11233 5820 -11883 -1416 -6201 -2785 6197 -3732 -3209
708 -3209 -42039 -14038 -27907 -6212 6742 20723 16215 4110 10954 6001 4343 -17641 4415
695 4415 6099 14566 8438 9479 11625 6943 26519 -6288 -33867 -35989 -30538 -39242 -14311 -7427
681 -7427 -9366 4972 20830 -472 -23408 -6353 20239 18705 -1560 3048 26297 18378 6169
668 6169 -874 15364 -5611 -13848 -10130 1266 31278 11675 4077 3114 904 -963 17774 -1196
654 -1196 7619 17487 -2780 -1154 -6905 -19372 -8907 -13885 -12036 -9206 -3522 27338 -7552 -3557
640 -3557 -17188 -14775 -2305 -14144 -16160 -17190 -14496 4383 23191 15153 9865 21588 20055 9353
626I353j459P540p747o900q334m004J5231J5580J5633m7196L2912k6323j2982
613a8696J9355R915k2167p159J4578J1869n546O010j5580j6801O278L2087r187
600D956j8129J2086L107K8075j8415j691l2057L794J1578K1905K6739k9213k5771
587a3036r770P360N341q461j761J3825R639k6172J8204o230l2032M1776j095J9314
573A6902M809q389r749k570J5608j3306M339j1320Q634K3178m39k9684j2780L0118
559A5351j7607R474k4588j94J1251J098R070p353P544K863k378r50K639l657R528
544A2091k7013J1916k835r421K2749J0812k539k1554j7541K5987p701l873J0750
531A828k7341O547Q638j6582L4142R400q557q366K5989k0504k8384q655p068M2532
$$ plain form
626 9353 7894 15434 7687 787 -7547 -11551 3680 19260 34893 -12303 20609 -5714 -18696
613 -18696 659 10574 -11593 -18752 -4174 7695 2149 8159 -7421 -24222 -17944 14143 4956
600 4956 -13173 -1087 2020 30095 11680 9989 -22068 -18274 -6696 15209 41948 12735 -13036
587 -13036 -22806 -15446 -10105 -18566 -20327 -6502 3137 -23035 -4831 -11061 -43093 -1317 -2412 16902
573 16902 21711 13322 3573 1003 16611 3305 7644 -3676 4958 28136 27697 -1987 -14767 15351
559 15351 -2256 7218 -17370 -17564 -6313 -5215 3855 -3498 4046 6909 4531 3581 6220 2563 12091
544 12091 -14922 -3006 -5841 -15262 7487 18299 15760 -5794 -23335 2652 -5049 -8922 1828
531 1828 -25513 -18966 -10328 -26910 7232 16632 8075 -291 25698 5194 -23190 -31845 -38913 3619
517C619l600k0820m638O896M385J1078J4717j8906K41r304J77k208J2088j7561
503b3836m425J8959K5060J4279M807l0085j2026K3426M190p474O257k248j1135
490E749K1401k0840o635L551o395j0055J0355J2191j146P777L697l106r891J1341
476A7994m696m662N839L02j0227j8371K7690P902j2076N593n376j2773M026j548
$$ plain form
517 3619 19 -20801 -25439 -18543 -14158 -3080 11637 -7269 -7028 -16332 -16155 -18363 -6275 -23836
503 -23836 -28261 -9302 15758 30037 34844 4759 -7267 16159 20349 12875 19132 16884 5749
490 5749 27150 6310 -325 3226 -3169 -13224 -2869 9322 8176 15953 19650 16544 6653 17994
476 17994 13298 8636 14475 14777 4550 -13821 13869 21771 9695 15288 9912 -2861 1165 -383
$$ [...]
##END NTUPLES=NMR SPECTRUM
##END=
