##TITLE=1H_EC-3333(VIII-3)
 CDCl3
 8 sc, 
 3.12.2024
##JCAMPDX= 6.0         $$ Bruker NMR JCAMP-DX V2.0
##DATA TYPE= NMR SPECTRUM
##DATA CLASS= NTUPLES
##ORIGIN= UXNMR, Bruker Analytische Messtechnik GmbH
##OWNER= root
$$ XWIN-NMR		Version 3.5
$$ Tue Dec  3 14:12:27 2024 Russian Standard Time (UT+4h)  she@DPX200
##.OBSERVE FREQUENCY= 200.1315
##.OBSERVE NUCLEUS= ^1H
##.ACQUISITION MODE= SIMULTANEOUS
##.ACQUISITION SCHEME= undefined
##.AVERAGES= 8
##.DIGITISER RES= 18
##SPECTROMETER/DATA SYSTEM= spect
##.PULSE SEQUENCE= zg30
##.SOLVENT NAME= CDCl3
##.SHIFT REFERENCE= (INTERNAL, CDCl3, 0, 19.4989)
##AUDIT TRAIL= $$ (NUMBER, WHEN, WHO, WHERE, WHAT)
$$ ##TITLE= Audit trail, XWIN-NMR		Version 3.5
$$ ##JCAMPDX= 5.01
$$ ##ORIGIN= Bruker BioSpin GmbH
$$ ##OWNER= she
$$ F:/spectra/data/she/nmr/H-F/1/pdata/1/auditp.txt
$$ ##AUDIT TRAIL=  $$ (NUMBER, WHEN, WHO, WHERE, WHAT)
(   1,<2024-12-03 14:11:04.79 +0400>,<she>,<DPX200>,
      <created by zg, POWCHK disabled, PULCHK disabled
       configuration hash MD5:
       00 E9 B6 7A A2 85 ED C7 34 08 36 98 17 FE 4E 26
       data hash MD5: 16K
       5E F1 A0 DD 77 69 7A F5 EE E8 FF 75 59 D4 28 08>)
(   2,<2024-12-03 14:11:07.15 +0400>,<she>,<DPX200>,
      <Start of raw data processing
       efp BC_mod = 2 LB = 0.24 FT_mod = 6 PKNL = 1 PHC0 = -26875.42 PHC1 = 11.18744 SI = 16K 
       data hash MD5: 16K
       0E 9B F1 0B F7 FC 21 78 F8 80 C0 E0 3D BC 40 FD>)
(   3,<2024-12-03 14:11:29.21 +0400>,<she>,<DPX200>,
      <pk PHC0 = -3.065596 PHC1 = 5 
       data hash MD5: 16K
       7F 9B 84 A3 86 37 31 A3 13 98 3D EC 0B 57 AC 29>)
(   4,<2024-12-03 14:11:32.79 +0400>,<she>,<DPX200>,
      <abs ABSG = 5 
       data hash MD5: 16K
       D0 E0 C3 27 7A 70 18 DC F4 06 8F B8 E8 15 72 89>)
$$ ##END=
$$ 
$$ hash MD5
$$ 28 19 C7 3D 8B 9B B8 4A 5A 22 05 54 C4 7A 86 66
##$RELAX= 
##$RELAX= 
##$RELAX= 
##$RELAX= 
##$RELAX= 
##$RELAX= 
$$ Bruker specific parameters
$$ --------------------------
##$DU= <F:/spectra>
##$EXPNO= 1
##$NAME= <H-F>
##$PROCNO= 1
##$TYPE= <nmr>
##$USER= <she>
##$AMP= (0..31)
100 100 100 100 100 100 100 100 100 100 100 100 100 100 100 100 100 100 
100 100 100 100 100 100 100 100 100 100 100 100 100 100 
##$AQSEQ= 0
##$AQ_mod= 1
##$AUNM= <au_zg>
##$AUTOPOS= <>
##$BF1= 200.13
##$BF2= 200.13
##$BF3= 200.13
##$BF4= 200.13
##$BF5= 200.13
##$BF6= 200.13
##$BF7= 200.13
##$BF8= 200.13
##$BYTORDA= 1
##$CFDGTYP= 0
##$CFRGTYP= 5
##$CHEMSTR= <none>
##$CNST= (0..31)
1 1 145 1 1 1 1 1 1 1 1 1 1 1 1 1 1 1 1 1 1 1 1 1 1 1 1 1 1 1 1 1 
##$CPDPRG= <>
##$CPDPRG1= <>
##$CPDPRG2= <>
##$CPDPRG3= <>
##$CPDPRG4= <mlev>
##$CPDPRG5= <mlev>
##$CPDPRG6= <mlev>
##$CPDPRG7= <mlev>
##$CPDPRG8= <mlev>
##$CPDPRGB= <>
##$CPDPRGT= <>
##$D= (0..31)
0 1.2 0 0 0 0 0 0 0 0.06 0 0.03 0 0 0 0 0.0002 0 0 0 0 0 0 0 0 0 0 0 0 
0 0 0 
##$DATE= 1733220663
##$DBL= (0..7)
120 120 120 120 120 120 120 120 
##$DBP= (0..7)
150 150 150 150 150 150 150 150 
##$DBP07= 0
##$DBPNAM0= <>
##$DBPNAM1= <>
##$DBPNAM2= <>
##$DBPNAM3= <>
##$DBPNAM4= <>
$$ [...]
##$SUBNAM3= <"">
##$SUBNAM4= <"">
##$SUBNAM5= <"">
##$SUBNAM6= <"">
##$SUBNAM7= <"">
##$SUBNAM8= <"">
##$SUBNAM9= <"">
##$SW= 24.0689530833862
##$SWIBOX= (0..15)
0 0 2 0 0 0 0 0 0 0 0 0 0 0 0 0 
##$SW_h= 4816.95568400771
##$TD= 16384
##$TD0= 1
##$TE= 0
##$TE2= 300
##$TE3= 300
##$TEG= 300
##$TL= (0..7)
0 120 120 120 120 120 120 120 
##$TP= (0..7)
150 150 150 150 150 150 150 150 
##$TP07= 0
##$TPNAME0= <>
##$TPNAME1= <>
##$TPNAME2= <>
##$TPNAME3= <>
##$TPNAME4= <>
##$TPNAME5= <>
##$TPNAME6= <>
##$TPNAME7= <>
##$TPOAL= (0..7)
0.5 0.5 0.5 0.5 0.5 0.5 0.5 0.5 
##$TPOFFS= (0..7)
0 0 0 0 0 0 0 0 
##$TUNHIN= 0
##$TUNHOUT= 0
##$TUNXOUT= 0
##$USERA1= <user>
##$USERA2= <user>
##$USERA3= <user>
##$USERA4= <user>
##$USERA5= <user>
##$V9= 5
##$VALIST= <valist>
##$VCLIST= <CCCCCCCCCCCCCCC>
##$VD= 0
##$VDLIST= <DDDDDDDDDDDDDDD>
##$VPLIST= <PPPPPPPPPPPPPPP>
##$VTLIST= <TTTTTTTTTTTTTTT>
##$WBST= 1024
##$WBSW= 4
##$XGAIN= (0..3)
0 0 0 0 
##$XL= 0
##$YL= 0
##$YMAX_a= 265603
##$YMIN_a= -430692
##$ZGOPTNS= <>
##$ZL1= 120
##$ZL2= 120
##$ZL3= 120
##$ZL4= 120
##$ABSF1= 19.40192
##$ABSF2= -4.66721
##$ABSG= 5
##$ABSL= 3
##$ALPHA= 0
##$AQORDER= 0
##$ASSFAC= 0
##$ASSFACI= 0
##$ASSFACX= 0
##$ASSWID= 0
##$AUNMP= <proc_1d>
##$AZFE= 0.1
##$AZFW= 0.1
##$BCFW= 0
##$BC_mod= 2
##$BYTORDP= 0
##$COROFFS= 0
##$CY= -3
##$DATMOD= 1
##$DC= 0
##$DFILT= <>
##$DTYPP= 0
##$F1P= 0
##$F2P= 0
##$FCOR= 1
##$FTSIZE= 16384
##$FT_mod= 6
##$GAMMA= 0
##$GB= 0
##$INTBC= 1
##$INTSCL= 2.524811e-10
##$ISEN= 128
##$LB= 0.24
##$LEV0= 0
##$LPBIN= 0
##$MAXI= 10000
##$MC2= 0
##$MEAN= 0
##$ME_mod= 0
##$MI= 1.114404
##$NCOEF= 0
##$NC_proc= -7
##$NLEV= 6
##$NOISF1= 3.799351
##$NOISF2= 2.8
##$NSP= 0
##$NTH_PI= 0
##$NZP= 0
##$OFFSET= 19.49888
##$PC= 1
##$PHC0= -26878.49
##$PHC1= 16.18744
##$PH_mod= 1
##$PKNL= yes
##$PPARMOD= 0
##$PSCAL= 0
##$PSIGN= 0
##$REVERSE= no
##$SF= 200.130006168121
##$SI= 16384
##$SIGF1= 3
##$SIGF2= 2
##$SINO= 5.538805
##$SIOLD= 16384
##$SREGLST= <1H.CDCl3>
##$SSB= 0
##$STSI= 16384
##$STSR= 0
##$SW_p= 4816.95568400771
##$SYMM= 0
##$S_DEV= 0
##$TDeff= 16384
##$TDoff= 0
##$TI= <>
##$TILT= no
##$TM1= 0
##$TM2= 0
##$TOPLEV= 0
##$USERP1= <user>
##$USERP2= <user>
##$USERP3= <user>
##$USERP4= <user>
##$USERP5= <user>
##$WDW= 1
##$XDIM= 16384
##$YMAX_p= 475832348
##$YMIN_p= -273611
$$ End of Bruker specific parameters
$$ ---------------------------------
##NTUPLES= NMR SPECTRUM
##VAR_NAME=  FREQUENCY,     SPECTRUM/REAL,   SPECTRUM/IMAG
##SYMBOL=    X,             R,               I
##VAR_TYPE=  INDEPENDENT,   DEPENDENT,       DEPENDENT
##VAR_FORM=  AFFN,          ASDF,            ASDF
##VAR_DIM=   16384,         16384,           16384
##UNITS=     HZ,            ARBITRARY UNITS, ARBITRARY UNITS
##FACTOR=    0.29402158847633, 1,            1
##FIRST=     3902.31105199219, 0,            0
##LAST=      -914.644632015523, 0,           0
##MIN=       -914.644632015523, -273611,     0
##MAX=       3902.31105199219, 475832348,    0
$$ Real data points
##PAGE= N=1
##DATA TABLE= (X++(R..R)), XYDATA
$$ [...]
7917C9214298O0919M93561P45209J339869J624846J980845K313784K741322L288970
$$ 39214298 39275217 39768778 40513987 41853856 43478702 45459547 47773331 50514653 53803623
7908E3803623L706889L958020M379478N333782M638516M300712L068166J587421
$$ 53803623 57510512 61468532 65848010 71181792 75820308 80121020 83189186 84776607
7900H4776607L6687q40291j001907J53224J918776K585789K335089R35599j233997
$$ 84776607 84813294 83973003 82971096 83124320 85043096 87628885 89963974 90899573 89665576
7891H9665576l577245n572600o497419o162619n102725m002298l089823k187109
$$ 89665576 86088331 80515731 74018312 67855693 62752968 58750670 55660847 53473738
7883E3473738j696779j110295n73510j88836L05239M69144Q50142J411825J853675
$$ 53473738 51776959 50666664 50093154 49904318 50209557 50678701 51528843 52940668 54794343
7874E4794343K585728L635415M603634M522408L864070K418466R58927o61212
$$ 54794343 57380071 61015486 65619120 70141528 74005598 76424064 77382991 76721779
7866G6721779j728270j323657J57113J175521J184319K84745j382885l354800
$$ 76721779 74993509 73669852 73826965 75002486 76186805 76471550 75088665 71733865
7858G1733865n106009n979573n701978m671435l965791l378019k739553k272086
$$ 71733865 66627856 60648283 54946305 50274870 46309079 42931060 40191507 37919421
7850C7919421j724378j719201j299807r70903r47877q55376o19005p31908p67805
$$ 37919421 36195043 34475842 33176035 32205132 31257255 30401879 29782874 29050966 28283161
7841B8283161n89554l94560l54422l21670j01955j19667j08000j84731k28397
$$ 28283161 27693607 27299047 26944625 26622955 26521000 26401333 26293333 26108602 25880205
7832B5880205l06675l91124k97891k45728n0825j00848l6277O3686l3493N0355
$$ 25880205 25573530 25182406 24884515 24638787 24587962 24487114 24450837 24514523 24481030 24531385
7822B4531385j16057n7518K16287K07755J85425L67984N58230P28131Q78688J072884
$$ 24531385 24415328 24357810 24574097 24781852 24967277 25335261 25893491 26621622 27500310 28573194
7812B8573194J128177J326105J769922K422602K742103K536435J744815J179430
$$ 28573194 29701371 31027476 32797398 35220000 37962103 40498538 42243353 43422783
7804D3422783L32245n54447r34124o24414J57019O86658N87272o20m07922r96709
$$ 43422783 43755028 43200581 42266457 41642043 41799062 42485720 43072992 43072372 42664450 41667741
7794D1667741j750198j613084j371977q04926k45117J36428M82267Q81161J216721
$$ 41667741 39917543 38304459 36932482 36127556 35882439 36018867 36501134 37382295 38599016
7785C8599016J258780J177844J126331J010488J345617J995002K957425L809052
$$ 38599016 39857796 41035640 42161971 43172459 44518076 46513078 49470503 53279555
7777E3279555M104980L835034K826887J153241n74195j595317j995706j522008
$$ 53279555 57384535 61219569 64046456 65199697 64625502 63030185 61034479 59512471
7769E9512471n09583L83242L73883l01204j407676k221072k975591l117379k734044
$$ 59512471 59002888 59386130 59760013 59458809 58051133 55830061 52854470 49737091 47003047
7760D7003047k102038j477607p39926n1966K68017N04864N45806K92166K8999
$$ 47003047 44901009 43423402 42683476 42631510 42899527 43404391 43950197 44242363 44271362
7751D4271362k39692l34124K54761Q81378J524257J771669J188697L39471m76373
$$ 44271362 44031670 43697546 43952307 44833685 46357942 48129611 49318308 49657779 49181406
7742D9181406j518719k227005k065047j390190q02836k42929n34892p21686j141994
$$ 49181406 47662687 45435682 43370635 41980445 41177609 40934680 40399788 39678102 38536108
7733C8536108j686223k047983j994735j518971j183528j121490p85736m53919
$$ 38536108 36849885 34801902 32807167 31288196 30104668 28983178 28197442 27743523
7725B7743523l21231j63113l07310n09990n48525o86763p88058n25422k63413
$$ 27743523 27422292 27259179 26951869 26441879 25893354 25206591 24418533 23893111 23629698
7716B3629698l18574l38047m16322n42448o30481p88252o20835o14388n76781
$$ 23629698 23311124 22973077 22556755 22014307 21383826 20595574 19974739 19360351 18783570
7707A8783570l33157l38211l04836j87602j76838k87808m09453m13830n70491
$$ 18783570 18450413 18112202 17807366 17619764 17442926 17155118 16745665 16331835 15761344
7698A5761344m91777m42153l86337l68465m17414m29805l38542m62242l21099
$$ 15761344 15269567 14827414 14441077 14072612 13655198 13225393 12886851 12424609 12103510
7689A2103510l04291l20867m63823l38369k98293k41912k10304k48672k47791
$$ 12103510 11799219 11478352 11014529 10676160 10377867 10135955 9925651 9676979 9429188
7680I429188k20030j92171r2783j06516n3298o8420k12399j42537j26507j18927
$$ 9429188 9209158 9016987 8924204 8817688 8764390 8695970 8483571 8341034 8214527 8095600
7670H095600j30232j65264j34746j2285k12419j85347n7212j66094q7765K3207
$$ 8095600 7965368 7800104 7665358 7653073 7440654 7255307 7198095 7032001 6944236 6967443
7660F967443k02237p6317j47689j20932p1846j41762k1435m6423k30375l45192
$$ 6967443 6765206 6688889 6541200 6420268 6348422 6206660 6185225 6138802 5908427 5563235
7650E563235k15830j37588q9244n1451k73067L7045l7412r0812q0273r3681o9596
$$ 5563235 5347405 5209817 5120573 5069122 4796055 4833100 4795688 4704876 4624603 4530922 4461326
7639D461326l5201P9391j09939p4167j5465m6671o3865N3121j11574m7041j88031
$$ 4461326 4426125 4505516 4395577 4321410 4305945 4259274 4195409 4248530 4136956 4089915 3901884
7628C901884j81649n9247l2741r3406n5650q2811j04196j1909l2808k7108r5648
$$ 3901884 3720235 3660988 3628247 3534841 3479191 3396380 3292184 3280275 3247467 3220359 3124711
7617C124711j8256n4046j06687p0744P7639k0859j98714q5753J23833j17282o8040
$$ 3124711 3106455 3052409 2945722 2874978 2952617 2931758 2733044 2647291 2771124 2653842 2585802
7606B585802R625o8650k8730K3708R76n8536Q1204R6060l5450K9692L8688j4620
$$ 2585802 2595427 2526777 2498047 2521755 2522731 2464195 2545399 2641459 2606009 2635701 2674389 2659769
7594B659769P4121o5525p3584o3520j12964j61672M6306L4007q1096l157r6238
$$ 2659769 2733890 2668365 2594781 2531261 2418297 2256625 2302931 2336938 2255842 2252685 2156447
7583B156447j58980L819N1254m4250m9949j20864o9918J45604n5807M4357j5594
$$ 2156447 1997467 2001286 2052540 2008290 1958341 1837477 1767559 1913163 1857356 1901713 1886119
7572A886119q6378Q0116O9484q5889r2245o7818J22684k6592K2195n2378O8300
$$ 1886119 1799741 1879857 1949341 1863452 1771207 1703389 1826073 1799481 1821676 1769298 1837598
7561A837598m6232K8181j4728n8421J36679j04358l6335R6400R375N7228Q0933
$$ 1837598 1791366 1819547 1804819 1746398 1883077 1778719 1742384 1838784 1848159 1905387 1986320
7550A986320J22761k2354L6680n9982K9977J89215k5575n1099j25497M9864n0170
$$ 1986320 2109081 2086727 2123407 2063425 2093402 2282617 2257042 2205943 2080446 2130310 2080140
7539B080140L6840M4061o1560N6935j13969Q9419P8889j1964J16380n5568J20829
$$ 2080140 2116980 2161041 2099481 2156416 2042447 2131866 2210755 2198791 2315171 2259603 2380432
7528B380432K8468M4722P7312p473o7187j5454M2072M5802L1294P2574k5056l6994
$$ 2380432 2408900 2453622 2530934 2523461 2456274 2440820 2482892 2528694 2559988 2632562 2607506 2570512
7516B570512j5859O9169j08635j29815J1739p0472k4662L6568n6311L9360n5135
$$ 2570512 2554653 2623822 2515187 2385372 2397111 2326639 2301977 2338545 2282234 2321594 2266459
7505B266459k1390O6277r716Q84J92274j38009K0606R7000P4412M3641J26852
$$ 2266459 2245069 2311346 2301630 2302514 2494788 2356779 2377385 2474385 2548797 2592438 2719290
7494B719290J33769J3633p6834l0530j76211P6659R343l0406l9639q2258l6272
$$ 2719290 2853059 2866692 2789858 2759328 2583117 2659776 2669119 2638713 2599074 2516816 2480544
7483B480544j84600j92629j21081j30266l1391j36509N267K3248r3707K794j27360
$$ 2480544 2295944 2103315 1982234 1851968 1820577 1684068 1689335 1712583 1618876 1621670 1494310
7472A494310L1859R940o9985m7686J03605J1247k2474M0210L6408L6826k6839
$$ 1494310 1526169 1536109 1466124 1418438 1522043 1533290 1510816 1551026 1587434 1624260 1597421
7461A597421J85248L3118j33656n1049n4086K4236j60982J6892q9964k5723l9256
$$ 1597421 1782669 1815787 1682131 1631082 1576996 1601232 1440250 1457142 1367178 1341455 1302199
7450A302199p4225o6721j16988n9477j04087j2304n8283M9306P713j58667j16427
$$ 1302199 1227974 1161253 1044265 984788 880701 868397 810114 859420 867133 708466 592039
7439E92039l3201N9161K5495O7195N082q4074j42536P0338L5353j8786j5862q6675
$$ 592039 558838 617999 643494 710689 715771 631697 489161 559499 594852 576066 560204 473529
7427D73529m7964l0706P8185J7009k9868m4533n2441o236r9611J22274K4163j4798
$$ 473529 425565 394859 473044 490053 460185 415652 363211 356975 257364 379638 403801 389003
7415C89003j52965L9612O9371k4331L9594n5872l3898k1231N3729L6000o2154
$$ 389003 236038 275650 345021 320690 360284 304412 270514 249283 303012 339012 276858
7404B76858K6494K9024k0716L1916J7799K9070l2347j16343k3421R9986n9713
$$ 276858 303352 332376 311660 343576 361375 390445 358098 241755 218334 318320 258607
7393B58607j37620k1135R2871r612Q764j7935J7688j8386l9234O4929m0599o404
$$ 258607 120987 99852 192723 183111 191875 173940 191628 173242 134008 198937 158338 151934
7381A51934N29J0235N1286k3834m1402M0095n3063j5377l4500K0189K8727L3326
$$ 151934 152463 162698 213984 190150 148748 188843 135780 120403 85903 106092 134819 168145
7369A68145J14673l7110q6327n8425q6827N9073k6427N1627m464N4210K8927j5449
$$ 168145 282818 245708 159381 100956 14129 73202 46775 98402 93938 148148 177075 161626
7357A61626k3109j8642j10406k2444J65073r936K5995q7047J736O9040j3628N628
$$ 161626 138517 119875 9469 -12975 152098 142162 168157 81110 82846 151886 138258 143886
7345A43886J8577M1824m7487L6529o2778l0177q3106M1276P2360r3502j3660J8597
$$ 143886 162463 204287 156800 193329 130551 100374 17268 58544 130904 37402 23742 42339
7333D2339o2179M2572K7141J4834R2741L6945p9182q9777L6810P1965q5402J7549
$$ 42339 -19840 22732 49873 64707 157448 194393 115211 25434 62244 134209 48807 66356
7321F6356O0346o309n2130n3231l0145M280M6900K0826J00276n1240p8933k9893
$$ 66356 126702 120393 68263 15032 -15113 -10833 36067 56893 157169 105929 26996 -2897
7309b897k5510R021N4228n925P1052m0274J19925j01846j07236K8061L5969L8984
$$ -2897 -28407 -19386 34842 28917 99969 59695 179620 77774 -29462 -1401 34568 73552
7297G3552j2344o8280R0957l3129K1286K7989j39613J30166P5339n1306n3773
$$ 73552 61208 -7072 83885 50756 72042 100031 -39582 90584 165923 114617 60844
7286F0844o1589K3211J0975M3814Q937L3603K3021j8867j4416j0720J39283n9895
$$ 60844 -745 22466 33441 77255 86192 119795 142816 123949 109533 98813 238096 178201
7274A78201l7920q5016M4665l3078J52Q3858o7881J09895l413J3989j04071o8066
$$ 178201 140281 55265 99930 66852 67004 150862 82981 192876 189463 203452 99381 31315
7262C1315K1462M9211j7351Q494J5149k2257J8000p63r2286P4810M668J0076Q565
$$ 31315 52777 101988 84637 93131 108280 86023 104023 103260 10974 85784 90452 100528 109093
7249A09093Q3776j35558M6873R6684r2447Q698N7087l3520m585R9531r4179j5111
$$ 109093 192869 57311 104184 200868 108421 117119 174206 140686 136101 235632 141453 126342
7237A26342Q861K5650Q0030J6594O7684m518r8770N5113j4821j90261M4272n4369
$$ 126342 135203 160853 240883 257477 325161 320643 221873 276986 262165 71904 116176 61807
7225F1807P4954k372m8730n4610M6232N5160j2338o2575j5202N9900K2266k1811
$$ 61807 136761 134389 85659 31049 77281 132441 120103 57528 42326 102226 124492 102681
7213A02681m5O4114o6336N0007o8228L2724J08846j39634m6854Q8071K8810m1567
$$ 102681 102636 166750 100414 150421 82193 114917 223763 84129 37275 125346 154156 112589
7201A12589j7032j9536k324k9519L6599O3881m5987o8532p5893J13246j2782N35
$$ 112589 95557 76021 73697 44178 80777 144658 98671 30139 -45754 67492 54710 55245
7189E5245r5272M962O7387J2590n8249R5368O0808j0611p7202J56K2252N621j4530
$$ 55245 -40027 -35065 32322 44912 -13337 82031 142839 132228 55026 55182 77434 83055 68525
7176F8525N7618k5171o4154k9551p1235P94N7990p209P5496n8412k2237L6411
$$ 68525 126143 100972 36818 7267 -63968 -63174 -5184 -12393 63103 4691 -17546 18865
7164A8865K718p2149Q0247M6056M2176J5716j8956j7389J09939m3311j20215n1831
$$ 18865 21583 -50566 29681 75737 117913 133629 114673 97284 207223 163912 43697 -8134
7152h134M7290J7663R2110J2899q697O3202O9152j04082j01310J93857L1143k1104
$$ -8134 39156 56819 148929 161828 153131 216333 285485 181403 80093 273950 305093 283989
7140B83989n0276J20334J28110r0425Q0270K1162j12610j26846M4660J42287j10231
$$ 283989 233713 354047 482157 391732 472002 493164 380554 253708 298368 440655 330424
7129C30424N6104m0964k7875O8702m4109j02143J8471O1680J22777n3044P8947
$$ 330424 386528 345564 317689 386391 342282 240139 258610 320290 443067 390023 468970
7118D68970l3213r4831M2897o4006m6329k2760J65503L07j50429L9986Q4931O9013
$$ 468970 435757 340926 383823 319817 273488 250728 416231 416538 266109 306095 391026 460039
7106D60039J6845L3038j6p4928J13164k1895m0852R7778J56l7287q4255n0869
$$ 460039 476884 509922 509906 434978 548142 526247 485395 583173 583329 546042 461787 410918
7094D10918P3687p6423M5777K1047p2582k7917p4381k3584J46043L0487q577M6638
$$ 410918 484605 408182 453959 475006 402424 374507 300126 276542 422585 453072 444495 491133
7082D91133m9680J8268L8915O0052K7963p1953N2067p7818j26959J16938l4952
$$ 491133 441453 459721 498636 558688 586651 514698 566765 488947 361988 478926 443974
7071D43974j04168N7522j7558L1226m7069p6841O3137k1332K8983K7625K7674
$$ 443974 339806 397328 379770 410996 363927 287086 350223 328891 357874 385499 413173
7060D13173r1598Q4668o8731K8878j489N5989q7198j3150O7648k0706M411Q1608
$$ 413173 321575 406243 337512 366390 364901 420890 333692 320542 388190 367484 371895 453503
7048D53503o7222K4915m6239M5645Q2269o0396L366p5820L5874Q3542k3970l3279
$$ 453503 386281 411196 364957 410602 492871 432475 435841 360021 395895 479437 455467 422188
7036D22188n8906N746O5330k5228j8273q8769M4271O348j00283O937N296M9287
$$ 422188 363282 369028 434358 409130 390857 302088 346359 352707 252424 259361 264657 313944
7024C13944R855L7341J8432m0372p3128N2108J6019m7892M7009Q620N790m712
$$ 313944 323799 361140 379572 339200 266072 318180 334199 286307 333316 341936 347726 343014
7012C43014l9485O9118l2154n7262N2406P8226P6456r673N2687N939m3087M7884
$$ 343014 303529 372647 340493 283231 335637 413863 490319 480646 533333 539272 496185 544069
7000E44069j6633m7771l8775N3930k436J0098p1887K8510O6342j00853n777L6610
$$ 544069 527436 479665 440890 494820 492384 502482 430595 459105 525447 424594 418817 455427
6988D55427P3719m6382K1188L1934K6858J6898L0299j12796P3320N0140k7380
$$ 455427 529146 482764 503952 535886 562744 579642 609941 497145 570465 620605 593225
6977E93225j0498o4361j5341J97227Q9185n8049j7283L4047J09448J4330O292
$$ 593225 582727 518366 503025 700252 789437 731388 714105 748152 857600 871930 878222
6966H78222L1217k6475R749O8492o1804j3368J49064m6837J4799M2142M9081J662
$$ 878222 909439 882964 892713 961205 899401 886033 1035097 988260 1003059 1045201 1094282 1095944
6954A095944k9033N0086J55m7269L8555M5576R9423R0003P1722J4121L3595J20507
$$ 1095944 1066911 1116997 1117152 1069883 1108438 1154014 1253437 1343440 1415162 1429283 1462878 1583385
6942A583385J69813J66285J56141P5168Q660O0348O3159j2361k3904K3039K5649
$$ 1583385 1753198 1919483 2075624 2150792 2159452 2219800 2282959 2270598 2246694 2269733 2295382
6931B295382q8603L6936r1283o2615N9909K1673J7875L1174N6230o8035j01975
$$ 2295382 2206779 2243715 2152432 2089817 2149726 2171399 2189274 2220448 2276678 2208643 2106668
6920B106668J8952r0997j06347j5332n5008k2806Q077l0514O0824m4369J26494
$$ 2106668 2125620 2034623 1928276 1912944 1857936 1835130 1843207 1812693 1873517 1829148 1955642
6909A955642J8834p5416J41597K4046O4305l0697M4781R4093J9491m218L7459
$$ 1955642 1974476 1899060 2040657 2064703 2129008 2098311 2143092 2237185 2256676 2252458 2289917
6898B289917N0575P3156n5592o239R8780M9955J7986m0241j34653K4778o4655
$$ 2289917 2340492 2413648 2358056 2351817 2450597 2500552 2518538 2478297 2343644 2368422 2303767
6887B303767k0419j7973k1654L0020K1072m8547j23255N9335q9360r870j17335
$$ 2303767 2283348 2265375 2243721 2273741 2294813 2246266 2123011 2182346 2092986 2083116 1965781
6876A965781n1544j314p220J01044l2317J13666K7373P7076J04500j6174j18474
$$ 1965781 1914237 1912923 1905703 2006747 1974430 2088096 2115469 2192545 2297045 2280871 2162397
6865B162397Q125j6563N6530l0908r9696o8129O6218J21988j29466k668R7814
$$ 2162397 2170522 2153959 2210489 2179581 2079885 2011756 2077974 2199962 2070496 2067828 2165642
6854B165642l4687K6171r6230L6758l837M1969Q5103N9814J8151Q4882j3410M2566
$$ 2165642 2130955 2157126 2060896 2097654 2093817 2135786 2220889 2280703 2298854 2383736 2370326 2412892
6842B412892K2668n0696L3343N8503j3506k38577j7332J20015q8529O413M4912
$$ 2412892 2435560 2384864 2418207 2476710 2463204 2224627 2207295 2327310 2238781 2245194 2290106
6831B290106j26093M1058o534K0550O1569J8285K2651R5104J0402O5888R8590
$$ 2290106 2164013 2205071 2198537 2219087 2280656 2298941 2321592 2416696 2427098 2492986 2591576
6820B591576J26401J18489N8282Q0755J08636k5055J5987N1565p9529j19998m8558
$$ 2591576 2717977 2836466 2894748 2975503 3084139 3059084 3075071 3126636 3047107 2927109 2878551
6809B878551r6021m3519l5769j27624j9911M4473N3210j00927n4327J66123j07918
$$ 2878551 2782530 2739011 2703242 2575618 2555707 2600180 2653390 2552463 2498136 2664259 2556341
6798B556341J2428M2830j0041R4371N9485j5j776l017O7802K07174O1169n3088
$$ 2556341 2568769 2611599 2601558 2695929 2755414 2755399 2753623 2750606 2818408 3025582 3086751 3033663
6786C033663J06889K05977Q2562j01215J38446M3155O6506p1065j5457P4201N4231
$$ 3033663 3140552 3346529 3429091 3327876 3466322 3509477 3575983 3504918 3489461 3563662 3617893
6775C617893J31611J01973O2642J53616J17185J05834K96927K59184J67003J49036
$$ 3617893 3749504 3851477 3914119 4067735 4184920 4290754 4587681 4846865 5013868 5162904
6765E162904N1433j1273J32580J3367l0059Q3577J04839R5834J42323N3921L6645
$$ 5162904 5214337 5203064 5335644 5349011 5318952 5402529 5507368 5603202 5745525 5799446 5836091
6754E836091M5790n3523k41522j56982j63383k65765l59319k10613j71158j83922
$$ 5836091 5881881 5828358 5586836 5429854 5266471 5000706 4641387 4430774 4259616 4075694
6744D075694p4850j10790j16672j18578k40084l7151p4639J35893j33397j2026
$$ 4075694 4000844 3890054 3773382 3654804 3414720 3377569 3302930 3438823 3305426 3293400
6734C293400j66331k9513O4376j04690j8948P002p4818m7300Q5491M164o6202
$$ 3293400 3127069 3097556 3161932 3057242 3038294 3045296 2970478 2923178 3008669 3012833 2946631
6723B946631Q2360Q3739J25742K8712J22048K01609J70256L60089J94315K57578
$$ 2946631 3028991 3112730 3238472 3267184 3389232 3590841 3761097 4121186 4315501 4573079
6713D573079J77157J44391J21547j35595k27246k28901k05125k23749l18020k28053
$$ 4573079 4750236 4894627 5016174 4880579 4653333 4424432 4219307 3995558 3677538 3449485
6703C449485j72991j57743j63921j16736j76483j64532j78103J1069q2996n2007
$$ 3449485 3276494 3118751 2954830 2838094 2661611 2497079 2318976 2330045 2247049 2195042
6693B195042r0941o0116k566o0378j38350j7975o2502l6638j25133J40394N5845
$$ 2195042 2104101 2043985 2041419 1981041 1842691 1824716 1762214 1725576 1600443 1740837 1796682
6682A796682j42756k4689L4725l4884j13259L5397o1352P6389N5829N565n6533
$$ 1796682 1653926 1629237 1663962 1629078 1515819 1551216 1489864 1566253 1622082 1627647 1571114
6671A571114j40195l7698o750J7906j5045j12143L9909l7100m884J0916j02370
$$ 1571114 1430919 1393221 1386471 1404377 1389332 1277189 1317098 1279998 1275114 1286030 1183660
6660A183660j03189m3816L4831Q379J936j58019J9819M5020j2982l010j5401r5234
$$ 1183660 1080471 1036655 1071486 1079865 1081801 923782 943601 988621 975639 972629 957228 861994
6648H61994j10821M1837p4188m8011R1824L9768q2637r9866Q9006j1880J6213
$$ 861994 751173 793010 718822 670811 762635 802403 719766 619900 708906 697026 713239
6637G13239o6963O6801j07919R018j1024l1719O7125n5270J3267j392j13593N7006
$$ 713239 646276 713077 605158 614176 603152 571433 638558 583288 596555 595163 481570 538576
6625E38576K7724j14748o7709J5389J3514k7818P03N4326K1608o5495J05369j12850
$$ 538576 566300 451552 383843 399232 412746 384928 385631 439957 461565 396070 501439 388589
6613C88589O1119n5503J8587J8304l8130k4451j2261N5165j11295M383L0270n2662
$$ 388589 449708 394205 412792 431096 392966 368515 356254 411419 300124 304507 334777 282115
6601B82115O3253O373O3202o3978M630J54481J9005J1079N7601q8663p7232P8296
$$ 282115 345368 351741 414943 350965 355595 510076 529081 540160 597761 509098 431866 510162
6589E10162n4903j17954K6061J5908k8709p7072K7537P42J6421J3985m3595N7347
$$ 510162 455259 337305 363366 379274 350565 273493 301030 301772 318193 332178 288583 345930
6577C45930R804K7425m6605m9207L3665j20986J6806l2853O0695Q8803r2378P5054
$$ 345930 355734 383159 336554 287347 321012 200026 216832 183979 244674 333477 241099 316153
6565C16153o5352L0636M4411o8607m9934J6828j9322N930Q436L5985P2061m0193
$$ 316153 250801 281437 325848 257241 207307 224135 204813 210743 219179 255164 327225 287032
6553B87032l3553k8670p2664l7158Q8060N6124J338p4466K4539M2647q2161J2548
$$ 287032 253479 224809 152145 114987 203047 259171 260509 186043 210582 253229 171068 183616
6541A83616O9766K0368k7226O1221M6836n8719k7655P4803p8289m3614j8103M1467
$$ 183616 253382 273750 246524 307745 354581 295862 268207 343010 264721 221107 203004 244471
6529B44471l97O6477r3255m9228R4930k8414n1927k1434J09530j07999L6648p0982
$$ 244471 244074 310551 217296 168068 262998 234584 182657 161223 270753 162754 199402 128420
6517A28420P8944l032J31941m0409l1807k5479K8518M4892J9475j4723M5169l570
$$ 128420 207364 204332 336273 295864 264057 238578 267096 311988 331463 316740 361909 358339
6505C58339l758L0973M522J24377o0705n4293K3762r4495L7580J2513N3478o9590
$$ 358339 354581 385554 390076 514453 453748 399455 423217 328722 366302 378815 432293 362703
6493C62703N2324Q110r1343k5342j5893J8871k9318p6828J07680L7694j8822R7678
$$ 362703 415027 423137 331794 306452 290559 309430 280112 203284 310964 348658 329836 427514
6481D27514j27286o31l5361K4474r23L5772m7118P7474J717L0425o9571N4783
$$ 427514 300228 299597 264236 288710 287787 323559 276441 353915 355632 386057 316486 371269
6469C71269p2530k2461M988J10431p5933O0247K2740J3874m456k3248j7656R7380
$$ 371269 298739 276278 281266 391697 315764 376011 398751 412625 408169 384921 367265 464645
6457D64645r9237M8136L5283j20281Q5459K7660n3490l4741J17794R346j35165
$$ 464645 365408 413544 448827 328546 414005 441665 388175 353434 471228 480574 345409
6446C45409R0602L440q7620j8261j00989M7437J08625m5583j5030J04092q3007
$$ 345409 436011 439451 351831 333570 232581 280018 388643 343060 328030 432122 349115
6435C49115k5775M5983l0862J15956k3800j03377P8419P9954m2851J2324q311
$$ 349115 323340 369323 338461 454417 430617 327240 405659 485613 442762 455086 446775
6424D46775j30740L0919P0665J2046r6902N5526l5088J2880K7196k2218K7522
$$ 446775 316035 346954 417619 429665 332763 388289 353201 366081 393277 371059 398581
6413C98581L0475m8050l4213N1574J9316k3291q6709l2225R0468m744J4071O3556
$$ 398581 429056 381006 346793 398367 417683 394392 307683 275458 365926 361182 375253 438809
6401D38809r3259n5734J04902l6909o6271L9865J28265K3280l6609K5206J516
$$ 438809 345550 289816 394718 357809 291538 331403 459668 482948 446339 471545 473061
6390D73061L3998l5624r8102R185J3800J12431j13967q419n0558Q0670K2901j30479
$$ 473061 507059 471435 373333 382518 396318 508749 394782 386363 335805 416475 439376 308897
6378C08897M7952l5276R1176N8423j09199J15335P2596j80623l3615o3106L1779
$$ 308897 356849 321573 412749 471172 361973 477308 549904 369281 335666 272560 304339
6367C04339M0335k5055J0499O7354L5581K5507q408p6696P9090p177O231m1233
$$ 304339 344674 319619 330118 397472 433053 458560 450152 373456 452546 445369 451600 410367
6355D10367j5468n9277M4192K6471M7789M893l0833R2868m183q879k52O632J15257
$$ 410367 394899 335622 379814 406285 454074 458967 428134 521002 516819 507940 507688 514320 629577
6342F29577l3831j07417j797j2494O1580l60j6634p7575M1432Q3727R756j09159
$$ 629577 595746 488329 486532 474038 535618 535258 518624 441049 482481 566208 575964 466805
6330D66805O1435m2976M5848K8152j08236J29728j9320m3028L8073O7946j32363
$$ 466805 528240 485264 531112 559264 451028 580756 561436 518408 556481 624427 492064
6319D92064o1410M0379J1231J3709J2178N4657Q4595j18226o7393Q0511K820M8116
$$ 492064 430654 471033 482264 495973 508151 562808 647403 529177 461784 542295 545115 593231
6307E93231O4714m9460P2081n6170n5821L3762M7683Q4849l3240J40039r6586
$$ 593231 657945 608485 680566 624396 568575 602337 650020 734869 701629 841668 745082
6296G45082K2908Q584j6679L9938o303k9947k4633R929M009J06993L4296N0136
$$ 745082 767990 776574 759895 799833 793530 763583 738950 748879 752888 859881 894177 944313
6284I44313J8353n5838l2940L1376j1599m9237K6717J10350M7307L6068n8629
$$ 944313 962666 906828 873888 905264 893665 844428 871145 981495 1028802 1064870 1006241
6273A006241J35518Q1353j58783N7578Q2444J5937N9941J48016m8390l3019N2237
$$ 1006241 1141759 1223112 1064329 1121907 1204351 1220288 1280229 1428245 1379855 1346836 1399073
6262A399073O9157O1655J25758L3932Q420J04593J0716J3286J06812l0493k9050
$$ 1399073 1468230 1529885 1655643 1689575 1697995 1802588 1813304 1826590 1933402 1902909 1873859
6251A873859L8986o2815J81660R1760L6461P0050l1899J30584J66836K30405J91117
$$ 1873859 1912845 1850030 2031690 2123450 2159911 2229961 2198062 2328646 2495482 2725887 2917004
6240B917004K08825J9161L6826J92958K8724j9535j9264j29332r0894j81904j34398
$$ 2917004 3125829 3144990 3181816 3374774 3403498 3383963 3364699 3235367 3144473 2962569 2828171
6229B828171K8494j02162k8792M867P98l0361l0305m7789Q1033l9909j24139n4060
$$ 2828171 2856665 2754503 2725711 2730578 2731376 2701015 2670710 2622921 2703954 2664045 2539906 2485846
6217B485846k5492m0553P6055R6607p2593K6507J5470j22319m8436J23863O8963
$$ 2485846 2460354 2419801 2495856 2592463 2519870 2546377 2561847 2439528 2391092 2514955 2583918
6206B583918j6735j40716J20417K3155m4877J81857J13765o8911l0973k5135q58
$$ 2583918 2567183 2426467 2546884 2570039 2525162 2707019 2820784 2751873 2720900 2695765 2694907
6195B694907O7982J4607L3463J4824K0535J1669K0848M0932L688j2625O4599p0898
$$ 2694907 2762889 2777496 2810959 2825783 2846318 2857987 2878835 2919767 2923455 2910830 2975429 2904531
6183B904531m653J14544J6286M7556k239K1827O0847Q4894N7957O3804j12355
$$ 2904531 2899878 3014422 3030708 3078264 3076025 3097852 3158699 3243593 3301550 3365354 3252999
6172C252999O4431K0172O8564l4758q1352P4384o3847o4296K4585Q4700j65913
$$ 3252999 3317430 3337602 3406166 3371408 3290056 3364440 3300593 3236297 3260882 3345582 3179669
6161C179669j68255p9467M8159k4798m9528J34719l0123l6538P0362K4919Q1432
$$ 3179669 3011414 2931947 2980106 2955308 2905780 3040499 3010376 2973838 3044200 3069119 3150551
6150C150551R4386M3163L1065l2610l7101R4941J08778N0231Q2683K8301r6215
$$ 3150551 3244937 3288100 3319165 3286555 3249454 3344395 3453173 3503404 3586087 3614388 3518173
6139C518173J35963j6857J28086J47585m3427J96095P1706Q2625J30318j259R2056
$$ 3518173 3654136 3637279 3765365 3912950 3869523 4065618 4137324 4219949 4350267 4349008 4441064
6128D441064J13316Q7011J15656n313K7331n551J34445m2680k08051K5227K2042
$$ 4441064 4554380 4641391 4757047 4751734 4779065 4773514 4907959 4865279 4657228 4682455 4704497
6117D704497q0637j23126M7682J5309j70726o8729L3983j03605L8312m1535n4730
$$ 4704497 4623860 4500734 4548416 4563725 4392999 4324270 4358253 4254648 4292960 4251425 4196695
6106D196695l8194l3583M1084J62814r2020j17391K26204O9326q6557L4154m852
$$ 4196695 4158501 4124918 4166002 4328816 4236796 4119405 4345609 4414935 4328378 4362532 4357680
6095D357680R0388J7057M2204K2656P3531M5171N7216K1717J41944J45369N7663
$$ 4357680 4448068 4465125 4507329 4529985 4603516 4648687 4705903 4727620 4869564 5014933 5072596
6084E072596K6547J93300K6539P0004J35072J4108l2557J44100J30759J27848
$$ 5072596 5099143 5292443 5318982 5388986 5524058 5538166 5505609 5649709 5780468 5908316
6074E908316Q71R9949K30366N9137M1067J60626J24025Q834R1100Q5971Q4568
$$ 5908316 5909187 6009136 6239502 6298639 6339706 6500332 6624357 6633191 6724291 6810262 6894830
6063F894830j6218K3413O3430J3330L5810J4437J64270Q1186M8688K02174J75807
$$ 6894830 6878612 6902025 6965455 6978785 7014595 7029032 7193302 7274488 7323176 7525350 7701157
6052G701157Q6548m164K80258J92285J74704J88995J78785J73871J77258J83753
$$ 7701157 7787705 7783541 8063799 8256084 8430788 8619783 8798568 8972439 9149697 9333450
6042I333450L28886J88187K83677P0556K02260K32490K37723K12253K55957J90368
$$ 9333450 9662336 9850523 10134200 10204756 10407016 10639506 10877229 11089482 11345439 11535807
6032A1535807K12034J56596K14440K74249K58006L36747K72397K81959L30867
$$ 11535807 11747841 11904437 12118877 12393126 12651132 12987879 13260276 13542235 13873102
6023A3873102M23542L46963K60078L34092K78492L07098L38040M62578L96516
$$ 13873102 14296644 14643607 14903685 15237777 15516269 15823367 16161407 16623985 17020501
6014A7020501M48677M42086M76872M37698N44084M62488N26204N94021N81560
$$ 17020501 17469178 17911264 18388136 18825834 19369918 19832406 20358610 20952631 21534191
6005B1534191N86704M85683O51914O59381N93990P02949P76325N46869O57738
$$ 21534191 22120895 22606578 23258492 23917873 24511863 25214812 25991137 26538006 27195744
5996B7195744R11453P38771Q24713J034821J023400J078067J097052J329839J476840
$$ 27195744 28107197 28845968 29670681 30705502 31728902 32806969 33904021 35233860 36710700
5987C6710700J528118J670960J880474J994492K204993K451924K612758K808745
$$ 36710700 38238818 39909778 41790252 43784744 45989737 48441661 51054419 53863164
5979E3863164L217426L619698M310237M990552O077826P335967Q264514Q245483
$$ 53863164 57080590 60700288 65010525 70001077 76078903 83414870 91679384 99924867
5971I9924867O796975N201310L433295J493064L65820O84743K220453M316471
$$ 99924867 106721842 111923152 115356447 116849511 117215331 117900074 120120527 124436998
5963A24436998N514979N901744O114472O521861O764260O881565O891163O132498
$$ 124436998 129951977 135853721 141968193 148490054 155254314 162135879 169027042 175159540
5955A75159540M700400K569766L37487j062303j923190k812505k926681k608147
$$ 175159540 179859940 182429706 182767193 181704890 179781700 176969195 174042514 171434367
5947A71434367k280531j929600l89446J997114M837195N938750N519316N041654
$$ 171434367 169153836 167224236 166834790 168831904 173669099 179607849 185127165 190168819
5939A90168819M089283K398662M66010j237525l244076n422432p946590j0190814
$$ 190168819 194258102 196656764 197122774 195885249 192641173 187218741 179272151 169081337
5931A69081337j1202755j0913362r756609q007283o353454m954214l724220k374406
$$ 169081337 157878582 146965220 137208611 129201328 122847874 117893660 114169440 111795034
5923A11795034j249243k79532Q37252J649310J862719J449720K42623j335490
$$ 111795034 110545791 110266259 111103511 112752821 114615540 116065260 116307883 114972393
5915A14972393l143907n085431o299565o829432o578430o099613n292776m619772
$$ 114972393 111828486 106743055 100443490 93614058 87035628 80936015 75643239 71023467
5907G1023467m006052l349278l189445k615002k365506k356561j887264j619552
$$ 71023467 67017415 63668137 60478692 57863690 55498184 53141623 51254359 49634807
5899D9634807j743449j580913j398720j454676j426674j304002j253727j256852
$$ 49634807 47891358 46310445 44911725 43457049 42030375 40726373 39472646 38215794
5891C8215794j145957j074664q54346r34956r44798p55518o71813p75605n32189
$$ 38215794 37069837 35995173 35140827 34205871 33261073 32505555 31833742 31058137 30525948
5882C0525948m46933m67096n26063l87091l40523k45972l20389j07876j22033
$$ 30525948 30079015 29611919 29085856 28698765 28358242 28112270 27791881 27684005 27561972
5873B7561972k2809J1484O4581K16769K12988L34801N31442O65564Q01279Q28250
$$ 27561972 27539163 27550647 27615228 27831997 28044985 28379786 28911228 29576792 30378071 31206321
5863C1206321J011552J083408J074244R09172M88000J86061j54146l53963m73579
$$ 31206321 32217873 33301281 34375525 35284697 35772697 35958758 35804612 35450649 34977070
5854C4977070m74733m50476q8303j05640K12483M51252Q53291J062046J373500
$$ 34977070 34502337 34051861 33963558 33857918 34070401 34521653 35374944 36436990 37810490
5845C7810490J777666J993862K257923K286907J947143J275776K44773p86149
$$ 37810490 39588156 41582018 43839941 46126848 48073991 49349767 49594540 48808391
5837D8808391j622892k060146k461658k369229k130845j775141j427347j134941
$$ 48808391 47185499 45125353 42663695 40294466 38163621 36388480 34961133 33826192
5829C3826192p95335l92298j67546L5650L22725N67466N35573L68614J24195k93788
$$ 33826192 33030857 32638559 32471013 32506663 32829388 33396854 33932427 34301041 34425236 34131448
5819C4131448p15355j262634j675743j768255j686064j745759j666370j326325
$$ 34131448 33416093 32153459 30477716 28709461 27023397 25277638 23611268 22284943
5811B2284943j170497j167677q62670r33621p43832n39125n62272n66824m89211
$$ 22284943 21114446 19946769 19084099 18150478 17406646 16867521 16305249 15738425 15249214
5802A5249214m32185l80504l98371n04322l47205k89987k06385j54875l05330
$$ 15249214 14817029 14436525 14038154 13533832 13186627 12896640 12690255 12535380 12230050
5793A2230050k65733k41965j88058j00159r8197j91003j92399j74384j79132Q604
$$ 12230050 11964317 11722352 11534294 11434135 11335938 11144935 10952536 10778152 10599020 10607624
5783A0607624q7075j45052k38924m6269l8557q0505o1490M1120m7797k372o9982
$$ 10607624 10520549 10375497 10136573 10090304 10051747 9971242 9909752 9950872 9903075 9900703 9830721
5772I830721l9059P6774J7581P5647m7892m7316K4648n6809r5395k5577k3669
$$ 9830721 9791662 9868436 9886017 9961664 9913772 9866456 9891104 9834295 9738900 9713323 9689654
5761I689654j14655j88767N1981n2769n0114n3197n378j6145m038N6971m1995
$$ 9689654 9574999 9386232 9438213 9385444 9335330 9282133 9276755 9260610 9256572 9313543 9271548
5750I271548j09840P1321R6428Q978L171P6199R4593K6680J5863J06190Q2835
$$ 9271548 9161708 9233029 9329457 9338435 9341606 9417805 9512398 9539078 9554941 9661131 9743966
5739I743966l0127J84602J12604J02789M0770R0468J36661J27428R9191R2133
$$ 9743966 9713839 9898441 10011045 10113834 10154604 10245072 10381733 10509161 10608352 10700485
5729A0700485Q6116Q3424L03582J56386J26162J24350J46501K44022J71979K70443
$$ 10700485 10786601 10870025 11173607 11329993 11456155 11580505 11727006 11971028 12143007 12413450
5719A2413450J48024K21328L29523J96942J60282L23428K62124J25741K36955
$$ 12413450 12561474 12782802 13112325 13309267 13469549 13792977 14055101 14180842 14417797
5710A4417797K62166K89261J56226J84563K19588L53901K91060J95182K74602
$$ 14417797 14679963 14969224 15125450 15310013 15529601 15883502 16174562 16369744 16644346
5701A6644346K57171J76557K96257J99967K22365L78865K06740J80385K82102
$$ 16644346 16901517 17078074 17374331 17574298 17796663 18175528 18382268 18562653 18844755
5692A8844755L02269K29535K43365K12655K85010K36501K73854L06652L61608
$$ 18844755 19147024 19376559 19619924 19832579 20117589 20354090 20627944 20934596 21296204
5683B1296204L44077L46911K91121M38053N57081N43674M80237O07694O65893
$$ 21296204 21640281 21987192 22278313 22716366 23273447 23817121 24297358 24905052 25570945
5674B5570945O79233Q00631P02633R17764Q21229Q00039P70706Q65405P80760
$$ 25570945 26250178 27050809 27753442 28671206 29492435 30292474 31063180 31928585 32709345
5665C2709345Q18973Q25000R66845J136547J187573J305488J506312J461732J714785
$$ 32709345 33528318 34353318 35320163 36456710 37644283 38949771 40456083 41917815 43632600
5656D3632600J879199K047217K325306K272284K697198K916854L119229L562351
$$ 43632600 45511799 47559016 49884322 52156606 54853804 57770658 60889887 64452238
5648F4452238M020037M463619M958376N559272O072432O099701N245672L717403
$$ 64452238 68472275 72935894 77894270 83453542 89525974 95625675 100871347 104588750
5640A04588750K023981K9208j706521k687948k422202j931676r04147j06238Q48208
$$ 104588750 106612731 106641939 104935418 102247470 99825268 97893592 96989445 96883207 97731415
5631I7731415J857709K958183M238086N579120P301505Q916944R406302Q106773
$$ 97731415 99589124 102547307 106785393 112364513 119666018 128582962 137989264 146096037
5623A46096037N421827J911973k122154n945427q370967q991584q245170o912535
$$ 146096037 151517864 153429837 151307683 145362256 136991289 127999705 119754535 112842000
5615A12842000n550539m434042l219280k305024j211930l02040N66388J298807
$$ 112842000 107291461 102857419 99638139 97333115 96121185 95819145 96385533 97684340
5607I7684340J992686K099766J375980M50829j043970k494009l593450m407181
$$ 97684340 99677026 101776792 103152772 103603601 102559631 100065622 96472172 92064991
5599I2064991m477897l978226l418740k827679k365719k161958j686810j402723
$$ 92064991 87587094 83608868 80190128 77362449 74996730 72834772 71147962 69745239
5591F9745239j182675j058001o96382o67145m85757l01936k21293r4678M8647
$$ 69745239 68562564 67504563 66808181 66141036 65655279 65353343 65132050 65037372 65086019
5582F5086019J62424L19538M18959O18545P28907R43975R90153J240147J340475
$$ 65086019 65248443 65567981 65986940 66605485 67334392 68278367 69268520 70508667 71849142
5573G1849142J552948J646294J369917J422125J499216J386932J524132J588753
$$ 71849142 73402090 75048384 76418301 77840426 79339642 80726574 82250706 83839459
5565H3839459J881720K184126K422480K665924K994872L401559L744127M271626
$$ 83839459 85721179 87905305 90327785 92993709 95988581 99390140 103134267 107405893
5557A07405893M781038N486203O176706P190450Q291955R511493J0947370J2517504
$$ 107405893 112186931 117673134 123849840 131040290 139332245 148843738 159791108 172308612
5549A72308612J3896326J4632997J5225188J5309329J4441193J3102322J0342087
$$ 172308612 186204938 200837935 216063123 231372452 245813645 258915967 269258054
5542B69258054P232307M045384L36919l161959n877675q072192r317090j0219207
$$ 269258054 276490361 280535745 280872664 277710705 271833030 263760838 254443748 244224541
5534B44224541j0930633j0860540r869453q601092o537340m495278k022075N80138
$$ 244224541 233293908 222433368 212563915 203962823 197425483 192930205 190908130 191488268
5526A91488268K754244K897241J346905o9828k074556m211341n240014m480304
$$ 191488268 194242512 197139753 198486658 198416830 196342274 192130933 186890919 182410615
5518A82410615k449566m85710J54533L27022O44866N69511O38921J396821J887973
$$ 182410615 179961049 179475339 179629872 179956894 180601760 181171271 181810192 183207013 185094986
5509A85094986J320857P32794j80829j120686j879912k706312l173045l263607
$$ 185094986 186415843 187148637 186967808 185847122 183967210 181260898 178087853 174824246
5501A74824246l977080m763013m850289l451736j573170l16356l15131j447183
$$ 174824246 170847166 166084153 161233864 157782128 156208958 155892602 155577471 154130288
5493A54130288k676392m246680o017358o970359o328334n058885l633133k797962
$$ 154130288 151453896 147207216 141189858 134219499 127891165 122832280 119199147 116401185
5485A16401185k503260k700212l113026m011275m632575m952621m970926m526479
$$ 116401185 113897925 111197713 108084687 104073412 99440837 94488216 89517290 84990811
5477H4990811m055778l488331l058484k692507k444889k199570j877961j465935
$$ 84990811 80935033 77446702 74388218 71695711 69250822 67051252 65173291 63707356
5469F3707356j392141j054082q32882r42901j046852j125796j392458j894053
$$ 63707356 62315215 61261133 60428251 59485350 58438498 57312702 55920244 54026191
5461E4026191k048001k170045k166825k165572j992972j861316j733490j522290
$$ 54026191 51978190 49808145 47641320 45475748 43482776 41621460 39887970 38365680
5453C8365680j620785j367897j104900r94379r98044r98472q79199p01254p07661
$$ 38365680 36744895 35376998 34272098 33277719 32279675 31281203 30402004 29700750 28993089
5444B8993089p37875p70164n95795o51135o06564n41541o41363m76136l39560
$$ 28993089 28255214 27485050 26889255 26238120 25631556 25090015 24448652 23972516 23632956
5435B3632956m34957l51692k89767l28219l11493p4592n7136j57907k80650m45229
$$ 23632956 23197999 22846307 22556540 22228321 21916828 21842236 21785100 21627193 21346543 20901314
5425B0901314l90366m73237m75382n55289n47031m86414l84562m40841l63220
$$ 20901314 20510948 20037711 19562329 19007040 18460009 17973595 17589033 17148192 16784972
5416A6784972k48609l04718l16747k25514j69851j75473k14450n0925l03650j63799
$$ 16784972 16536363 16231645 15914898 15689384 15519533 15344060 15129610 15078685 14775035 14611236
5406A4611236K4663p5831k90039p6115L4459l8640j76664N388n2216m4879j14535
$$ 14611236 14635899 14560068 14270029 14193914 14228373 14189733 14013069 14018457 13966241 13921362 13806827
5395A3806827p7116k2491j2607O1645j17939L610k4587m98J47548K30422J41078
$$ 13806827 13729711 13707220 13694613 13756258 13638319 13641929 13617342 13616844 13764392 13994814 14135892
5384A4135892K02143K17981J78551L02042J91257L19827J49282J0500p6006n5622
$$ 14135892 14338035 14556016 14734567 15036609 15227866 15547693 15696975 15707475 15631469 15575847
5374A5575847n2338j96389j14650j3033j37897l1011J17122J90715K05742L86758
$$ 15575847 15523509 15327120 15212470 15199437 15061540 15030529 15147651 15338366 15544108 15930866
5364A5930866L10559L41045L40209L13336M24529L53989K26075L09997L65252
$$ 15930866 16241425 16582470 16922679 17236015 17660544 18014533 18240608 18550605 18915857
5355A8915857N31989N60243R33302J415435K038254K856706M397467L121357J129193
$$ 18915857 19447846 20008089 20941391 22356826 24395080 27251786 31649253 34770610 35899803
5346C5899803R11143o69217k568507l657511l870539l087260k316009j792172
$$ 35899803 36810946 36141729 33573222 29915711 26045172 22957912 20641903 18849731
5338A8849731j383166j234491j028828q67097p00768n91131m89602n03201k34908
$$ 18849731 17466565 16232074 15203246 14336149 13635381 13044250 12554648 12051447 11816539
5329A1816539m10421k75509m20095j30209k11785j59018j55570j51852j44682
$$ 11816539 11406118 11130609 10710514 10580305 10368520 10209502 10053932 9902080 9757398
5320I757398j26542j30608j28367q6585k02047o2463l9289j30636j3412J5138
$$ 9757398 9630856 9500248 9371881 9285296 9083249 9020786 8981497 8850861 8837449 8852587
5310H852587m3411k71812r1242k0378j03564j30962j43762j14337j47327j23793
$$ 8852587 8809176 8537364 8446122 8425744 8322180 8191218 8047456 7933119 7785792 7661999
5300G661999l5165k7425o4209j86291j66714j2473j30860j42823N4206L2825J34206
$$ 7661999 7626834 7599409 7535200 7348909 7182195 7169722 7038862 6896039 6950245 6983070 7117276
5289G117276l5538j5921o1672m4201L754Q9915l5515K4213k1077R8848k5369n0827
$$ 7117276 7081738 7065817 7004145 6959944 6963698 7053613 7018098 7042311 7021234 7120082 7094713 7043886
5277G043886L8809K8639l3385J16999p1979M1025J7698R864K5138N0159l9936
$$ 7043886 7082695 7111334 7077949 7194948 7122969 7163994 7181692 7191556 7216694 7266853 7226917
5266G226917k1941j16460K6132K475N421O977o7298J26964R1166l7K7209J47250
$$ 7226917 7204976 7088516 7114648 7117123 7122544 7129521 7062223 7189187 7280353 7280316 7307525 7454775
5254G454775j09055J09084J61374J7178R3963J76119K25305K39039K27899J17516
$$ 7454775 7345720 7454804 7616178 7633356 7727319 7903438 8128743 8367782 8595681 8713197
5244H713197K1541o9054k84131k52169k66500j59701j19881q8083k75723p3901
$$ 8713197 8734738 8665684 8381553 8129384 7862884 7703183 7583302 7495219 7219496 7145595
5234G145595L377o141j77994J15435j02191M0112P240m790O1262p858m332p0188
$$ 7145595 7148972 7142831 6964837 7080272 6978081 7018193 7025433 7020643 7081905 7074047 7069715 6999527
5222F999527J19378Q4503N2529J17118n3265n2971J47104J01669J00840J20978
$$ 6999527 7118905 7203408 7255937 7373055 7319790 7266819 7413923 7515592 7616432 7737410
5212G737410L4908J31069J87427J34317Q7396J25735M0374Q5742R1054J87910
$$ 7737410 7772318 7903387 8090814 8225131 8312527 8438262 8478636 8564378 8655432 8843342
5202H843342j07592M7366k5308M6381J08039R0844j7729J11712O4249J45682l8449
$$ 8843342 8735750 8783116 8757808 8804189 8912228 9003072 8985343 9097055 9161304 9306986 9268537
5191I268537J11153J88623R4819K40289J59638J69627L0110J86217K50397K64271
$$ 9268537 9379690 9568313 9663132 9903421 10063059 10232686 10262796 10449013 10699410 10963681
5181A0963681J71242K40545J86053J37901K50600J32517J92544J17274K54684
$$ 10963681 11134923 11375468 11561521 11699422 11950022 12082539 12275083 12392357 12647041
5172A2647041J47265P2347L47525J81761L28995L39059K93140L62606N17215M54665
$$ 12647041 12794306 12866653 13214178 13395939 13724934 14063993 14357133 14719739 15236954 15691619
5162A5691619N64858P19911P35118N33941O35603P23244O50537L62856M27747
$$ 15691619 16256477 16976388 17711506 18245447 18881050 19604294 20254831 20617687 21045434
5153B1045434O5541o5716q1106k92516k49328m30015m50569l66999l30646k86034
$$ 21045434 21110975 21045259 20964153 20671637 20422309 19992294 19541725 19174726 18844080 18558046
5143A8558046k92231j97573j73560j07386K5301j2007R3446M151J32991J46838
$$ 18558046 18265815 18068242 17894682 17787296 17812597 17800590 17894036 17898187 18031178 18178016
5133A8178016J84808J44687J37633J55221K57744K28463K54651J13393K46360
$$ 18178016 18362824 18507511 18645144 18800365 19058109 19286572 19541223 19654616 19900976
5124A9900976K59546O1516K14305K40563K17302K42735K11004K94299K50399K12372
$$ 19900976 20160522 20222038 20436343 20676906 20894208 21136943 21347947 21642246 21892645 22105017
5114B2105017K30100K24788K95874J84897L07184M48180L98923L82744N51096
$$ 22105017 22335117 22559905 22855779 23040676 23347860 23796040 24194963 24577707 25128803
5105B5128803N15900O84485M44423P07183Q17173O19257O17920P95358R25382
$$ 25128803 25644703 26329188 26773611 27480794 28297967 28917224 29535144 30330502 31255884
5096C1255884R03965R46567J023818J145165J192856J311536J420594J514789
$$ 31255884 32159849 33106416 34130234 35275399 36468255 37779791 39200385 40715174
5088D0715174J618458J725768J737377J656511J791919J651669J710513J935613
$$ 40715174 42333632 44059400 45796777 47453288 49245207 50896876 52607389 54543002
5080E4543002J872870K052113K137411K335476K302380K274685K437300K515688
$$ 54543002 56415872 58467985 60605396 62940872 65243252 67517937 69955237 72470925
5072G2470925K586145K574894K558406K770339K921830L208297L770310M117310
$$ 72470925 75057070 77631964 80190370 82960709 85882539 89090836 92861146 96978456
5064I6978456M597877N049024N497658N818970O151708O294948O359293O304570
$$ 96978456 101576333 106625357 112123015 117941985 124093693 130388641 136747934 143052504
5056A43052504O065330N526957N011369M811800M892941M803345N222217N659365
$$ 143052504 149117834 154644791 159656160 164467960 169360901 174164246 179386463 185045828
5048A85045828O116333O470659P066343P195422P131526O939993O657210O218763
$$ 185045828 191162161 197632820 204699163 211894585 219026111 225966104 232623314 238842077
5040B38842077N786902N093631M505734L318712J835303j0201j954809l833629
$$ 238842077 244628979 249722610 254228344 257547056 259382359 259372158 257417349 253583720
5032B53583720n455825o320775n743066m730112k819577n94435J782071K977564
$$ 253583720 248127895 241807120 236064054 231333942 228514365 227919930 229702001 232679565
5024B32679565L634820L215194K935416K307209K049787K399753L896949O534227
$$ 232679565 236314385 239529579 242464995 244772204 246821991 249221744 253118693 259652920
5016B59652920R916526J3919539K0338910K9905722M4474109N1736499L0749000
$$ 259652920 269569446 283488985 303827895 333733617 378207726 429944225 460693225
5009D60693225J3828537J310586k6206962m8880494n3039758m5056145l3060254
$$ 460693225 474521762 475832348 449625386 400744892 347705134 302648989 269588735
5002B69588735k5799778k1070023j7193669j3777774j1514121r700921q007602
$$ 269588735 243788957 222718934 205525265 191747491 180233370 170532449 162524847
4995A62524847o561697o061086n570818m432857l689305k922998k527383j915492
$$ 162524847 155963150 149902064 144331246 139898389 136209084 133286086 130758703 128843211
4987A28843211j502608j028600l42721M51597J157081K040209K472005K988038
$$ 128843211 127340603 126312003 125969282 126420879 127577960 129618169 132090174 135078212
4979A35078212L809619M575436M818768M803940M540746L801907K437482R27618
$$ 135078212 138887831 143463267 148282035 153085975 157626721 161428628 163866110 164793728
4971A64793728o96102k459799l880949m881374n847301o234871o451213o648339
$$ 164793728 164097626 161637827 157756878 152875504 147028203 140793332 134342119 127693780
4963A27693780o326996n724782n208888m550640l858731l323471k759188k225182
$$ 127693780 121366784 115642002 110433114 105882474 102023743 98700272 95941084 93715902
4955I3715902j650793p53126P9209P31749j41880j078099j959038l512942m856388
$$ 93715902 92065109 91311983 91391192 92122941 91981061 90902962 88943924 85430982 80574594
4946H0574594n017188m739247m051138l492091k994914k736542k415261k272611
$$ 80574594 75557406 70818159 66767021 63274930 60280016 57543474 55128213 52855602
4938E2855602j809335j814843j725197j472062j326079j261397j155043j002730
$$ 52855602 51046267 49231424 47506227 46034165 44708086 43446689 42291646 41288916
4930D1288916q64805r54857q14656q33178q34314o05196p00911o51201o31359
$$ 41288916 40424111 39469254 38654598 37821420 36987106 36381910 35680999 35029798 34398439
4921C4398439o16025o28300m72921m68389m81702m94370l21307l14411m82694
$$ 34398439 33782414 33154114 32681193 32212804 31731102 31236732 30915425 30601014 30118320
4912C0118320l28473l32633l48180k39810l27647k05430l73701k46678j53332
$$ 30118320 29789847 29457214 29109034 28869224 28541577 28336147 27962446 27715768 27562436
4903B7562436k42894k12364j16322j15049P9608m1465K010O5204J4644J81141
$$ 27562436 27319542 27107178 26990856 26875807 26955415 26913950 26915960 26981164 26995808 27176949
4893B7176949L47925O0107J50102K64746L41654L55175L56520M37338M71885O16680
$$ 27176949 27524874 27584981 27735083 27999829 28341483 28696658 29053178 29490516 29962401 30579081
4883C0579081O21534O65763P92090P66972P22850P39461P59370Q42762Q38176
$$ 30579081 31200615 31866378 32658468 33425440 34148290 34887751 35647121 36489883 37328059
4874C7328059R92349J125643J113904J081818J141490J134767J317498J258064
$$ 37328059 38320408 39446051 40559955 41641773 42783263 43918030 45235528 46493592
4866D6493592J401644J730907J980946J911016K100197K045838K033039K207641
$$ 46493592 47895236 49626143 51607089 53518105 55618302 57664140 59697179 61904820
4858F1904820K391562K417411K526435K645085K911316L155302L388850L857064
$$ 61904820 64296382 66713793 69240228 71885313 74796629 77951931 81340781 85197845
4850H5197845M291734M866683N496565O303292P378988Q466457R722311J1203858
$$ 85197845 89489579 94356262 99852827 106156119 113535107 122001564 131723875 142927733
4842A42927733J2693991J4711835J7210896K0438715K4632865K9745103L5534580
$$ 142927733 155621724 170333559 187544455 207983170 232616035 262361138 297895718
4835B97895718L9580337L6859746K7822600J6626356L216267j1666062k2661924
$$ 297895718 337476055 374335801 402158401 418784757 422001024 410334962 387673038
4828C87673038k7597312k7867832k7535124k7050936k5494322k2493171j8919774
$$ 387673038 360075726 332207894 304672770 277621834 252127512 229634341 210714567
4821B10714567j5695902j3021605j0832806q872335p748813o904530o264186n830174
$$ 210714567 195018665 181997060 171164254 162291919 154543106 147638576 141374390 135544216
4813A35544216n440186m942093m694531m497433m338020m243756m296401m401209
$$ 135544216 130104030 125161937 120467406 115969973 111631953 107388197 103091796 98690587
4805I8690587m434886m700206m660242m318261m143063l643591l391073l066856
$$ 98690587 94255701 89555495 84895253 80576992 76433929 72790338 69399265 66332409
4797F6332409k776000k636034k415462k374787k210551k001708k091393j930552
$$ 66332409 63556409 60920375 58504913 56130126 53919575 51917867 49826474 47895922
4789D7895922j750406j696814j595436j414084j376844j320062j301236j105182
$$ 47895922 46145516 44448702 42853266 41439182 40062338 38742276 37441040 36335858
4781C6335858j165484j051236r20545q54134q36270p56945o83378o26108o01127
$$ 36335858 35170374 34119138 33198593 32344459 31508189 30751244 30067866 29441758 28840631
4772B8840631l73771o13959o87636o92986p37243p53541p42020o13106n46266
$$ 28840631 28466860 27852901 27165265 26472279 25735036 24981495 24239475 23626369 23080103
4763B3080103m74237m31664k89269m49510l60796k75822m57700l45157j81566
$$ 23080103 22605866 22174202 21884933 21435423 21074627 20798805 20341105 19995948 19814382
4754A9814382k57249k11683j68829k69832k38927p5208j99644k03536k32324k97323
$$ 19814382 19557133 19345450 19176621 18906789 18667862 18592654 18393010 18189474 17957150 17659827
4744A7659827n7694N1489l2582k4059j57190l8633j49675o246j74720N5920l5682
$$ 17659827 17602133 17653622 17621040 17596981 17439791 17401158 17251483 17245237 17070517 17126437 17090755
4733A7090755j57175k95508j44431k0654j95492L5865j41403k63603j08699j98189
$$ 17090755 16933580 16638072 16493641 16472987 16277495 16313360 16171957 15908354 15799655 15601466
4723A5601466k14821l96767l88137l45093l63389k85981k22109k80864j10069
$$ 15601466 15386645 14989878 14601741 14256648 13893259 13607278 13385169 13104305 12994236
4714A2994236j63282k66264k03620p169j10494k44664k3880j99488k28216j04886
$$ 12994236 12830954 12564690 12361070 12353901 12243407 11998743 11974863 11775375 11547159 11442273
4704A1442273o2684j37571j90976q0863k55362k91856q154j20965k25321o9208
$$ 11442273 11379589 11242018 11051042 10970179 10714817 10422961 10414807 10293842 10068521 9999313
4694I999313m8854j41538j27424j29421j13355j0344j50501r4506K9073j59950
$$ 9999313 9950459 9808921 9681497 9552076 9438721 9428377 9277876 9183370 9212443 9052493
4684I052493M769n3223r1686j942q3030j42828r8715j93485l6516n512m7368j4544
$$ 9052493 9057262 9004039 8912353 8910411 8827381 8684553 8585838 8392353 8355837 8350325 8302957 8288413
4672H288413M3641M3734J06295R1684R6660K05710K13558L65901L62878M61134
$$ 8288413 8332054 8375788 8482083 8573767 8670427 8876137 9089695 9455596 9818474 10279608
4662A0279608N72680M74193L45501n0304k27624m11773o62658o12827n28544m24387
$$ 10279608 10852288 11326481 11671982 11621678 11394054 10982281 10319623 9706796 9178252 8753865
4652H753865k25617l19208k36311o4950j74654j68586j07113q6829J96J2671N3523
$$ 8753865 8528248 8209040 7972729 7907779 7733125 7564539 7457426 7370597 7370793 7383464 7436987
4641G436987J2928K2847P1439o3164J9953q0942o8072j08343j31413j60618p9222
$$ 7436987 7449915 7472762 7544201 7481037 7500990 7420048 7351976 7243633 7112220 6951602 6872380
4630F872380p7767j34718l6182j25578N038R3151l5729m0052J27179q9940j8276
$$ 6872380 6794613 6659895 6623713 6498135 6503173 6596324 6560595 6520543 6647722 6557782 6539506
4619F539506M8617L7197J12881p466o170J93874Q5333N4485Q6456J57150K27517
$$ 6539506 6588123 6625320 6738201 6730735 6724565 6918439 7003772 7058257 7144713 7301863 7529380
4608G529380K21227K31761L8704J16578J01120P2052l5334n8243L6061j39969
$$ 7529380 7750607 7982368 8021072 8137650 8238770 8310822 8275488 8217245 8253306 8113337
4598H113337j60959l8855j35696n5230M8399l818L9758M2189M7083J504K466K46349
$$ 8113337 7952378 7913523 7777827 7722597 7770996 7767178 7806936 7849125 7896208 7897712 7900178 8146527
4586H146527K41667O9227K59634J27441L29649L52044N18935O16738N65540N33003
$$ 8146527 8388194 8457421 8717055 8844496 9174145 9526189 10045124 10661862 11227402 11760405
4576A1760405O40799N17096M69556L52886O4066k30107k85701m21603o02385m91604
$$ 11760405 12401204 12918300 13387856 13740742 13804808 13574701 13289000 12867397 12265012 11773408
4566A1773408n64104n54783m11108l93860l81314j30585k24989K7946q9988j48362
$$ 11773408 11209304 10654521 10243413 9849553 9468239 9337654 9112665 9140611 9050623 8902261
4556H902261o3421j94856q2639r8799l18137j59823j69558l28333k22133j56246
$$ 8902261 8838840 8643984 8561345 8462546 8144409 7984586 7815028 7486695 7264562 7108316
4546G108316k35109k36581k61210k98131j98388k03032q8053j44525j80344k2651
$$ 7108316 6873207 6636626 6375416 6077285 5878897 5675865 5587812 5443287 5262943 5240292
4536E240292p8033j55954r9011p6420j41998n4518k9293j2137n7256j16339j1424
$$ 5240292 5162259 5006305 4907294 4830874 4688876 4634358 4605065 4592928 4535672 4419333 4407909
4525D407909k7626j23716l5082r2842l8993o745j32076k2166l7568o7890K6280
$$ 4407909 4380283 4256567 4221485 4128643 4089650 4082905 3950829 3928663 3891095 3823205 3849485
4514C849485M995o3964k4519k5512q0189j09561j22377j40671k1652K8109q0Q6349
$$ 3849485 3854480 3790516 3765997 3740485 3660296 3550735 3428358 3287687 3266035 3294144 3294064 3380413
4502C380413j33205L6746q5670P3152K8603j04942q6385j9406r0420m854k969
$$ 3380413 3247208 3283954 3198284 3271436 3300039 3195097 3108712 3089306 2998886 2994032 2991063
4491B991063j3735K0545m6544k9586l7317r0515N9724K5510n4388Q685l6862J01795
$$ 2991063 2977328 2997873 2951329 2921743 2884426 2793911 2853635 2879145 2824757 2833442 2796580 2898375
4479B898375K2088n5222N4515o6550n6927K1457o6570K2619K6944K896p6862K264
$$ 2898375 2920463 2865241 2919756 2853206 2796279 2817736 2751166 2773785 2800729 2803625 2726763 2729027
4467B729027L8116r4636O369R5849j09421l1338M3142J2801m5154O8228N9695
$$ 2729027 2767143 2672507 2678876 2774725 2665304 2633966 2677108 2689909 2644755 2712983 2772678
4456B772678j34838N28Q0499N1994M8378j3844R1825l677O6109J5669Q029N1451
$$ 2772678 2637840 2638368 2718867 2770861 2819239 2805395 2897220 2893543 2959652 2975321 2983350 3034801
4444C034801r837l4166K1592j39576k4943r37p7704j40241j31624J9155k3162
$$ 3034801 3024964 2990798 3012390 2872814 2847871 2846934 2769230 2628989 2497365 2516520 2493358
4433B493358p1058j47577p6405j3294J3702j02745n933k5717K6837J42324k4280
$$ 2493358 2422300 2274723 2198318 2185024 2198726 2095981 2090048 2064331 2091168 2233492 2209212
4422B209212j17270q0542J5783l686j4261N3055J5140L5127m5166r7960J571p0114
$$ 2209212 2091942 2011400 2027183 2023497 2009236 2062291 2077431 2112558 2067392 1969432 1971003 1900889
4410A900889o5944O5654o9246j1341J8512n4766l4711k6776Q8702r164n6682K3059
$$ 1900889 1834945 1900599 1831353 1820012 1838524 1783758 1749047 1722271 1810973 1801809 1745127 1768186
4398A768186J5221M5453l07R002M4962L1628n0285M2612l3806K5156J11272L8559
$$ 1768186 1783407 1828860 1828553 1837555 1882517 1914145 1863860 1906472 1872666 1897822 2009094 2047653
4386B047653R0750R7990J6086J3229J89440N8970O0866j28507p263R355l8902
$$ 2047653 2138403 2236393 2252479 2265708 2455148 2514118 2574984 2446477 2439214 2448569 2409667
4375B409667n4166K7307J74225J14795N768K7082K1451N0090R309K8284N036J06643
$$ 2409667 2355501 2382808 2557033 2671828 2677596 2704678 2726129 2776219 2785528 2813812 2818848 2925491
4363B925491J74253L2798J14025J86993P6414J120r8907j71420j57548j64974
$$ 2925491 3099744 3132542 3246567 3433560 3509974 3511094 3412187 3240767 3083219 2918245
4353B918245n7402j00909n3111J3490j40388K1889l4975l8809j15188r9816m5059
$$ 2918245 2860843 2759934 2706823 2720313 2579925 2601814 2566839 2528030 2412842 2313026 2267967
4342B267967p5786n1443J6454j19900O145M1227o2889j26519l7613n0709j30978
$$ 2267967 2192181 2140738 2157192 2037292 2043437 2084664 2021775 1895256 1857643 1806934 1675956
4331A675956l7918k41679o1363K6720Q1111n9231k8929j03620r3690r741j4778
$$ 1675956 1638038 1396359 1334996 1361716 1442827 1383596 1354667 1251047 1157357 1147616 1132838
4320A132838q1506n8180j1009k2353P8767p0314k6551K2936l3004M1412R327J6146
$$ 1132838 1051332 993152 982143 959790 1038557 968243 941692 964628 931624 973036 982363 998509
4308I98509k9247j44729N0151J5508N475m1792J259q2811Q4588J987m8757P8727
$$ 998509 969262 824533 874684 890192 895667 853875 855134 772323 856911 858898 810141 888868
4296H88868n1713K6020p7867N2916r5382L8582o3123J74j3866j10875j9635R362
$$ 888868 837155 863175 785308 838224 742842 781424 718301 718475 704609 593734 574099 583461
4284E83461q6263P4340K0110J32101l4249j6958k3378J04737l5558k0398k1108
$$ 583461 497198 571538 591648 723749 689500 672542 649164 753901 718343 697945 676837
4273F76837J670R296m0990J2620J8201L0140p6829J37863j06496r5024N1611n0698
$$ 676837 678507 687803 646813 659433 677634 707774 630945 768808 662312 567288 618899 568201
4261E68201L3596L2607K388n5822j6835j3630R4493L7602j05784p4525N0176N5399
$$ 568201 601797 634404 636792 580970 564135 550505 644998 682600 576816 502291 552467 607866
4249F07866l9179L9555k5309k5357l0075O2305Q7281j2105p6704n1030K5333Q2102
$$ 607866 568687 608242 582933 557576 527501 589806 677087 664982 588278 537248 562581 644683
4237F44683L3083N700j32578p106J0910M8250k9980r964m9842O5153M5869p2589
$$ 644683 677766 683466 550888 543782 554692 602942 572962 562998 513156 578309 624178 551589
4225E51589L2320m1231L4188R3096J4729o3332j33543K4739m950J35004P9510
$$ 551589 583909 542678 576866 669962 684691 621359 487816 512555 507605 642609 722119
4214G22119j3895p5491p1511P7349O1310q1646q6094K6160J01117P1257P917M7708
$$ 722119 708224 632733 561222 638571 699881 618235 532141 558301 659418 730675 738592 786300
4202G86300l2931m7875L2877m8393m8420P2180K3830n810P2581k2625p9830Q9748
$$ 786300 753369 705494 738371 689978 641558 713738 737568 731758 804339 781714 701884 791632
4190G91632O3479l6040n51N7631p1530J6853M2639K4220L5299P6709j9852L0912
$$ 791632 855111 819071 818520 876151 804621 821474 864113 888333 923632 1000341 980489 1011401
4178A011401Q981l9000k0141q6837J14513O3830K3827n5866p7764R0635j7818
$$ 1011401 1020382 981382 961241 874404 988917 1052747 1076574 1020708 942944 1033579 1015761
4167A015761P4018j17526L4993O1453r3870J31559M9361j6803r0455L6910K0662
$$ 1015761 1089779 972253 1007246 1068699 974829 1106388 1155749 1138946 1048491 1085401 1106063
4156A106063q1L7930o34j29520Q1759L3290K9501p0239L7809K0740j8814M1659
$$ 1106063 1105982 1143912 1143278 1013758 1095517 1128807 1158308 1088069 1125878 1146618 1127804 1169463
4144A169463m5514o8935R8921o6874j03153J70225m9737m3851L1584n7664j7057
$$ 1169463 1123949 1055014 1153935 1087061 983908 1154133 1104396 1060545 1092129 1034465 1017408
4133A017408p8089J55131q9392q0261O3960l3294J8148j9841J03790j0463p5216
$$ 1017408 939319 1094450 1005058 924797 988757 955463 973611 953770 1057560 1047097 971881
4122I71881j15864P1790k4609J39034j7821j99065N9589J1699k7568o3402M3324
$$ 971881 856017 927807 903198 1042232 1024411 825346 884935 896634 869066 805664 848988
4111H48988J7221m0142n7391K3571O6153l6949J5406o0136J0308o8032K7045k3755
$$ 848988 866209 826067 768676 792247 858400 821451 836857 776721 787029 718997 746042 722287
4099G22287L7382k6810j2804M4222j42514J9564Q1155J4150M4215P6114K0145
$$ 722287 759669 732859 720055 764277 621763 641327 722482 736632 780847 856961 877106
4088H77106J383n4626m3338N2502p7280n3248p5840J60961M3866j01347K6681
$$ 877106 878489 823863 780525 833027 755747 702499 626659 787620 831486 730139 756820
4077G56820o5415J12645q4749n4094p00N972Q8975L1359k9162O6767m87k9594
$$ 756820 691405 804050 719301 665207 664507 670479 759454 790813 761651 828418 827931 798337
4065G98337K3414M8572n4281R703J21334n3136M986l6827k9705O5793P2589j1819
$$ 798337 821751 870323 816042 825745 947079 893943 898929 862102 832397 898190 970779 958960
4053I58960O7148P2098J2430M5718M5568n512L691j1450P750p9607N5567J1873
$$ 958960 1026108 1098206 1110636 1156354 1201922 1196410 1200101 1188651 1196401 1116794 1172361 1184234
4041A184234l8232m474L0337O5853K9207m2853O5153J39595J7178J13686k7785
$$ 1184234 1146002 1141528 1171865 1237718 1266925 1224072 1289225 1428820 1445998 1559684 1531899
4030A531899j03392J56313K9915L25J35465L3366N5221J1572k4378J48008R2702
$$ 1531899 1428507 1584820 1614735 1615060 1750525 1783891 1839112 1850684 1826306 1974314 2067016
4019B067016O3433P829M336P0728k0372M8282K01049J5841n6834J32469k0446
$$ 2067016 2130449 2138278 2142614 2213342 2192970 2241252 2442301 2458142 2401308 2533777 2513331
4008B513331K14373K00189M4211N1633J03894J41542L231Q4526J64804J20914
$$ 2513331 2727704 2927893 2972104 3023737 3127631 3269173 3272404 3356930 3521734 3642648
3998C642648Q4004J33676R8123J04138J61390K03112J87390K50634J48028J45608
$$ 3642648 3726652 3860328 3958451 4062589 4223979 4427091 4614481 4865115 5013143 5158751
3988E158751J61016K18156J42131J61292L15296K60317K37825K95051K72001L70803
$$ 5158751 5319767 5537923 5680054 5841346 6156642 6416959 6654784 6949835 7221836 7592639
3978G592639M00258L86426M89533M82404O18089O37911O43747O49247P79554Q56955
$$ 7592639 7992897 8379323 8868856 9351260 9969349 10607260 11251007 11900254 12679808 13536763
3968A3536763Q13824P16909P53497N36900M24599K81393J28141p5864j17088k05569
$$ 13536763 14350587 15067496 15820993 16357893 16782492 17063885 17192026 17116162 16999074 16793505
3958A6793505k22226k45388j21885j87422j68534j64161k25486j78579J8622k36030
$$ 16793505 16571279 16325891 16204006 16016584 15848050 15683889 15458403 15279824 15298446 15062416
3948A5062416k64155l27582m87597n45417o27921p47116p91384p22442o55115
$$ 15062416 14798261 14470679 13983082 13437665 12809744 12062628 11271244 10548802 9893687
3939I893687n32522p31739m04459m16401n20735l74378k58468k20371j50015l50562
$$ 9893687 9361165 8629426 8224967 7808566 7287831 6913453 6654985 6434614 6284599 5934037
3929E934037k00180j27943p8052j40362k95324j44883l1696k27439p758l6965
$$ 5934037 5733857 5605914 5527862 5387500 5092176 4947293 4915597 4688158 4680400 4643435
3919D643435o6196L9742M4772m0141O5898R6972n814J51646J79216J76245K27008
$$ 4643435 4577239 4616981 4661753 4621612 4687510 4784482 4778668 4930314 5109530 5285775 5512783
3908E512783M43335L79607N34290P88871R78392R65249N63195K34226O8707o02442
$$ 5512783 5956118 6335725 6870015 7658886 8637278 9602527 10165722 10399948 10468655 9866213
3898I866213q79271r55561p36740m45538m09899j23964j29681j23621L8347K29999
$$ 9866213 8986942 8031381 7294641 6849103 6439204 6315240 6185559 6061938 6100285 6330284
3888F330284M2446K16787M11059L70473O60075P93098J055071J438897K096608
$$ 6330284 6372730 6589517 7000576 7371049 8031124 8824222 9879293 11318190 13414798
3879A3414798J720360P40751M35048k98181j414487j789947j801220j483756r53590
$$ 13414798 15135158 15875909 16310957 16012776 14598289 12808342 11007122 9523366 8569776
3870H569776r46454n98962m56663l48368k76331j58440j49973j32041K6475J12481
$$ 8569776 7623322 7024360 6567697 6219329 5942998 5784558 5634585 5502544 5529019 5641500
3860E641500J93374L11870L97392N74049P70551P16800L63477n7445k39584p32897
$$ 5641500 5834874 6146744 6544136 7118185 7888736 8605536 8969013 8911568 8671984 7939087
3850G939087r51638r78721p49929m88547n12460l37456l01248k46318j26065k75981
$$ 7939087 6987449 6008728 5258799 4770252 4257792 3920336 3619088 3372770 3246705 2970724
3840B970724j48480q9673j53811j88401n5931p4689j21058m9393j05817l3754
$$ 2970724 2822244 2732571 2578760 2390359 2334428 2259739 2138681 2089288 1983471 1949717
3830A949717r2715o8941o3898j15093Q6710O313j10431j50478j6435J4970j05047
$$ 1949717 1857002 1788061 1724163 1609070 1695780 1702093 1591662 1441184 1424749 1439719 1334672
3819A334672r381r1414N3024J0910o4725L6775j44032j8632k9260K6362j27119
$$ 1334672 1325291 1233877 1286901 1297811 1233086 1269861 1125829 1107197 1077937 1104299 977180
3808I77180k377o900l528J6434L7872L5529j1664O166o6896o2446K9364J37037
$$ 977180 974803 967903 964375 980809 1018681 1054210 1042546 1048712 981816 919370 948734 1085771
3796A085771j70283l119Q6271q9565p4256M1388j8684K9350q3740N9248m7644
$$ 1085771 915488 912369 998640 909075 834819 876207 857523 886873 803133 862381 814737
3785H14737p169O737K5694r5253K8494j00435P9588J78798m2484l1703M2581j0039
$$ 814737 807568 814305 839999 744746 773240 672805 752393 931191 888707 857004 899585 889546
3773H89546q1625N7471m6370O2357j39330j1917R7003L8845k0254J29285o3938
$$ 889546 807921 865392 819022 881379 742049 730132 827135 865980 845726 975011 911073
3762I11073L349J08433m5555j35490L8593R7753L5146L1565l6220K6600J7612
$$ 911073 914422 1022855 977300 841810 880403 978156 1013302 1044867 1008647 1035247 1052859
3751A052859p3310O7307J03583J2863l1623m3888P2094P1061J15298n4770J1473
$$ 1052859 979549 1046856 1150439 1163302 1131679 1087791 1159885 1230946 1346244 1291474 1302947
3740A302947K790J28920L7706j5193J40781J15860J12298J11364J03790K6701
$$ 1302947 1305737 1434657 1472363 1457170 1597951 1713811 1826109 1937473 2041263 2067964
3730B067964N5087N8299K3550n6409R2707R6166j05472R9358R4458o9586r435
$$ 2067964 2123051 2181350 2204900 2148491 2241198 2337364 2231892 2331250 2425708 2356122 2346687
3719B346687J74075N0876N2274O2626R4010J35535O1807J32765N2949K45785J15750
$$ 2346687 2520762 2571638 2623912 2686538 2780548 2916083 2977890 3110655 3163604 3409389 3525139
3708C525139p6939l4197m9886j86628j05236j77639o9873m0383j64098j19478
$$ 3525139 3448200 3414003 3364117 3177489 3072253 2894614 2824741 2784358 2620260 2500782
3698B500782N826k7674J4479M2187k9204j5307m3555L5944O3936n2102l0098O6551
$$ 2500782 2506608 2478934 2493413 2535600 2506396 2491089 2447534 2483478 2547414 2495312 2465214 2531765
3686B531765j01325L934r9075p7014r2968p4864o3484p0979j23850j18200M6041
$$ 2531765 2430440 2434374 2335299 2258285 2165317 2090453 2026969 1955990 1832140 1713940 1759981
3675A759981L0153k08988O750m5034J48r0752j17082L2980l8011j7903m8132j6394
$$ 1759981 1790134 1581146 1587896 1542862 1543010 1452258 1335176 1368156 1330145 1312242 1264110 1247716
3663A247716j07954q3173M1923m2253p5497l6564l6449M8952j01345q6829m3960
$$ 1247716 1139762 1056589 1098512 1056259 980762 944198 907749 956701 855356 768527 724567
3652G24567K4748o068o4635j8678O012j13390j6658K1393N4611m4545J3815m7398
$$ 724567 749315 743247 678612 659934 665946 552556 535898 557291 611902 567357 581172 533774
3640E33774o2039o3709J63214o7062o2466O6821o2618j1349j9991J41350j29541
$$ 533774 471735 408026 571240 504178 441712 508533 445915 434566 414575 555925 426384
3629D26384j69396R208j4979L3307m0584R7094n2739k2720N3086P8120k0424j1049
$$ 426384 256988 266196 251217 284524 243940 341034 288295 265575 318661 396781 376357 365308
3617C65308j27582j3408O0580j9761J2159P5576o907j14608O7781r0032R1594
$$ 365308 237726 224318 284898 265137 277296 352872 345965 231357 299138 209106 300700
3606C00700p8574j1717m92k7498n8771J90638l2092q5264p0197j5062j4071N3594
$$ 300700 222126 210409 209917 182419 123648 314286 282194 196930 126733 111671 97600 151194
3594A51194r1747L3858J38742r1222L3075J9099j04030k3105J06438O3502j22275
$$ 151194 59447 93305 232047 140825 173900 192999 88969 65864 172302 235804 113529
3583A13529P6459K1364j56748K1884N109J9571l971j232K004r0585M5681J14863
$$ 113529 189988 211352 54604 76488 81597 101168 97197 95965 97969 7384 53065 167928
3571A67928O7732o5665r4386P8220Q7781j8044p6497j04890M1235R4328l9675
$$ 167928 235660 169995 75609 153829 241610 223566 147069 42179 83414 177742 138067
3560A38067p3263q4101J08821p3183Q6635J3869K5863q9793L2555l5064J9792
$$ 138067 64804 -19297 89524 16341 102976 116845 142708 52915 85470 50406 70198
3549G0198K6368O0817k4458r1262n3886O9429M690k547j9347P0006j4583o6034
$$ 70198 96566 157383 132925 41663 -12223 57206 61896 59349 40002 110008 95425 29391
3537B9391J5066O7636O8308j41008k9577Q558M1113P8390K7282j8825q8156J6860
$$ 29391 44457 112093 180401 39393 9816 18374 59487 137877 165159 146334 58178 75038
3525G5038J0782j18672P4100R0543K1224l6292j11294K0444l5745P2046o3046
$$ 75038 85820 -32852 41248 131791 153015 116723 5429 25873 -9872 62174 -872
3514h72O3860R4204j10269L7482Q9732k8453j60132O7511q60N5823l1909N2441
$$ -872 62988 157192 46923 84405 174137 145684 -14448 53063 52203 108026 76117 128558
3502A28558l8422o6387n0707J0760n9824m4992J54675O390J1836m132P349k5301
$$ 128558 90136 23749 -26958 -16198 -76022 -121014 33661 40051 51887 47755 55104 29803
3490B9803L695J1958q7347M8199N381P6006k4564J04790j44224k7826R1321m3256
$$ 29803 33498 45456 -41891 6308 11689 87695 63131 167921 23697 -4129 87192 43936
3478D3936m9931k5038L4090J4048n9735O9795n9919P1655O7468m723o4222l8999
$$ 43936 -5995 -31033 3057 17105 -42630 27165 -32754 38901 106369 101646 37424 -1575
3466a575k9790M4406L2019o1353R6074L6950o7336r226j10905j8387O9241K7752
$$ -1575 -31365 13041 45060 -16293 79781 116731 49395 40169 -70736 -89123 -19882 7870
3454G870P5561m4436o1318Q2345j6438N1062j8168j07569N6817K9001k2181j9246
$$ 7870 83431 38995 -22323 60022 43584 94646 76478 -31091 25726 54727 32546 13300
3442A3300J5013p3999N9581J0626J9810J4324R1308j5089k5575l3424j15324J0533
$$ 13300 28313 -45686 13895 24521 44331 58655 149963 134874 109299 75875 -39449 -28916
3430b8916K8996j7422K4750O3824j03108L4803J20076j0885j2510k282P0236o6803
$$ -28916 80 -17342 7408 71232 -31876 2927 123003 112118 99608 97326 167562 100759
3418A00759r3980J3546j6907K9344M0020j8171l8772J4458K6681p6591M5515n2945
$$ 100759 6779 20325 3418 32762 72782 54611 15839 30297 56978 -19613 25902 -27043
3406b7043Q0423q5692K5987o3248j9036K2041K8930M5553K1394L036N0822k0728
$$ -27043 53380 -32312 -6325 -69573 -88609 -66568 -37638 7915 29309 32345 83167 62439
3394F2439p7334N4015K6426j20522M6357O3597j0094p8750j0054M3931L5152q3702
$$ 62439 -14895 39120 65546 -54976 -8619 54978 44884 -33866 -43920 11 35163 -48539
3382d8539P6277R9985j73735J825n5343R2048n2204Q1795N6359O3600r3810n8315
$$ -48539 27738 127723 -46012 -44187 -99530 -7482 -59686 22109 78468 142068 48258 -10057
3370a0057K1484J3301J2949j21112N3882J38369o305p8016K6100l4680k6786J4780
$$ -10057 11427 24728 37677 -83435 -29553 108816 102511 24495 50595 15915 -10871 3909
3358C909m8779J2433N8740k7880J8880L0835K4121r1304p228k5074K702J7654
$$ 3909 -44870 -32437 26303 -1577 17303 48138 72259 -19045 -26273 -51347 -48645 -30991
3346c0991q2873m4538J10870o8471Q5679L4240N0006r810n2582j2115p8653J56447
$$ -30991 -113864 -158402 -47532 -116003 -30324 3916 53922 44112 -8470 -20585 -99238 57209
3334E7209j9835M0185r6946k9499J9074K4889k8610n1Q4618j05025L3776m2392
$$ 57209 37374 77559 -19387 -48886 -29812 -4923 -33533 -33584 51034 -53991 -20215 -62607
3322f2607L6686q7776K4813O4735q0159J08935n6600M0819J01601J0412j3608
$$ -62607 -25921 -113697 -88884 -24149 -104308 4627 -51973 -11154 90447 100859 87251
3311H7251q7208L8313N2841p2748M3314J82q7800K9435N8746k7590l0459K9977
$$ 87251 43 38356 91197 18449 61763 61945 -25855 3580 62326 34736 4277 34254
3299C4254k7361m1458K5059j47818J19762O1887O513O2231l8052m276j17026N3073
$$ 34254 6893 -34565 -9506 -157324 -37562 24325 30838 93069 55017 50741 -66285 -13212
3287a3212N5409r68N9426r8117j01585J35945O4013j40257J5743P618p0893l5713
$$ -13212 42197 41229 100655 2538 -99047 36898 100911 -39346 -23603 -15985 -86878 -122591
3275a22591K7159J20729j6111r2572O3344K1489l50r6618K6118q082K7143J9097
$$ -122591 -95432 25297 9186 -83386 -20042 1447 1097 -95521 -69403 -77485 -50342 -31245
3263c1245Q7714O346q0421K48O2861j10530M4237J21693j34696k5273m9541P9717
$$ -31245 56469 62815 -17606 -17358 45503 -65027 -20790 100903 -33793 -59066 -108607 -28890
3251b8890J5967L1508l3893O1697M7344r6065r1819R3944L808r3347q3475J09606
$$ -28890 -12923 18585 -15308 46389 93733 -2332 -94151 -207 3601 -89746 -173221 -63615
3239f3615J01166n0991L2221l3584M0813N1364k2833m6438K5727J4527L363L588
$$ -63615 37551 -13440 18781 -14803 26010 77374 54541 8103 33830 48357 51720 55308
3227E5308k3973m467K5984M0646j445m2881O7217m5721j0494N7310o2379k7729
$$ 55308 31335 26868 52852 93498 92053 49172 116389 70668 60174 117484 55105 27376
3215B7376L22j3865l976l7808O8276l457m1318k1265L5873K9849J44315j309j33720
$$ 27376 27698 13833 9857 -27951 40325 36868 -4450 -25715 10158 40007 184322 183013 49293
3202D9293j6594O3781k7319m5598p0465m076Q5434n0406r283Q1246m1802k9876
$$ 49293 32699 96480 69161 23563 -46902 -50978 34456 -15950 -25233 56013 14211 -15665
3190a5665l2351P1321J83316p3959n4237L6771q3723O4647J7789j6532L3543O0679
$$ -15665 -48016 23305 206621 132662 78425 115196 31473 96120 113909 97377 130920 191599
3178A91599q0842K059J00873l6045p6052l4398N3863J0346J4446N3929p060M5505
$$ 191599 110757 112816 213689 177644 101592 67194 121057 131403 145849 199778 192718 238223
3166B38223L7485n5301L6276m7477J14521k9475n4559P0161M1581N2776p706K3371
$$ 238223 275708 220407 256683 209206 323727 294252 239693 309854 351435 404211 396505 419876
3154D19876Q9856q9007j592N8416M7453J4716M2602j083k05R1451J94423m1991
$$ 419876 509732 420725 419133 477549 525002 539718 582320 581237 581032 672483 866906 824915
3142H24915O9585K1923L1016j8742M3879N7484J4234O5509l2120o164K78859L2067
$$ 824915 894500 916423 947439 928697 972576 1030060 1044294 1109803 1077683 1071519 1350378 1382445
3130A382445L6999M7330K21958K18119J06433J36605K52353L35304R6738M51417
$$ 1382445 1419444 1466774 1688732 1906851 2013284 2149889 2402242 2737546 2834284 3285701
3120C285701L63457L53778N12233Q18907J141022J589727J739671Q95123M02102
$$ 3285701 3649158 4002936 4515169 5334076 6475098 8064825 9804496 10699619 11101721
3111A1101721j80719j267543j831128j586695r37622q57148n63924m73424l95740
$$ 11101721 10921002 9653459 7822331 6235636 5298014 4440866 3876942 3403518 3007778
3102C007778k16836l08842j91980k15431q0908k69717j24243o2093j84711o4171
$$ 3007778 2790942 2482100 2290120 2074689 1993781 1724064 1599821 1537728 1353017 1288846
3092A288846p6941j11156k682r057j68833j02771R753l5956o7929j6030j51040
$$ 1288846 1211905 1100749 1098067 1089010 920177 817406 827159 791203 723274 707244 556204
3081E56204P1721L6309o113r1912K4962L2869j10394J7728l193j52193L2969J1348
$$ 556204 627925 664234 658121 566209 591171 624040 513646 531374 528181 375988 408957 420305
3069D20305m0271K695j8346Q027J2887q4605k9355N1587m6069l9178R7318j09334
$$ 420305 380034 382729 364383 372410 385297 300692 271337 322924 276855 237677 334995 225661
3057B25661L1540L5715r672p344K0122J796q3837N3557j45683P2638L8274o872
$$ 225661 257201 292916 283244 275900 296022 297818 213981 267538 121855 194493 232767 225895
3045B25895R4475m2719Q199j07129l4196l1668K3946M0855J237p9031q009N3645
$$ 225895 320370 277651 285850 178721 144525 112857 136803 177658 178895 99864 91855 145500
3033A45500k5775N206O6139r8269p6618Q6857N008J7488j19830R2627k2727o4001
$$ 145500 119725 124931 191070 92801 16183 103040 108048 125536 5706 98333 75606 11605
3021A1605l0086J77117m2858j12671k9230N0022K459k3695j359N3677n1419N7413
$$ 11605 -18481 158636 115778 3107 -26123 23899 26358 2663 1304 54981 3562 60975
3009F0975M8800q2921O8730k734M2890j92822J8592N6732R9354q5108M2408M8121
$$ 60975 109775 26854 95584 92850 135740 -57082 -38490 18242 117596 32488 74896 123017
2997A23017r1478n1009l3029L9212L4878J00242j20781m1499M7275R4917k4510
$$ 123017 31539 -19470 -52499 -13287 21591 121833 1052 -40447 6828 101745 77235
2986G7235P8405l4979o1549K260q0249J8564p2119P1526M6394n1193Q2304m541
$$ 77235 155640 120661 59112 61372 -18877 -313 -72432 -906 45488 -5705 76599 72058
2974G2058m1588j01577P6414Q7494p6818j0787j6357M1238m0376N8554K4767j01691
$$ 72058 30470 -71107 5307 92801 15983 5196 -11161 30077 -10299 48255 73022 -28669
2962b8669j0344P3804l7422L0852j0972N9556r3715m0492K1979K1539l4878Q2004
$$ -28669 -39013 34791 -2631 28221 17249 76805 -16910 -57402 -35423 -13884 -48762 33242
2950C3242N8257m758j19989P1322n2271L776l521l7475k4856Q6920j8188o2461
$$ 33242 91499 86741 -33248 38074 -14197 -10421 -13942 -51417 -76273 10647 -7541 -70002
2938g0002m7809k8576J14540j835O1757p2486m508M222L2646L3353K2161o0568
$$ -70002 -117811 -146387 -31847 -33682 28075 -44411 -48919 -44697 -12051 21302 43463 -17105
2926a7105P289P065j3279K1666l8153m992o898n0673N6757j6807J66533q6620
$$ -17105 -9816 -2751 -16030 5636 -32517 -37509 -44407 -95080 -38323 -55130 111403 24783
2914B4783K7548P1509m9440o1819n012N5646r7051N6283M7046k0685j3672J117
$$ 24783 52331 123840 74400 12581 7569 63215 -33836 22447 69493 48808 35136 36253
2902C6253k8447J0362j213n72q252o0542K6818L9224p6618l1669M8013k5385N7868
$$ 36253 7806 18168 16955 16383 8131 -52411 -25593 13631 -62987 -94656 -46643 -72028 -14160
2889a4160J04171P849j92283Q1092o434j81j11014J8764J88882J5886j17956O9545
$$ -14160 90011 97860 -94423 -13331 -19765 -19946 -130960 -112196 76686 92572 -25384 44161
2877D4161q8452o061M979J0839p6192N6109L7852o068K7791j8L9064q1676Q8814
$$ 44161 -44291 -50352 -45373 -34534 -110726 -54617 -16765 -22833 4958 4940 44004 -37672 51142
2864E1142n2496k0179K1030j9916j29535L4703J56796m4669r6656n498P9803N4303
$$ 51142 -1354 -21533 -503 -20419 -149954 -115251 41545 -3124 -99780 -105278 -25475 28828
2852B8828l7773j5606q0890J33845k991j5726O2642o9772j4393L5237j13863q828
$$ 28828 -8945 -24551 -105441 28404 25413 9687 72329 2557 -11836 23401 -90462 -99290
2840i9290Q1806M5737j04022N9065N242q5448L4406J0891R054O5101p3315k2013
$$ -99290 -17484 28253 -75769 -16704 -11462 -96910 -62504 -51613 -42559 22542 -50773 -72786
2828g2786O1502k4417K5993r313Q4592n9069l7846M2653J2051J0261r1443m4522
$$ -72786 -11284 -35701 -9708 -19021 65571 6502 -31344 11309 23360 33621 -57822 -102344
2816a02344J08235k0882M5212K8827l6175j5789m3487M451L2628j0269j8925m9483
$$ -102344 5891 -14991 30221 59048 22873 7084 -36403 -31952 676 -9593 -28518 -78001
2804g8001J5281N2281l2857P9908j08717M3939l2756n0420Q9720m192N4221J9284
$$ -78001 -62720 -10439 -43296 36612 -72105 -28166 -60922 -111342 -21622 -25814 28407 47691
2792D7691q7174m4454L8303l7853k4367k7429J31088l3785J1415R3762m1113j598
$$ 47691 -39483 -83937 -45634 -83487 -107854 -135283 -4195 -37980 -26565 67197 26084 24486
2780B4486n6829m1706R3998n9936p6247L2989R1496k0148p2574R4046K5441j18453
$$ 24486 -32343 -74049 19949 -39987 -116234 -83245 8251 -11897 -84471 9575 35016 -83437
2768h3437q22M7281Q6K8303j4727J4740n2271O381P4873l5296l3113j398N0229
$$ -83437 -84259 -36978 -36892 -8589 -23316 -8576 -60847 -54466 20407 -14889 -48002 -49400 829
2755H29m0954m2126K2748n4751N9138j02013L6226K8499J9929M9778l0988k5922
$$ 829 -40125 -82251 -59503 -114254 -55116 -157129 -120903 -92404 -72475 -22697 -53685 -79607
2743g9607J3201M7997l2106O2848j5264k4408k2234k1740o0840P7684%j3127k4238
$$ -79607 -66406 -18409 -50515 12333 -2931 -27339 -49573 -71313 -132153 -54469 -54469 -67596 -91834
2730i1834j6448L7030q0251J81436L6412m1095r5731n2277Q810N8349j26551J69561
$$ -91834 -108282 -71252 -151503 29933 66345 25250 -70481 -122758 -113948 -55599 -182150 -12589
2718a2589J4929q4578J11187N8639q1128j19103j0345K8726M404M4996q1221N2207
$$ -12589 2340 -82238 28949 87588 6460 -112643 -122988 -94262 -89858 -44862 -126083 -73876
2706g3876J01222j13367o3789J51012R7426j03123j33454R1827R0348l6299l5390
$$ -73876 27346 -86021 -149810 1202 98628 -4495 -137949 -46122 44226 7927 -27463
2695b7463K2794M2404j08908J67538m17j22665J12694K402j43247k0383J12170
$$ -27463 -4669 37735 -71173 96365 95948 -26717 85977 88379 -54868 -75251 36919
2684C6919j1750j35145R011M3421P8599m449k2570p0864m7485P4323N2130J03937
$$ 36919 25169 -109976 -100965 -57544 21055 16606 -5964 -76828 -124313 -49990 2140 106077
2672A06077j29762j09517M3357l545K7737j8629j4597K6455N8145l7162r1983
$$ 106077 -23685 -133202 -89845 -93390 -65653 -84282 -98879 -72424 -14279 -51441 -143424
2661a43424k1145J13562M4719J478m5845M817R6333M804l4943m3161J3206N4261
$$ -143424 -164569 -51007 -6288 -4810 -50655 -45838 50495 55299 20356 -22805 -9599 44662
2649D4662n0010Q4324q6709n6490L8785N7828l9223j11733R2859J8112j9062k6048
$$ 44662 -5348 78976 -7733 -64223 -25438 32390 -6833 -118566 -25707 -7595 -26657 -52705
2637e2705p5262K7439N739P4657j6553m4406p5818p576k190j30N7060J26238J2087
$$ -52705 -127967 -100528 -94789 -20132 -36685 -81091 -156909 -164485 -166675 -166805 -109745 16493 28580
2624B8580L8623q3224n7620l7931O6270P1098p0735M0502n523J5005r58M7231
$$ 28580 67203 -16021 -73641 -111572 -45302 25796 -44939 -4437 -9960 5045 4087 51318
2612E1318k3606j13852j7397J4007Q6457k1080l836r9468P400O1704j30896J51506
$$ 51318 27712 -86140 -103537 -89530 -3073 -24153 -27989 -127457 -120057 -58353 -189249 -37743
2600c7743j279j3476P5609K1627L815k9203K8238p9236n937J8438K8072k6337
$$ -37743 -39022 -52498 23111 44738 48553 19350 47588 -31648 -37585 -19147 8925 -17412
2588a7412l2549J2313l9076k4906L7800O0331J5001q1217N5315R1207m248l2294
$$ -17412 -49961 -37648 -76724 -101630 -63830 -3499 11502 -69715 -14400 76807 72559 40265
2576D0265j0144P8548p5862j06337O6061n5427L3309J01943o7390K3405k6332
$$ 40265 30121 108669 32807 -73530 -7469 -62896 -29587 72356 4966 28371 2039
2565B039J6829k995J5003n3662p4935N9025J8912l886k2296Q431N6879r8959j08965
$$ 2039 18868 15873 30876 -22786 -97721 -38696 -19784 -23670 -45966 -37535 19344 -79615 -188580
2552a88580Q5111O4129L2740l6264p091J31788q8189k8759N6788K4987k6880m8235
$$ -188580 -103469 -39340 -6600 -42864 -49955 81833 -6356 -35115 21673 46660 19780 -28455
2540b8455K7231J1269O6837j09812n4986N7899p8977K9675J12346n1444j222M4403
$$ -28455 -1224 10045 76882 -32930 -87916 -30017 -108994 -79319 33027 -18417 -19639 24764
2528B4764o1140O2353M0841m8808n9122m7500L8391Q2535n6462N4913r9078l9808
$$ 24764 -36376 25977 66818 18010 -41112 -88612 -50221 32314 -24148 30765 -68313 -108121
2516a08121J06859k8312k8879Q5524j9939o9267m1619J7562M2203r5166J07307
$$ -108121 -1262 -29574 -58453 27071 7132 -62135 -103754 -86192 -43989 -139155 -31848
2505c1848m1697o6177R7322n8995J07631k5675P4380l0851R430k5498m2444m254
$$ -31848 -73545 -139722 -42400 -101395 6236 -19439 54941 24090 33520 8022 -34422 -38676
2493c8676k5241O7491M822k9449l1988j6804N7802o8202K2305M3545K1418k2427
$$ -38676 -63917 3574 8396 -21053 -53041 -69845 -12043 -80245 -57940 -14395 7023 -15404
2481a5404m5640m2025K2032M7987Q8539l4587p6720K8470m416r5286J80650J9598
$$ -15404 -61044 -103069 -81037 -33050 55489 20902 -55818 -27348 -31764 -127050 53600 73198
2469G3198k10180J082O4036L771k889J7591Q108N2104M6743j6021r6501R8178
$$ 73198 -136982 -135900 -71864 -68093 -70982 -53391 -45283 6821 53564 37543 -58958 39220
2457C9220J1433L5996L8927p5430k9451M1606o5186r2107o4118J15827J17390
$$ 39220 50653 86649 125576 50146 20695 62301 -2885 -94992 -159110 -43283 74107
2446G4107n7252R5508n1317j8736j7037q3008O6654k8155j9084k8424O0421M2144
$$ 74107 16855 112363 61046 42310 25273 -57735 8919 -19236 -38320 -66744 -6323 35821
2434C5821j1331j01914R2198m890j88274N6037Q4031j8985K6384q9704Q1515K7453
$$ 35821 24490 -77424 14774 9884 -178390 -122353 -38322 -57307 -30923 -120627 -39112 -11659
2422a1659l8528j6130J9762M9131M0344q9728L5073N963J7473j6490j1379R9369
$$ -11659 -50187 -66317 -46555 2576 42920 -46808 -11735 -5772 11701 -4789 -16168 83201
2410H3201j6487p4461m809p391J9695m6509K0876P0599j08930K9551k3854J00226
$$ 83201 66714 -7747 -12556 -19947 -252 -46761 -25885 44714 -64216 -34665 -58519 41707
2398D1707p8927p8846M8398J4906M7985j09863Q7503M1469J2675j33672Q8826
$$ 41707 -37220 -116066 -67668 -52762 -4777 -114640 -27137 14332 27007 -106665 -17839
2387a7839P5066j05280M7333K2011j46120m9518P1381P6476j4530K9149l737q1953
$$ -17839 57227 -48053 -720 21291 -124829 -174347 -102966 -26490 -41020 -11871 -15608 -97561
2375i7561N884J8494K7646j000L4664J7920p4134J18456p0738L8130J8544j57228
$$ -97561 -91677 -73183 -45537 -46537 -11873 6047 -68087 50369 -20369 17761 36305 -120923
2363a20923k2268N8176K9059K0521J3474j06698J455R2738j2509m343m2891N4752
$$ -120923 -143191 -85015 -55956 -35435 -21961 -128659 -127204 -34466 -46975 -51318 -94209 -39457
2351c9457l8081n8082M5165J5007J11383j33458J12183K0695K4274j43162j1611
$$ -39457 -77538 -135620 -90455 -75448 35935 -97523 14660 35355 59629 -83533 -95144
2340i5144J05510r9940m1686R3666j00637J29890M4688l2678L6071m6939K9302
$$ -95144 10366 -89574 -131260 -37594 -138231 -8341 36347 3669 39740 -7199 22103
2329B2103K2272k51l2297K8537r2899K3562J10183l7538r4662L1553j4697O924
$$ 22103 44375 44124 11827 40364 -52535 -28973 81210 43672 -50990 -19437 -34134 -27210
2317b7210o4273M4752J15224l2081j15178O3941j6280O9012j4246n6626M6205
$$ -27210 -91483 -46731 68493 36412 -78766 -14825 -31105 37907 23661 -32965 13240
2306A3240l6411N5961q027k0653J1684O0229j0741o1383k4324K4965k5476j912
$$ 13240 -23171 32790 24763 4110 15794 76023 65282 3899 -20425 4540 -20936 -22848
2294b2848Q10k6115j1335n2113M6466M0107J710n1404M4876M797K5016L3340o8398
$$ -22848 -22038 -48153 -59488 -111601 -65135 -25028 -23318 -74722 -29846 -25049 -33 33307 -35091
2281c5091R8370j73376P0381M9463k1493o525L4434Q12m7155m1037m200J6334
$$ -35091 63279 -110097 -39716 9747 -11746 -18271 16163 16975 -30180 -71217 -75417 -59083
2269e9083J04829j63382n1416K0351J70335m1379L1008j01264j03960R2314P284
$$ -59083 45746 -117636 -169052 -148701 21634 -19745 11263 -90001 -193961 -101647 -94363
2258i4363Q0195J8898K7649p7328Q6841j17970q659Q5507R556K3538K8314p1713
$$ -94363 -14168 4730 32379 -44949 41892 -76078 -84737 770 10326 33864 62178 -9535
2246i535J9385L8047j0375q5534o7810J33829K8731j56462M7428l6530r613R1048
$$ -9535 9850 47897 37522 -48012 -115822 18007 46738 -109724 -62296 -98826 -108439 -17391
2234a7391k9028l3369J3129J27133o4477l8020J068l1895K2516L9905R3802q2884
$$ -17391 -46419 -79788 -66659 60474 -4003 -42023 -40955 -72850 -50334 -10429 83373 489
2222D89j42174O7703l8839K9062J30452o981l4180o460L3814R4068m3468j49833
$$ 489 -141685 -73982 -112821 -83759 46693 39712 5532 -928 32886 126954 83486 -66347
2210f6347O6211J5996J1978N2622j5502n4014j15713m552M6499j9069N5234K3002
$$ -66347 -136 15860 27838 80460 64958 10944 -104769 -109321 -62822 -81891 -26657 -3655
2198c655J38725r5679p2910k6581k3172J24454O1073j93227K8834J6507K7892
$$ -3655 135070 39391 -33519 -60100 -83272 41182 102255 -90972 -62138 -45631 -17739
2187a7739j6862N145J1433j71557J1529J23569M2064k4968o6245M277N3708j23045
$$ -17739 -34601 -29456 -18023 -189580 -178051 -54482 -12418 -37386 -103631 -99354 -45646 -168691
2175a68691N2372M5573K1178Q8909J6102Q285l406l8911Q6020m5876q352l955
$$ -168691 -116319 -70746 -49568 39341 55443 63728 60322 21411 107431 61555 53203 49248
2163D9248n8888j11287M3876J32566j00510N1567k8496N3160l664q4366M162L3434
$$ 49248 -9640 -120927 -77051 55515 -44995 6572 -21924 31236 27572 -56794 -52632 -19198
2151a9198n6754j6910J07292N610p10L2588n4814J2795k3395p8717J2686J1200
$$ -19198 -75952 -92862 14430 20040 19330 51918 -2896 9899 -13496 -92213 -79527 -68327
2139f8327M3220O0240m763o5436K39l8917K4695l6967o531M5218j13312M3668
$$ -68327 -25107 35133 30370 -35066 -34827 -73744 -49049 -86016 -92547 -47329 -160641 -116973
2127a16973l0429Q9935N5272l3235l3014n4145L9736Q74Q1169J23005o8479j34765
$$ -116973 -147402 -57467 -2195 -35430 -68444 -122589 -82853 -81979 -810 122195 53716 -81049
2115h1049o6443R1639N8098J4401l9072n5452N2692n0272Q0666q485N3025k0305
$$ -81049 -147492 -55853 2245 16646 -22426 -77878 -25186 -75458 5208 -3277 49748 29443
2103B9443J9800n0580L2821l8725K3513m3763j5007j3146K0442Q8334j29637P7423
$$ 29443 49243 -1337 31484 -7241 16272 -27491 -42498 -55644 -35202 53132 -76505 918
2091I18Q9770o0490p328N6670j62709L4377K3618k0920O285N9291j73952R1945
$$ 918 90688 30198 22870 79540 -83169 -48792 -25174 -46094 -39809 19482 -154470 -62525
2079f2525M7761J2612N7865k7785n7318j33896O2611N3997j1060M4897M9660p831
$$ -62525 -14764 -2152 55713 27928 -29390 -163286 -100675 -46678 -57738 -12841 36819 28988
2067B8988m1896J1256p3162p2735L0000N0919j5188m7009J31609o636n0380k5858
$$ 28988 -12908 -1652 -74814 -147549 -117549 -66630 -81818 -128827 2782 -3854 -54234 -80092
2055h0092M7998j2946j01774K9401R9039R610p5845m2675Q538J22043L8840k8933
$$ -80092 -32094 -45040 -146814 -117413 -18374 -8764 -84609 -127284 -118746 3297 42137 13204
2043A3204m7714l2714L4797J7575J5480p4742M3922n3222N8189R383O3605j7587
$$ 13204 -34510 -67224 -32427 -14852 628 -74114 -30192 -83414 -25225 -15842 47763 30176
2031C0176K3648n9269N6041p6648J07m5681K076Q9259j9861J1011P06J5836K6348
$$ 30176 53824 -5445 50596 -26052 -25945 -71626 -69550 19709 -152 10859 11565 27401 53749
2018E3749j8571o5256l8374l5055M7614R4121O4643j39123J19613M5434j52099
$$ 53749 35178 -30078 -68452 -103507 -55893 38228 102871 -36252 83361 128795 -23304
2007b3304L162q7969N2891K7892n1781K5119O6431M1765r243o7176j08193M5804
$$ -23304 -20142 -108111 -55220 -27328 -79109 -53990 12441 54206 44963 -22213 -130406 -84602
1995h4602L2390K3899r6351J23780j5834j1741M466L7461p6224l9293Q4101Q3140
$$ -84602 -52212 -28313 -124664 -884 -16718 -28459 -23993 13468 -62756 -102049 -17948 65192
1983F5192m8853p8036R505M315Q0750l4612P5629r905k0371p6395k4801P4488
$$ 65192 16339 -61697 -52192 -47877 32873 -1739 73890 63985 43614 -32781 -57582 16906
1971A6906j3614o9734J03643n6665p2413J3185L3258J78715l2819K3067j01536
$$ 16906 3292 -66442 37201 -19464 -91877 -78692 -45434 133281 100462 123529 21993
1960B1993q575m3325j60267J9369R8040J06444q2800Q9L9630m2804K4670L0447
$$ 21993 13418 -29907 -190174 -170805 -72765 33679 -49121 -49032 -9402 -52206 -27536 2911
1948B911R1490p5679j1694j02026K6022n8340Q6803k8774l4140M3594P3839J1475
$$ 2911 94401 18722 7028 -94998 -68976 -127316 -40513 -69287 -103427 -59833 14006 25481
1936B5481r8043n7268j6453J71542l777p180m3046l9853j29389J19438R9942j1657
$$ 25481 -72562 -129830 -146283 25259 21482 14302 -28744 -68597 -197986 -78548 21394 9737
1924I737O241j8404r9727Q7121p056l6031Q9887k3279n1099q907n3778O5131p874
$$ 9737 15978 -2426 -102153 -15032 -22088 -58119 31768 8489 -42610 -51517 -105295 -40164 -48038
1911d8038l5042R0095j3452l050K8177q069m8804j72977R9752J9993P4561j8316
$$ -48038 -83080 7015 -6437 -9487 18690 10621 -38183 -211160 -111408 -91415 -16854 -35170
1899c5170l6898k7487m1596L9342O1525O694O9069K350j2743m667K8592l4636
$$ -35170 -72068 -99555 -141151 -101809 -40284 -33590 35479 37829 25086 20419 49011 14375
1887A4375j11227J37162j01907j10989L9955J12132K3818L365n5725K4336r1554
$$ 14375 -96852 40310 -61597 -172586 -132631 -20499 3319 6684 -49041 -24705 -116259
1876a16259O128L1733O8166K7794j11644M6189j0918k1123J7728l3662j9732O3980
$$ -116259 -110131 -78398 -10232 17562 -94082 -47893 -58811 -79934 -62206 -95868 -115600 -51620
1864e1620m4587l6669L3255M2786J09436m4038k6111m3762m936J5583J35236n1778
$$ -51620 -96207 -132876 -99621 -56835 52601 8563 -17548 -61310 -66246 -50663 84573 32795
1852C2795q524p6865J1075O7391P2237r3153k9529O337M6709j9825j1990M3142
$$ 32795 24271 -52594 -41519 25872 98109 4956 -24573 -18236 28473 8648 -3342 39800
1840C9800l9178r5166Q1005M766N098r9539m4476L1834k4410J9191J06394l0322
$$ 39800 622 -94544 -13539 -8773 -3675 -103214 -147690 -115856 -140266 -121075 -14681 -45003
1828d5003j6208M1838L8495K0834j17529n7879j38159K2937J32676J76941q7743
$$ -45003 -61211 -19373 19122 39956 -77573 -135452 -273611 -250674 -117998 58943 -28800
1817b8800J6465N743P6537l0285j8781M9825J1994l3524K796o9346J372m6219
$$ -28800 -12335 -6592 69945 39660 20879 70704 82698 49174 51970 -17376 -16004 -62223
$$ [...]
##END NTUPLES=NMR SPECTRUM
##END=
