##TITLE=1H_EC-3333(VIII-2)
 CDCl3
 8 sc, 
 3.12.2024
##JCAMPDX= 6.0         $$ Bruker NMR JCAMP-DX V2.0
##DATA TYPE= NMR SPECTRUM
##DATA CLASS= NTUPLES
##ORIGIN= UXNMR, Bruker Analytische Messtechnik GmbH
##OWNER= root
$$ XWIN-NMR		Version 3.5
$$ Tue Dec  3 14:18:24 2024 Russian Standard Time (UT+4h)  she@DPX200
##.OBSERVE FREQUENCY= 200.1315
##.OBSERVE NUCLEUS= ^1H
##.ACQUISITION MODE= SIMULTANEOUS
##.ACQUISITION SCHEME= undefined
##.AVERAGES= 8
##.DIGITISER RES= 18
##SPECTROMETER/DATA SYSTEM= spect
##.PULSE SEQUENCE= zg30
##.SOLVENT NAME= CDCl3
##.SHIFT REFERENCE= (INTERNAL, CDCl3, 0, 19.5033)
##AUDIT TRAIL= $$ (NUMBER, WHEN, WHO, WHERE, WHAT)
$$ ##TITLE= Audit trail, XWIN-NMR		Version 3.5
$$ ##JCAMPDX= 5.01
$$ ##ORIGIN= Bruker BioSpin GmbH
$$ ##OWNER= she
$$ F:/spectra/data/she/nmr/H-F/1/pdata/1/auditp.txt
$$ ##AUDIT TRAIL=  $$ (NUMBER, WHEN, WHO, WHERE, WHAT)
(   1,<2024-12-03 14:17:14.03 +0400>,<she>,<DPX200>,
      <created by zg, POWCHK disabled, PULCHK disabled
       configuration hash MD5:
       00 E9 B6 7A A2 85 ED C7 34 08 36 98 17 FE 4E 26
       data hash MD5: 16K
       F4 13 BF 4A 3A 1F 8D 68 95 4C EF 12 1C 15 54 AB>)
(   2,<2024-12-03 14:17:16.45 +0400>,<she>,<DPX200>,
      <Start of raw data processing
       efp BC_mod = 2 LB = 0.24 FT_mod = 6 PKNL = 1 PHC0 = -26878.49 PHC1 = 16.18744 SI = 16K 
       data hash MD5: 16K
       92 9D 9A 37 29 35 8C B8 9A 49 24 A8 3C 34 FE 70>)
(   3,<2024-12-03 14:17:33.56 +0400>,<she>,<DPX200>,
      <pk PHC0 = 3.296482 PHC1 = -4.4 
       data hash MD5: 16K
       82 D3 48 AB 7A F4 53 21 3C 61 07 36 6C 1C 01 1F>)
(   4,<2024-12-03 14:17:36.90 +0400>,<she>,<DPX200>,
      <abs ABSG = 5 
       data hash MD5: 16K
       D6 05 B9 56 D2 C8 4A DF FF 59 B6 EA 45 30 C4 70>)
$$ ##END=
$$ 
$$ hash MD5
$$ CF 79 33 32 E6 8A 8A E8 19 46 51 8F 71 8A 15 88
##$RELAX= 
##$RELAX= 
##$RELAX= 
##$RELAX= 
##$RELAX= 
##$RELAX= 
$$ Bruker specific parameters
$$ --------------------------
##$DU= <F:/spectra>
##$EXPNO= 1
##$NAME= <H-F>
##$PROCNO= 1
##$TYPE= <nmr>
##$USER= <she>
##$AMP= (0..31)
100 100 100 100 100 100 100 100 100 100 100 100 100 100 100 100 100 100 
100 100 100 100 100 100 100 100 100 100 100 100 100 100 
##$AQSEQ= 0
##$AQ_mod= 1
##$AUNM= <au_zg>
##$AUTOPOS= <>
##$BF1= 200.13
##$BF2= 200.13
##$BF3= 200.13
##$BF4= 200.13
##$BF5= 200.13
##$BF6= 200.13
##$BF7= 200.13
##$BF8= 200.13
##$BYTORDA= 1
##$CFDGTYP= 0
##$CFRGTYP= 5
##$CHEMSTR= <none>
##$CNST= (0..31)
1 1 145 1 1 1 1 1 1 1 1 1 1 1 1 1 1 1 1 1 1 1 1 1 1 1 1 1 1 1 1 1 
##$CPDPRG= <>
##$CPDPRG1= <>
##$CPDPRG2= <>
##$CPDPRG3= <>
##$CPDPRG4= <mlev>
##$CPDPRG5= <mlev>
##$CPDPRG6= <mlev>
##$CPDPRG7= <mlev>
##$CPDPRG8= <mlev>
##$CPDPRGB= <>
##$CPDPRGT= <>
##$D= (0..31)
0 1.2 0 0 0 0 0 0 0 0.06 0 0.03 0 0 0 0 0.0002 0 0 0 0 0 0 0 0 0 0 0 0 
0 0 0 
##$DATE= 1733221033
##$DBL= (0..7)
120 120 120 120 120 120 120 120 
##$DBP= (0..7)
150 150 150 150 150 150 150 150 
##$DBP07= 0
##$DBPNAM0= <>
##$DBPNAM1= <>
##$DBPNAM2= <>
##$DBPNAM3= <>
##$DBPNAM4= <>
$$ [...]
##$SUBNAM3= <"">
##$SUBNAM4= <"">
##$SUBNAM5= <"">
##$SUBNAM6= <"">
##$SUBNAM7= <"">
##$SUBNAM8= <"">
##$SUBNAM9= <"">
##$SW= 24.0689530833862
##$SWIBOX= (0..15)
0 0 2 0 0 0 0 0 0 0 0 0 0 0 0 0 
##$SW_h= 4816.95568400771
##$TD= 16384
##$TD0= 1
##$TE= 0
##$TE2= 300
##$TE3= 300
##$TEG= 300
##$TL= (0..7)
0 120 120 120 120 120 120 120 
##$TP= (0..7)
150 150 150 150 150 150 150 150 
##$TP07= 0
##$TPNAME0= <>
##$TPNAME1= <>
##$TPNAME2= <>
##$TPNAME3= <>
##$TPNAME4= <>
##$TPNAME5= <>
##$TPNAME6= <>
##$TPNAME7= <>
##$TPOAL= (0..7)
0.5 0.5 0.5 0.5 0.5 0.5 0.5 0.5 
##$TPOFFS= (0..7)
0 0 0 0 0 0 0 0 
##$TUNHIN= 0
##$TUNHOUT= 0
##$TUNXOUT= 0
##$USERA1= <user>
##$USERA2= <user>
##$USERA3= <user>
##$USERA4= <user>
##$USERA5= <user>
##$V9= 5
##$VALIST= <valist>
##$VCLIST= <CCCCCCCCCCCCCCC>
##$VD= 0
##$VDLIST= <DDDDDDDDDDDDDDD>
##$VPLIST= <PPPPPPPPPPPPPPP>
##$VTLIST= <TTTTTTTTTTTTTTT>
##$WBST= 1024
##$WBSW= 4
##$XGAIN= (0..3)
0 0 0 0 
##$XL= 0
##$YL= 0
##$YMAX_a= 192872
##$YMIN_a= -304467
##$ZGOPTNS= <>
##$ZL1= 120
##$ZL2= 120
##$ZL3= 120
##$ZL4= 120
##$ABSF1= 19.49887
##$ABSF2= -4.570261
##$ABSG= 5
##$ABSL= 3
##$ALPHA= 0
##$AQORDER= 0
##$ASSFAC= 0
##$ASSFACI= 0
##$ASSFACX= 0
##$ASSWID= 0
##$AUNMP= <proc_1d>
##$AZFE= 0.1
##$AZFW= 0.1
##$BCFW= 0
##$BC_mod= 2
##$BYTORDP= 0
##$COROFFS= 0
##$CY= -3
##$DATMOD= 1
##$DC= 0
##$DFILT= <>
##$DTYPP= 0
##$F1P= 0
##$F2P= 0
##$FCOR= 1
##$FTSIZE= 16384
##$FT_mod= 6
##$GAMMA= 0
##$GB= 0
##$INTBC= 1
##$INTSCL= 2.524811e-10
##$ISEN= 128
##$LB= 0.24
##$LEV0= 0
##$LPBIN= 0
##$MAXI= 10000
##$MC2= 0
##$MEAN= 0
##$ME_mod= 0
##$MI= 1.114404
##$NCOEF= 0
##$NC_proc= -7
##$NLEV= 6
##$NOISF1= 3.799351
##$NOISF2= 2.8
##$NSP= 0
##$NTH_PI= 0
##$NZP= 0
##$OFFSET= 19.50328
##$PC= 1
##$PHC0= -26875.19
##$PHC1= 11.78744
##$PH_mod= 1
##$PKNL= yes
##$PPARMOD= 0
##$PSCAL= 0
##$PSIGN= 0
##$REVERSE= no
##$SF= 200.130005284902
##$SI= 16384
##$SIGF1= 3
##$SIGF2= 2
##$SINO= 5.538805
##$SIOLD= 16384
##$SREGLST= <1H.CDCl3>
##$SSB= 0
##$STSI= 16384
##$STSR= 0
##$SW_p= 4816.95568400771
##$SYMM= 0
##$S_DEV= 0
##$TDeff= 16384
##$TDoff= 0
##$TI= <>
##$TILT= no
##$TM1= 0
##$TM2= 0
##$TOPLEV= 0
##$USERP1= <user>
##$USERP2= <user>
##$USERP3= <user>
##$USERP4= <user>
##$USERP5= <user>
##$WDW= 1
##$XDIM= 16384
##$YMAX_p= 448695104
##$YMIN_p= -1028382
$$ End of Bruker specific parameters
$$ ---------------------------------
##NTUPLES= NMR SPECTRUM
##VAR_NAME=  FREQUENCY,     SPECTRUM/REAL,   SPECTRUM/IMAG
##SYMBOL=    X,             R,               I
##VAR_TYPE=  INDEPENDENT,   DEPENDENT,       DEPENDENT
##VAR_FORM=  AFFN,          ASDF,            ASDF
##VAR_DIM=   16384,         16384,           16384
##UNITS=     HZ,            ARBITRARY UNITS, ARBITRARY UNITS
##FACTOR=    0.29402158847633, 1,            1
##FIRST=     3903.19165748577, 0,            0
##LAST=      -913.764026521942, 0,           0
##MIN=       -913.764026521942, -1028382,    0
##MAX=       3903.19165748577, 448695104,    0
$$ Real data points
##PAGE= N=1
##DATA TABLE= (X++(R..R)), XYDATA
$$ [...]
7985D6959243L267165K790005J313458o84587k406148l440007l424445k739545
7977D1635139j765936q57353r4253L06525J000197J873074K483772K334208J464827
7968D8380200n2915j948865l654159m486251m242137l605479k798435k321048
7960B5270911j870161j614339j290682j018197q84891p42024p25683n83657n13363
7951A6027914n43422m55748m35377l86107k08826k11301k06330n6531n1227m2898
7941A3430147j24085j36298r8234n2469l1063J77887K33359J40065J96751K86696
7931A4022756L38359L00806K34331K51665J32239K51260K66377K10384K63847
7922A6272024L36242K72466N18103N15047N60917M91342P99085Q16193J022079
$$ y = [46959243, 50226408, 53016413, 54329871, 53645284, 51239136, 47799129, 44374684, 41635139, 39869203, 39011850, 38917597, 39224122, 40224319, 42097393, 44581165, 46915373, 48380200, 48327285, 46378420, 42724261, 38238010, 33995873, 30390394, 27591959, 25270911, 23400750, 21786411, 20495729, 19477532, 18592641, 17850617, 17124934, 16541277, 16027914, 15484492, 15028744, 14593367, 14207260, 13998434, 13787133, 13580803, 13524272, 13473045, 13430147, 13306062, 13169764, 13071530, 13019061, 12987998, 13165885, 13399244, 13539309, 13736060, 14022756, 14361115, 14661921, 14896252, 15147917, 15280156, 15531416, 15797793, 16008177, 16272024, 16608266, 16880732, 17398835, 17913882, 18474799, 18966141, 19765226, 20581419, 21603498]
7913B1603498J037597R90561J290586J332721J469507J851151K339154L078887
7905C4993662L816672L516144L497499K311186O98012l59946j033044q74248L24792
7896D6890729J302524J493812R09451o56361k252903l648822m263500l736947
7888C6037983k757033j964533j463245j016297n32508k99609P437J92048M58766
7879B8663009O26197P48235J026415J342909J703954K490055L271638L695287
7871D3567699L526387K768166J139636m3953j074591j279691m09625R01023J300963
7862E0396014Q00927j22843j947928l198816m146177m330361l568342k947672
7854C0934802k441424j815574j516414j164508r00870o59443m41747l35460l10125
$$ y = [21603498, 22641095, 23631656, 24922242, 26254963, 27724470, 29575621, 31914775, 34993662, 38810334, 42326478, 45823977, 48135163, 48833175, 48473229, 47440185, 46565937, 46890729, 48193253, 49687065, 50596516, 49940155, 47687252, 44038430, 39774930, 36037983, 33280950, 31316417, 29853172, 28836875, 28304367, 28004758, 28012195, 28204243, 28663009, 29289206, 30037441, 31063856, 32406765, 34110719, 36600774, 39872412, 43567699, 47094086, 49862252, 51001888, 50957935, 49883344, 48603653, 48194028, 49095051, 50396014, 51196941, 51074098, 49126170, 45927354, 41781177, 37450816, 33882474, 30934802, 28493378, 26677804, 25161390, 23996882, 23096012, 22436569, 21994822, 21659362, 21349237]
7845B1349237k62267l41575j52760k8152k09508L01890K94732K03502J73718P1153
7835B1399970J1657j36614j10953j67625k19951k22727j43043P9949J86546j3755
7825B0663454J36418N9318o4565n0761J44693R4130J38791M90272N75383Q95556
7815B3082689Q20466R41409J184464J382331J749211K393717K669560K029404
7807C6253251J284961M15660q12091j608626j240176m60440K12268N09631k18070
7798C4336368n07189j156863j816153k164415j858834j115328r22345n45194k64972
7789B3985075o0951K71756K33682N33171P15037J228483J420803J939624K381119
7780C2647799L007552L541181L639509L133588J656150L34639r77804j710955
$$ y = [21349237, 21086970, 20745395, 20592635, 20564483, 20354975, 20656865, 20951597, 21155099, 21328817, 21399970, 21411627, 21275013, 21164060, 20996435, 20776484, 20553757, 20410714, 20490663, 20677209, 20663454, 20799872, 20859190, 20794625, 20743864, 20888557, 20982687, 21121478, 21611750, 22187133, 23082689, 23903155, 24844564, 26029028, 27411359, 29160570, 31554287, 34223847, 36253251, 37538212, 37953872, 37141781, 35533155, 34292979, 33832539, 34044807, 34554438, 34336368, 33829179, 32672316, 30856163, 28691748, 26832914, 25717586, 24795241, 24250047, 23985075, 23924124, 24195880, 24429562, 24962733, 25677770, 26906253, 28327056, 30266680, 32647799, 35655351, 39196532, 42836041, 45969629, 47625779, 47960418, 46982614, 45271659]
7772D5271659j547447n53137L17545O88735K42631j076010k083876l033702l522689
7763C4703709l123716k527319j909804j419904j058879r37748p62780n45018k76652
7754B2141889j29685K05869L03939M46008O76781J127590J430090J532890Q62253
7745B8597624M12107k47553r93234j147681q92323l08437K23240K65005j41765
7736B5766983o91260j180984j877361j676238j490754j057401p92773o10522n75933
7727A5813757n38965n68630n85157n52569k92256k69220l40663k74974k08428
7718A2182895k70424m44576n89665m36988l20403l49864l21964k50751j67322
7709I030938j36862l4391o4561n5905j17189N7043O1966n7771r2409p7946j64092
$$ y = [45271659, 43724212, 43171075, 43488620, 44177355, 44419986, 43343976, 41260100, 38226398, 34703709, 31579993, 29052674, 27142870, 25722966, 24664087, 23726339, 22963559, 22418541, 22141889, 22012204, 22218073, 22522012, 22968020, 23644801, 24772391, 26202481, 27735371, 28597624, 29009731, 28762178, 27768944, 26621263, 25728940, 25420503, 25643743, 25908748, 25766983, 25075723, 23894739, 22017378, 20341140, 18850386, 17792985, 17000212, 16389690, 15813757, 15274792, 14706162, 14121005, 13568436, 13276180, 13006960, 12666297, 12391323, 12182895, 11912471, 11467895, 10878230, 10441242, 10120839, 9770975, 9449011, 9198260, 9030938, 8894076, 8859685, 8795124, 8739219, 8622030, 8679073, 8741039, 8683268, 8590859, 8512913, 8348821]
7698H348821j36537m9006k07154k76138k75749l00802k77161k41172k26142j98633
7688F160327k16980k31095k03152l28649k40263k78678k10356j35038o5977j14663
7678D135476L979k2985j42083M6396j26501j56616L075K4020j21045k9626j83311
7667C430779O373o152j37625K4004j9005j20349l6430N7663O7583r3180l0686
7656C142975r1053m991j86138j42424j27413j08595k5559j56317k9143j30165
7646B141177m8671l7531J2040o8083k7531m4161J27195n0684J2346k4000J53795
7635B145892J8951r7132J427n9188j73670N3438K4885o6291p6908j5497r0585
7624A665322j6175L7246n0812k5248O596n0778j02182K9782L9983k3939l5497
$$ y = [8348821, 8212284, 8163278, 7956124, 7679986, 7404237, 7103435, 6826274, 6585102, 6358960, 6160327, 5943347, 5712252, 5509100, 5180451, 4940188, 4661510, 4451154, 4316116, 4250139, 4135476, 4139455, 4116470, 3974387, 4020783, 3894282, 3737666, 3740741, 3764761, 3643716, 3614090, 3430779, 3437152, 3431000, 3293375, 3317379, 3298374, 3178025, 3141595, 3199258, 3266841, 3173661, 3142975, 3051922, 3046931, 2860793, 2718369, 2590956, 2482361, 2456802, 2300485, 2271342, 2141177, 2092506, 2054975, 2067015, 1998932, 1971401, 1927240, 2054435, 2003751, 2016097, 1992097, 2145892, 2164843, 2067711, 2069138, 2009950, 1836280, 1889718, 1914603, 1848312, 1771404, 1755907, 1665322, 1649147, 1686393, 1635581, 1610333, 1616929, 1566151, 1463969, 1493751, 1533734, 1509795, 1474298]
7613A474298n4172m7137j11424n7792K0578N6974j8468N2300l6028m5638K7482
7602A260973J16263P1160k555K5888J10373O5836o2623j01165O3996l8049n5876
7591A454221j31643r3628K7949l2498q583p7494m6744p3990R20r6892P7763J05938
7579A105319m1979p9117J4890n9292r8440M1009K4577m9866O805l6182R440P1598
7567I08762j13622J36129M3304j5270j02826p5205M740O4361n3152K388J9053
7556H18662k493M7719o645R017K9313r6170Q2756J41550n2550j1443P3257n6584
7544I76389n7167L621P6369J43195o9265k8717o3350J43785P8112k899L0692P0460
7532A301225R7022J94823j06198Q6359J25075P286P4558r272Q780P9553l83r5012
$$ y = [1474298, 1420126, 1372989, 1261565, 1203773, 1224351, 1281325, 1262857, 1315157, 1279129, 1233491, 1260973, 1377236, 1448396, 1445841, 1471729, 1582102, 1647938, 1585315, 1484150, 1548146, 1510097, 1454221, 1322578, 1228950, 1256899, 1224401, 1215818, 1138324, 1091580, 1017590, 1018510, 921618, 999381, 1105319, 1063340, 984223, 999113, 939821, 841381, 882390, 906967, 857101, 863906, 827724, 837164, 908762, 795140, 931269, 974573, 959303, 856477, 781272, 786012, 850373, 797221, 799609, 818662, 816169, 863888, 857243, 866260, 895573, 799403, 882159, 1023709, 971159, 959716, 1032973, 976389, 919222, 922843, 999212, 1142407, 1073142, 1044425, 981075, 1124860, 1202972, 1200073, 1230765, 1301225, 1398247, 1593070, 1486872, 1573231, 1698306, 1705592, 1780150, 1770878, 1779658, 1859211, 1858828, 1763816]
7520A763816L1917M9918n7764r7544j83845N6111j57033q7743l4475O0329j09971
7509A233716l7019m3286m4066N2979K8956P7602l0801J04951Q411O1091P8802
7498A491336Q7111j9221R8915N8651j0894K1601j2248J26978l1411j11192o1019
7487A638607o2143k7231j37088j07664p8362q704P7795k10639o4632p3880m8187
7476H97872r4494p3718M7733m5472m6929K0086k6060K0732o5954j6507Q2261J8494
7464G18044j28014q723n4271r3910M5760L0461M6405m7185K3555k04089L4217
7453C62250k0107K8119k8962P838M7459K0763q0683m831P2604m983Q712j00815
7441C07364M1550l8997K620n425n3432o6246J6941N8491j36635l6284O3033N8047
$$ y = [1763816, 1795733, 1845651, 1787887, 1690343, 1506498, 1562609, 1405576, 1317833, 1283358, 1343687, 1233716, 1196697, 1153411, 1109345, 1162324, 1191280, 1268882, 1238081, 1343032, 1351443, 1412534, 1491336, 1578447, 1559226, 1658141, 1716792, 1705898, 1727499, 1715251, 1842229, 1810818, 1699626, 1638607, 1576464, 1549233, 1412145, 1304481, 1226119, 1217415, 1295210, 1084571, 1019939, 946059, 897872, 803378, 729660, 777393, 731921, 684992, 705078, 679018, 699750, 633796, 617289, 699550, 718044, 590030, 581307, 527036, 433126, 478886, 509347, 555752, 508567, 532122, 328033, 362250, 342143, 370262, 341300, 349138, 396597, 417360, 336677, 331846, 404450, 399467, 408179, 307364, 348914, 309917, 312537, 307112, 253680, 187434, 204375, 262866, 126231, 89947, 152980, 211027]
7429B11027J1904q996q1223K1930j5657n811N2312p8672J3144J07802m6159k5345
7417A56256k075L3375K2440J4254K670r2891M0185J5578p108j5367M1277O059
7405B14653j05274o3945o4J20338r4569M993n320j8390m500R15L8793j60617R1421
7392A8434j1521L308M9800J6989p4976M5564K2944m2279O8654q919k1385j7877
7380D8736L5115K083R658p5346n6215N5904p6527r4159O2327P7011p704P9911
7368F0794n7545N5346r8007L4392L1705Q3694q160q1085j5642J0100R2437o4316
7356D3713j3951J763k9646R6043j7019K4512K7593j74943J0031O6595R4114o7579
7344F1226j7169l1411M4068l7365J629p3374O3285J18607j490o6365m0342P7012
$$ y = [211027, 222931, 213935, 132712, 154642, 138985, 133174, 185486, 106814, 119958, 227760, 181601, 156256, 154181, 187556, 209996, 224250, 226920, 134029, 174214, 189792, 182684, 167317, 208594, 214653, 109379, 45434, 45370, 165708, 71139, 76132, 70812, 52422, 47922, 48837, 87630, -72987, 18434, 6913, 10221, 60021, 77010, 2034, 47598, 70542, 28263, 96917, 87998, 66613, 48736, 83851, 85934, 95592, 20246, -35969, 19935, -56592, -150751, -88424, -11413, -19117, 60794, 3249, 58595, -39412, -5020, 26685, 110379, 102219, 21134, 5492, 15592, 108029, 43713, 29762, 31525, 1879, 97922, 80903, 105415, 133008, -41935, -31904, 34691, 128805, 61226, 44057, 12646, 56714, 19349, 20978, -52396, 10889, 129496, 128006, 61641, 21299, 98311]
7332I8311j0759o0478J4287j2082l713j812j3189l2333J13527r890j97269R6447
7320a8953O0905M8828O099L9428J943l0183M676j9014o3371j10874m5557N0845
7308g5228P7193O0953l8435n463R2238j65197O4881M1635K0284m122J836o7160
7296C415q142k1226P7313J6886p5428m4468P3105R662O097j2393q5924J60959
7284I9856p9709k1527R1224j18509P6290K697Q6930n0139j0393L9781M0577n637
7272A51441j21517R1910p6657n2358N0762n0196Q4107o7025o5594K0035Q6953
7261E1861L7725j17137k0742P7580M4207n1911N0801K9488N2318K5968j30124
7250E0034j27891R2919N353q127Q7108O2973l1823J8191K4590l8845o1373M3341
$$ y = [98311, 87552, 27074, 41361, 29279, 25566, 23754, 10565, -21768, 91759, 81869, -115400, -18953, 41952, 90780, 96879, 136307, 138250, 108067, 112743, 93729, 30358, -80516, -126073, -75228, 1965, 62918, 24483, 19020, 111258, -53939, 10942, 52577, 72861, 68739, 70575, 3415, -4727, -25953, 51360, 68246, -7182, -51650, 21455, 31117, 37214, 24821, -61103, 99856, 20147, -1380, 89844, -28665, 47625, 50322, 137252, 87113, 76720, 116501, 157078, 151441, 29924, 121834, 45177, -7181, 43581, -6615, 77492, 10467, -55127, -35092, 51861, 89586, -27551, -48293, 29287, 73494, 21583, 72384, 101872, 154190, 180158, 50034, -77857, 15062, 20415, 12288, 99396, 162369, 130546, 148737, 173327, 134482, 73109, 116450]
7238A16450J8331r9146J3017l5434j5464j3933l6028P9050j211L5980j17646O6833
7226A0799l0653n3965J63966O163n4162K2138o7046L5886J05801o6567r8639P4617
7214D8338L9878q388p9220O8070K2678l1274J0013m2543K4722n8403lQ3949j10569
7201c2752l5232j7371P5798l795K6273J2384L8002o3901P9475l6367n9276M8518
7189C1756P7769l254m9627K0271P7876J15414j21663o7158L6367K0639l8752j45070
7177d5432J8069L1211M5352L0792m2050K0596l5494M83o567j0735P5161j5433
7165F5953K5547j5168N2420m2128R6817P8846p2969M4835j17689k5796k0525J5961
7153H6104N0949P0567J9497r5716P6361J09350l5067R494O7224L7434j0299J20157
$$ y = [116450, 134781, 35635, 48652, 13218, -2246, -16179, -52207, 26843, 25632, 61612, -56034, 10799, -19854, -73819, 90147, 96310, 42148, 64286, -2760, 33126, 138927, 72360, -26279, 48338, 88216, 79828, 608, 68678, 91356, 60082, 70095, 27552, 52274, -6129, -6132, 77817, -32752, -67984, -85355, -9557, -13352, 12921, 25305, 63307, -594, 78881, 42514, -16762, 31756, 109525, 106271, 56644, 76915, 154791, 270205, 148542, 81384, 117751, 138390, 99638, -45432, -27363, 3848, 49200, 79992, 37942, 58538, 23044, 23527, 16960, 6225, 81386, 65953, 91500, 76332, 128752, 86624, 183441, 262287, 189318, 234153, 116464, 90668, 70143, 86104, 137053, 207620, 227117, 131401, 207762, 317112, 282045, 291539, 358763, 396197, 385898, 506055]
7141E06055M1600m3622l4507P8688j92L6098l9987k1207J463l7204l4693q8744
7129C63748n3691k2876o7983J6359J3408K3616o1233k5621l0467J5051o8494J98229
7117C00046l4560O908j57255k9345J01529Nk6856K153m6869j7664K9922J1351
7105A39365O7690P172k738m0614N3084L542l2988P0484p4056N8465o0752O055
7093A94709L9007l4234J03069k0365N8276m6175J29500j17810K4098M5019Q480
7082C83574j4035R8931L1729j7753M2622M1048m8489K0156l5854o0029k0809r9262
7070C21829Q4150J1592q4334K4879L2951q5634k7203M2206j7109q4932j161J17471
7058C34705m6606j14581j01732R6246k7010N2138p436n5978k6518M5594N0954
$$ y = [506055, 547655, 504033, 469526, 548214, 548022, 584120, 544133, 522926, 524389, 487185, 452492, 363748, 310057, 287181, 219198, 235557, 248965, 272581, 211348, 185727, 155260, 170311, 101817, 300046, 265486, 272394, 115139, 85794, 187323, 187328, 160472, 162625, 115756, 98092, 128014, 139365, 207055, 214227, 211489, 170875, 223959, 227501, 194513, 264997, 190941, 249406, 188654, 194709, 233716, 199482, 302551, 282186, 340462, 294287, 423787, 305977, 330075, 375094, 383574, 369539, 468470, 500199, 482446, 525068, 566116, 517627, 537783, 501929, 441900, 421091, 321829, 405979, 417571, 333237, 358116, 391067, 305433, 278230, 320436, 303327, 218395, 217234, 334705, 288099, 173518, 71786, 168032, 141022, 193160, 185724, 129746, 103228, 148822, 199776]
7047A99776m3142l4657N9303N8762K7350j6750j10151J44386j22078O4768P1351
7036B98918l9609j5177q9032p328R6133L1183K6159j02977n9229J16209p8080
7025A77170j00797M9589k348J02413P1866L4043o0808M315n4322q947J20039k3388
7013C08825k7571p4924L9474J52609p7374n7938K7757K2329O4656J88818P7317
7002F43978J5672n781Q0681R6784l3105l4268K5660j9401M1222j50410L9825k2602
6990F78255j50365j9427r751R657j5199L3861m9043l4613l2461O4245L6391j08856
6978D02694J06327j0659j04252Q9961l5604O2038K6867K7259j572O2709j05785
6967E19983J70774J9431L1779o2975M5243J15282J56230Q267O3908q1383l6855
$$ y = [199776, 156634, 121977, 181280, 240042, 267392, 250642, 140491, 284877, 162799, 227567, 298918, 259309, 244132, 155100, 147772, 243905, 275088, 301247, 198270, 139041, 255250, 177170, 76373, 125962, 123614, 226027, 297893, 331936, 271128, 275443, 221121, 212174, 332213, 308825, 281254, 206330, 245804, 398413, 321039, 263101, 290858, 313187, 377843, 566661, 643978, 659650, 653869, 734550, 831334, 798229, 763961, 789621, 770220, 811442, 661032, 700857, 678255, 527890, 508463, 498712, 508369, 493170, 527031, 477988, 443375, 410914, 475159, 511550, 402694, 509021, 498362, 394110, 484071, 448467, 510505, 537372, 564631, 563059, 625768, 519983, 690757, 710188, 741967, 678992, 724235, 839517, 995747, 1004014, 1067922, 986539, 949684]
6956I49684P6326j4396k5307m9407n8973o8856P7367j6494p3300k1089K04794
6945I80349k3271L4233L1149L8381Q9462J38435L3322M0054K8838n5360N0244
6934A385836k9666m3385o6106r3793o9920j14471n7262L625q0833j4551r573J21625
6922I31526N1961j29643r7938R0499K8517R2212P1463l9935J48926K5655K7434
6911A200677N3618K277J5593O4926M4272o534O5142n3746J5613O5686J0233j9754
6899A458003L9722p1534K9603N6134n9536L0530p6274j02927j01124O2364j27127
6888A137834k9640P0572K1231N0823M8511J37631m0639J1693k2448q6850J16236
6877A414954m9921q298o8701l9598M6427l4530l3786M8945O417n4633o7687j9444
$$ y = [949684, 1026010, 1011614, 986307, 936900, 877927, 809071, 886438, 869944, 796644, 775555, 980349, 957078, 991311, 1022460, 1060841, 1150303, 1288738, 1322060, 1362114, 1390952, 1335592, 1385836, 1356170, 1312785, 1246679, 1152886, 1082966, 968495, 911233, 914858, 834025, 819474, 809901, 931526, 983487, 853844, 755906, 846405, 874922, 967134, 1038597, 998662, 1147588, 1173243, 1200677, 1254295, 1256572, 1272165, 1337091, 1381363, 1374829, 1439971, 1386225, 1401838, 1467524, 1477757, 1458003, 1497725, 1426191, 1455794, 1511928, 1452392, 1482922, 1406648, 1303721, 1202597, 1264961, 1137834, 1108194, 1178766, 1199997, 1250820, 1299331, 1436962, 1396323, 1408016, 1385568, 1298718, 1414954, 1365033, 1356735, 1288034, 1248436, 1294863, 1260333, 1226547, 1275492, 1281909, 1227276, 1159589, 1140145]
6865A140145Q57j5074l7105j90448P5204O3700n8238o4793o7153n9401J9729R013
6853H16436N6743m5194j2874N5161M2774J6279J6643p15M5086N0446o8755p3482
6841H98548M3414J17717p9466n6945M2287L5580n0795M7304N1818J53560Q191
6830A211213q1342J3918J15322J958Q6478P6243K6827N1104N5267O5854J35505
6819A758347L6308L1367O4752N6932j10330j14145o1494l7726K8390p9791q4413
6808A488197r0408j62275j63241O4804k7869M661j51191N8553m4455K999K0940
6797A000715m3394k0561M7242m2532l7663J55086o5348o5315N4268J8250N2460
6786A053208p893l8005J880J4343J6036P5978j01188q3275J09878L2455o8552
$$ y = [1140145, 1141002, 1125928, 1088823, 898375, 973579, 1037279, 979041, 914248, 847095, 787694, 807423, 816436, 873179, 827985, 815111, 870272, 913046, 929325, 945968, 945253, 990339, 1040785, 972030, 898548, 941962, 1059679, 980213, 923268, 965555, 1001135, 950340, 997644, 1049462, 1203022, 1211213, 1129871, 1143789, 1259111, 1261069, 1347547, 1423790, 1450617, 1501721, 1556988, 1622842, 1758347, 1794655, 1826022, 1890774, 1947706, 1837376, 1723231, 1661737, 1624011, 1652401, 1572610, 1488197, 1397789, 1235514, 1072273, 1137077, 1109208, 1113869, 962678, 1021231, 976776, 979775, 1000715, 957321, 936760, 984002, 941470, 903807, 1058893, 993545, 928230, 982498, 1000748, 1053208, 1045315, 1007310, 1009190, 1023533, 1039569, 1115547, 1014359, 931084, 1040962, 1073417, 1004865]
6775A004865k4053J46409O5859J16173n3125L7956o9342J45557K0469k9757O6810
6764A427821K2992R0568Q1345M1037K583J89570K07987N6103P8112N6324L7763
6753B292205Q141J55821k2223n9982P1240J54204P1549O5535J76242J26345R6299
6742C135376O0946N461J1727j35386j05266j56780j94139j38388j01334l9720
6732B342497M7636K8999p1561P5562K20200J04616J93258J91996J61054K28673
6722C522930L39940R2425M6549O5074k3346k88033l21011k47287k91329k96210
6712B599702k87719j70116j71207j98342k37732p3091r8204m8350j28579j03598
6702A082764j02530O30j05919j2365k2927K4687o7968m763j09810k2052K2335
$$ y = [1004865, 980812, 1127221, 1193080, 1309253, 1256128, 1294084, 1224742, 1370299, 1390768, 1361011, 1427821, 1450813, 1541381, 1622726, 1663763, 1666346, 1855916, 2063903, 2120006, 2198118, 2254442, 2292205, 2300346, 2456167, 2433944, 2373962, 2445202, 2599406, 2670955, 2736490, 2912732, 3039077, 3135376, 3196322, 3201783, 3213510, 3078124, 2972858, 2816078, 2621939, 2483551, 2382217, 2342497, 2390133, 2419132, 2347571, 2423133, 2643333, 2747949, 2941207, 3133203, 3294257, 3522930, 3862870, 3955295, 4001844, 4066918, 4043572, 3755539, 3434528, 3187241, 2895912, 2599702, 2311983, 2141867, 1970660, 1772318, 1534586, 1461495, 1363291, 1314941, 1186362, 1082764, 980234, 980864, 874945, 862580, 839653, 864340, 796372, 791609, 681799, 659747, 682082]
6691F82082j5729K3637N1898j61174j07336M4125L4274j12194Q313J00783q0242
6680D68437j66299R9251M9588p2074n4282N2903m8874m1444J21677J4753P47r3068
6668C31315K327Q9827o2179J6564o1959j09960L1521O1854k7528Q3965j00290
6657B55457k5699J6938o4649P6669m1884M568M7946j2708j48964N9204K4180j15589
6645G5469j6652l6413J24030k2475n7073J4638J2876O1890k7220N4844l0061L554
6633A57407J04821j20650q5423Q045K8505J25423j2897k2239L9257O480m2605
6622A86124j35267J34919N4113j01564K9640m0361r4168L3377R2238j2890j8266
6611A27895m7262L3096J39190l6995m3119Q0787J13264j38309j14047Q8918j9778
$$ y = [682082, 666353, 689990, 741888, 580714, 473378, 517503, 551777, 439583, 447896, 548679, 468437, 302138, 401389, 450977, 378903, 324621, 377524, 328650, 287206, 408883, 423636, 424383, 331315, 333642, 423469, 361290, 377854, 315895, 205935, 237456, 299310, 271782, 355747, 255457, 229758, 246696, 182047, 258716, 216832, 221400, 269346, 256638, 107674, 166878, 191058, 75469, 58817, 22404, 146434, 123959, 66886, 81524, 94400, 156290, 129070, 183914, 153853, 157407, 262228, 141578, 56155, 64200, 92705, 218128, 205231, 182992, 222249, 228729, 186124, 50857, 185776, 239889, 138325, 167965, 127604, 33436, 66813, 159051, 146161, 127895, 80633, 113729, 252919, 215924, 172805, 253592, 366856, 228547, 114500, 203418, 183640]
6600A83640k6635o2027R062R085M197j01924R8633R8525o2058m7237m522Q1182
6588A79921j11122j0838L5610j00724O9200N4605L6137n3757K8111M1508K3890
6577A92541j02850L3082O8298M0319k4294n2729j09493N7061o895m3288J16186
6566A67938q7430P362l2632Q5662N7693k0267K779o0916L273M6278N1027p1231
6554A49536m886M965k2937R9122P3694j00426R9312n067K81l8274M8062j12665
6542A90717m794P3472L8108R4198J9871q3773k3138O4360K9218K774l7595N7262
6530D20680O003L8778K6549m694J6019q8258j29131m2773k4232j1992M9804k59
6518B56494M879l8525J08043j53022j809J09660j32173M3551P827m8012k5735
$$ y = [183640, 157005, 94978, 104040, 113125, 117322, 15398, 114031, 212556, 150498, 103261, 98739, 179921, 68799, 57961, 93571, -7153, 62047, 116652, 152789, 99032, 127143, 168651, 192541, 89691, 122773, 191071, 231390, 207096, 154367, 44874, 101935, 95040, 51752, 167938, 80508, 87870, 55238, 140900, 198593, 178326, 181105, 120189, 123462, 169740, 220767, 149536, 144650, 149615, 126678, 225800, 299494, 199068, 298380, 293313, 293594, 255320, 303382, 190717, 185923, 259395, 297503, 391701, 411572, 327799, 304661, 369021, 398239, 401013, 363418, 420680, 426683, 465461, 492010, 487316, 503335, 415077, 285946, 243173, 218941, 206949, 256753, 256494, 261373, 222848, 330891, 177869, 176060, 285720, 153547, 197098, 204925, 156913, 131178]
6507A31178J41758L6734p8544R8883q5296M3031K3982n2093M4378N4750P1325
6496D30086n7123P2139j4139J8830k3428K4928M1912O8513o2362j5509P6N2242
6484E36165n7000n1961M9687j7539M1986p8152J0734m7272L0125n2254q3466n063
6472B75990L2479J1006j3424M7010M625K9301k5456j3822R952q9469r6921m1867
6460A29404J2524J23381n144K1284l4070n4869m1600J03769P8714q6809j40068
6449A06516M0664M8560L0523k8694j8206k0406R0239P620k2537Q488m9835P624
6437B00556o3001m9255L882J4723P0406o690Q3212q4055j6952j4299n3922K0655
6425A05260M7377P1951q2404M0414J16614j17440n2616O2443k8286R1573L1942
$$ y = [131178, 272936, 309670, 231126, 330009, 244713, 287744, 311726, 259633, 304011, 358761, 430086, 372963, 445102, 430963, 449793, 426365, 451293, 493205, 561718, 499356, 483847, 483923, 536165, 479165, 427204, 476891, 459352, 501338, 423186, 433920, 386648, 416773, 364519, 281053, 275990, 308469, 319475, 306051, 353061, 357686, 386987, 361531, 347709, 357661, 268192, 171271, 129404, 141928, 265309, 260165, 281449, 247379, 192510, 150910, 254679, 333393, 246584, 106516, 147180, 195740, 226263, 197569, 179363, 158957, 249196, 256816, 234279, 242767, 192932, 200556, 137555, 88300, 92182, 106905, 177311, 170621, 253833, 169778, 152826, 138527, 84605, 105260, 152637, 224588, 142184, 182598, 299212, 181772, 129156, 191599, 163313, 254886, 286828]
6414B86828r2302M2989J6015j1025P1816m1645L4112k2803o0706M918p8990P9973
6402B29180j18051r80m2081R5183k6887k3536J9709N653k1747l7203k4976J4009
6390F8273O1738R4685m4298q9824M9418k0692L8971O0664l550j46388J24405l3625
6378A59777o0070K7032L8750K6206j8787n9156n2427J01790J01421r4209L43n7707
6366A12963P7454K1070q5948J9045j1494M9856R3688l7704j5320J052k7268Q886
6354B06280n642L1275Q92q5794P3249m2596p1390J79486P6096n8165J10558R09
6342D15158k16145O2709P8623p9265n6647J05656O2251L439M9940K6381p6364
6331C75736N0535q1416L473O9433r9267j3013J32715N9397q6042J03491j43173
$$ y = [286828, 194526, 237515, 253530, 242505, 314321, 272676, 306788, 283985, 223279, 228197, 149207, 229180, 111129, 110149, 68068, 163251, 136364, 112828, 132537, 138190, 116443, 79240, 54264, 68273, 130011, 224696, 180398, 90574, 139992, 119300, 158271, 218935, 215385, 68997, 193402, 159777, 99707, 126739, 165489, 191695, 172908, 113752, 61325, 163115, 264536, 170327, 170670, 112963, 190417, 211487, 125539, 144584, 133090, 182946, 276634, 238930, 223610, 224662, 197394, 206280, 200638, 231913, 232805, 147011, 220260, 177664, 106274, 285760, 361856, 303691, 414249, 415158, 199013, 261722, 340345, 261080, 204433, 310089, 372340, 375779, 425719, 452100, 375736, 426271, 344855, 348328, 417761, 318494, 305481, 438196, 497593, 411551, 515042, 371869]
6320C71869Q0898J8719L5034Q9279j2513p1816k3953k99j3669j9866L0491m8874
6308D35300J28702J02212j02650j8380j4499r77R9895m972r1428J13307R7178
6297G43688j12907J41402J8091j34165r2276J23143r007k8995J106J3023O5775
6286G28878o6381J5860K0730k278K8117J74775k4495m1702M6838l9528Q0475M8612
6274I69901N6255r651l8237L316J09737J89616M8479P6109J11923K2388L4021
6263A573857P8189M6671J33710r7371p5839L1554N7831K4173n1947j8939O7391
6252A769280k5349L6671O1655Q5325J7381p8914J32866p5477k3546J12934q0455
6241A932371q0315p7621L5200J1863Q7837N5693Q36P7815l5572K6725K2339n2685
$$ y = [371869, 452767, 471486, 506520, 595799, 583286, 511470, 487517, 487218, 473549, 453683, 484174, 435300, 564002, 666214, 563564, 545184, 530685, 529708, 629603, 624631, 533203, 646510, 743688, 630781, 772183, 790274, 656109, 563833, 686976, 677969, 648974, 650080, 663103, 728878, 662497, 678357, 699087, 696809, 724926, 899701, 875206, 833504, 880342, 840814, 921289, 969901, 1026156, 1016505, 978268, 981584, 1091321, 1280937, 1329416, 1405525, 1517448, 1539836, 1573857, 1652046, 1698717, 1832427, 1735056, 1659217, 1690771, 1748602, 1772775, 1720828, 1701889, 1769280, 1743931, 1780602, 1842257, 1927582, 1944963, 1866049, 1998915, 1923438, 1899892, 2012826, 1932371, 1852056, 1774435, 1809635, 1821498, 1909335, 1965028, 1965864, 2043679, 2008107, 2034832, 2057171, 2004486]
6229B004486K507J67370k7649k1776j6R0144J13764o7874R5698j5904J12260l0053
6217B422957O7334N4270j3011J11240j08710R0701J35530R5909N1889J08789M9915
6206C066813P9720K49836L9509J55417O9702P7231O8355N6561O2975O8761K7536
6195D022416n1283r7622j27725p8912k8814j60637l8333j51736o2073j01823m2535
6184C080923r548m9236P1346o2869m5999J20133o9346p64K390n4075R0184l8252
6172C034887K7863j24598K3903L9224k4064M1558R4142Q2573N820P1045K00286
6161C472639J58071J02865Q9940Q0943J68120J92345R2341J40663J39434N3702
6151D691063J51559J24168O1788P4064N5735p2115p7426k6273j25453j25700j65977
$$ y = [2004486, 2006993, 2174363, 2146714, 2124938, 2124922, 2215066, 2328830, 2260956, 2356654, 2340750, 2453010, 2422957, 2490291, 2544561, 2531550, 2642790, 2534080, 2624781, 2760311, 2856220, 2908109, 3016898, 3066813, 3146533, 3396369, 3435878, 3591295, 3660997, 3738228, 3806583, 3863144, 3926119, 3994880, 4022416, 3971133, 3873511, 3745786, 3666874, 3638060, 3477423, 3439090, 3287354, 3225281, 3123458, 3080923, 3071375, 3022139, 3093485, 3030616, 2984617, 3104750, 3035404, 3034640, 3037030, 2982955, 3073139, 3034887, 3062750, 2938152, 2962055, 3001279, 2977215, 3018773, 3112915, 3195488, 3201308, 3272353, 3472639, 3630710, 3733575, 3823515, 3904458, 4072578, 4264923, 4357264, 4497927, 4637361, 4691063, 4842622, 4966790, 5028578, 5102642, 5158377, 5086262, 5008836, 4982563, 4857110, 4731410, 4565433]
6140D565433k73381j35816j84594j69844p6657j22195j30140p8902q5027j18740
6130C190137j4559P9052j42550l9738K8405j47835K0226m5717m458J7102J3832
6119B953897M8650K7220M8454l1555L5576N8441Q3269r3896K4174n7064J12488
6108C209654J85335k0950J1559J2996J03847R8471q1142J6903n2151P8138q287
6097C554373k0718R7107L4348P9980Q9985R9178n107K0789R5915R7350k0113O2932
6085D186019J78232K3421J06653Q7968L2768K23742J08403J69472J57823J93104
6075E467605J40189O9022M5098J70937N7844K24752J69622K35741J47848J83041
6065F911699J43652K32061L20071J68501J71330K90148J66482K93673K67407J05705
$$ y = [4565433, 4292052, 4156236, 3971642, 3801798, 3725141, 3602946, 3472806, 3393904, 3308877, 3190137, 3175578, 3254630, 3112080, 3072342, 3100747, 2952912, 2973138, 2927421, 2922963, 2940065, 2953897, 3002547, 3029767, 3078221, 3046666, 3082242, 3140683, 3223952, 3130056, 3154230, 3097166, 3209654, 3394989, 3374039, 3385598, 3398594, 3502441, 3600912, 3519770, 3536673, 3484522, 3562660, 3554373, 3533655, 3630762, 3665110, 3745090, 3835075, 3934253, 3929146, 3949935, 4045850, 4143200, 4123087, 4186019, 4364251, 4387672, 4494325, 4582293, 4615061, 4838803, 4947206, 5116678, 5274501, 5467605, 5607794, 5676816, 5721914, 5892851, 5950695, 6175447, 6345069, 6580810, 6728658, 6911699, 7055351, 7287412, 7607483, 7775984, 7947314, 8237462, 8403944, 8697617, 8965024, 9070729]
6055I070729J07666J97495J46870K54718K43165K67508J30861J54337L08198J83300
6045A1064847J05090K14249K32033J10408J85470K74401K28750K29896L53789
6036A2998933L78757M44135N50225M44639M05582M64300L90431L67056J13043
6027A6557101O6049N2798J5476j46436L7877J69618J28961J14988L11509L93524
6017A7701465K55005M43420N62632O25052O99159P03927N66981P39778O56998
6008B2954417O29166P87257P80422Q25224Q70490Q64484J114826J172515J359729
5999C1358530J372730J386299J504218J751584J865092K042470K310950K365153
5991D5957026K664889K913369L158801L615330M308028M969865N789369O747890
$$ y = [9070729, 9178395, 9375890, 9522760, 9777478, 10020643, 10288151, 10419012, 10573349, 10881547, 11064847, 11169937, 11384186, 11616219, 11726627, 11912097, 12186498, 12415248, 12645144, 12998933, 13377690, 13821825, 14372050, 14816689, 15222271, 15686571, 16077002, 16444058, 16557101, 16623150, 16675948, 16691424, 16544988, 16582865, 16752483, 16881444, 16996432, 17307941, 17701465, 17956470, 18399890, 18962522, 19587574, 20286733, 20990660, 21557641, 22297419, 22954417, 23583583, 24370840, 25151262, 25976486, 26846976, 27711460, 28826286, 29998801, 31358530, 32731260, 34117559, 35621777, 37373361, 39238453, 41280923, 43591873, 45957026, 48621915, 51535284, 54694085, 58309415, 62617443, 67587308, 73376677, 80124567]
5983H0124567P907974Q161900O820091N194307L854491J976460L94017O6247J223767
5974A15723821L162459N036170N415654N587930O273037O700530O901680O922542
5966A61723823N985122M481287K562033K23571j788684k747123l475041l632290
5958A63332698k772228k216227j850702p46242J302449M015779N948018N633799
5950A72647344N034960M736941L369682P78003j984853m340933o494047q796570
5942A64950527j0836452j1673764j1175149r734796p993458o223209m758991l558249
5934I8996459k291749j259281j75212P23572J517140J866949J446363L91245j341403
5925I9874083l192585n111705o222065o727498o467866n916210n036827m369735
$$ y = [80124567, 88032541, 96194441, 103014532, 108208839, 112063330, 114039790, 114433807, 114500054, 115723821, 118886280, 123922450, 129338104, 134926034, 141199071, 147899601, 154801281, 161723823, 167708945, 172190232, 174752265, 174975836, 173187152, 170440029, 166964988, 163332698, 160560470, 158344243, 156493541, 155747299, 157049748, 161065527, 167013545, 172647344, 177682304, 182419245, 185788927, 186566930, 184582077, 180241144, 173747097, 164950527, 154114075, 142440311, 131265162, 121530366, 113536908, 107313699, 102554708, 98996459, 96704710, 95445429, 95270217, 95993789, 97510929, 99377878, 100824241, 101215486, 99874083, 96681498, 91569793, 85347728, 78620230, 72152364, 66236154, 61199327, 56829592]
5917E6829592l802701l438973k955692k595535k367578k091489j887853j490302
5909C6199469j440024j439775j299523j171442j198902j283727j007552r68668
5901B6389856r85055r78353j002368r61870q51375p24670p03829o92270o92063
5892A8798003o56638m56499m30782m67841n42509m48336m28748m94838n32140
5883A4339672m22174l62032l60527m20738k78576l01241k63398j43748k43607
5874A1543631k14343m0961j90405k65397r3762q3086k18978j28739m986l05145
5864I997829j55515j80144o8600k01377j72256r5803k19333j38236j37172j19715
5854H509678R183q4477R1300m8608M939j55703Q2328J8107o1323j00950j79203
$$ y = [56829592, 53026891, 49587918, 46632226, 44036691, 41669113, 39577624, 37689771, 36199469, 34759445, 33319670, 32020147, 30848705, 29649803, 28366076, 27358524, 26389856, 25404801, 24426448, 23424080, 22462210, 21610835, 20886165, 20182336, 19490066, 18798003, 18141365, 17684866, 17254084, 16786243, 16243734, 15795398, 15366650, 14871812, 14339672, 13917498, 13555466, 13194939, 12774201, 12495625, 12194384, 11930986, 11787238, 11543631, 11329288, 11288327, 11097922, 10832525, 10738763, 10655677, 10436699, 10307960, 10302974, 9997829, 9842314, 9662170, 9593570, 9392193, 9219937, 9124134, 8904801, 8766565, 8629393, 8509678, 8518861, 8434384, 8525684, 8477076, 8482015, 8326312, 8408640, 8426747, 8365424, 8264474, 8085271]
5843H085271j53862j46272j27144j63986j64376j16960r2306n4005k10512m2492
5833F813356M8957r7943o2064L92N2247n4212K21o8128r9921j7124j05315j34493
5821F275973j16833l1456q4664j65680r6110j1698k3832k4867M8091j27561r1818
5810E549545R5436o8006q2769J13526l6820r6929L5120q504O359N1672j6030O7130
5798E609730j14164J03743L4655p4577j12966L4531Q5410k7264J02754K0607O4688
5787E727147l3971R3599J88321J7642R5586K0683o846K13986Q022J13302P5438
5776F512909J81656K10383J2935L8046J31576J17051M6427J85759J25503Q6833
5766G649078n4999J3599J31257O2337j3287K6731J01264J03974R7978J84055J12440
$$ y = [8085271, 7931409, 7785137, 7657993, 7494007, 7329631, 7212671, 7120365, 7066360, 6855848, 6813356, 6862313, 6764370, 6702306, 6702698, 6754945, 6700733, 6700954, 6632826, 6532905, 6515781, 6410466, 6275973, 6159140, 6127684, 6043020, 5877340, 5781230, 5769532, 5745700, 5720833, 5768924, 5641363, 5549545, 5644981, 5576975, 5494206, 5607732, 5570912, 5473983, 5509103, 5500599, 5506958, 5558630, 5542600, 5609730, 5495566, 5599309, 5633964, 5559387, 5446421, 5480952, 5566362, 5539098, 5641852, 5662459, 5727147, 5693176, 5786775, 5975096, 5992738, 6088324, 6109007, 6102161, 6316147, 6324169, 6437471, 6512909, 6694565, 6904948, 6917883, 6955929, 7087505, 7204556, 7250983, 7436742, 7562245, 7649078, 7594079, 7607678, 7738935, 7801272, 7787985, 7814716, 7915980, 8019954, 8117932, 8301987, 8414427]
5755H414427n3215J38000J43825J86107R8535K64265J04264J83073J41815K05999
5745I827095L37098J71948K37585N1182K09976L14555K10083K40277L39977J82802
5735A2122578K47512L33444L25835K51207K65057K96560K34747L39105L53059
5726A4769104K39391K94111K65683L21097L19838L03717K79156J87899K58940
5717A7238936J86191J39302J81304J15094J19417K7929J05879n4054N9270K4526
5707A8143794J9754N0072P170M2986J64701J93040J17783J66584K99782K94537
5697A9500203L13525M06475L74315L61544M84501N61831M17508N25057M57635
5688B3402594N94294O69904O69981Q15544P56754Q61440Q95601Q80546J002196
$$ y = [8414427, 8361212, 8499212, 8643037, 8829144, 8927679, 9191944, 9296208, 9479281, 9621096, 9827095, 10164193, 10336141, 10573726, 10624908, 10834884, 11149439, 11359522, 11599799, 11939776, 12122578, 12370090, 12703534, 13029369, 13280576, 13545633, 13842193, 14076940, 14416045, 14769104, 15008495, 15302606, 15568289, 15889386, 16209224, 16512941, 16792097, 16979996, 17238936, 17425127, 17564429, 17745733, 17860827, 17980244, 18008173, 18114052, 18059998, 18119268, 18143794, 18163548, 18213620, 18220790, 18263776, 18428477, 18621517, 18739300, 18905884, 19205666, 19500203, 19813728, 20220203, 20594518, 20956062, 21440563, 22002394, 22419902, 22944959, 23402594, 23996888, 24666792, 25336773, 26152317, 26909071, 27770511, 28666112, 29546658, 30548854]
5679C0548854R70801R06454Q46594J043229R90797Q17843Q89108J154095J042505
5670C9210280J041077J064360R82478J273775J374829J462405J664556J780197
5662D9853957K024317K193536K355393K518778K905391L392014L930143M449113
5654G3622642N034360N755234N671096M764206K958484J096940q02401k491516
5646I5609045l366498l229734k492126j348017l47951O63023J512954K615319
5638H9616015L828885N240139O497190Q211765Q969211P747775M872608J321761
5630A36305349k426805o259370q919428r486214q550806p057487n532831m278043
5622H3794365l132764k075870j251268k57997O53102J527251K011028K016011
$$ y = [30548854, 31519655, 32426109, 33272703, 34315932, 35306729, 36124572, 37013680, 38167775, 39210280, 40251357, 41315717, 42298195, 43571970, 44946799, 46409204, 48073760, 49853957, 51878274, 54071810, 56427203, 58945981, 61851372, 65243386, 69173529, 73622642, 78657002, 84412236, 90083332, 94847538, 97806022, 98902962, 98100561, 95609045, 92242547, 89012813, 86520687, 85172670, 84824719, 85487742, 87000696, 89616015, 93444900, 98685039, 105182229, 113393994, 122363205, 130110980, 134983588, 136305349, 133878544, 127619174, 118699746, 109213532, 100662726, 93605239, 88072408, 83794365, 80661601, 78585731, 77334463, 77076466, 77729568, 79256819, 81267847, 83283858]
5614H3283858J544992L71956j145376k749220m060186m854490m935363m540484
5606F2915687l879241l332306k845575k345504j891998j758655j423453j195488
5598D4243467q25229p98014o84467n55407n63177l56940l74799m71502k91109
5589C9322823j16855k27029j44182m3189l8335K01036J23626L51055M60478N44836
5579D0434264P50873P60431Q46829J044724J070508J210725J273733J363342J271934
5570E0027363J357363J386769J598921J697882J818940J970795K158584K239586
5562F4256203K305905K693372K926122L028604L496390L790441M278607N019557
5554I1795201N590479O241688P189258Q286924R685151J0739772J1767271J2497511
$$ y = [83283858, 84828850, 85200806, 84055430, 81306210, 77246024, 72391534, 67456171, 62915687, 59036446, 55704140, 52858565, 50513061, 48621063, 46862408, 45438955, 44243467, 43418238, 42620224, 41935757, 41380350, 40817173, 40460233, 40085434, 39613932, 39322823, 39205968, 38978939, 38834757, 38791568, 38753233, 38954269, 39077895, 39428950, 39889428, 40434264, 41185137, 41945568, 42792397, 43837121, 44907629, 46118354, 47392087, 48755429, 50027363, 51384726, 52771495, 54370416, 56068298, 57887238, 59858033, 62016617, 64256203, 66562108, 69255480, 72181602, 75210206, 78706596, 82497037, 86775644, 91795201, 97385680, 103627368, 110816626, 119103550, 128788701, 139528473, 151295744, 163793255]
5546A63793255J2684234J2711511J2101948J0556579Q405895N438677K525980
5539B28218079J82051j521448k565234m587497o877803q206067r937731j1313729
5531A83390621j0983225q938962n970694l610736k685357k099495j098557j067908
5523A46935687m04179O75139P08271J44147m10100j225288k235194k755951l421214
5514A38011318l685347l283674l356478l660719l404916k221681p74686K48344
5506A17872161o66964k289880l626249n340396p207056p959405p717538o647555
5498G6417118n526320m698228m000059l548976l170348k776856k553357k381186
5490D7761788k077763j866763j752109j728971j719065j591433j432022j328036
$$ y = [163793255, 176477489, 189189000, 201290948, 211847527, 220253422, 225692099, 228218079, 228400130, 226878682, 224313448, 219725951, 212848148, 204642081, 194704350, 183390621, 172407396, 163468434, 157497740, 153887004, 151201647, 149102152, 148003595, 146935687, 146531508, 147206647, 147914918, 148059065, 147648965, 146423677, 144188483, 141432532, 138011318, 134325971, 131042297, 127685819, 124025100, 120620184, 118398503, 117623817, 117872161, 117205197, 114915317, 111289068, 105948672, 98741616, 90782211, 83064673, 76417118, 70890798, 66192570, 62192511, 58643535, 55473187, 52696331, 50142974, 47761788, 45684025, 43817262, 42065153, 40336182, 38617117, 37025684, 35593662, 34265626]
5482C4265626j346460j225337j256624r29912j079094j043244r74410r55994q53387
5473B4601164p91634p99347q27681n72479n61984o97785p41964l91212m70656
5464A8746422m21877m02158l83344m81266m50744n05405m38985m17743m32832
5455A4812068m28214l22774l41081l59961k60399k62023k95130k61434k09892
5446A2071160j86281j57072k75699k38717l31168j60762j39305k77522k61179
5437A0043455l10024j99356j28057k54896k71082j35251j86183j35103k33950
5428H189553j30622L0978r2994k39626j80789j06912o3123o4113n1562o2894k19246
5417G008650j29119j19350j42426r0330o2774p3184j47620K2910K9337p1555K3341
$$ y = [34265626, 32919166, 31693829, 30437205, 29507293, 28428199, 27384955, 26410545, 25454551, 24601164, 23809530, 23010183, 22182502, 21610023, 21048039, 20350254, 19608290, 19217078, 18746422, 18324545, 17922387, 17539043, 17057777, 16607033, 16101628, 15662643, 15244900, 14812068, 14383854, 14061080, 13719999, 13360038, 13099639, 12837616, 12542486, 12281052, 12071160, 11884879, 11727807, 11452108, 11213391, 10882223, 10721461, 10582156, 10304634, 10043455, 9733431, 9534075, 9406018, 9151122, 8880040, 8744789, 8558606, 8423503, 8189553, 8058931, 8089909, 7996915, 7757289, 7576500, 7469588, 7406465, 7342352, 7290790, 7227896, 7008650, 6879531, 6760181, 6617755, 6527425, 6464651, 6391467, 6243847, 6266757, 6296094, 6224539, 6247880]
5406F247880j93728j50106j8063o8768p7316p7243m6631o5700k00315o3488K2910
5395E309432O1901j07603n8412m5122O5549k2877L7352m9850j5465p5358j25239
5384D974308o2626p6859j67308q305r1491j42138n658k2770r148N5445o6008j00502
5372D276940l250k0076m485o7064r0292l4062j05490j01779M1928q7346l7492
5361C767532l7732N2209q9811k2433l9367o6498L2565j7703N379J4350j1157r5707
5349C491627Q185j3388J0714o5338l1188m0008q751J10384p3596k6985l5926N7366
5337C383096j4955o5224r9366R6160J8150O3473J17710j7101j02886j8820M1935
5326C402172J02031j2986j8698l6548L2267P6981l8077M1060J73781R0280J83214
$$ y = [6247880, 6054152, 5904046, 5885983, 5817215, 5739899, 5662656, 5616025, 5550325, 5350010, 5286522, 5309432, 5371333, 5263730, 5205318, 5160196, 5225745, 5202868, 5240220, 5190370, 5174905, 5099547, 4974308, 4911682, 4834823, 4667515, 4659210, 4567719, 4425581, 4419923, 4397153, 4388005, 4443450, 4377442, 4276940, 4273690, 4253614, 4249129, 4182065, 4091773, 4057711, 3952221, 3850442, 3892370, 3805024, 3767532, 3729800, 3782009, 3692198, 3669765, 3630398, 3563900, 3596465, 3578762, 3584141, 3598491, 3587334, 3491627, 3499812, 3486424, 3497138, 3431800, 3400612, 3360604, 3351853, 3462237, 3388641, 3361656, 3325730, 3383096, 3368141, 3302917, 3203551, 3299711, 3317861, 3381334, 3499044, 3481943, 3379057, 3360237, 3402172, 3504203, 3491217, 3472519, 3435971, 3468238, 3545219, 3507142, 3548202, 3721983, 3812263, 3995477]
5315C995477j91187J9392J65433l1947P6565J6126q164k7188p4719o7967N5540
5304C927361n8345M2795J7906o3769L7685M5926K1744M1695J5758k948l5326P1859
5292D062341J20248J2030J3388J09586k1370J3044M2677q9830J41522O9227N4483
5281D527346J35428R1138P4771M8309L7540J61700m533M8151J74105k0878J3654
5270E286731J0967O2722M1147l159P6488J15358J41245K38753l671Q8297K62623
5259F317501K08621J45358J75807L53902L79443M12002R0059J8192l3285j96230
5249G871370l33857l41067k79100r3062k63009k75423l643j62808Q322p8264j03876
5238E945583K5319J01042o5312L0070K4707j4649J10082N8143L1255O3121K5390
$$ y = [3995477, 3804290, 3823682, 3989115, 3957168, 4033733, 4049859, 4041695, 4014507, 3939788, 3871821, 3927361, 3869016, 3911811, 3929717, 3865948, 3903633, 3949559, 3971303, 4012998, 4028756, 4025808, 3990482, 4062341, 4182589, 4194619, 4208007, 4317593, 4296223, 4309267, 4351944, 4262114, 4403636, 4472863, 4527346, 4662774, 4753912, 4828683, 4876992, 4914532, 5076232, 5071699, 5119850, 5293955, 5273077, 5286731, 5297698, 5360420, 5401567, 5398408, 5474896, 5590254, 5731499, 5970252, 5966581, 6054878, 6317501, 6526122, 6671480, 6847287, 7201189, 7580632, 7992634, 8082693, 8100885, 8067600, 7871370, 7537513, 7196446, 6917346, 6824284, 6561275, 6285852, 6282209, 6119401, 6127723, 6049459, 5945583, 5970902, 6071944, 6006632, 6036702, 6061409, 6046760, 6156842, 6214985, 6246240, 6309361, 6334751]
5227F334751N8884J47475m2424O8963Q6746J76403R6875N5964J09743N9979P9901
5216G233260J58678K63837J74057J73257J02694J76005K72742K40917J99131J57172
5206I151750K67881L00469K70727L48677L45154K68398L69587L85726L33093L41295
5196A2382757M71353M15700L54958L73473L73325M77598M50278M88742N88985
5187A6377169O14680N65073Q01526Q90781R32807J016926J033120J259631J242571
5178B4734284R80396Q37133O88517M15721J2905l24056o89888j007947j278229
5169B4368836j166923j105132q16054p40258n61462l28217k10711l14041k94409
5160A8831629K7240k4493j22945j06406j46604k61094k97495j24095j93544k42396
$$ y = [6334751, 6393635, 6541110, 6498686, 6567649, 6654395, 6830798, 6927673, 6983637, 7093380, 7153359, 7233260, 7391938, 7655775, 7829832, 8003089, 8105783, 8281788, 8554530, 8795447, 8994578, 9151750, 9419631, 9720100, 9990827, 10339504, 10684658, 10953056, 11322643, 11708369, 12041462, 12382757, 12854110, 13269810, 13624768, 13998241, 14371566, 14849164, 15299442, 15788184, 16377169, 16991849, 17556922, 18358448, 19249229, 20182036, 21198962, 22232082, 23491713, 24734284, 25714680, 26551813, 27240330, 27656051, 27668956, 27344900, 26655012, 25647065, 24368836, 23201913, 22096781, 21280727, 20540469, 19979007, 19650790, 19440079, 19126038, 18831629, 18858869, 18834376, 18711431, 18605025, 18458421, 18197327, 17899832, 17775737, 17582193, 17339797]
5150A7339797j11156m3247n3257m7960o9269q7474l862L7192m2390M120k46609
5139A6675885j03433j37886j59687l3117n444O2286K3007m3548o3054O8195J52300
5128A6435504J12430K04614Q4889K79931K75377Q8900J25312J01189J2371J17938
5118A7838455l4224K30765L11121K55047K46223L14043M34045M04216L91656L23834
5108B0715181L99784J62800L86419L35555M03863M76313N69103O21821O72451
5099B4743290Q22180Q46085R17982R94042J166028J198618J335949J470505J495889
5090C4990568J665610J668668J814427J801557J724803J804135J738563J755768
5082D8964099J733934J913950K120747K182624K269886K250372K485011K298017
$$ y = [17339797, 17228641, 17185394, 17132137, 17084177, 17014908, 16927434, 16923572, 16960764, 16918374, 16922494, 16675885, 16572452, 16434566, 16274879, 16241762, 16236318, 16298604, 16321611, 16278063, 16215009, 16283204, 16435504, 16547934, 16752548, 16837437, 17117368, 17392745, 17481645, 17606957, 17708146, 17720517, 17838455, 17804231, 18034996, 18346117, 18601164, 18847387, 19161430, 19595475, 19999691, 20391347, 20715181, 21114965, 21277765, 21664184, 21999739, 22403602, 22879915, 23449018, 24070839, 24743290, 25565470, 26411555, 27329537, 28323579, 29489607, 30688225, 32024174, 33494679, 34990568, 36656178, 38324846, 40139273, 41940830, 43665633, 45469768, 47208331, 48964099, 50698033, 52611983, 54732730, 56915354, 59185240, 61435612, 63920623, 66218640]
5074F6218640K344322K419936K501961K561029K795655L178899L708565M044518
5066H9773525M625934M999844N284587N281836N326535N446951N624927N572009
5058A31936148N441898M909384M548696M206828M291731M451543M789825N288369
5050A69864422N774588O194457O546010O559067O491894N980656N394244M709453
5042B17514791M172218L922234M031001M310985M389125L717241K872164J559888
5034B46489647M8604j287527j513041q12661J213960K495494M192918O686139
5026B57513533R804983J2076264J4874915J6687649K1031854K7994283M0522219
5019D00505700L7397858R897638Q93908j1840130l9254484n2867523n0691435
$$ y = [66218640, 68562962, 70982898, 73484859, 76045888, 78841543, 82020442, 85729007, 89773525, 94399459, 99399303, 104683890, 109965726, 115292261, 120739212, 126364139, 131936148, 137378046, 142287430, 146836126, 151042954, 155334685, 159786228, 164576053, 169864422, 175639010, 181833467, 188379477, 194938544, 201430438, 207411094, 212805338, 217514791, 221687009, 225609243, 229640244, 233951229, 238340354, 242057595, 244929759, 246489647, 246538251, 245250724, 243737683, 242925022, 244138982, 246634476, 250827394, 257513533, 267318516, 279394780, 294269695, 310957344, 331989198, 359983481, 400505700, 437903558, 447801196, 448695104, 436854974, 397600490, 344732967, 294041532]
5012B94041532l9618739k8203744k2286454j7983135j4756065j2503049j0771537
5005A47918809r154189p973178p494895p193091o365043n419774m838785m519297
4997I4960557l955529l530007l389355l100373l036409l007036k881299l112331
4989F8948218k974140k855575k532967k188740j859776j676478j520960j529197
4981E1810385j279444j143817j149931j169785j042475q63807r26366n89636p31250
4972D2913874o17294n67860n16862l83411m07301m07252n61773n15519n46501
4963C8390101o81769p81565p30517q15409q55937o69022p79982p09994o77789
4954C1688117m84587m18287l90710k71607j83641j0507o384j42595Q9068J89243
$$ y = [294041532, 254422793, 226219049, 203932595, 185949460, 171193395, 158690346, 147918809, 138764620, 130791442, 123296547, 116103456, 109738413, 104318639, 99479854, 94960557, 91005028, 87475021, 84085666, 80985293, 77948884, 74941848, 72060549, 68948218, 65974078, 63118503, 60585536, 58396796, 56537020, 54860542, 53339582, 51810385, 50530941, 49387124, 48237193, 47067408, 46024933, 45161126, 44234760, 43645124, 42913874, 42296580, 41728720, 41211858, 40828447, 40421146, 40013894, 39452121, 38936602, 38390101, 37708332, 36926767, 36196250, 35380841, 34524904, 33855882, 33075900, 32365906, 31688117, 31203530, 30785243, 30394533, 30122926, 29939285, 29928778, 29922394, 29779799, 29868867, 30058110]
4944C0058110K89618L61061N74210P70252R19395J276079J695681K256866K704246
4935D0905518L528384M452593L809675K047203P02825o57884l269787n177295
4927D6341232n546035m516400l390403k613343k040750j904373j475796j101025
4919B3753107r66728r75946p28491o35448o09953m67143n69252l73347l70727
4910A8056072l08477k24718j84137j57892k01397j85842j46580r7859j77420m8624
4900A6323126o3750N4975J76971L3675J70877l778J70052K11817J64399K68521
4890A7506885L25572L97522L13874N81676M43715N17093N02081O59570Q03997
4881B2051985M58069M42262M33121M88698M82695N35586O93754P14793Q44721
$$ y = [30058110, 30347728, 30708789, 31282999, 32053251, 32972646, 34248725, 35944406, 38201272, 40905518, 44433902, 48886495, 52696170, 54743373, 55446198, 54788314, 51518527, 46341232, 40795197, 36278797, 32888394, 30275051, 28234301, 26329928, 24854132, 23753107, 22786379, 21810433, 21081942, 20446494, 19836541, 19369398, 18800146, 18426799, 18056072, 17747595, 17522877, 17338740, 17180848, 16979451, 16793609, 16647029, 16549170, 16371750, 16323126, 16259376, 16314351, 16491322, 16524997, 16695874, 16692096, 16862148, 17073965, 17238364, 17506885, 17832457, 18229979, 18543853, 19125529, 19569244, 20086337, 20588418, 21247988, 22051985, 22510054, 22952316, 23385437, 23874135, 24356830, 24892416, 25586170, 26300963, 27145684]
4872B7145684R31100J090997J198850J181569J233406J497949J523391J501098
4864C7304044J678418J732590J693392J764509J830687J806763J874408J933066
4856E1617877K177912K374922K547362K784873L015507L340015L778286M424111
4848G6060865M957310N920559O624795P519636Q753938R822575J1564258J3381002
4840A44604938J6097172J9149058K3177865K8079188L2351453L1550206K0833582
4833C15843462O435486r341450k5737441l4829730l4395267k8481637k2326695
4826A67166728j7720831j4358200j1526871r193570p371237o010777m716743l708467
4818I2560032l109516k890991k602963k840279l423372l506082l657225l729647
$$ y = [27145684, 28076784, 29167781, 30366631, 31548200, 32781606, 34279555, 35802946, 37304044, 38982462, 40715052, 42408444, 44172953, 46003640, 47810403, 49684811, 51617877, 53795789, 56170711, 58718073, 61502946, 64518453, 67858468, 71636754, 76060865, 81018175, 86938734, 93563529, 101083165, 109837103, 119659678, 131223936, 144604938, 160702110, 179851168, 203029033, 231108221, 263459674, 295009880, 315843462, 322278948, 312937498, 287200057, 252370327, 217975060, 189493423, 167166728, 149445897, 135087697, 123560826, 114367256, 106996019, 100985242, 96268499, 92560032, 89450516, 86559525, 83956562, 81116283, 77692911, 74186829, 70529604, 66799957]
4810F6799957l419867l171949k941581k959136k952924k953337l039092k707028
4802D2655043k388792k114314k025528j743741j565184j442440j230706j122703
4794B9021635j112799r33298q40936q46334q85287p74466o29454o90675o95693
4785B1612693n65017n17891m51876k13471l45106m38273m46424m32872p30971
4776A7470792p77722o52146p61343m98188l99809n56272m72225l82697m63840
4767A2506550l85114k21730k40406k12192k53683k18144j51103j61140j58209
4758A0504829j72530j58761j48032n4783l18110j53854j95318j81579p0502j17892
4748H933468j35268j18244j42427j4361j23748j67486r3226o9654j89991k7296
$$ y = [66799957, 63380090, 60208141, 57266560, 54307424, 51354500, 48401163, 45362071, 42655043, 40266251, 38151937, 36126409, 34382668, 32817484, 31375044, 30144338, 29021635, 27908836, 26975538, 26134602, 25288268, 24402981, 23628515, 22999061, 22308386, 21612693, 21047676, 20529785, 20077909, 19864438, 19519332, 19081059, 18634635, 18201763, 17470792, 16693070, 16040924, 15279581, 14781393, 14381584, 13825312, 13353087, 12970390, 12506550, 12121436, 11899706, 11659300, 11447108, 11193425, 10975281, 10824178, 10663038, 10504829, 10332299, 10173538, 10025506, 9970723, 9652613, 9498759, 9303441, 9121862, 9051360, 8933468, 8798200, 8679956, 8537529, 8523168, 8399420, 8231934, 8138708, 8069054, 7879063, 7851767]
4738G851767m5443j02157k07554j00169j03717k13347k6449o8249j37968j50064
4728F696650O651K3652Q7035n7946k5687j32592k54644k63255j92225j21102p5970
4717E690567o6926p2635m7562r0829j41207P8272R3606N9522o6848J09743q061
4706E537642r4896M3910j27175j60980k88072j85884m1523l0597p7968j12623
4696D461834j11740l1225j15711j82943N0651M7352k8204k3307p7507o1521q0918
4685C846761r2300R749k8239j782M331j0708r1937n5606m2662Q9322m5997K2721
4673C603653J32800J19019K6102N6202K53127J14347J69269K55247L40502L66140
4663E436408O66705N43794K78339P3051k57817n85125o68780n59890l37320k76881
$$ y = [7851767, 7806324, 7704167, 7496613, 7396444, 7292727, 7079380, 7052931, 6984682, 6846714, 6696650, 6703301, 6726953, 6813988, 6756042, 6730355, 6597763, 6343119, 6079864, 5887639, 5766537, 5690567, 5623641, 5551006, 5503444, 5412615, 5271408, 5349680, 5443286, 5502808, 5435960, 5545703, 5537642, 5442746, 5486656, 5359481, 5198501, 4910429, 4724545, 4683022, 4652425, 4574457, 4461834, 4350094, 4318869, 4203158, 4020215, 4070866, 4118218, 4090014, 4066707, 3989200, 3927679, 3846761, 3754461, 3764210, 3735971, 3734189, 3738520, 3727812, 3635875, 3580269, 3537607, 3626929, 3580932, 3603653, 3736453, 3855472, 3881574, 3937776, 4190903, 4305250, 4474519, 4729766, 5070268, 5436408, 6103113, 6646907, 6925246, 6998297, 6740480, 6155355, 5486575, 4926685, 4589365, 4312484]
4653D312484k47831k35357k66605j04841r8231r1993k6864L2590Q4041q4912k5863
4642C246618p780J1280j08672r4288N9280j17528r5212r115N5178k2875o5866
4631B851020j16635K4757n4539j07112J14470k853L3837r729j68306L3398M1340
4620B639648m2969o9978K6210J12204Q3121Q0659N0475L5795j6156J27557L9354
4609C065920J39464J96923J26827J92462K7626p2600j83342j77816j07338j48400
4599C059726l4419K283l3487m8218k5516j32615L7276J45333K6623j81010j02732
4588B713244J01233P4416l1058p3112L3941j0463k9235J17215l0775J01850L8334
4577C005590K5362J69743J07721J54374K67656J73196K36700K26730K04122J8333
$$ y = [4312484, 4064653, 3829296, 3562691, 3457850, 3359619, 3267626, 3240762, 3273352, 3357393, 3272481, 3246618, 3238838, 3250118, 3141446, 3047158, 3106438, 2988910, 2893698, 2884583, 2939761, 2916886, 2851020, 2734385, 2759142, 2704603, 2597491, 2711961, 2709108, 2742945, 2733216, 2564910, 2598308, 2639648, 2596679, 2526701, 2552911, 2665115, 2748236, 2828895, 2879370, 2915165, 2899009, 3026566, 3065920, 3205384, 3402307, 3529134, 3721596, 3749222, 3676622, 3493280, 3315464, 3208126, 3059726, 3025307, 3027590, 2994103, 2945885, 2920369, 2787754, 2825030, 2970363, 2996986, 2815976, 2713244, 2814477, 2888893, 2857835, 2784723, 2818664, 2808201, 2778966, 2896181, 2865406, 2967256, 3005590, 3030952, 3200695, 3308416, 3462790, 3730446, 3903642, 4140342, 4367072, 4571194, 4589527]
4567D589527l7766r0615j63993k94333l28740k20256j20445j76051j49846j71993
4557B835489j97525m5869j47308j14037R216j6003j24450k8967L5800o3211k23205
4546A919930M6075j15277l9097J2732l5804k5124N676J2616N064j4222l44j77510
4534A594715J7477M0114O3844k7385n7654j01826J49657j11967p1995m4996J0226
4523A460210l6392M2998R3545j65655o4602Q8292j0282M1208o3698l5577R376
4512A359423J5253l9018j12427k5468q567M5050r786n9490m7008n01o8862O6557
4500A115156L9571r7188l9695n3293j2585M4804P2116L5127l9744j3781j2895
4489A037593J1740m4211p87j22068k6017m6544m2647P3189O9929K2246q4680n6353
$$ y = [4589527, 4551761, 4461146, 4297153, 4002820, 3674080, 3453824, 3333379, 3157328, 3007482, 2835489, 2637964, 2592095, 2444787, 2330750, 2339966, 2323963, 2199513, 2170546, 2206346, 2143135, 1919930, 1966005, 1850728, 1811631, 1824363, 1788559, 1763435, 1769111, 1781727, 1786791, 1772569, 1772225, 1594715, 1612192, 1652306, 1716150, 1688765, 1631111, 1529285, 1678942, 1566975, 1494980, 1449984, 1460210, 1423818, 1466816, 1560361, 1394706, 1330104, 1418396, 1408114, 1449322, 1385624, 1350047, 1359423, 1374676, 1335658, 1223231, 1197763, 1189196, 1234246, 1224460, 1164970, 1117962, 1117461, 1048599, 1115156, 1154727, 1057539, 1017844, 964551, 951966, 996770, 1068886, 1104013, 1064269, 1050488, 1037593, 1049333, 1005122, 1004335, 882267, 856250, 809706, 767059, 840248, 910177, 932423, 847743, 791390]
4477G91390N0923J9170Q545j15563J4572P4839K1232l469K3692O2737n3726j50542
4465G43800O1141L2139p8958m0558j8150l9941L9515m428L284r1477J46495m0547
4453G12315l2263j6168O3808Q0586M2590m1134o8831J0642O006o4979m6468P3670
4441G19774n8247K488Q5103o2342j2729O9883P3351p7603j44041J1232l1155M285
4429E79999O6174j5573l1193o9655q198J07446k3247P66j1025Q861N2825m0088
4417F17092P4645m3103m4764l62m3291N9804J00537O541n6617q2447k5396p703
4405E54936K990m2633L034J8199N7912j14661J7872M9845m9344N7443m57Q490
4393E63626j6929O9686m5792J20165o5801n2801p000r107Q7573O1853j5136m5563
$$ y = [791390, 842313, 861483, 870028, 754465, 769037, 843876, 865108, 861639, 885331, 948068, 894342, 743800, 804941, 837080, 758122, 717564, 699414, 659473, 698988, 694560, 697844, 606367, 752862, 712315, 680052, 663884, 727692, 808278, 850868, 809734, 740903, 751545, 757551, 692572, 646104, 719774, 661527, 664015, 749118, 686776, 674047, 743930, 817281, 739678, 595637, 606869, 575714, 579999, 646173, 630600, 599407, 529752, 521554, 629000, 605753, 606519, 595494, 604355, 657180, 617092, 691737, 648634, 603870, 603508, 560217, 620021, 720558, 727099, 670482, 588035, 562639, 554936, 557926, 515293, 518327, 536526, 594438, 479777, 497649, 547494, 498150, 555593, 555136, 563626, 546697, 616383, 570591, 690756, 624955, 572154, 565154, 556047, 643620, 705473, 690337, 644774]
4381F44774J299L4705n9411R7996k5280J41061K849j13949L2653J8197p422L6974
4369H04446M42q5300J30373L1006l597J2586J11983m7963m402K6564l4107k5340
4357I16691j24283p5316K861J28249r0426j11669M3436l8851o2090Q676N8177
4346F55455P435o7922p9793J20063J5129n0319L837j3080k0692M7768J3400j22797
4334E08484j19845l2896L0287O0954r1768j2727J9378j8239J08618M9051n3487
4323D47810o2340n9957k0090J11306N9519q7129j7672j8407o4174K8055k8622
4312B88299K4052j3837K6057j6015O595r0259O2508L4172k0126o372j4054l1224
4300B49796q6281J2494M5960l8689K6823j6667p0056J23357K9822o1909L0546
$$ y = [644774, 646073, 680778, 621367, 719363, 694083, 835144, 837993, 724044, 756697, 774894, 767472, 804446, 804888, 719588, 849961, 880967, 877370, 889956, 1001939, 953976, 949574, 976138, 942031, 916691, 792408, 717092, 719953, 848202, 757776, 646107, 689543, 650692, 588602, 597278, 655455, 662890, 594968, 515175, 635238, 650367, 600048, 603885, 590805, 570113, 617881, 631281, 508484, 388639, 355743, 386030, 446984, 355216, 342489, 361867, 343628, 452246, 501297, 447810, 385470, 325513, 305423, 416729, 476248, 389119, 371447, 353040, 288866, 316921, 288299, 312351, 298514, 324571, 308556, 315151, 224892, 287400, 321572, 301446, 295074, 281020, 249796, 163515, 176009, 221969, 183280, 210103, 193436, 123380, 246737, 276559, 214650, 245196]
4289B45196k8664N4934p9804k0645P8630p9085P1023K855j09400J04787k7060
4278B12767O3641n9855m1610M4229l3041J02156K113N1916j58312L2743J18876
4267C35623O845l0351q4203Q2968O6204k8852o7379J1655N2568l9857m9941j2097
4255B43183K5246r272j8044N3777J9770j73793Q3364K9357N7695m9842n67M5463
4243C06337L1368O0373j43385r775q4810J11185O1144m4095n0079n5395N559r471
4231A78956Q072N3341L4110M9766n9228J8659M1734K9065l9881o1599j02015N6810
4219B07790Q0409j17685R235R4291p8370O6218J46978j8796p6680j19734M2440
4208B36096n1973k5921J22745L4402r0014j07011Q8339Q502m6998K1044o969P8988
$$ y = [245196, 216532, 271466, 191662, 171017, 249647, 170562, 241585, 244440, 135040, 239827, 212767, 276408, 216553, 174943, 219172, 186131, 288287, 290400, 342316, 184004, 216747, 335623, 342468, 312117, 227914, 310882, 377086, 348234, 280855, 292510, 345078, 305221, 255280, 243183, 268429, 259157, 241113, 294890, 314660, 140867, 224231, 253588, 311283, 261441, 260874, 306337, 337705, 398078, 254693, 244918, 160108, 271293, 332437, 288342, 238263, 182868, 188427, 178956, 187028, 240369, 274479, 324245, 265017, 283676, 325410, 354475, 314594, 252995, 150980, 207790, 288199, 170514, 179749, 274040, 195670, 261888, 408866, 390070, 313390, 193656, 236096, 184123, 158202, 280947, 315349, 225335, 118324, 206663, 215165, 168167, 189211, 182242, 261230]
4196B61230J5154r129o1645J3826j1733n4834J635m279P4205J0355K7668k829
4184B59624K786P1206r542l6695k3097L3227r7840P044P9227M9635p4799n0831
4172B09945L0263J23021O8707o3533j31317J16673m174j14412m4359O8147o2293
4161A96668N0603j5943J3187M8114j5425R849O6314k8821R0295N5972j93855q9665
4149A87293j158K1926M8909j22841O1908Q8854q0291k4374Q2003J4749L9437K5407
4137C41822p1134l0981n8636j4410R9391n2913l2433j4448j120l9677L1225R0177
4125B46863k2286Q7748k6698N0279j26671j0883M0731q635O9651J1192K7687o7346
4113B71632P7567j4049J3354k9279m5202Q7109j13668q0404L3494O562l9655J21889
$$ y = [261230, 276384, 267255, 205610, 219436, 207703, 152869, 154504, 150225, 224430, 234785, 262453, 259624, 262410, 333616, 324074, 287379, 264282, 297509, 199669, 206713, 285940, 335575, 260776, 209945, 240208, 363229, 431936, 368403, 237086, 353759, 349585, 235173, 190814, 258961, 196668, 247271, 231328, 244515, 292629, 277204, 287053, 353367, 324546, 414841, 470813, 276958, 187293, 186135, 208061, 256970, 134129, 196037, 284891, 204600, 180226, 262229, 276978, 316415, 341822, 270688, 239707, 181071, 166661, 266052, 213139, 180706, 166258, 165138, 125461, 156686, 246863, 224577, 312325, 285627, 335906, 209235, 198352, 239083, 230448, 300099, 311291, 338978, 271632, 349199, 335150, 348504, 319225, 274023, 361132, 247464, 167060, 200554, 207116, 167461, 289350]
4101B89350n9795M2460M1624M5350q0317Q5296L4602k8506o6437M1963L4209K8977
4089D08776k9467m3684J2426p4949J0267M7657k9991O2003q3515l0034J41910
4078C91399L8704m0565M2220p1780J2658J7223m1412O0258L2142r3162J5782j6022
4066C47445L2157L468J59389M7947j15348j12278J09128P1946j4521j17587j4692
4055C97054J05485j7832N6998M887P5813k2119k6704o70m4221l9997J53929p644
4043F34979l1747O2962J7813l2491j7370P71m4340M1453j7923J0542J00961q9135
4031F36475J07723n5331k6005L6715R863O2758r1010J1776J50898m7703L1574
4020H27733J00203Q3387p5725K1657o934L2301Q088J00440j2398L0075Q1015j9422
$$ y = [289350, 229555, 272015, 313639, 358989, 278672, 363968, 398570, 370064, 303627, 345590, 379799, 408776, 379309, 335625, 348051, 273102, 283369, 331026, 301035, 363038, 279523, 249489, 391399, 430103, 389538, 431758, 359978, 372636, 389859, 348447, 408705, 440847, 347685, 363467, 347445, 379602, 383070, 542459, 590406, 475058, 362780, 471908, 543854, 529333, 411746, 397054, 502539, 484707, 541705, 546592, 622405, 600286, 573582, 572912, 528691, 488694, 642623, 634979, 603232, 666194, 684007, 651516, 634146, 634917, 590577, 632030, 614107, 624649, 725610, 636475, 744198, 688867, 662862, 699577, 709440, 772198, 681188, 692964, 843862, 796159, 827733, 927936, 1011323, 935598, 957255, 950321, 982622, 990710, 1091150, 1078752, 1108827, 1189842, 1170420]
4008A170420N7746o3462l50n4937K4580J32596l6518R1204J49890m7664M3822
3997A467327Q1392P0259M0424N2940N9597R768L6638J77402M2792O222R80R195
3985B054936K5841K20172K8769R8469P1409J03637J30005M4148J62985J14390
3975C054761P3632J70506K00599J93018J80067K98428K37558K08251K68472K25127
3965E110419J57698K4082R7586j13049j14753l20748m11692j83100j94038k95357
3955C757048p6143j88762o6365k2303k10006k2955r750j77227r0178n3635L5861
3944B875585j2668j00709o0352r9271J366n6581j32772N4287Q932j14166K7228
3933B390879r5818J3956O905o8795N7450o9303m5423P5593J70575m3604Q6815
$$ y = [1170420, 1228166, 1164704, 1164354, 1109417, 1133997, 1266593, 1230075, 1321279, 1471169, 1423505, 1467327, 1548719, 1618978, 1659402, 1712342, 1771939, 1781707, 1818345, 1995747, 2038539, 2044761, 2045741, 2054936, 2080777, 2300949, 2329718, 2428187, 2499596, 2603233, 2733238, 2777386, 2940371, 3054761, 3128393, 3298899, 3499498, 3692516, 3872583, 4171011, 4408569, 4616820, 4885292, 5110419, 5268117, 5292199, 5389785, 5276736, 5161983, 4841235, 4429543, 4246443, 4052405, 3757048, 3680905, 3492143, 3425778, 3403475, 3193469, 3170514, 3160764, 2983537, 2893359, 2839724, 2875585, 2862917, 2762208, 2701856, 2602585, 2603951, 2547370, 2414598, 2468885, 2477817, 2363651, 2390879, 2295061, 2309017, 2315922, 2247127, 2304577, 2235274, 2189851, 2265444, 2436019, 2392415, 2479230]
3922B479230O5064K58393J97995J20975N7061J3725K3852k10101j60592j74420
3912B671182j44762q6019j81711q1400j499j0141M2826l0607J8320l2655J29947
3901B293481J96033J21520J55040K84677K90847L47876L50288M9638K2585j68712
3891C943273k99862k02998l02507m44166k76381j89751j47757r5706l9350K333
3881A947128m6145j62111N1057m947J5162m0682k79K17854R1612J54783J0007
3870B233439L8685j3098r733j78522j27126k15015j93827j03016j14666j5196
3860A301925n6409j36543p0527N8191j11122k5834r1843n6404K2695j5773M4925
3849H63281k1496J6460j18538M9155q1007m643O8747n1031K093l0083L2145J3593
$$ y = [2479230, 2544294, 2802687, 3000682, 3121657, 3178718, 3192443, 3216295, 3006194, 2845602, 2671182, 2526420, 2440401, 2258690, 2177290, 2175791, 2165650, 2208476, 2177869, 2196189, 2163534, 2293481, 2489514, 2611034, 2766074, 3050751, 3341598, 3689474, 4039762, 4089400, 4111985, 3943273, 3643411, 3440413, 3137906, 2693740, 2417359, 2227608, 2079851, 1984145, 1944795, 1947128, 1900983, 1738872, 1789929, 1784982, 1800144, 1759462, 1759183, 1977037, 2068649, 2223432, 2233439, 2272124, 2259026, 2249293, 2070771, 1943645, 1728630, 1534803, 1431787, 1317121, 1301925, 1245516, 1108973, 1038446, 1096637, 985515, 959681, 867838, 811434, 834129, 818356, 863281, 841785, 858245, 739707, 788862, 707855, 703212, 771959, 720928, 723021, 692938, 725083, 738676]
3837G38676p8234m0502L6668K8603p7378m973K6742j9786k7333J12n8868Q9823
3825F13550K5498k3269J8530p3691j0275R6838N023j10162k7171j13048J0296
3814D12119M5520p6817O9168O6789j10016J29166k2203J4270P030p5506r1232
3803C68288r457J04749r845m8091n370N433j46270R7229K7549p586M7740j2565
3791D11804l2855P9659q5826p8725J1807N9155L6551K0615N6513q9923K3281K7548
3779D39604q8m6765k699j3016p6372R9520M990N0247n4516J8054j5590J1110Q0726
3766D95205k7545k6853J1111p4027j7764P5086N7826J28475j1136o6343L0193
3755E74228m2830o7940M2534J7478J13609r2450o9538Q5667Q1444m2221J9673
$$ y = [738676, 660442, 619940, 656608, 685211, 607833, 602860, 629602, 609816, 582483, 582595, 523727, 613550, 639048, 615779, 634309, 560618, 550343, 647181, 652204, 542042, 514871, 401823, 412119, 457639, 380822, 449990, 516779, 406763, 535929, 513726, 527996, 535026, 459520, 368288, 358831, 463580, 453735, 405644, 400274, 405707, 259437, 356666, 384215, 376629, 424369, 411804, 378949, 458608, 372782, 294057, 305864, 365019, 401570, 422185, 478698, 388775, 412056, 439604, 439516, 392751, 390052, 377036, 300664, 400184, 405174, 455421, 400905, 418959, 403369, 414479, 495205, 467660, 440807, 451918, 377891, 360127, 435213, 493039, 621514, 610378, 544035, 574228, 531398, 463458, 505992, 523470, 637079, 544629, 475091, 560758, 642202, 599981, 619654]
3744F19654Q5425Q8430p6738N8605L4750j20184M0938O1751L4574K5264m276P2032
3732I20225P8530l1461Q863q3163J12102Q6503P2743L779M5523k8006M4577j6090
3720A214125Q1161J35457l4342M143N8337K0586J17512J06808K3750R6244K8551
3709A852332J37811o2721q5684O8132O339q1244o4599j53994J13943q7178N2409
3698A695546j6979O1760J47301o1292J2423j9015J15179m3106N8865R9214n5367
3687A994529r8665K697Q1901K8077j73148j36286O9738j48226r6275n3105K0371
3676A491608p5011r494L175N554O1063p1882p885K1760k0292r5125p9942p5057
3664A148472j03337M0140j70190O1392L5k14693R678j8674J8165m9983q3002j1470
$$ y = [619654, 705079, 793509, 716771, 775376, 810126, 689942, 730880, 792631, 827205, 852469, 848193, 920225, 998755, 967294, 976157, 892994, 1005096, 1091599, 1164342, 1168121, 1213644, 1185638, 1230215, 1214125, 1295286, 1430743, 1396401, 1400544, 1458881, 1479467, 1596979, 1703787, 1727537, 1823781, 1852332, 1990143, 1927422, 1841738, 1909870, 1916209, 1834965, 1770366, 1616372, 1730315, 1643137, 1695546, 1678567, 1740327, 1887628, 1826336, 1838759, 1819744, 1934923, 1891817, 1950682, 2049896, 1994529, 1895864, 1898561, 1980462, 2008539, 1835391, 1699105, 1768843, 1620617, 1524342, 1471237, 1491608, 1416597, 1407103, 1410278, 1415832, 1476895, 1405013, 1397128, 1418888, 1398596, 1303471, 1223529, 1148472, 1045135, 1085275, 915085, 976477, 976512, 761819, 771497, 752823, 770988, 721005, 638003, 626533]
3652F26533K9058j49226q9246P7970m4216n034J088o8271j3977J44091p3267L2286
3640D67789K3130L4810k1245n0873p0740L3396j04033m9677N1924N948j12766
3629B07663J497j464J05257Q7667r5481R446n8580o8890Q9630j1600q2143K1405
3617B04407P0442O341p9062p115J7576N461q5601l5531j1639O6105m2984M7985
3605A56385l3733l2748l8328J7334M9136K6105l8817O1889j13174m6614J3998
3594B1433J06224k4876K0857l6179R991K8475o237O8014k8497k6386M2860k14724
3582c9045J3577Q4343N6588l6432Q202M2804k2910J3211n2493q5972Q6928K4477
3570I3278o4528M9425J5561l802n3921k0601n3695K3035J08988j65293k6085J16626
$$ y = [626533, 655591, 506365, 417119, 495089, 450873, 445839, 446927, 378656, 364679, 508770, 435503, 467789, 490919, 525729, 504484, 453611, 382871, 416267, 312234, 262557, 314481, 320429, 207663, 209160, 207696, 312953, 400620, 305139, 314585, 256005, 187115, 276745, 265145, 183002, 204407, 274849, 281190, 202128, 195013, 212589, 218050, 132449, 96918, 85279, 151384, 108400, 156385, 122652, 89904, 51576, 68910, 118046, 144151, 105334, 167223, 54049, 7435, 21433, 127657, 102781, 123638, 87459, 97450, 125925, 119688, 187702, 159205, 132819, 175679, -39045, -25468, 58875, 115463, 79031, 87233, 130037, 107127, 120338, 67845, -18127, 68801, 93278, 28750, 78175, 93736, 89934, 36013, 15412, -38283, -15248, 93740, -71553, -97638, 18988]
3558A8988l0145O186J22465n595m5643L4300j7605j35125K1563J13420L618m5566
3546D0861l6573j00648N1910Q6311n5575P9244l7216k2583j1581k4455l4951N0255
3534a5001K0293Q8022m9443q7234n5789P5317M2136n2431N4551j6858j9078O4381
3522D8866J7090j6876Q37o688L1952j56533L9951N509p2051O9874Q6401m3086
3510E246N6413j00698M8304p0944m4798J01755l8463q289n2001N3982O7878L0108
3498D8493j5076n158j841N4835m3269l4235l764q5746L148J05623m6807k2854
3486d6651K0947O4242N465l5304k5637j0421r353n792K4368M3607j07600N5794
3474b6335n4110M3822K2613K8339n3249P9579k520J390k5439M0120J8173p7285
$$ y = [18988, -11157, -4971, 117494, 111899, 66256, 100556, 82951, -52174, -30611, 82809, 86427, 40861, 4288, -96360, -44450, 41861, -13714, 65530, 28314, 5731, -5850, -30305, -65256, -15001, 5292, 93314, 43871, -43363, -99152, -23835, 18301, -34130, 20421, 3563, -15515, 48866, 65956, 49080, 49917, 43229, 75181, -81352, -41401, -35892, -107943, -38069, 48332, 5246, 61659, -39039, 9265, -61679, -106477, -4722, -43185, -51474, -103475, -49493, 18385, 48493, 33417, 28259, 26418, 81253, 37984, 3749, -15, -85761, -82613, 23010, -23797, -46651, -25704, 38538, 44003, 8699, -16938, -27359, -36712, -42504, -18136, 25471, -82129, -26335, -80445, -36623, -14010, 14329, -38920, 40659, 38139, 39529, 14090, 54210, 72383, -4902]
3462d902l4239J02742l7737k0105j8620j04447J8188M5832m0896K9846K0050J09644
3450F5356j0560j2419J4197n8180j6599m5956M8697k7517j9192j6242M585m0227
3438a14057K3238J43823n4914n3267R168l3690Q1552l4363k9267K7483Q3788j5213
3426C4281q8022L5779K7070r6388J06399J3629r4677o7674M4582J2297P3433l6927
3414c6218n9587P9058O9985p0589m5417L2695n9882n329K4188Q7404j10949K9147
3402f5494n9858r65m9803o786O1350J7596l5096O9039q0885J8990K791q3248L0950
3389a81419J30858J2310r7568J3881J50656J07427j03231o6974p8746O8065j8874
3378f3615J9163k3794M3270j32040N4762M4945P1997k1204O9323j6127n1151L5270
$$ y = [-4902, -39141, 63601, 25864, 5759, -12861, -117308, -99120, -53288, -94184, -64338, -44288, 65356, 54796, 42377, 56574, -1606, -18205, -64161, -15464, -42981, -62173, -78415, -73830, -114057, -90819, 53004, -1910, -55177, -46009, -79699, 1853, -32510, -61777, -34294, 49494, 34281, -53741, -17962, 9108, -87280, 19119, 32748, -61929, -129603, -85021, -72724, 709, -36218, -95805, -16747, 53238, -17351, -62768, -30073, -89955, -95284, -71096, 16308, -94641, -65494, -125352, -126317, -176120, -182906, -121556, -103960, -139056, -70017, -150902, -131912, -129121, -212369, -181419, -50561, -38251, -135819, -121938, 28718, 136145, 32914, -34060, -112806, -44741, -63615, -44452, -68246, -24976, -157016, -102254, -57309, 14688, -6516, 62807, 46680, -4471, 30799]
3366C0799j6855l1152m106p6906m0110M171Q1727L4472l2115L3385J25m5244K8503
3353c3306J27325p427j09642L6916r0571R2648r2444l0860J4164n677J08755Q7201
3341I7082k9543k02057N1626n3025j2017Q1223m7023k8841N025Q5312Q0994j31469
3329a02713J10722l792o9094N2541K988J3014n4925j319q1828k6956M4415P02
3317a16245J40288R0644M7585J3485j99326L0057P937O0k1743q9981J57271l425
3305E6607j39173O8278J9240k2539J6751m0930j01390N528O8398M7585j9526j03583
3293a44754L8553J11970m7031p4876j5837K1708l5214N6816J4670M0921N2471
3282A9397o4495j3098R0097O6999j1676Q0386k0144m6380r7792j7871M1699j738
$$ y = [30799, 13944, -17208, -21314, -98220, -138330, -134159, -52432, -17960, -50075, -16690, -16565, -61809, -33306, 94019, 86592, -23050, 13866, -76705, 15943, -76501, -107361, -93197, -98874, 9881, 97082, 67539, -134518, -82892, -135917, -147934, -66711, -113734, -142575, -137550, -52238, 28756, -102713, 8009, 4217, -64877, -12336, -9348, 3666, -51259, -52578, -134406, -161362, -116947, -116245, 24043, 114687, 162272, 175757, -23569, 6488, 14425, 14485, -7258, -97239, 60032, 56607, -82566, -14288, 4952, -17587, -836, -41766, -143156, -137628, -69230, -21645, -41171, -144754, -106201, 5769, -41262, -116138, -131975, -110267, -145481, -88665, -73995, -33074, 19397, -45098, -58196, 31901, 98900, 87224, 167610, 147466, 101086, 3294, -14577, 27122, 25384]
3270B5384l7883o0790n746P9026L0259l2578j8685n7529L578P8500o1578Q7143
3258B9101l0344m3832O4776k2681j4148N2860r8670L9283Q557j82240J1920J17418
3246f8000P7739M7209j25768K0684k5124L0815M1470K4191m5257J8607o6887J8191
3234e2130p0930N3635O080n5322J22062J2728k5966o7245M911J05264j28158l1527
3222a26598O6072P4495O9812j76636M559J02085l489n195p428K7084q3004N5946
3210b297m4953L3607P8995p9646P6001l1853m4795r2895J09584K7215l2804n7089
3198f0930Q8514M8202m1247R5704j17823r7200N9348l666j8656L5732m8549L3998
3186b6573M4886J1576M7620o7247J30083p8506J933K580m3132L3200Q924n2597
$$ y = [25384, -12499, -73289, -79035, -9, 30250, -2328, -21013, -78542, -74964, 3536, -58042, 29101, -1243, -45075, 19701, -2980, -17128, 35732, -62938, -23655, -15098, -197338, -185418, -68000, 9739, 56948, -68820, -48136, -73260, -42445, -975, 23216, -22041, -3434, -70321, -52130, -123060, -69425, -63345, -118667, 3395, 16123, -9843, -77088, -72177, 33087, -95071, -126598, -60526, 13969, 83781, -92855, -88296, 13789, 10300, 5105, -2323, 24761, -58243, -2297, -47250, -13643, 65352, -14294, 61707, 29854, -14941, -107836, 1748, 28963, -3841, -60930, 27584, 75786, 34539, 130243, 12420, -84780, -25432, -29098, -47754, -12022, -60571, -26573, 18313, 29889, 77509, 10262, 140345, 61839, 63772, 66352, 23220, 56420, 65344, 12747]
3174A2747j432O0873J07997n3545k1749L6101O5794q1780J78311N5818j98395
3163A60740j8466j0582Q6395J56221N2181M2239r3239q0843L5796p5812R2417
3152C47047M2728O2638Q231N6579O6698q6318J56377Q6999O835J10194Q5443j6231
3140I27220k0098P4458Q0166O3589J39308R4988l4690R9560L2736o208J00564
3129A551593J93972N7842O6290J32636P2904J30130J59817J45200L39378K54194
3119C103956L50237L05898L78364M24416N05954P11513R62352J431826J749218
3110I923734K320960J105075M5907j150931k558570k218181j507597r36498p03061
3101D320838n40217m65132l31938k60687j37777j71446k44008j36853j90962k38100
$$ y = [12747, 11315, 72188, 180185, 126640, 104891, 140992, 206786, 125006, 303317, 359135, 160740, 142274, 131692, 218087, 374308, 426489, 468728, 375489, 294646, 330442, 254630, 347047, 389775, 452413, 460644, 517223, 583921, 497603, 653980, 740979, 747814, 858008, 943451, 927220, 907122, 981580, 1061746, 1125335, 1264643, 1359631, 1324941, 1424501, 1457237, 1451029, 1551593, 1745565, 1803407, 1869697, 2002333, 2075237, 2205367, 2365184, 2510384, 2849762, 3103956, 3454193, 3760091, 4138455, 4562871, 5068825, 5780338, 6742690, 8174516, 9923734, 12244694, 13349769, 13395676, 12244745, 9686175, 7467994, 5960397, 5023899, 4320838, 3780621, 3315489, 2983551, 2722864, 2585087, 2413641, 2169633, 2032780, 1841818, 1603718]
3091A603718j72912L7242j2378k62666j21898j3108L314r7080j41509J0460Q5596
3080I18779q5752L928r9799K6816n7674p0857j23026o1066J13095p4866l0552
3069D59026K2007j4404n3306k4760k0843l1946l8804M9586n7140J2212l8003j19813
3057A43812N7745N7757L3261j4101k5879N695L449m3341k239J00134j26280O8669
3045B58682q7230m9459N2639p0907o01m6192K8829o7465K4982R966m3905M9917
3033E9256K9347J08356j1305k8260j32831O0079N1378j697m5664l8078l5771J7576
3021C2386J05854m7694j7938k13j4231P0679l9479k8249L381N475k3955n9966
3009a3950O231o0961j01241J6835J04079K4409N0755r0684r362N8955o1388m1254
$$ y = [1603718, 1430806, 1468048, 1455670, 1193004, 1071106, 1057998, 1061312, 964232, 822723, 833183, 918779, 833027, 836955, 737156, 763972, 706298, 635441, 512415, 451349, 564444, 489578, 459026, 481033, 466629, 413323, 388563, 367720, 335774, 296970, 346556, 289416, 301628, 263625, 143812, 201557, 259314, 292575, 278474, 252595, 258290, 261739, 218398, 216159, 316293, 190013, 258682, 171452, 121993, 174632, 103725, 103124, 56932, 85761, 18296, 43278, 53244, 9339, 59256, 88603, 196959, 185654, 157394, 24563, 84642, 136020, 134323, 88659, 50581, 14810, 32386, 138240, 90546, 72608, 72395, 58164, 128843, 89364, 61115, 64496, 69971, 46016, -13950, -7719, -68680, -169921, -153086, -49007, -24598, 26157, -64527, -73889, -14934, -76322, -117576]
2997a17576O2980L9198K9463M7475k0507o654K0075p2599J2330M642J2708j0426
2985A109L1723j3459O100m5555j00155r114J0083O1186L1822j3025J5340K7823
2973C878J7948q4852o462Q3232J9101o3464N7844j785j8956j5500p7879J84060
2961I7165j3818j09917n277m5796l0381k661J07504P132r6483O0964L4831l6507
2949c3244j1703m4790Q5871L792n5406q7357J79281L1519l5500o5988J40576j9659
2937H7392j19345J766J00371k0657n2722N260J07784P121j8658Q455q8145m8024
2925b9402J4856J19970p6595o258j17746M8844n628j47j46044J08299m45P6171
2913a4125m7140k2470L8990J04911O5909r7049M9501J0996k0995m081P2202m9793
$$ y = [-117576, -54596, -15398, 14065, 61540, 41033, 34379, 54454, -18145, -5815, -1173, 11535, 1109, 32832, 19373, 25473, -20082, -120237, -129351, -119268, -58082, -26260, -39285, -23945, 3878, 21826, -63026, -69488, 13744, 32845, -30619, 27225, 25440, 6484, -9016, -86895, 97165, 83347, -26570, -31847, -77643, -108024, -110685, -3181, 3951, -92532, -31568, 3263, -33244, -44947, -89737, -3866, -74, -55480, -142837, 36444, 67963, 32463, -33525, 107051, 87392, -31953, -30187, 70184, 49527, -3195, 2065, 109849, 116970, 98312, 106767, 18622, -29402, -14546, 105424, 28829, 22571, -95175, -46331, -51959, -52106, -198150, -89851, -90296, -14125, -61265, -83735, -44745, 60166, 126075, 29026, 78527, 89523, 68528, 64447, 136649, 86856]
2901H6856o6283k5945P2777L1895o3147j3869J08545j89890p621q072J2484l8853
2889a01123K5981M7360p870R648o3223J12603L440k2679n6693J01815j09325J10401
2877E0335n6655m963K6253n0491k7635K9889o089l117J7484o4124j1415Q4918
2865a5610M7260l0985k9818j618n0055K1200Q7171L1538j14988l5899J07576k2370
2853f598k2274o610K6540k2524J10252o8449N2001q612r7932l6588o2914J22189
2841b1519N8464j22637k6411N9652j13570J42162K3033O9306r2531j07992J11770
2830b0273Q398K0962o0326P186k7987o5128J3469P507M5922K0738M9010O1847
2818F1325j87643O8388k126k2514M3729L8856M3275M6780k709l9353j17103N9058
$$ y = [86856, 20573, -5372, 67405, 99300, 36153, 22284, 130829, -59061, -66682, -74754, -62270, -101123, -75142, -27782, -35652, -26004, -89227, 23376, 26816, 4137, -52556, 49259, -60066, 50335, -6320, -11283, 14970, -35521, -63156, -33267, -39356, -42473, -24989, -89113, -100528, -15610, 31650, 665, -29153, -30771, -80826, -59626, 27545, 59083, -55905, -91804, 15772, -6598, -28872, -35482, -8942, -31466, 78786, 10337, 62338, 53726, -44206, -80794, -143708, -21519, 36945, -85692, -112103, -52451, -166021, -23859, -826, 68480, -24051, -132043, -20273, -11875, 9087, -51239, -44053, -72040, -137168, -123699, -116192, -70270, -49532, -522, 61325, -126318, -57930, -60056, -82570, -38841, 15, 43290, 90070, 87361, 48008, -69095, -10037]
2806a0037Q0060j3781k7959k6706j13695L283K475p4669Q5220P9625m5609L2140
2794b9653R778M6853k7774J26939j58538k7031J46812r2207r5445K9797p228N7869
2782a9828k991l4741l1434O4699j4649m3620M5916J8317P1662q2349q4518R9679
2770a3857K7728p6107R82N7358j7085o5883K1469j5799r3737n317M9588J9482
2758a11178M0104M1640K6558n0856n4851L5438J56444q3624P9060r5646l4061
2747e0972l0562O0840l5242Q6005j7884p5487p7255L1829O4599J4212q304N5953
2735A7732J996J9799N976j94844L7111L7789j623j4524L8879O8029N1664q4298
2723a6314j2978K3227m5203Q873M6756j11369Q597O2296m9974J42081m3498o9953
$$ y = [-10037, 70023, 56242, 28283, 1577, -112118, -108835, -106360, -181029, -95809, -16184, -61793, -29653, -19875, 26978, -796, 126143, -32395, -59426, 87386, -4821, -100266, -70469, -77697, -19828, -22819, -57560, -88994, -24295, -38944, -82564, -36648, -18331, 53331, -29018, -113536, -13857, 13871, -62236, -61254, -3896, -20981, -86864, -65395, -81194, -174931, -180248, -130660, -111178, -71074, -29434, -2876, -53732, -108583, -73145, 83299, -325, 78735, -16911, -50972, -81534, -20694, -55936, 30069, 12185, -63302, -140557, -108728, -44129, -29917, -38221, 17732, 19728, 39527, 45503, -149341, -112230, -74441, -76064, -90588, -51709, 16320, 67984, -16314, -29292, -6065, -51268, -42395, 4361, -107008, -98411, -36115, -86089, 55992, 12494, -57459]
2711e7459j1068m394n7097K8898K2906L1661P8808n7471l4798j8293K5706N3280
2699F79k2902o4768L3321M5056k5303j43637J51806J44680r0743l3141p4336m3835
2687a23123J17193k1636J3909K205n9435Q301O3723K3000k7770J4898j49690Q8697
2675d9728m1375l9732P290q693n3869M3650J08597N356J2233J1260q638n8077
2663g1726j6970P5841m3302K722P7068l2544l8991R821k5699o8728M4526J15677
2651B7695k3885o6027k5006l982P984K2181M1200L6267k6222n42M0495k0187j33552
2638a23581Q2163m325r5122L0594R3754j5288P249N0539m8982J1942m3314J9385
2626c4986M298Q8592o0970N553j22058R4604k4949j7242j27453N4105P6811l9549
$$ y = [-57459, -68527, -72921, -130018, -101120, -78214, -46553, 32255, -25216, -60014, -78307, -52601, 679, -22223, -86991, -53670, -8614, -33917, -177554, -25748, 118932, 28189, -4952, -79288, -123123, -5930, -27566, -13657, -11452, -70887, -62586, 1137, 24137, -3633, 11265, -138425, -49728, -91103, -130835, -123545, -132238, -186107, -142457, -33860, -28504, -16271, -5011, -13649, -71726, -88696, -12855, -56157, -53435, 23633, -8911, -47902, -38081, -63780, -132508, -87982, 27695, 3810, -62217, -87223, -91205, -83221, -61040, -19840, 16427, -9795, -10337, 30158, 9971, -123581, -41418, -45743, -140865, -110271, -16517, -31805, -24556, 25983, -22999, -11057, -54371, -34986, -30688, 57904, -3066, 2487, -119571, -24967, -49916, -67158, -194611, -140506, -63695, -103244]
2614a03244J5666L8102J3196L1304K82k3904q644n995O8656r732j9996J1774l1419
2601b3954P1652q5416K1629r529m9329o6691K29304n4724o5089k7766p9345M5001
2589i4257N9124M8402r0033P002k959J43150q2003r651m2347j1191K5671O6616
2577A7524l5539q051P2211r6980l2587j6796p2734P2564P6276m0660q9655J33532
2565b0895J4689J5221O2478l5748l0765q1244n9222L435Q7449O543m002j6161
2553e8222L2922L9472j17904n3623q680N2433L5171N5507o2689K6158Q0599J3216
2541C4360l8494j50107P1349J16575j13099J08453K2190k1753p6630p3770j0197
2530a31123K6423K8921n4755M2471l6560P6599k8577m2312M9225O4069q201l5787
$$ y = [-103244, -87578, -49476, -36280, -4976, -4694, -28598, -37242, -43237, 25419, 15687, -4309, 7465, -23954, 47698, -37718, -16089, -25618, -74947, -141638, 87666, 32942, -32147, -59913, -139258, -94257, -35133, 13269, -76764, -69762, -72721, 70429, -11574, -21225, -63572, -74763, -49092, 17524, -18015, -26066, 46145, -50835, -83422, -100218, -172952, -100388, -24112, -64772, -154427, -20895, -6206, 9015, 71493, 35745, 4980, -76264, -135486, -132051, -44602, -38059, -42061, -58222, -25300, 14172, -103732, -157355, -166035, -113602, -78431, -22924, -85613, -59455, 21144, 34360, -4134, -154241, -82892, 33683, -79416, 29037, 51227, 29474, -47156, -120926, -131123, -104700, -75779, -130534, -88063, -124623, -48024, -76601, -118913, -69688, -5619, -13820, -49607]
2518d9607J33208j6097n1328p9142o0341J03355M8097q0003q8200n1056O7013
2507a24101M2807j2851J9241J00742j4523L383K3402O2346J0874O950r8835L2069
2495E1504k3758k6628n218l5637m4013n278L5558P7816P05q9979j36186O5924
2483a35190K1574L2245l3258M0452N9492n5799O6288o407l0951p5928J58825j3446
2471B7897k8983l3525R761J15339n64k7970n1924N7765j0220j28671l9990N7444
2459e3641N3956l6136m30q364K8048J01018p5552l3057M417o8494J4455j02105
2447a75885J46825N0446r2812q093K4643l645J56450j04239o8580l6356P087Q2055
2435b2104m025j64772P1447m0795j01106P8691J58776N0258m6776Q6703m559k6285
$$ y = [-49607, 83601, 67504, 16176, -62966, -123307, -19952, 28145, -51858, -140058, -191114, -124101, -81294, -94145, -74904, 25838, 11315, 14698, 38100, 100446, 111320, 118270, 19435, 51504, 27746, 1118, -4100, -39737, -83750, -89028, -53470, 24346, 25051, -64928, -201114, -135190, -113616, -81371, -114629, -74177, -14685, -70484, -4196, -10603, -41554, -117482, 41343, 27897, -1086, -34611, -24850, 90489, 89925, 61955, 10031, 67796, 57576, -71095, -111085, -53641, 315, -35821, -36251, -44615, -16567, 84451, 8899, -24158, -19741, -88235, -73780, -175885, -29060, 21386, -71426, -79519, -54876, -58521, 97929, -6310, -74890, -111246, -104159, -22104, -26129, -190901, -119454, -160249, -261355, -182664, -23888, 26370, -20406, 66297, 61738, 35453]
2423C5453K222N5246o5577M0445k5462k8680N1252o3891p9376L0639L8113L1509
2411B1893m2947j14782N1936L7155m8276R172R0371j5205o1505j49060J15109
2400a06139J13400j16344Q0128L9901m0186J2973m9968Q5419q0817J9142m2320
2389h4811j7335R0341N4306q8366r1500J26123p984j6632k933o4421K8916M5730
2377b8566q282L1887r7648J608L5762J6367N9287k807j9334n7523l0753J24978
2365B4976l618Q0848p807o0529q8873J6662N1178k3451M8054p3618j0766j3892
2353f0836j056M6301m0190M7226N0564o8885m5633J06235k0955p0165N3675L6583
2341C2864o8119L9784p0523N4747m8293N2966O5262j42732P7946N6706r0094J31818
$$ y = [35453, 37675, 92921, 27344, 67789, 42327, 13647, 64899, 1008, -78368, -47729, -9616, 21893, -21054, -135836, -83900, -46745, -95021, -85849, 4522, -10683, -72188, -221248, -106139, 7261, -109083, -28955, 10946, -29240, -16267, -66235, 19184, -61633, -42491, -84811, -102146, -11805, 42501, -45865, -137365, -11242, -19226, -35858, -38791, -103212, -74296, -28566, -36848, -4961, -102609, -101001, -65239, -48872, 10415, 7608, -11726, -69249, -100002, 24976, 21358, 102206, 94399, 33870, -55003, -38341, 12837, -10614, 37440, -36178, -46944, -60836, -61892, -15591, -55781, -8555, 42009, -26876, -72509, 33726, 12771, -57394, -3719, 32864, -35255, 4529, -65994, -11247, -59540, -6574, 58688, -84044, -6098, 50608, -39486, 92332]
2329I2332r7789j0465k096L5602l1396L151M1457q0961K5752p175p2446M7170
2317e6864L9602J7840k6237m7614J09151k3204l5118l1775J4529J9214K2081l5422
2305c3817m4519P8939m3032j3968Q0378O9420j11185m9271Q1231l1786j8693q965
2293d5268P063r8153n6684J57260R482q2263P9453K8766P9577j65734j1300n475
2281a03276l4294M8533M1091m1709P5728n6650O0096j2752q0584R360K04054J19326
2269B28923j58197l5263n9381o3832j4998N3152k5386k0809L4536r1454J86449
2258C3740m5497q4274o5997K9915J23866L0343m4719l9994Q5276j17752o9970
2247a65063L2010N5301K975l9379L0905J8482j7202l1729Q4367J18700m999N0987
$$ y = [92332, -5457, -15922, -18018, 17584, -13812, -10661, 30796, -50165, -24413, -31588, -104034, -56864, -17262, 578, -25659, -73273, 35878, 12674, -22444, -54219, -39690, -20476, 1605, -33817, -78336, 603, -42429, -56397, 23981, 93401, -17784, -67055, 14176, -17610, -36303, -45268, -38205, -136358, -193042, -35782, -26300, -108563, -29110, -344, 79233, -86501, -97801, -103276, -137570, -89037, -47946, -89655, -13927, -70577, -10481, -23233, -103817, -94457, 109597, 228923, 70726, 35463, -23918, -87750, -102748, -49596, -74982, -95791, -61255, -152709, 33740, -11757, -96031, -162028, -132113, -8247, 22096, -22623, -62617, 22659, -95093, -165063, -133053, -77752, -74777, -114156, -83251, -64769, -81971, -113700, -29333, 89367, 84368, 135355]
2235A35355l1904r7929k6518L3491J8824o1877p5172O9766m6474l802J8132L3595
2223c4513O2457q862M2150K2443o2939l6963p9902J20850L60o4777k0498j0918
2211g1112M3575j533O9295m9221j0715n8116R0213o3902K5280l7222M907P2553
2199A4002J492k5202m0035O194p1803J19328O1878j979q9992R1958q8950P5128
2187E2019M3254j42710n4308P6229m8022Q0306Q2719J7272j8764n1720K321J9459
2175E8055Q4373j13560m2707L0796k3563k4742K283m9358Q6581l1871r6041Q8631
2163c1123m4710M7795r015M5896M7531j04916P8845K7349l6980m5758n4290Q6583
2151G207p2944k6143K652J5121l023P5599N4926m9786L4359j13712K2449P528
$$ y = [135355, 103451, 5522, -20996, 12495, 31319, -30558, -105730, -35964, -82438, -86240, -68108, -34513, 27944, 19082, 61232, 83675, 20736, -16227, -96129, 24721, 25081, -39696, -60194, -71112, -27537, -29070, 40225, -8996, -19711, -77827, 12386, -51516, -26236, -63458, -58551, 14002, 15494, -9708, -49743, -43549, -115352, 3976, 65854, 63875, -26117, 65841, -23109, 52019, 95273, -47437, -101745, -25516, -73538, 6768, 89487, 106759, 87995, 36275, 38596, 58055, 142428, 28868, -13839, 16957, -6606, -31348, -29065, -78423, 8158, -23713, -119754, -31123, -75833, -28038, -37053, 8843, 56374, -48542, 30303, 57652, 20672, -25086, -79376, 7207, -65737, -91880, -89228, -74107, -77130, -1531, 53395, 3609, 37968, -75744, -53295, -45767]
2139d5767p2360J08432j2337K1258r744m923N6890l0371q5936L6507m9997q1237
2127a69585P6607J00001n2032P247M7335L1511J0007l0952k3013l6461O5488j31069
2115a04916O0023J3515k0361J5563l9989K0859j8972N2046M5731k7042j8711K5834
2103C580k4771k2474q3140R295R0487l9855j238K5824K1535k4764P6352j8660
2091A2171P999m4723L5753P8750l6312K5423m554r0114L5045N3790r6342p8721
2079a01835O8408L3749M4714k344m6430O594J5555l2510J8449N595p687r7522
2067i5264L8526N9392m5310L1764L614L5744P01p9612N2846M6446j5184R694n8622
2054a5265j00210J18196j8102j7141O3603M4637J5844p2929p7823j9298R1633
$$ y = [-45767, -118127, -9695, -22032, -774, -10518, -15441, 41449, 11078, -74858, -38351, -88348, -169585, -92978, 7023, -45009, -37762, 9573, 41084, 51091, 20139, -2874, -39335, 26153, -104916, -44893, -31378, -51739, -36176, -76165, -55306, -74278, -22232, 23499, -3543, -22254, 3580, -21191, -43665, -126805, -117510, -27023, -66878, -68116, -42292, -20757, -45521, 30831, 12171, 20170, -24553, 11200, 89950, 53638, 79061, 74507, -15607, 19438, 73228, -23114, -101835, -33427, 322, 45036, 42692, -3738, 2856, 18411, -14099, 4350, 9945, 2258, -95264, -56738, 2654, -42656, -10892, -7278, 28466, 29167, -50445, 2401, 48847, 33663, 43357, -15265, -115475, 2721, -15381, -32522, 31081, 75718, 91562, 18633, -59190, -78488, 13145]
2043A3145L4140n4986M6192L0569m5678j25910Q5724k1094P2402k9035L98N2695
2031E8562j32817L4680R8813j7185r5441p7018P0063N4520M8978J7341j9873j02092
2019f1469K45M3420j24985N5266o2130J13178M0253P891O3394n0808o0827p876
2007d4448m3977P5789J5495P907o1639L5088K0118R7008k5962q9610M5892m1848
1995a0187J3104O1310L5588L5215p7253m1386N604n0811j872r2244J07671J02690
1983H7429j61485Q4849m6372k4479K3943o9441o6154Q5872K9570J35622m2595
1972C6759p6213k5041O7891j498K3832m7627p1034K2934P1282l3653n4r0952o111
1959a29485J39605N3951L2136J2493q9394l2803P9110k532J4945j05141K1969
$$ y = [13145, 47285, -7701, 38491, 69060, 23382, -102528, -16804, -37898, 34504, 5469, 5867, 58562, -74255, -39575, 59238, 42053, -53388, -130406, -60343, -5823, 43155, 60496, 40623, -61469, -61224, -17804, -142789, -87523, -149653, -36475, 3778, 11669, 75063, 24255, -36572, -44448, -88425, -12636, 2859, 10766, -50873, -15785, 4333, 101341, 75379, -14231, 31661, -10187, 2917, 64227, 99815, 135030, 57777, 16391, 21995, -28816, -30688, -122932, -15261, 87429, -74056, 10793, -35579, -60058, -36115, -105556, -171710, -85838, -56268, 79354, 36759, -39454, -64495, 3396, 1898, 25730, -21897, -92931, -69997, 1285, -32368, -32422, -123374, -129485, 10120, 64071, 96207, 108700, 19306, -13497, 65613, 63081, 78026, -27115, -5146]
1948e146R389P901r944m1878M6241M9620o6100O3251j7420k9851k0985n6863L7876
1935c3909O9879O351k6711O4941r7398p7138Q1890M5293K8317j13179N4788O4742
1923F7866K3014o4558J292K5002j2502j06360n114M0646K8862n8656K5241n599
1911d0866o4132N4165K7293q3603L5433j1666K9418J26648N9341m7777j47608
1900f3354j0922N8450K4831K119M722J6671k6572l7773N3912q582N5509J0038
1888G9049P255j03310p8975J06721r0031J08786K0466j09853k9010O6593K6363
1877D054l3176J2916j8087R2938m6786j214m3573m3109j3418N8824l7263M1305
1865b6589l9794J26441M705k1881K6541m2884K9160l2612L9546o0933p587j00923
$$ y = [-5146, 4243, 12144, 2200, -39678, 6563, 56183, -9917, 53334, 35914, 6063, -14922, -71785, -33909, 35970, 42321, 15610, 80551, -16847, -93985, -12095, 33198, 61515, -51664, 3124, 67866, 90880, 26322, 27614, 52616, 40114, -66246, -71360, -30714, -1852, -60508, -35267, -40866, -104998, -50833, -23540, -107143, -71710, -83376, -53958, 72690, 132031, 84254, -63354, -74276, -15826, 9005, 11124, 15846, 32517, 5945, -31828, 22084, 13502, 69011, 79049, 86304, -17006, -95981, 10740, -79291, 29495, 49961, -59892, -88902, -22309, 4054, -29122, -16206, -34293, 58645, 11859, 10645, -32928, -76037, -89455, -30631, -67894, -26589, -66383, 60058, 64763, 42882, 69423, 26539, 55699, 23087, 62633, 1700, -5887, -106810]
1853a06810K9380R7543j6741j7692Q7603K5273K8026j46863M719K4535L6964k1603
1841B4334l2596m023R4638L5085j71528l7412Q2839O9714l4432L8134l0118r6962
1829f2327L2877M8125N6478k5324j0860j9338M5349K1751r6815k1705P4839q325
1817C4725j635L2950l8285n561j71796J45376L3975q4598N1670o9246M2241M2969
1805A2785k3210p4231N9187Q009l8531N6718k2087p100L6431Q2949o6440L2926
1793E7406J7409l6430r0752k5375r5627R6662O4714N8755p3317J6110N4110m4246
1781e81K3681j9826Q310p4833j6348J01646j17529n4314j5621M640O9339P3452
1769a7984O4082q3477J20422J6027p0235q9741l951L6546R4475j11894P8977J6303
$$ y = [-106810, -77430, 20113, 3372, -14320, 73283, 98556, 126582, -20281, -15562, 8973, 45937, 24334, -8262, -12285, 82353, 117438, -54090, -91502, -8663, 61051, 26619, 64753, 34635, -62327, -29450, 18675, 75153, 49829, 38969, 19631, 64980, 86731, -10084, -31789, 43050, 34725, 33090, 66040, 27755, 22194, -149602, -4226, 29749, -54849, -3179, -72425, -30184, 12785, -10425, -84656, -25469, -17460, -55991, 727, -21360, -28460, 7971, 90920, 24480, 57406, 74815, 38385, -52367, -77742, -173369, -76707, -11993, 46762, -26555, -10445, 43665, -581, 23100, 3274, 11584, -63249, -79597, 22049, -95480, -149794, -165415, -160775, -91436, -17984, 46098, -37379, 83043, 99070, 28835, -60906, -64857, -28311, 66164, -45730, 33247, 49550]
$$ [...]
##END NTUPLES=NMR SPECTRUM
##END=
