##TITLE=1H_EC-3333(VII-2)
 CDCl3
 8 sc, 
 1.11.2024
##JCAMPDX= 6.0         $$ Bruker NMR JCAMP-DX V2.0
##DATA TYPE= NMR SPECTRUM
##DATA CLASS= NTUPLES
##ORIGIN= UXNMR, Bruker Analytische Messtechnik GmbH
##OWNER= root
$$ XWIN-NMR		Version 3.5
$$ Fri Nov  1 14:05:39 2024 Russian Standard Time (UT+4h)  she@DPX200
##.OBSERVE FREQUENCY= 200.1318
##.OBSERVE NUCLEUS= ^1H
##.ACQUISITION MODE= SIMULTANEOUS
##.ACQUISITION SCHEME= undefined
##.AVERAGES= 8
##.DIGITISER RES= 18
##SPECTROMETER/DATA SYSTEM= spect
##.PULSE SEQUENCE= zg30
##.SOLVENT NAME= CDCl3
##.SHIFT REFERENCE= (INTERNAL, CDCl3, 0, 20.9929)
##AUDIT TRAIL= $$ (NUMBER, WHEN, WHO, WHERE, WHAT)
$$ ##TITLE= Audit trail, XWIN-NMR		Version 3.5
$$ ##JCAMPDX= 5.01
$$ ##ORIGIN= Bruker BioSpin GmbH
$$ ##OWNER= she
$$ F:/spectra/data/she/nmr/H-F/1/pdata/1/auditp.txt
$$ ##AUDIT TRAIL=  $$ (NUMBER, WHEN, WHO, WHERE, WHAT)
(   1,<2024-11-01 14:04:27.53 +0400>,<she>,<DPX200>,
      <created by zg, POWCHK disabled, PULCHK disabled
       configuration hash MD5:
       00 E9 B6 7A A2 85 ED C7 34 08 36 98 17 FE 4E 26
       data hash MD5: 16K
       44 33 2D 76 7F 22 83 8A 6B 4E 12 32 F9 78 7F A3>)
(   2,<2024-11-01 14:04:29.82 +0400>,<she>,<DPX200>,
      <Start of raw data processing
       efp BC_mod = 2 LB = 0.24 FT_mod = 6 PKNL = 1 PHC0 = -26347.17 PHC1 = 13.98743 SI = 16K 
       data hash MD5: 16K
       C5 D6 60 AB 99 F7 E6 FB A8 A3 9F B5 67 A3 32 44>)
(   3,<2024-11-01 14:04:48.18 +0400>,<she>,<DPX200>,
      <pk PHC0 = 1.27805 PHC1 = -2.599999 
       data hash MD5: 16K
       AA B5 F7 30 D9 61 4A EA BD 9C BA 11 B8 39 C3 43>)
(   4,<2024-11-01 14:04:52.17 +0400>,<she>,<DPX200>,
      <abs ABSG = 5 
       data hash MD5: 16K
       5A 1F A9 DA 4D A6 31 25 8F D0 71 68 10 B3 B4 F2>)
$$ ##END=
$$ 
$$ hash MD5
$$ 52 F8 B8 2B 29 04 8E 78 89 9C 03 2F B7 34 53 81
##$RELAX= 
##$RELAX= 
##$RELAX= 
##$RELAX= 
##$RELAX= 
##$RELAX= 
$$ Bruker specific parameters
$$ --------------------------
##$DU= <F:/spectra>
##$EXPNO= 1
##$NAME= <H-F>
##$PROCNO= 1
##$TYPE= <nmr>
##$USER= <she>
##$AMP= (0..31)
100 100 100 100 100 100 100 100 100 100 100 100 100 100 100 100 100 100 
100 100 100 100 100 100 100 100 100 100 100 100 100 100 
##$AQSEQ= 0
##$AQ_mod= 1
##$AUNM= <au_zg>
##$AUTOPOS= <>
##$BF1= 200.13
##$BF2= 200.13
##$BF3= 200.13
##$BF4= 200.13
##$BF5= 200.13
##$BF6= 200.13
##$BF7= 200.13
##$BF8= 200.13
##$BYTORDA= 1
##$CFDGTYP= 0
##$CFRGTYP= 5
##$CHEMSTR= <none>
##$CNST= (0..31)
1 1 145 1 1 1 1 1 1 1 1 1 1 1 1 1 1 1 1 1 1 1 1 1 1 1 1 1 1 1 1 1 
##$CPDPRG= <>
##$CPDPRG1= <>
##$CPDPRG2= <>
##$CPDPRG3= <>
##$CPDPRG4= <mlev>
##$CPDPRG5= <mlev>
##$CPDPRG6= <mlev>
##$CPDPRG7= <mlev>
##$CPDPRG8= <mlev>
##$CPDPRGB= <>
##$CPDPRGT= <>
##$D= (0..31)
0 1.2 0 0 0 0 0 0 0 0.06 0 0.03 0 0 0 0 0.0002 0 0 0 0 0 0 0 0 0 0 0 0 
0 0 0 
##$DATE= 1730455467
##$DBL= (0..7)
120 120 120 120 120 120 120 120 
##$DBP= (0..7)
150 150 150 150 150 150 150 150 
##$DBP07= 0
##$DBPNAM0= <>
##$DBPNAM1= <>
##$DBPNAM2= <>
##$DBPNAM3= <>
##$DBPNAM4= <>
$$ [...]
##$SUBNAM3= <"">
##$SUBNAM4= <"">
##$SUBNAM5= <"">
##$SUBNAM6= <"">
##$SUBNAM7= <"">
##$SUBNAM8= <"">
##$SUBNAM9= <"">
##$SW= 24.0689170037331
##$SWIBOX= (0..15)
0 0 2 0 0 0 0 0 0 0 0 0 0 0 0 0 
##$SW_h= 4816.95568400771
##$TD= 16384
##$TD0= 1
##$TE= 0
##$TE2= 300
##$TE3= 300
##$TEG= 300
##$TL= (0..7)
0 120 120 120 120 120 120 120 
##$TP= (0..7)
150 150 150 150 150 150 150 150 
##$TP07= 0
##$TPNAME0= <>
##$TPNAME1= <>
##$TPNAME2= <>
##$TPNAME3= <>
##$TPNAME4= <>
##$TPNAME5= <>
##$TPNAME6= <>
##$TPNAME7= <>
##$TPOAL= (0..7)
0.5 0.5 0.5 0.5 0.5 0.5 0.5 0.5 
##$TPOFFS= (0..7)
0 0 0 0 0 0 0 0 
##$TUNHIN= 0
##$TUNHOUT= 0
##$TUNXOUT= 0
##$USERA1= <user>
##$USERA2= <user>
##$USERA3= <user>
##$USERA4= <user>
##$USERA5= <user>
##$V9= 5
##$VALIST= <valist>
##$VCLIST= <CCCCCCCCCCCCCCC>
##$VD= 0
##$VDLIST= <DDDDDDDDDDDDDDD>
##$VPLIST= <PPPPPPPPPPPPPPP>
##$VTLIST= <TTTTTTTTTTTTTTT>
##$WBST= 1024
##$WBSW= 4
##$XGAIN= (0..3)
0 0 0 0 
##$XL= 0
##$YL= 0
##$YMAX_a= 335581
##$YMIN_a= -208730
##$ZGOPTNS= <>
##$ZL1= 120
##$ZL2= 120
##$ZL3= 120
##$ZL4= 120
##$ABSF1= 20.99586
##$ABSF2= -3.073273
##$ABSG= 5
##$ABSL= 3
##$ALPHA= 0
##$AQORDER= 0
##$ASSFAC= 0
##$ASSFACI= 0
##$ASSFACX= 0
##$ASSWID= 0
##$AUNMP= <proc_1d>
##$AZFE= 0.1
##$AZFW= 0.1
##$BCFW= 0
##$BC_mod= 2
##$BYTORDP= 0
##$COROFFS= 0
##$CY= -3
##$DATMOD= 1
##$DC= 0
##$DFILT= <>
##$DTYPP= 0
##$F1P= 0
##$F2P= 0
##$FCOR= 1
##$FTSIZE= 16384
##$FT_mod= 6
##$GAMMA= 0
##$GB= 0
##$INTBC= 1
##$INTSCL= 3.70164e-10
##$ISEN= 128
##$LB= 0.24
##$LEV0= 0
##$LPBIN= 0
##$MAXI= 10000
##$MC2= 0
##$MEAN= 0
##$ME_mod= 0
##$MI= 1.114404
##$NCOEF= 0
##$NC_proc= -6
##$NLEV= 6
##$NOISF1= 3.799351
##$NOISF2= 2.8
##$NSP= 0
##$NTH_PI= 0
##$NZP= 0
##$OFFSET= 20.99291
##$PC= 1
##$PHC0= -26345.89
##$PHC1= 11.38743
##$PH_mod= 1
##$PKNL= yes
##$PPARMOD= 0
##$PSCAL= 0
##$PSIGN= 0
##$REVERSE= no
##$SF= 200.130007166498
##$SI= 16384
##$SIGF1= 3
##$SIGF2= 2
##$SINO= 5.538805
##$SIOLD= 16384
##$SREGLST= <1H.CDCl3>
##$SSB= 0
##$STSI= 16384
##$STSR= 0
##$SW_p= 4816.95568400771
##$SYMM= 0
##$S_DEV= 0
##$TDeff= 16384
##$TDoff= 0
##$TI= <>
##$TILT= no
##$TM1= 0
##$TM2= 0
##$TOPLEV= 0
##$USERP1= <user>
##$USERP2= <user>
##$USERP3= <user>
##$USERP4= <user>
##$USERP5= <user>
##$WDW= 1
##$XDIM= 16384
##$YMAX_p= 308745797
##$YMIN_p= -592175
$$ End of Bruker specific parameters
$$ ---------------------------------
##NTUPLES= NMR SPECTRUM
##VAR_NAME=  FREQUENCY,     SPECTRUM/REAL,   SPECTRUM/IMAG
##SYMBOL=    X,             R,               I
##VAR_TYPE=  INDEPENDENT,   DEPENDENT,       DEPENDENT
##VAR_FORM=  AFFN,          ASDF,            ASDF
##VAR_DIM=   16384,         16384,           16384
##UNITS=     HZ,            ARBITRARY UNITS, ARBITRARY UNITS
##FACTOR=    0.29402158847633, 1,            1
##FIRST=     4201.31130582208, 0,            0
##LAST=      -615.644378185626, 0,           0
##MIN=       -615.644378185626, -592175,     0
##MAX=       4201.31130582208, 308745797,    0
$$ Real data points
##PAGE= N=1
##DATA TABLE= (X++(R..R)), XYDATA
$$ [...]
6992B5940712J935204J907168J094933n8375j272539j730370j602212j409066
6984B4805455o97980l71491k7385K28944Q30809J182410J787042K080502K725407
6975C2543713J951626N55756r96136k230114k245889k048810j482584p94797o45282
6966B4607483j36230L95097R31324J369218J901951K155104J148426m52906k049966
6957B9869501k900400k759204k364017j902731j646520j403692j109479r86253
6949A4797205p35482n67201m85071l68873l79357k58302l21283j74653j69514
6940A1337469j40323o0773k46213J01713J34374J17717M6802j4542q1937N9486
6930A1253773k74859o2625p4019M4648j20630J19451P2712K92571L63872J16351
$$ y = [25940712, 27875916, 29783084, 30878017, 30819642, 29547103, 27816733, 26214521, 24805455, 24107475, 23735984, 23708599, 23937543, 24768352, 25950762, 27737804, 29818306, 32543713, 34495339, 35051095, 34054959, 31824845, 29578956, 27530146, 26047562, 25252765, 24607483, 24471253, 24866350, 25797674, 27166892, 29068843, 31223947, 32372373, 31919467, 29869501, 26969101, 24209897, 21845880, 19943149, 18296629, 16892937, 15783458, 14797205, 14061723, 13494522, 13009451, 12640578, 12261221, 12002919, 11681636, 11506983, 11337469, 11197146, 11136373, 10890160, 10991873, 11126247, 11243964, 11290766, 11276224, 11194287, 11253773, 10978914, 10916289, 10842270, 10886918, 10766288, 10885739, 10958451, 11251022, 11614894, 11731245]
6920A1731245N24194L05790K79866J52511J16929J38783K57151M3784P0946M09032
6910A4030231L49142N41687N79866O55864R11291R61272J195360J341338J216208
6901B1782259J012905J334630J456264K377924K934057K454068J413187O5229
6893C4830523q47430r97675k63373R38515J692805J888902N43425q89292k604421
6884C4291979l296944l091096k429745j733145j237145j145896p43692l72554
6876B0241762j51395j96494J01898L20748M95558P26375P51503N79194J166460
6867B4035609J621919K316640K741784K469657J573310L82896r40304j349855
6859C2851656p96028M5360R56108J498641Q92167k21065j847444k959396l114919
$$ y = [11731245, 12255439, 12561229, 12841095, 12993606, 13110535, 13249318, 13506469, 13550253, 13621199, 14030231, 14379373, 14921060, 15500926, 16156790, 17068081, 18029353, 19224713, 20566051, 21782259, 22795164, 24129794, 25586058, 27963982, 30898039, 33352107, 34765294, 34830523, 33983093, 32985418, 32722045, 33660560, 35353365, 37242267, 37785692, 36896400, 34291979, 30995035, 27903939, 25474194, 23741049, 22503904, 21358008, 20614316, 20241762, 20090367, 19893873, 19995771, 20316519, 20812077, 21538452, 22289955, 22869149, 24035609, 25657528, 27974168, 30715952, 33185609, 34758919, 35141815, 34201511, 32851656, 32055628, 32100988, 33057096, 34555737, 35447904, 35226839, 33379395, 30419999, 27305080]
6850B7305080k857149k198555j559514j157029j041874q90346p53966n03689l93636
6841A5949322n01273n89864l62338j69575j11851k24049P7433j72592k29455j62250
6831A3503508O7424J12551K65954K61196J59234n3245O3922j33j92901j61378
6821A4026132m6677M5053q6636N5785J07284J02518O7101J58083J37032M52310
6811A5017985K96883L44558K99109M41709P58479Q05313J444022J457535J831594
6802B2697187R06076Q018n62363q25525n10503O5647N90155Q28615N09511l7044
6792B3669774r44278j493623j437066j233156o71546l15838l23719m14717K2951
6783A6858782K66982K34093M09050M13687M46590N65242R16261J184942J656109
$$ y = [27305080, 24447931, 22249376, 20689862, 19532833, 18490959, 17600613, 16846647, 16342958, 15949322, 15448049, 14858185, 14495847, 14326272, 14214421, 13990372, 14067805, 13895213, 13665758, 13503508, 13570932, 13683483, 13949437, 14210633, 14369867, 14316622, 14380544, 14380411, 14187510, 14026132, 13979455, 14024508, 13937872, 13993657, 14100941, 14203459, 14270560, 14428643, 14565675, 15017985, 15314868, 15659426, 15958535, 16400244, 17158723, 17964036, 19408058, 20865593, 22697187, 23603263, 23611281, 23048918, 22223393, 21712890, 21778537, 22368692, 23197307, 23706818, 23669774, 22725496, 21231873, 19794807, 18561651, 17890105, 17574267, 17250548, 16835831, 16858782, 17125764, 17359857, 17768907, 18182594, 18629184, 19194426, 20110687, 21295629, 22951738]
6774B2951738K254886K754015K294849J578842L1711j158404j526336j430107
6766B7751194m87512M51671Q04391M36445k60355j370578k257628k344376k055411
6757B0667841j381158r50142j077138o28915k75988j54042j425L63914J48040
6748A6710987j25551p7465r8004L69896P18366J027292J196872J140554M13246
6739B1276193n67075j059529j272221q60704k71761M1274L10679K64320m58170
6730A7403006q80648j287402j303899p76224p30733p46210n89151k32187k34234
6721A0622318L134m1057p5950p6844l46620k58626m20748j89334o5688j84829
6711H965756J83181j76000k33725k58655m62862m30852j51053l66246m00602p4872
$$ y = [22951738, 25206624, 27960639, 30255488, 31834330, 31866041, 30707637, 29181301, 27751194, 27263682, 27715353, 28519744, 28956189, 28695834, 27325256, 25067628, 22723252, 20667841, 19286683, 18336541, 17259403, 16630488, 16354500, 16200458, 16199033, 16562947, 16710987, 16585436, 16507971, 16409967, 16779863, 17498229, 18525521, 19722393, 20862947, 21276193, 20709118, 19649589, 18377368, 17516664, 17244903, 17286177, 17596856, 17861176, 17403006, 16522358, 15234956, 13931057, 13154833, 12424100, 11677890, 11088739, 10856552, 10622318, 10625452, 10584395, 10508445, 10431601, 10084981, 9826355, 9405607, 9216273, 9150585, 8965756, 9148937, 8972937, 8739212, 8480557, 8017695, 7586843, 7435790, 7069544, 6668942, 6594070]
6701F594070N3899j13845r8012q6858k39648j16215n8605k12140j09193p031J09157
6690E715579L0165K6950J1673p1009J95776j30130j53000j65146L5665k60903
6680E235620k16251k39856k26162j41717k68992j16533j84831k08312j04036m2116
6670C486814p2937j20295m4370N2047k25706j21968m9924m4826K4537M79m5098
6659B838753p4260j32625j39645J70839j12799q9908j32676N171p3472m548N9389
6648B314219R264r1092j62785K1246M4935k01764o0355P7616J16842l7573j24737
6637A905816l0721j55729q7281J25285k85796J63823j44509j43424R1426J66584
6627A605474k31377M3705Q5410j48381J33557n3578K2572J1422l4950k9133j4391
$$ y = [6594070, 6647969, 6534124, 6436112, 6349254, 6109606, 5993391, 5934786, 5722646, 5613453, 5606422, 5715579, 5745744, 5772694, 5784367, 5713358, 5909134, 5779004, 5626004, 5460858, 5496523, 5235620, 5019369, 4779513, 4553351, 4411634, 4142642, 4026109, 3841278, 3632966, 3528930, 3486814, 3413877, 3293582, 3249212, 3301259, 3075553, 2953585, 2903661, 2858835, 2883372, 2883851, 2838753, 2764493, 2631868, 2492223, 2663062, 2550263, 2460355, 2327679, 2332850, 2259378, 2254830, 2314219, 2323483, 2232391, 2069606, 2090852, 2135787, 1934023, 1873668, 1951284, 2068126, 2030553, 1905816, 1875095, 1719366, 1632085, 1757370, 1471574, 1635397, 1490888, 1347464, 1438890, 1605474, 1374097, 1417802, 1503212, 1354831, 1488388, 1434810, 1457382, 1468804, 1433854, 1404721, 1390330]
6616A390330o2879j04387j751o5078q9511J89021j02537k1600j03280J24269k9615
6605A122982r9581J259j9125J1294k2652q8017J11985n8232N4931O3512j02471
6594I75885M632j04938j09034O0734J4161O4137J29422n9555Q5151L9212L6686
6583A136493J9215N8027q3629k5031J95629j26402r0360j82663Q6520j3902j90912
6572G82985q1622P6351M1024j91027K4755K1358j07195n8115Q4077P134O0334
6561F60059J35499r5033k5053n3239J16449o6558p8707J94822p5118J6994j41220
6550E88895K8960Q2625j68280J21008l116J02953k9091J2987K6919l8081M2771
6539G68550r7880Q4297J58055r7773j11559R2068J43525n6601j28407O5147L5416
$$ y = [1390330, 1327451, 1223064, 1221313, 1156235, 1066724, 1255745, 1153208, 1131608, 1028328, 1152597, 1122982, 1023401, 1024660, 1005535, 1016829, 994177, 906160, 1018145, 959913, 1014844, 1078356, 975885, 980517, 875579, 766545, 827279, 841440, 905577, 1034999, 975444, 1060595, 1099807, 1136493, 1155708, 1213735, 1130106, 1105075, 1300704, 1174302, 1083942, 901279, 987799, 973897, 782985, 701363, 777714, 818738, 627711, 652466, 673824, 566629, 508514, 592591, 599725, 660059, 795558, 700525, 675472, 622233, 738682, 672124, 593417, 788239, 713121, 730115, 588895, 617855, 700480, 532200, 653208, 650092, 753045, 723954, 736941, 763860, 725779, 768550, 670670, 754967, 913022, 815249, 703690, 795758, 939283, 882682, 754275, 819422, 854838]
6528H54838N3153J81907M4770R3946j10849M5536J86857m6808m0949n908j9310
6517A237183j17937M5668j27454j6519J2403P5719p7740p6106q4739N0685M156
6506I25319n9835k01947J37420J87574q8755j25723M8389J47357m4480J29341
6496A054660m9074Q2258k0702J29723K0415r2420R2590J1906l9415k4987j04514
6485A060440Q1146o3404j28486r9714N8692J6966j74117l1659q1374K4276k4541
6474F38225r7524L3735k6342n7068J31205N548j46037Q8661L0613j09195n4472
6463D37349N6781o2029O4092J8190m4901q256M055j16861J59976R3975j18794
6452D83577k3161j24791n8429l1296O7729O6909j7888p49p7551K8941P839J9636
$$ y = [854838, 907991, 1089898, 1134668, 1228614, 1117765, 1163301, 1350158, 1303350, 1262401, 1256493, 1237183, 1119246, 1164914, 1037460, 1020941, 1033344, 1109063, 1031323, 955217, 870478, 921163, 925319, 865484, 663537, 800957, 988531, 899776, 774053, 822442, 969799, 925319, 1054660, 1005586, 1087844, 1067142, 1196865, 1217280, 1124860, 1217450, 1229356, 1189941, 1164954, 1060440, 1141586, 1078182, 949696, 849982, 908674, 925640, 751523, 719864, 638490, 662766, 638225, 540701, 574436, 548094, 491026, 622231, 627779, 481742, 570403, 601016, 491821, 437349, 494130, 432101, 496193, 514383, 469482, 461226, 465281, 348420, 508396, 602371, 483577, 460416, 335625, 277196, 245900, 313629, 380538, 362650, 361901, 284350, 313291, 321130, 340766]
6440C40766p679k292j62121p5922K2298J15560k3358R502K28296o7676r6678k01185
6428G9511O4692n9595N7942J4019j58142l2184J75105L4788Q0055p9563j06415
6417G0213J40032p2025k595p7927O4425J45167q5052m5591J05282l9551j24126
6406G8252J37775j68033R1759J9064p257R2274m4421K366j60599l8820O4346K6083
6394I2789L320J04023j40151k430J35457K03772k35352k07791P8862R4553q1862
6383D5190j51733J21134j6765K5279J30781p4929k6923p691q5985Q8614j86466
6372a39494o5815J27876J24419k09803k8796J16825K0283J13361R8960j08248
6362D9568J9818M8909J85003j61166l0193j25025m6162P6774L1460O0330j46757
$$ y = [340766, 333087, 330795, 168674, 92752, 115050, 230610, 207252, 216754, 445050, 377374, 280696, 79511, 144203, 84608, 142550, 156569, -1573, -33757, 141348, 176136, 256191, 176628, 70213, 210245, 138220, 135625, 57698, 122123, 267290, 182238, 136647, 241929, 202378, 78252, 216027, 47994, 139753, 158817, 151560, 243834, 199413, 201779, 41180, 2360, 66706, 92789, 96109, 200132, 59981, 57551, 193008, 396780, 161428, -46363, 32499, 127052, 45190, -106543, 14591, -2174, 23105, 153886, 78957, 52034, 44343, -41642, 46972, -139494, -205309, -77433, 46986, -162817, -191613, -74788, -54505, 58856, 157816, 49568, 69386, 118295, 303298, 142132, 111939, -13086, -59248, 17526, 48986, 109316, -37441]
6351c7441K1160Q5087J3315j64046O4801N3452j3704o2067l6372J32525n0918
6340E792O9870p0289k0049r343J34006j2102q6616J5985k7764l3159l8396J39986
6328F7921O7857l5254j54215j32245N2908K86472j43068Q988o1756o0480J19640
6317A6768J12621k6031l7281r84k793q9537L1290P4563j3756j09323j47035K47152
6305E5654N085L3149M105k8912l0313n1472J32862m7392o6532q6010R2607j33389
6293a20558J18270j2578r5J6255m1842R6380j93477L1846Q0659R8103j1360k00872
6281a39269L8572J07214L2815j27611K08133p1858q9327m2088J76874o9888p856
6270A5711P8241j03648Q3828k1794p2290L3010n7721P565J7219J6472N6438j06009
$$ y = [-37441, -16281, 68806, 82121, -81925, -17124, 36328, 22624, -39443, -75815, 56710, 5792, 75662, 5373, -14676, -24019, 109987, 97885, 11269, 27254, -510, -33669, -72065, 67921, 135778, 100524, -53691, -185936, -133028, 153444, 10376, 19364, -42392, -102872, 16768, 129389, 103358, 66077, 65093, 62300, -27237, 4053, 78616, 64860, -44463, -191498, 55654, 60739, 93888, 97993, 69081, 38768, -12704, 120158, 72766, 6234, -79776, 12831, -120558, -2288, -14866, -14961, 1294, -40548, 55832, -137645, -105799, -25140, 72963, 61603, -139269, -100697, 6517, 39332, -88279, 119854, 47996, -41331, -83419, 93455, 23567, 15711, 93952, -9696, 74132, 52338, -19952, 13058, -44663, -37098, -19879, -3407, 53031, -52978]
6258e2978K5105m0844n1320l8120Q0572P9624J1601J61402o8046j47980K7580
6247a3404p3604K4559P0768O792p346j36072L9469J32269n7278M948R9010L8828
6235A28939q3575L3071L5388J1312j52619Q2311r9379N6831q83J10155R4536j26498
6223H9589r8721M7464Q105j42239K4311J21723J91748k2672k06366Q828l1548
6212i778j23895p2705J56946J69652r5006K292O2729j03607N7517j9418M5022
6201F9749J2487J50351j27272l8768M2396l5127j7215p9870P7049j20777L5217
6190c1780P8548J59342o486j68152p628J06628q7295p4167j3595j23639K41811
6179G3587l737j05222R1934L0604k9670j16453K6411M1357N6379j4378P7773q4756
$$ y = [-52978, -27873, -68717, -120037, -158157, -77585, 2039, 13640, 175042, 106996, -40984, -13404, -87008, -62449, 8319, 15111, 7765, -128307, -88838, 43431, -13847, -8899, 90111, 128939, 45364, 78435, 113823, 125135, -27484, 54827, -44552, 12279, 11396, 121551, 216087, 89589, -9132, 38332, 46437, -95802, -71491, 50232, 241980, 219308, 12942, 21770, -9778, -133673, -206378, -49432, 120220, 25214, 27506, 90235, -13372, 44145, 24727, 69749, 82236, 232587, 105315, 66547, 108943, 73816, 56601, -23269, 53780, -66997, -31780, 46768, 206110, 199624, 31472, 23844, 130472, 43177, -30990, -44585, -168224, 73587, 69850, -35372, 56562, 87166, 57496, -58957, -32546, 8811, 65190, 50812, 128585, 43829]
6167D3829M00r3543P3204M7314l4624M5795j9234j02022P40J3582J17284L1464
6155A24189p1482L9640Q2839r4331m4772m3208Q1940j3888m055K9744l1320l6651
6143A8645p0590Q7399K9752J13446K6741j09514K1645k8168k8186j5723Q6771
6132A32218q068Q9740l7446j58961J63512k2462j5583l8345L8040M4846J12039
6121B99530M5293K3940j25631p5697j3412k4729K915o1753K1852P0964R7972j20554
6109A40690J2686r448m598o4398J27413N561j38848J04832l8983m8008l4803J8764
6097G0860Q1309P4039r3145l8642j68192R9883P6844J31398o3578m7584J6496
6086A39688j8312R5376J10580o4474j96427J1588n3257J18810Q3398q3015J49581
$$ y = [43829, 44229, -49314, 23890, 71204, 36580, 82375, 63141, -38881, -38141, -24559, 92725, 124189, 52707, 92347, 175186, 80855, 36083, -7125, 74815, 60927, 56872, 86616, 55296, 18645, -51945, 35454, 65206, 178652, 205393, 95879, 117524, 89356, 61170, 45447, 132218, 124150, 213890, 176444, 17483, 180995, 158533, 142950, 104605, 142645, 187491, 299530, 344823, 368763, 243132, 167435, 154023, 129294, 132209, 70456, 92308, 163272, 261244, 140690, 153376, 143928, 139330, 74932, 202345, 207906, 69058, 173890, 134907, 86899, 52096, 70860, 152169, 226208, 133063, 94421, -73771, 26112, 102956, 234354, 170776, 123192, 139688, 121376, 216752, 327332, 262858, 66431, 78019, 24762, 143572, 226970, 143955, 293536]
6075B93536M6622o1172j42031O5168J36738j60587R8916J71621q3679k55523j07962
6064A647K18199P8588J00773k9562q2878l6078j53273L8979J1022M7118o0459
6053A34076J02320m9450l6532J30748j30781K6723j05228o4441Q1494j4259R1119
6042A65789N9790J5507L7028j19218K2289J10347j94142j04088o518m4969J24471
6031F6286j03766O7125J27537K1617K1389j30707M6121M0814M4010p2523O3234
6020A91137r3379K936K38687l4223n0989j6088M3803j02076q9550l2127j44359
6009h6228K13099J91608j95700j8323J20518p6279N0037k4085j25884l7623J69108
5998A80248J34250r7894M5512j35496j5320N5727n43Q7737K1367l848J02201j8842
$$ y = [293536, 340158, 278986, 136955, 202123, 338861, 178274, 277190, 448811, 365132, 109609, 1647, 219846, 298434, 399207, 369645, 286767, 250689, 97416, 136395, 147417, 194535, 134076, 236396, 186946, 150414, 281162, 150381, 177104, 71876, 7435, 88929, 74670, 165789, 225579, 241086, 278114, 158896, 181185, 291532, 97390, -6698, -13216, -58185, 66286, -37480, 29645, 157182, 178799, 200188, 69481, 115602, 156416, 200426, 127903, 191137, 97758, 100694, 339381, 305158, 254169, 238081, 281884, 179808, 90258, 58131, -86228, 126871, 318479, 122779, 104456, 224974, 148695, 198732, 174647, 48763, 11140, 180248, 314498, 216604, 262116, 126620, 111300, 167027, 166484, 254221, 275588, 271740, 373941, 355099]
5986C55099N8580J7369n903o5113l2739R2129o5061P2838j1964k15024m5913L7696
5974A91994R8022J21626j59343M242M1177O3246M7736j11120j38026N9636J2632
5963B31822K4580N45J04177J73362o1904j16134N6835J800r6733K1905P4584O0529
5951D75368m0841o5820O8940J27432r5447M2095K0437Q3810n276L246n0327j63117
5939D00500L0125J14299r054n3650O8110m5080J90854l2381K9547n5914q6524
5928E50832J17146K17903K6892j9042O3730j3826L2573J1509k0727n6548j48738
5917G61704Q3116r3380M7892O7275j24261Q663J15919r5285j43597Q3026M0797
5906G51869O932l7302j583L5313r710m750n8729J08691l3855O2325J0928l6712
$$ y = [355099, 413679, 431048, 425145, 360032, 327293, 419422, 354361, 427199, 415235, 200211, 154298, 191994, 290016, 411642, 252299, 256541, 297718, 360964, 408700, 297580, 159554, 219190, 231822, 256402, 256947, 361124, 534486, 472582, 356448, 413283, 415083, 318350, 340255, 414839, 475368, 434527, 368707, 437647, 565079, 469632, 511727, 532164, 615974, 610698, 613944, 563617, 400500, 430625, 544924, 535870, 482220, 550330, 505250, 696104, 663723, 693270, 637356, 550832, 667978, 885881, 912773, 893731, 957461, 943635, 976208, 987717, 966990, 910442, 761704, 844820, 751440, 799332, 866607, 742346, 751009, 866928, 771643, 628046, 711072, 751869, 758801, 721499, 719916, 755229, 745519, 740769, 682040, 790731, 756876, 819201, 830129, 793417]
5894G93417Q1j39966J21831M9210k1236K63731n4657J26815O5441j50520j06235
5883I47912n8385K06185j78840M2511p2003J00655j9819L2051K6155J15348j22591
5872A019179O0786K5818q5816K7475j19917K3388L1366r6910P5612p9980Q0533
5861I61534j4562n4063q7708j42912k0715J26288J28929r6375L3570p7871j16340
5850F39775J61246J65389j34346R6029N2184k46144M5925L0875q0559Q935K1092
5839G60401j2737J32809l4313J1468m2948K1231p9667j5391R3036K77410N8449
5828A169748k03075j0301j5488L8110R1754n9615j66220J01552N5844n8959k3477
5817I19873O0923Q1396n593R2822l4574P0875J5469O3945J9732j05792K9456N425
$$ y = [793417, 793498, 653532, 775363, 824573, 803337, 1067068, 1012411, 1139226, 1204667, 1054147, 947912, 889527, 1095712, 916872, 959383, 887380, 988035, 968216, 1000267, 1026422, 1141770, 1019179, 1079965, 1105783, 1019967, 1047442, 927525, 950913, 982279, 885369, 960981, 881001, 961534, 946972, 892909, 805201, 662289, 641574, 767862, 896791, 800416, 833986, 756115, 639775, 801021, 966410, 832064, 928093, 980277, 734133, 780058, 810933, 730374, 739309, 760401, 747664, 880473, 846160, 857628, 814680, 835911, 756244, 740853, 833889, 1111299, 1169748, 966673, 956372, 940884, 978994, 1070748, 1011133, 844913, 946465, 1002309, 943350, 919873, 980796, 1062192, 1056599, 1149421, 1114847, 1185722, 1201191, 1265136, 1284868, 1179076, 1208532, 1213957]
5805A213957J22403k6962K10494r2188m9225j87634J41348M4121j66428m6671
5795A163215Q2033K8746k2229q8954M0894m2478r8291n2361J45960J4766J8114
5784A189415j12273M3136m621K09389r433n134P0825r3454J74577k9483j15618
5773A317326p3593K04259N9334j78131J10656Q3293M7158j42747J61659L6118
5763A625332M5409K00358J46142O3448j27763m6536l2004K67407l0173K9000P481
5752B148101k9045k20600q9106m8247K9441N3824L04230L3007J2087M4563M5637
5741B283892n7861R1175n8820J37044k09198k67922j39462k3595N4857q542k09377
5730A592191j77893J69994N0303J87611R0684n153j0936J34774n0985J01532K52689
$$ y = [1213957, 1336360, 1309398, 1519892, 1427704, 1378479, 1190845, 1332193, 1376314, 1209886, 1163215, 1245248, 1273994, 1251765, 1162811, 1203705, 1161227, 1062936, 1010575, 1156535, 1171301, 1189415, 1077142, 1120278, 1115657, 1325046, 1315613, 1310479, 1381304, 1287850, 1462427, 1432944, 1317326, 1243733, 1447992, 1507326, 1329195, 1439851, 1523144, 1570302, 1427555, 1589214, 1625332, 1670741, 1871099, 2017241, 2080689, 1952926, 1906390, 1874386, 2141793, 2111620, 2140620, 2148101, 2119056, 1898456, 1809350, 1761103, 1790544, 1844368, 2148598, 2181605, 2193692, 2238255, 2283892, 2226031, 2317206, 2258386, 2395430, 2186232, 1918310, 1778848, 1755253, 1810110, 1801568, 1592191, 1414298, 1584292, 1634595, 1822206, 1912890, 1907737, 1896801, 2031575, 1980590, 2082122, 2334811]
5719B334811J20386J21067J29506r4642j51735j83295r4940k43393j81091j50631
5709A606043j57327J48695j12640k94077q4403m1719r414k44508K42266j17351
5699I35565m5735J0317l8010o5846K5471O00j09741p1256q6970j823K4423Q2580
5687F59575q9371P5773m8534J8938p2995K7113l0928P9505q6708q9221J26398
5676E69545j0944j17452R3891m3483l275j13396j4366Q0131j86849n693J00662
5665C48771R3559r6173o6787J7042O6286J43881l8664j20815R2220j196K2877
5654D61001q3301j42007Q3684j71900N5691J43089J06529j29769k954j9013j08035
5643A93015m3083J9768J48012j73817n1050O1241p3037J16518o4231R0216P5403
$$ y = [2334811, 2455197, 2576264, 2705770, 2611128, 2459393, 2276098, 2181158, 1937765, 1756674, 1606043, 1448716, 1597411, 1484771, 1190694, 1106291, 1064572, 1055158, 810650, 1052916, 935565, 889830, 900147, 862137, 796291, 821762, 822362, 712621, 641365, 554395, 552572, 576995, 659575, 570204, 645977, 597443, 616381, 543386, 570499, 539571, 619076, 532368, 443147, 569545, 558601, 441149, 535040, 491557, 488282, 374886, 360520, 440651, 253802, 248109, 348771, 442330, 346157, 279370, 296412, 362698, 506579, 467915, 347100, 439320, 438124, 461001, 377700, 235693, 319377, 147477, 203168, 346257, 452786, 323017, 320063, 301050, 193015, 149932, 169700, 317712, 143895, 92845, 154086, 81049, 197567, 133336, 223552, 298955]
5632B98955j08308J34042o5760j7363J9252j04460J194Q6106j8835j04917O4793
5621A84699M2000n9154n3508O9981K9850q873P191R5199K6789k36976j1149J70256
5609B56305j16494P4911J15516Q6908M400k5257K12455k47837J47968j09154l1928
5598C67793M4721p7246k17798K4526p744L699K5456J219N3808j30507K8517N7708
5586A74152n013J37204j49348j44798m2384J57076O6705j20176m7087P099Q9022
5575A22452K14208o1565m2615n0470j33733J29738R148R7794r113J760j50087
5564A27517Q6902m9578r7255N9426n5686K18706J0902j34308p3063P9799O9490
5553B42852m3070P1441j63357J97416l8929J1170k9760J1497J52118k3271j05653
$$ y = [298955, 190647, 324689, 258929, 241566, 260818, 156358, 157552, 243658, 224823, 119906, 184699, 226699, 167545, 114037, 184018, 213868, 204995, 212186, 307385, 334174, 97198, 86049, 256305, 139811, 214722, 330238, 417146, 421546, 396289, 608744, 360907, 508875, 399721, 367793, 412514, 335268, 117470, 141996, 134252, 137951, 163407, 164626, 218434, 87927, 116444, 174152, 169139, 306343, 156995, 12197, -30187, 126889, 193594, 73418, 26331, 33430, 122452, 336660, 275095, 232480, 182010, 48277, 178015, 187163, 284957, 275844, 277604, 127517, 214419, 164841, 67586, 127012, 71326, 290032, 300934, 166626, 93563, 173362, 242852, 199782, 271223, 107866, 305282, 266353, 277523, 247763, 259260, 411378, 388107, 282454]
5542B82454j58799o489J02330l2101L8593k0055j10969O2977R6066p6863j43658
5531C3486K39205L4298j24345j4202o1164n0055J7980M8174Q2352L3232m0708
5520A98253j83681o4235J41422J089P8960l5836M4355j0603q7152J77851p0371
5509A90052K2650p1844R3993l2850p111K650R6143l6399p1622N3519L9574L3181
5497C11936r2393P7712m2866J9847l2388Q0096J4446p6878j73557j1181K9379
5486A04153L0008j24553J78977j30108K355l5749L8441K7760j09950J59710K4298
5475A65342j55218J06129J04177j00286r8189j5129J72324m8316k8267J63840
5465B66407o6949l6293J0738K2030p9869o2864o206q5461m4054K42311q3902q4625
$$ y = [282454, 123655, 117166, 219496, 187395, 225988, 205933, 94964, 157941, 254007, 177144, 33486, 272691, 306989, 182644, 168442, 107278, 57223, 75203, 123377, 205729, 238961, 198253, 14572, -49663, 91759, 92848, 171808, 135972, 180327, 169724, 82572, 260423, 190052, 212702, 140858, 234851, 202001, 194890, 197540, 293683, 257284, 185662, 239181, 278755, 311936, 219543, 297255, 254389, 274236, 241848, 321944, 336390, 259512, 85955, 74774, 104153, 134161, 9608, 188585, 58477, 60832, 25083, 63524, 91284, -18666, 141044, 165342, 10124, 116253, 220430, 120144, 21955, 6826, 179150, 130834, 102567, 266407, 199458, 163165, 173903, 195933, 116064, 53200, 46994, -38467, -82521, 159790, 75888, -8737]
5453h737q7879Q8613J98010l6342J6776j22184p7319P0897N9251k8936J27367
5442A99517o5167P6078j76417R4124o6180j3358J26167r9654j36673J04108L1336
5431G3881J9915L4233L9362R4782J3408o2357m0293L5576q2016j14262Q0453J13532
5419B06214l7127q514J42515j52105o4299N0481q9812L4466P0961j28545o683
5408A7552M2919O8091r4709Q0310R3770j88382k9719p4837K87305l8729p2706
5397I0865j11570q119Q8544k6946M7317j21368J13497m8762Q2270j98382P4209
5386a8445R5601L311O0279n2647J01618p5702k0138L9769L7906l5391o082Q0465
5374B10544O3581j22874k6889L7669j1836q1166L4629J0954O5791Q5248j3890
$$ y = [-8737, -96616, -8003, 190007, 153665, 170441, 48257, -29062, 41835, 101086, 72150, 199517, 134350, 210428, 34011, 128135, 61955, 48597, 174764, 75110, -61563, 42545, 73881, 93796, 128029, 167391, 262173, 275581, 213224, 172931, 208507, 126491, 12229, 92682, 206214, 169087, 160573, 303088, 150983, 86684, 137165, 47353, 81819, 152780, 24235, 17552, 60471, 128562, 33853, 114163, 207933, 19551, -10168, -85005, 202300, 163571, 90865, -20705, -28824, 59720, 32774, 80091, -41277, 72220, 23458, 105728, -92654, -18445, 77156, 80467, 140746, 88099, 189717, 114015, 93877, 133646, 171552, 136161, 130079, 210544, 274125, 151251, 124362, 162031, 150195, 69029, 103658, 114612, 180403, 265651, 251761]
5363B51761M0354l7090j27669R7533J8625k68052K36332L5029o1641j70789M1904
5352E6297P7026O8450q871P1124r8727P452m9191O3243n8563P4683K5714P3926
5340C02563o1183k3040P5470j06053J2174r3785m1373l0898J61531M0875m5203
5329A91078k7183K10247m3852j3329M1321J4616j70805J13173m850m2163j74022
5318I4231J57591M1511Q1414j42338m6853J8288J08562P853L1492O5313r4148
5307C22916P1873q662p0634o0735M5553K00678j01434K5294J73144r1827j72108
5296C34058N2906M347J19985m5754N4905q9198O7929N4317l1209j22160O5601
5285D65727K13474j37703j22013J86511r5424j49408L1613K5003p647M7297M8229
$$ y = [251761, 292115, 255025, 127356, 224889, 243514, -24538, 211794, 246823, 185182, 14393, 56297, 133323, 201773, 192902, 264026, 165299, 172751, 123560, 186803, 128240, 202923, 228637, 302563, 241380, 218340, 293810, 187757, 199931, 106146, 64773, 33875, 195406, 236281, 191078, 163895, 374142, 330290, 316961, 358282, 372898, 202093, 315266, 310416, 268253, 94231, 251822, 293333, 374747, 232409, 185556, 203844, 312406, 320259, 351751, 417064, 322916, 394789, 386127, 315493, 254758, 300311, 500989, 399555, 424849, 597993, 506166, 334058, 386964, 391311, 511296, 465542, 520447, 431249, 499178, 553495, 522286, 400126, 465727, 679201, 541498, 419485, 605996, 510572, 361164, 392777, 417780, 410133, 457430, 505659]
5274E05659J34761Q1476j39581L3226Q8932J52131l0127J02419k5443K410p5908
5263H29955J05136L7744k5627K1523Q4688l3433L6526l534m3846j0386K29296
5252A228042n1589L0445P5871j6O9989J87719o0362j07781N0878O7089J98106
5241A688391n8685L136j25323K8163o2491j26220J25424N209n3934l6691K5905
5230A412884p4560r1730p5831K69427l3230J4168m5331P1624k18811n517N2735
5219A275828J13438K01375m6085l8499o542J964j07915N7687j8770j18811j009
5208A312661K28811L3738J13945l8749J60536j16557Q5623K9218o2679P8398K31126
5197B056071r8891m7339q006j36773K719M1124J5222R5757k7931j48466K966q397
$$ y = [505659, 640420, 721896, 582315, 615541, 704473, 856604, 826477, 928896, 903453, 905863, 829955, 935091, 972835, 947208, 968731, 1053419, 1019986, 1056512, 1052978, 1009132, 998746, 1228042, 1176453, 1206898, 1282769, 1282753, 1352742, 1540461, 1480099, 1372318, 1423196, 1490285, 1688391, 1629706, 1632842, 1507519, 1535682, 1473191, 1346971, 1472395, 1477604, 1423670, 1386979, 1412884, 1338324, 1246594, 1170763, 1440190, 1406960, 1421128, 1375797, 1447421, 1228610, 1223093, 1275828, 1389266, 1590641, 1544556, 1506057, 1499515, 1501479, 1393564, 1451251, 1432481, 1313670, 1312661, 1541472, 1575210, 1689155, 1650406, 1810942, 1694385, 1780008, 1809226, 1746547, 1824945, 2056071, 1957180, 1909841, 1901835, 1765062, 1767781, 1808905, 1824127, 1919884, 1891953, 1743487, 1746453, 1738056]
5185A738056R5957K1054O8343l4404J37865Q5996K72171m9002J36071O7642K1706
5174B561455K16042N1338k81280N5412L449r8710j16903J7749j4479n1912j0629
5163B331532R093k05441r2432L0520K7961n8183q1972k9093P1096l8741L7359
5152B001699l7916r3709P2927Q9533P5947j74557J48913r5540R3298O7355J3596
5141B161546m6306L1042J49842J6329J12064o671J69938j9979k2336K53335K15765
5130C014569K16450N534K479p3678K55791J04323K04576o902r2355J19321n8479
5119C691629j77458J4661j03623j56492L0944o3535q6485l7149K0826J8360p5716
5108C075962j40032l4789L0718j31475Q3060R7233M6695k7423j48757j86100K80455
$$ y = [1738056, 1834013, 1855067, 1923410, 1889006, 2026871, 2112867, 2385038, 2336036, 2472107, 2539749, 2561455, 2777497, 2828835, 2547555, 2602967, 2606416, 2507706, 2390803, 2408552, 2394073, 2342161, 2331532, 2340625, 2135184, 2042752, 2073272, 2101233, 2043050, 1961078, 1931985, 2003081, 1964340, 2001699, 1963783, 1870074, 1943001, 2032534, 2108481, 1933924, 2082837, 1987297, 2080595, 2147950, 2161546, 2115240, 2146282, 2296124, 2312453, 2424517, 2417846, 2587784, 2567805, 2545469, 2798804, 3014569, 3231019, 3236553, 3239032, 3165354, 3421145, 3525468, 3730044, 3723142, 3630787, 3750108, 3691629, 3514171, 3528832, 3425209, 3268717, 3299661, 3236126, 3149641, 3112492, 3133318, 3151678, 3075962, 2935930, 2901141, 2931859, 2800384, 2883444, 2980677, 3027372, 2999949, 2851192, 2665092, 2945547]
5097B945547J66377N7347o0430p6844n2586M819M9994N637P1837j51568J7683
5086B977813O9267p6482Q0454m1770K06646J04869O3653o484J05817M1810j9428
5075C506165l220J1578n7181R4657P9801j39738J96601J37898l4515L2636J32759
5064C957441K66672J98298L1984k2513N6869J38495J30281J38583R2259q98J3807
5053E001278K13745N4571J24731J00827L25908J06680J62698m2851J23585P0292
5043F241464N2798N8120J19605J00821J23012J29854J04566K22600K26440J15171
5033G494451P7690K56011K71175J43439L00662K02961K74389J85904K7671L25560
5023I559913L17649K42477J48391J08939K58398K25395K52442K63070K31174L85620
$$ y = [2945547, 3111924, 3169271, 3108841, 3031997, 2979411, 2984230, 3034224, 3039861, 3111698, 2960130, 2977813, 3047080, 2970598, 3051052, 3009282, 3215928, 3320797, 3384450, 3377966, 3483783, 3525593, 3506165, 3502945, 3514523, 3457342, 3551999, 3631800, 3492062, 3688663, 3826561, 3792046, 3824682, 3957441, 4224113, 4422411, 4454395, 4431882, 4488751, 4627246, 4757527, 4896110, 4988369, 4987471, 5001278, 5215023, 5269594, 5394325, 5495152, 5821060, 5927740, 6090438, 6047587, 6171172, 6241464, 6294262, 6352382, 6471987, 6572808, 6695820, 6825674, 6930240, 7152840, 7379280, 7494451, 7572141, 7828152, 8099327, 8242766, 8543428, 8746389, 9020778, 9206682, 9234353, 9559913, 9877562, 10120039, 10268430, 10377369, 10635767, 10861162, 11113604, 11376674, 11607848, 11993468]
5013A1993468L30677L60419N33068K89606N02173P34159M12527O06095M04584
5004A6166776N53549O66377M85703Q07989O86131Q27644Q20848J151081J083239
4995B3249337Q74412J164023J479889J397776J425077J791658J863990K241364
4987C5487526K358937K950449L517530M460108N355032N813276M429597J962923
4979F6335378j83850j317788j004959M01888J453665K764230M095525M239882
4971G6783971L366494K817495L384895M384112N605510N123307L177222Q16845
4963A05459851r62417j708081j565027j220939k184312k678237k615753j944583
4955I0580502r5346J694159L479108M904806M642090K243485Q14247J99352J137686
$$ y = [11993468, 12324145, 12684564, 13217632, 13507238, 14009411, 14743570, 15156097, 15762192, 16166776, 16720325, 17386702, 17872405, 18680394, 19366525, 20194169, 21015017, 22166098, 23249337, 24123749, 25287772, 26767661, 28165437, 29590514, 31382172, 33246162, 35487526, 37846463, 40796912, 44314442, 48774550, 54129582, 59942858, 64372455, 66335378, 66151528, 64833740, 63828781, 64230669, 65684334, 68448564, 72544089, 76783971, 80150465, 82967960, 86352855, 90736967, 96342477, 101465784, 104643006, 105459851, 104497434, 102789353, 101224326, 100003387, 97819075, 95140838, 92525085, 90580502, 90485156, 92179315, 95658423, 100563229, 105205319, 107448804, 108263051, 108462403, 109600089]
4946A09600089J675266L45340k781243n935982p516870p984804p260472o043443
4938G4097881m886787l780380k917574k302075j623909r24743k64766J87005J132418
4929E8717070K109320K117436J655833k6023k152508l757512m533886m514280
4921D9615450m089611l843284l119528k805813k359736k242376k131083j520817
4913B7503202j453141j310486j228457r98541r82574p92097p36649p33894n87093
4904A8680270m77830q62686p16559n73822m40165n97620n70697m54624n92693
4895A3393574m53420l52752l76881l00687l36511j90706m42312j41005k27517
4886A0571783k63661j47118j01668j77415j80154j93608k38988k21299N936o8074
$$ y = [109600089, 111275355, 111620695, 108839452, 102903470, 95386600, 87401796, 80141324, 74097881, 69211094, 65430714, 62513140, 60211065, 58587156, 57662413, 57397647, 57584652, 58717070, 60826390, 62943826, 64599659, 64573636, 62421128, 58663616, 54129730, 49615450, 45525839, 41682555, 38563027, 35757214, 33397478, 31155102, 29024019, 27503202, 26050061, 24739575, 23511118, 22512577, 21530003, 20737906, 20001257, 19267363, 18680270, 18202440, 17339754, 16623195, 16049373, 15609208, 15011588, 14440891, 13986267, 13393574, 12940154, 12587402, 12210521, 11909834, 11573323, 11382617, 10940305, 10799300, 10571783, 10308122, 10161004, 10059336, 9881921, 9701767, 9508159, 9269171, 9047872, 9053808, 8985734]
4876H985734j98775J9727J31596Q6532j04252L8694K37977K80136J40300J83761
4866I801430J51791K44923j3933p1673n9105j37139k52502k37705l1740j00816
4856I293531j03687k0048O714J66778J62208K98204M59208L44294M93827M73194
4846A1574223O51571K83591P1803m25801m74112l79939o22110n21130n77521m05528
4836I175047l16176j53380k37744j54467J43144j51392J30300m1509J42086J91055
4826H726964J32673K8249r0710k93820o44881j77253l78861l18069k45414l99857
4816F339021l14584j18715j86583k35633j90364j25903k11103J00787j9448j53104
4806D884371j27946k0580j2930j22908p5168k45808J60373j17879m4421J52978
$$ y = [8985734, 8786959, 8806686, 8938282, 9024814, 8920562, 8959256, 9197233, 9477369, 9617669, 9801430, 9953221, 10198144, 10184211, 10112538, 10053433, 9916294, 9663792, 9426087, 9394347, 9293531, 9189844, 9169796, 9176510, 9343288, 9505496, 9803700, 10262908, 10607202, 11101029, 11574223, 12225794, 12509385, 12581188, 12155387, 11681275, 11301336, 10679226, 10158096, 9580575, 9175047, 8858871, 8705491, 8467747, 8313280, 8456424, 8305032, 8435332, 8393823, 8535909, 8726964, 8859637, 8887886, 8797176, 8503356, 7858475, 7681222, 7302361, 6984292, 6738878, 6339021, 6024437, 5905722, 5719139, 5483506, 5293142, 5167239, 4956136, 5056923, 5037475, 4884371, 4756425, 4735845, 4722915, 4600007, 4524839, 4279031, 4439404, 4321525, 4277104, 4430082]
4796D430082j12485j5975j73647m2491k0814l3046O2818J13152r3282P2714j8934
4785D168092J22122M2694J16545p3636p5414n9037J72489K07398q9017K3977J04660
4774D660873J91071n7941k361N0408J14465O0102m0431K30347J55503J9225j2113
4763E369148N2472j401N0448p370P0982n1480j00764K61317N7526J3755L8641
4752E753274P6870K21712o2339R8941J21042J64687N8639Q2147J31832L9622J61223
4741F847650J86593J18040J88317K74671O5238j09707K50003L47143L8530K76651
4731H483129P4847P4988L55389K96079M18909Q0716J96965K76684K62720L31199
4721A0851625j1045l1762J19903J40670j34081N5686P5773J36778l2376j62015
$$ y = [4430082, 4317597, 4301622, 4127975, 4085484, 4064670, 4031624, 4094442, 4207594, 4114312, 4187026, 4168092, 4290214, 4332908, 4449453, 4375817, 4300403, 4241366, 4413855, 4621253, 4532236, 4556213, 4660873, 4851944, 4794003, 4791642, 4842050, 4956515, 5016617, 4976186, 5206533, 5362036, 5381261, 5369148, 5421620, 5420219, 5470667, 5463297, 5534279, 5482799, 5382035, 5643352, 5700878, 5714633, 5753274, 5830144, 6051856, 5989517, 6088458, 6209500, 6374187, 6432826, 6514973, 6646805, 6686427, 6847650, 7034243, 7152283, 7340600, 7615271, 7680509, 7570802, 7820805, 8167948, 8206478, 8483129, 8557976, 8632964, 8988353, 9284432, 9703341, 9784057, 9981022, 10257706, 10520426, 10851625, 10840580, 10808818, 10928721, 11069391, 10935310, 10990996, 11066769, 11203547, 11171171, 11009156]
4711A1009156P6756M5928l326J6924j24830Q6248R8378J4262P8966J15649J28665
4700A1542776K59582J03989J29788L81016K72564J52564M68945M38831K07840
4691A3957895K92022L86068L19102L49213M84840M06732K47468K81556M86723
4682A7211619M14408L63205M59364N47052N10105K93065N16560N54290N16745
4673B1386413L97265N54578L34364K34849M66911L98189L44410M34069P29962
4664B5281010Q80085R57783R42688J005018J098373J422459J588185J605265J890470
4655C6671336K365767K768416L028701L857613M361316M046543K565683M16910
4647F0082285j416428k550008k635628j943126j471689r99319k76554M71144Q12445
$$ y = [11009156, 11085912, 11131840, 11128514, 11145438, 11020608, 11106856, 11205234, 11219496, 11298462, 11414111, 11542776, 11802358, 11906347, 12036135, 12417151, 12689715, 12842279, 13311224, 13750055, 13957895, 14249917, 14635985, 14955087, 15304300, 15789140, 16195872, 16443340, 16724896, 17211619, 17626027, 17989232, 18448596, 18995648, 19505753, 19798818, 20315378, 20869668, 21386413, 21783678, 22338256, 22672620, 22907469, 23374380, 23772569, 24116979, 24551048, 25281010, 26161095, 27118878, 28061566, 29066584, 30164957, 31587416, 33175601, 34780866, 36671336, 39037103, 41805519, 44834220, 48691833, 53053149, 57099692, 59665375, 60082285, 58665857, 56115849, 53480221, 51537095, 50065406, 49066087, 48789533, 49260677, 50073122]
4638E0073122J372383K138562L186207M176923N202043O652957P017758N658295
4630H5478250J905068k490708n416438o601121o330815n183096m267157l347047
4622E3746936k427990j815501j117760p88351l24663M67808J003770J475664K159762
4613E2379675K101579J157660l68799k231741l105020l504438l233658k699074
4605D0496184k429003j917929j496703j317072j203775q17941k32917k43308k36638
4596C0600898P347k60508m39321n06969p61270o10145p86297q01337l37748N3004
4586B6157654l00267k50770j06640J80674K54198P7985L61967M44472J48841L74536
4576B7342650O13918M46923Q56955Q89704Q28786P16657O77629N77152L96102
$$ y = [50073122, 51445505, 53584067, 56770274, 60947197, 66149240, 72802197, 79819955, 85478250, 87383318, 84892610, 79476172, 72875051, 66544236, 61361140, 57093983, 53746936, 51318946, 49503445, 48385685, 47597334, 47272671, 47740479, 48744249, 50219913, 52379675, 54481254, 55638914, 55270115, 53038374, 49933354, 46428916, 43195258, 40496184, 38067181, 36149252, 34652549, 33335477, 32131702, 31313761, 31080844, 30837536, 30600898, 30608245, 30347737, 29908416, 29401447, 28640177, 28030032, 27243735, 26442398, 26104650, 26157654, 25857387, 25606617, 25499977, 25680651, 25934849, 26012834, 26374801, 26819273, 26968114, 27342650, 27956568, 28403491, 29260446, 30150150, 30978936, 31695593, 32373222, 32950374, 33346476]
4567C3346476K89943O61328Q70343Q60613R35070J204681J432314J418119J476005
4558D2494892J901505J911911K104004K147533K546510L074087L367309L933888
4550F3481639M437524N147273O072743O909795P720322Q385911Q529324Q771074
4542A19455605Q907670Q693010Q154571O891216M603720K594248J381878o30835
4534A60051083m181322p413163r172375r411756q187844n878659m032185k689957
4526A09083822k634574l205782k880811k028917k29025J048613J173521k71629
4518A00055218k096012k781512k576453j498577j184640k281897k772003k969962
4510H1894162k396308j079124J33934J133091J638846Q94161j574236l826119
$$ y = [33346476, 33636419, 34297747, 35168090, 36028703, 36963773, 38168454, 39600768, 41018887, 42494892, 44396397, 46308308, 48412312, 50559845, 53106355, 56180442, 59547751, 63481639, 67919163, 73066436, 79139179, 86048974, 93769296, 102155207, 110684531, 119455605, 128363275, 137056285, 145210856, 152102072, 156705792, 159300040, 160681918, 160051083, 155869761, 148456598, 139284223, 129872467, 121684623, 115805964, 111773779, 109083822, 106449248, 103243466, 100362655, 98333738, 98104713, 99153326, 100326847, 100055218, 97959206, 95177694, 92601241, 91102664, 89918024, 87636127, 84864124, 81894162, 79497854, 78418730, 78552664, 79685755, 81324601, 82218762, 80644526, 76818407]
4502G6818407n686896n797137n160987m424264l674285l263750k602065k265647
4494D3943376k116406j635674j614407j304073j155208p11959q10443n29682m29587
4485C3635937o95554q50035j181532j481801j363357j434574j234724j320000
4477B4074360j037972q91915q07191p41112m90892n05429n32152l94915m88316
4468A8184466j97972k84958j62088m22837l68142m94571n72644p14552n77858
4459A4388844m76188m26180m64013k58367k98593l04709k75983k93532k01382
4450A1389897j62880k01811k60658j45007j99859l54805k91114q5704J6301k81915
4440I422445q4489j70602k71402O977J03375k16621J4314p738K1322j12247m9237
$$ y = [76818407, 71131511, 65334374, 60173387, 55749123, 52074838, 48811088, 46209023, 43943376, 41826970, 40191296, 38576889, 37272816, 36117608, 35405649, 34595206, 34065524, 33635937, 32940383, 32090348, 30908816, 29427015, 28063658, 26629084, 25394360, 24074360, 23036388, 22144473, 21337282, 20596170, 20105278, 19599849, 19067697, 18672782, 18184466, 17986494, 17701536, 17539448, 17116611, 16748469, 16253898, 15681254, 14966702, 14388844, 13912656, 13486476, 13022463, 12764096, 12465503, 12160794, 11884811, 11591279, 11389897, 11227017, 11025206, 10764548, 10619541, 10419682, 10064877, 9773763, 9688059, 9704360, 9422445, 9337956, 9167354, 8895952, 8902929, 9006304, 8789683, 8803997, 8796259, 8817581, 8705334, 8656097]
4429H656097J9864n7477J06646J63715k01889J7402p2741J03260L15122L1623
4419I081622K60309N8035K63654K97796M61386K45423M70379O10524R13363J050593
4409A3713084J608624K271125K923015L475104N88004n00086m9385j588711k950255
4400A9490519k826866k338986j524410j233825j140358r22775p75103m76467m85492
4391G766237l31652j92381l02538k07693k23644j14025j12425j83405j05406r5404
4381E897664J313k49393j86973j47457m0987j62674j15350j22844j32474O9420
4371D810245o4995l3781m5752m5543p6230k27776j26687m1651q1965q7723L2611
4360D010753L2014r5018j25678j22264q0054l1223L5709o2922l3470k353k4178
$$ y = [8656097, 8675961, 8618484, 8725130, 8888845, 8686956, 8704358, 8631617, 8734877, 9049999, 9081622, 9341931, 9399966, 9663620, 9961416, 10422802, 10668225, 11138604, 11749128, 12662491, 13713084, 15321708, 17592833, 20515848, 23990952, 24578956, 24078870, 24029485, 22440774, 19490519, 16663653, 14324667, 12800257, 11566432, 10426074, 9503299, 8728196, 8251729, 7766237, 7434585, 7242204, 6939666, 6731973, 6508329, 6394304, 6281879, 6098474, 5993068, 5897664, 5898977, 5649584, 5462611, 5315154, 5274167, 5111493, 4996143, 4873299, 4740825, 4810245, 4745250, 4711469, 4665717, 4620174, 4543944, 4316168, 4189481, 4147830, 4065865, 3978142, 4010753, 4042767, 3947749, 3822071, 3699807, 3619753, 3588530, 3624239, 3561317, 3527847, 3525494, 3501316]
4349C501316q0090M4125K9664k2478P8228o7848j0994K4837j43869o6299r1935
4338C194657J1567k8970N5076R3503j63563J9895J6423j6127J34947J02871j58225
4327C262054j58141K07350L3797m8649j19959J7854J03329o254o9538o010m9774
4316C166059j3738j2763J25397J20376r7019J50481n1060K7468P3645k2287k30972
4305C235587Q1395n5771k1120J6858l9113j23996l495K10538k5197j48695J4693
4294C141684j73168Q791k3115J60685j3254r3533l6105K8818N7688K808J39929
4283C201228J5811Q1959n4263p4073K08029M372r9878m9924P7225p74J05929Q5976
4271C501617j83664O0059K4761K1350j23541J32686J67849M9965K8264O8732J56195
$$ y = [3501316, 3421226, 3465351, 3495015, 3472537, 3550765, 3482917, 3471923, 3496760, 3352891, 3286592, 3194657, 3206224, 3177254, 3232330, 3325833, 3162270, 3182165, 3198588, 3182461, 3317408, 3420279, 3262054, 3103913, 3311263, 3345060, 3296411, 3176452, 3194306, 3297635, 3291381, 3221843, 3215833, 3166059, 3152321, 3139558, 3264955, 3385331, 3288312, 3438793, 3387733, 3415201, 3488846, 3466559, 3235587, 3316982, 3261211, 3240091, 3256949, 3217836, 3093840, 3090345, 3300883, 3275686, 3126991, 3141684, 2968516, 2977307, 2954192, 3114877, 3101623, 3008090, 2971985, 3000803, 3058491, 3061299, 3201228, 3217039, 3298998, 3244735, 3170662, 3378691, 3383063, 3283185, 3233261, 3310486, 3309712, 3415641, 3501617, 3317953, 3378012, 3402773, 3424123, 3300582, 3433268, 3601117, 3651082, 3679346, 3748078, 3904273]
4260C904273n8073j26091J55279N4234J25673P9413L17674K23202J50420J09002
4250D935006l5242j58456j23933n8001j09866m16m3978N8726r7412L7511J1515
4239D415454j5224M432r233n5699r531j39086J29296n5175M2207K6811n148J8952
4227D348056L3662j26482j5836m6654r0106r76J94025O8926p5237J34719O5883
4216D489980K8213J7665J25688o8913K7433K60936R5864o3546L7809N4481o6634
4205D938976Q300J25960J56638K87180J02129J20890J18108R1862J216J50917
4195F102176m244M08831J55741M8504J10400K79654J06769J98682J47235J86493
4185G740241L58771Q2082K27055J86000J95580O7617L02137L27165K62333J66691
$$ y = [3904273, 3846200, 3720109, 3875388, 3929622, 4055295, 4134708, 4452382, 4675584, 4826004, 4935006, 4899764, 4741308, 4617375, 4559374, 4449508, 4449092, 4405114, 4463840, 4366428, 4403939, 4415454, 4400230, 4404662, 4395429, 4339730, 4330199, 4191113, 4320409, 4265234, 4307441, 4334252, 4329104, 4348056, 4381718, 4255236, 4239400, 4192746, 4102640, 4101664, 4295689, 4364615, 4289378, 4424097, 4489980, 4518193, 4535858, 4661546, 4592633, 4620066, 4881002, 4976866, 4913320, 4951129, 5005610, 4938976, 4947276, 5073236, 5229874, 5517054, 5619183, 5740073, 5858181, 5950043, 5951259, 6102176, 6097932, 6506763, 6662504, 6711008, 6821408, 7101062, 7207831, 7406513, 7553748, 7740241, 8099012, 8181094, 8408149, 8594149, 8789729, 8857346, 9159483, 9486648, 9748981, 9915672]
4175I915672L09892M85793M19601M37551L33925M99837O95393N29317P35799Q95211
4165A5257991P24412O64488P10731L80909K69054J47145k63952m39999m27433
4156A7023346o71920n52297m67843n07425n53837k90709l72663m76145l84319
4147A2746188l04221j98252k14861j24750k51644R158j59403m6427j7484M2377
4137A1480681n8226k08519o4103j30615o7864L4228J6901O0643M3048J05383J09926
4126A1321483K39854J16017l383J85719K58790J70554k6811p2700j51205j45096
4116A1893222N1930j42225j6568J01577K55108J63908Q069M1108J86957J99021
4106A2742107J37540K81257L24201J61322K46651J76939M39846L97596L47150
$$ y = [9915672, 10225564, 10711357, 11130958, 11568509, 11902434, 12402271, 13097664, 13626981, 14362780, 15257991, 15982403, 16646891, 17357622, 17738531, 18007585, 18154730, 17890778, 17450779, 17023346, 16351426, 15799129, 15331286, 14823861, 14270024, 13979315, 13606652, 13130507, 12746188, 12441967, 12243715, 12028854, 11904104, 11652460, 11661618, 11502215, 11455788, 11438304, 11480681, 11422455, 11213936, 11149833, 11019218, 10951354, 10985582, 11002483, 11063126, 11106174, 11211557, 11321483, 11561337, 11677354, 11673971, 11859690, 12118480, 12289034, 12262223, 12189523, 12038318, 11893222, 11945152, 11802927, 11786359, 11887936, 12143044, 12306952, 12315021, 12356129, 12543086, 12742107, 12879647, 13160904, 13485105, 13646427, 13893078, 14070017, 14509863, 14907459, 15254609]
4097A5254609M53014N03639L66990N41377M89957O70704O58690Q03317P52657
4088B0494954R72910Q99888Q62646J035901J045338J057682J186021R52768J158207
4079B9666315J271449J225267J365061J235647J415250J326561J434114J438190
4071D0377854J522726J441020J210149J247330J371894J506110J738480J931967
4063E2347530K239427K807192L024663L103915L432908L365608L126500L280132
4055G6727875L281579L551229L052960K855987K191022K227660K486619L037178
4047I9412109L422895L598778L913933M002069M118734M181323M139360L471765
4039A30260966L132194L078229L313860L400175M002361M369358M311287L763362
$$ y = [15254609, 15707623, 16211262, 16578252, 17119629, 17609586, 18280290, 18938980, 19742297, 20494954, 21467864, 22367752, 23230398, 24266299, 25311637, 26369319, 27555340, 28508108, 29666315, 30937764, 32163031, 33528092, 34763739, 36178989, 37505550, 38939664, 40377854, 41900580, 43341600, 44551749, 45799079, 47170973, 48677083, 50415563, 52347530, 54586957, 57394149, 60418812, 63522727, 66955635, 70321243, 73447743, 76727875, 80009454, 83560683, 86613643, 89469630, 91660652, 93888312, 96374931, 99412109, 102835004, 106433782, 110347715, 114349784, 118468518, 122649841, 126789201, 130260966, 133393160, 136471389, 139785249, 143185424, 147187785, 151557143, 155868430, 159631792]
4031A59631792L041344J776881Q51624j33442j228923j025330j25930K474060
4023A65262076O063252R465278J4618451K0600351K7527697L2259500L2297358
4016C08093963O51834k3048492l6997974m0197108k8092862k2099637j7774642
4009A40535082j4638401j1343571r475141p640218o955615n290426m467233l450851
4001G7273626l028359l086040l357984l001037l148592k520575k420489j652343
3993E5058207j776537j573240j778336j271720j477230j387920j299086j233653
3985D3260485j223730r23969j161498q65259p83727n11243k15864m7230Q8355
3976C7616320N10573P40463J147977J100893J082851J053724Q67465J73271J9813
$$ y = [159631792, 162673136, 164450017, 165301641, 165168199, 163939276, 162913946, 162788016, 165262076, 171325328, 180790606, 195409057, 216009408, 243537105, 275796605, 308093963, 308745797, 285697305, 248699331, 208502223, 180409361, 158309724, 140535082, 125896681, 114553110, 105077969, 97437751, 90482136, 85191710, 80724477, 77273626, 74245267, 71159227, 67801243, 64800206, 61651614, 59131039, 56710550, 55058207, 53281670, 51708430, 49930094, 48658374, 47181144, 45793224, 44494138, 43260485, 42036755, 41112786, 39951288, 39086029, 38302302, 37791059, 37575195, 37527965, 37616320, 38126893, 38867356, 40015333, 41116226, 42199077, 43252801, 44120266, 44293537, 44313350]
3967D4313350n72887j078459j338001j416103j496456j410277j429105j538843
3959C4033219j475126j176400j061055j166603q40185q41389q37608o29494o49743
3950B5355616m82654k29665k22047k17883J573o6713Q6161L54090L85598K59645
3940B5223721R88821J096211J437077J936054K680413L348893L554992J665579
3932D1931761j239245k973543m100764l740142k763044k272823j819509j468631
3924B1554060j260865j183089j061335r61646p35067l85942l33962m19928l80584
3915A4831642j15167j92104n07878j96941j50437k44194l45352j71415j48108
3906A2760046k8706q3029n7563j39571j49116N3782j31400L9116n3992j16516
$$ y = [44313350, 43740463, 42662004, 41324003, 39907900, 38411444, 37001167, 35572062, 34033219, 32558093, 31381693, 30320638, 29154035, 28313850, 27472461, 26634853, 26005359, 25355616, 24872962, 24643297, 24421250, 24203367, 24204940, 24138227, 24224388, 24578478, 24964076, 25223721, 26212542, 27308753, 28745830, 30681884, 33362297, 36711190, 40266182, 41931761, 40692516, 37718973, 33618209, 29878067, 27115023, 24842200, 23022691, 21554060, 20293195, 19110106, 18048771, 17087125, 16352058, 15966116, 15632154, 15212226, 14831642, 14716475, 14524371, 14016493, 13819552, 13669115, 13424921, 13079569, 12908154, 12760046, 12731340, 12648311, 12590748, 12451177, 12302061, 12355843, 12224443, 12263559, 12209567, 12093051]
3896A2093051K8762P244N1751J53971N8417K09487L07812J07128J05347K57765
3886A3380735M1219L87699L18957K78642L66989L59489M06548K22816M11599K21677
3876A6396370q3704K42845K01102L00557L81280K08140K74030O79351M35099M30923
3866A9465993O45128M79697M44502N97168O68952O88987Q53252Q09991P11130
3857B5364800Q87418J003388J061122Q99663J251693J113034J275741J426648
3849C4283507J529743J686892J868080J813298K046911K547463K698611K894279
3841E1368784L453881L862918M332747N084079N602441O519822P116405Q245664
3833I5586741R696302J1612537J4546789J8488317K2657040K5199583K2524718
$$ y = [12093051, 12121813, 12129057, 12180808, 12334779, 12393196, 12602683, 12910495, 13017623, 13122970, 13380735, 13421954, 13809653, 14128610, 14407252, 14774241, 15133730, 15540278, 15763094, 16174693, 16396370, 16312666, 16555511, 16756613, 17057170, 17438450, 17646590, 17920620, 18599971, 19035070, 19465993, 20111121, 20590818, 21035320, 21632488, 22301440, 22990427, 23843679, 24653670, 25364800, 26252218, 27255606, 28316728, 29216391, 30468084, 31581118, 32856859, 34283507, 35813250, 37500142, 39368222, 41181520, 43228431, 45775894, 48474505, 51368784, 54822665, 58685583, 63018330, 68102409, 73704850, 80224672, 87341077, 95586741, 105283043, 116895580, 131442369, 149930686, 172587726, 197787309, 220312027]
3826B20312027Q660664p953125j8664023k1195758j7652228j4525521j2899342
3819A36082694j1905469j0461793q906654p333380n904798m849927l680359l129960
3811G9910354k895640l045384l130520l082088k888250k746269k541697k461924
3803E7118582k369147k405097k333582k365571k408381k200811j919157k034213
3795C9082623j780355j710117j605270j525010j374328j373657j279568j180211
3787B7254107j201368r42312j052586q48636o66761p25912n86625m59052m13198
3778B0357657n71202p53035q31314p59351p05868o93647q17563p52898n40858
3769A3931921n74560l04097l96993l23814l30775m05743l87354k12571j58575
$$ y = [220312027, 228972691, 221019566, 202355543, 181159785, 163507557, 148982036, 136082694, 124177225, 113715432, 104808778, 97475398, 91570600, 86720673, 83040314, 79910354, 77014714, 73969330, 70838810, 67756722, 64868472, 62122203, 59580506, 57118582, 54749435, 52344338, 50010756, 47645185, 45236804, 43035993, 41116836, 39082623, 37302268, 35592151, 33986881, 32461871, 31087543, 29713886, 28434318, 27254107, 26052739, 25110427, 24057841, 23209205, 22542444, 21816532, 21229907, 20770855, 20357657, 19786455, 19033420, 18202106, 17442755, 16736887, 16043240, 15225677, 14472779, 13931921, 13357361, 13053264, 12656271, 12332457, 12001682, 11595939, 11208585, 10996014, 10837439]
3760A0837439k00482k97814k88058k20858l60305o4048n2806l32390k36322k88896
3750H495460j43722L8179j22659k57704j97461j59327J85299o5092j58054j83465
3740G431454M0944M0091l33993p9491k137J36915K0776j04399k56961k37714q1506
3729F573979r1145j04224k4739k05356j62041q5572k82236J03333j82299k37569
3719E302131j1652q222j71506L3069q2155p2487p6617n6658Q0579j03705j30577
3708D702200L63m4643q8272J0034j07666j15405n5515P0024L0932l5920k07694
3697D158438k08375j47059q7637O7708k47115n3227j01945J23006p3815N2743
3687C482722j68754N6251p1331j54138k2355J7093J31740k6516j57590r7373Q843
$$ y = [10837439, 10636957, 10339143, 10051085, 9830227, 9469922, 9405874, 9353068, 9020678, 8784356, 8495460, 8351738, 8389917, 8267258, 8009554, 7812093, 7652766, 7838065, 7772973, 7614919, 7431454, 7472398, 7512489, 7178496, 7099005, 7096868, 7233783, 7254559, 7150160, 6893199, 6655485, 6573979, 6482834, 6378610, 6353871, 6148515, 5986474, 5900902, 5618666, 5721999, 5539700, 5302131, 5290479, 5282257, 5110751, 5143820, 5061665, 4989178, 4912561, 4855903, 4936482, 4832777, 4702200, 4702563, 4657920, 4569648, 4579682, 4472016, 4356611, 4301096, 4371120, 4402052, 4366132, 4158438, 3950063, 3803004, 3715367, 3783075, 3535960, 3482733, 3380788, 3503794, 3429979, 3482722, 3313968, 3370219, 3298888, 3144750, 3122395, 3139488, 3271228, 3244712, 3087122, 2989749, 2998592]
3676B998592j7656J58194j90825o7311Q6545j0094j7419o5256R67Q1176L3272
3665B990185j12433p7519J28386j43606R8971Q4655K174j39353O6452J47858J39672
3654C185442J25763o367J82596k7726n8673j92315j96201k54563m1580j14194
3644B602182Q148N3426N7280j34295p1860r9642m3815l5437J7729J0840J5019
3633B379575J19965l5751L6766n5029J51615k50932l8471n2356r8876J77696Q8620
3622B422822J2455j20753o2174M8876j07981J73980l4981m520j13060M192Q0471
3611B299327p836O9616j10186J99799M0374O2556J25041M448J16312K9467Q1533
3600B910451N0663J74621L1772o7536j05598m2123k06526J7104k3330q2287q1321
$$ y = [2998592, 2980936, 3139130, 2948305, 2880994, 2967539, 2957445, 2940026, 2874770, 2875737, 2956913, 2990185, 2877752, 2800233, 2928619, 2785013, 2883984, 2968639, 2970813, 2831460, 2897912, 3045770, 3185442, 3311205, 3304838, 3487434, 3459708, 3401035, 3208720, 3012519, 2757956, 2716376, 2602182, 2610330, 2663756, 2721036, 2586741, 2514881, 2415239, 2371424, 2335987, 2353716, 2364556, 2379575, 2499540, 2463789, 2500555, 2445526, 2597141, 2346209, 2307738, 2255382, 2156506, 2334202, 2422822, 2435277, 2314524, 2252350, 2301226, 2193245, 2367225, 2332244, 2327724, 2214664, 2218856, 2299327, 2291491, 2361107, 2250921, 2450720, 2491094, 2553650, 2678691, 2683139, 2799451, 2828918, 2910451, 2961114, 3135735, 3167507, 3099971, 2994373, 2952250, 2745724, 2762828, 2739498, 2657211, 2575890]
3589B575890p4502M8818l4248q8307n5877j43379J50043k2095q9494J07257j60209
3578B213897O0961J86752J5208K8458N0176M4992o8151J2815K04929J63076o7137
3567B845976q8908J81527O5288J09488K40304J98781Q4383J42384n9889m7858
3557C671476K23047O7070o3897L6982n759p4678k22412k02635j83607k29965N8209
3546C073831o6660k78938N710m9055o6758j49851j86878p3040k5787m1013O640
3535B148201j3725k25566q8667J60018j5196o3124j47687j00456j2786O8279j67274
3524A542017n4508L7588L7930o6403o0071J1170p8051r1826j7610K8157j02472
3513A185921r269k8595l0974P3526J13993o3882K9726q3003K923j94194p9138
$$ y = [2575890, 2501388, 2550206, 2515958, 2427651, 2371774, 2228395, 2378438, 2356343, 2266849, 2374106, 2213897, 2274858, 2461610, 2476818, 2505276, 2555452, 2600444, 2532293, 2545108, 2750037, 2913113, 2845976, 2757068, 2938595, 3003883, 3113371, 3353675, 3552456, 3636839, 3779223, 3719334, 3671476, 3894523, 3961593, 3897696, 3934678, 3928919, 3854241, 3631829, 3429194, 3245587, 3015622, 3073831, 3007171, 2728233, 2733943, 2684888, 2618130, 2468279, 2281401, 2208361, 2182574, 2141561, 2148201, 2134476, 1908910, 1820243, 1980261, 1965065, 1901941, 1754254, 1653798, 1641012, 1709291, 1542017, 1487509, 1525097, 1563027, 1496624, 1436553, 1447723, 1369672, 1277846, 1260236, 1288393, 1185921, 1176652, 1148057, 1117083, 1190609, 1304602, 1240720, 1270446, 1187443, 1190366, 996172, 917034]
3502I17034O0304K14663j9189r4022P1294r927J2771j61860m8753K4103R7706
3491A064124o1079j44296K69971J2163M3359k6027l50689L7571j3651n3982O6221
3480H43685m2394Q5381J09579m1274q1773O0143j09164j45233J00754J11829o4967
3469H26566J17770j03190r3501k3922J27803J20679j39463j11129K12268J16777
3459A050658j01058J7529K9854q1963j56773k0603j986o3652k2637p0051q393
3448E70925J17827k5043J77584j3366j32943l6652L7928l6664M991J4295M2195
3437G21077j05433J32248j6626k9528r649M5381L671J3895O2574j63661J30759
3426G84708O2442r6534j28085J45176l7097J7476M8529j78834m1116r0088J29886
$$ y = [917034, 977338, 1192001, 1172812, 1078790, 1150084, 1140157, 1152928, 991068, 942315, 966418, 1064124, 1003045, 858749, 1128720, 1140883, 1184242, 1158215, 807526, 845097, 831446, 777464, 843685, 801291, 886672, 996251, 954977, 873204, 933347, 824183, 678950, 779704, 891533, 826566, 944336, 841146, 747645, 723723, 851526, 972205, 832742, 721613, 933881, 1050658, 949600, 967129, 996983, 915020, 758247, 737644, 735658, 672006, 649369, 579318, 570925, 688752, 663709, 841293, 827927, 694984, 658332, 696260, 659596, 664587, 678882, 721077, 615644, 747892, 731266, 701738, 692089, 737470, 741141, 755036, 817610, 653949, 784708, 847150, 750616, 622531, 767707, 730610, 748086, 796615, 617781, 576665, 486577, 616463]
3415F16463L3572R0275l07650j19898J60187p6997l320O2903p3774r0746m2407
3404B48608l574J23761P177N4260J3419j07634j0171N0479M447L3500L3931j03967
3392C44236R4416n5783J2559j6004L0624l6308J20385j79469m5413J24802n2340
3381C41705m4893J5797l2954k026J7580j01190Q5088J17217j39382L5250k3846
3370B68346j0927J03483k3083L2724j8163q8938j15471R0389O8348l3472r270
3359B63966j4835P1902k0637n4565L0837j01579J2746k5553J11253J33627j9222
3348C87940r8096m7453k3628N155m1865p9300K10159j6362k00688R2489M8468
3337B36819o4880k69J09863o4113j16429K03864j5289j43196J6321N3813l3100
$$ y = [616463, 650035, 740310, 432660, 312762, 472949, 395952, 392632, 455535, 381761, 291015, 248608, 245034, 368795, 375972, 430232, 443651, 336017, 325846, 376325, 380772, 414272, 448203, 344236, 438652, 382869, 395428, 379424, 410048, 373740, 494125, 314656, 269243, 394045, 341705, 296812, 312609, 279655, 277629, 295209, 194019, 279107, 396324, 256942, 292192, 268346, 257419, 360902, 337819, 370543, 352380, 263442, 147971, 238360, 306708, 273236, 263966, 249131, 321033, 300396, 245831, 276668, 175089, 187835, 162282, 273535, 407162, 387940, 289844, 242391, 218763, 223918, 182053, 102753, 312912, 296550, 95862, 188351, 236819, 171939, 171670, 281533, 217420, 100991, 304855, 289566, 146370, 162691, 216504, 183404]
3326A83404j07381N8150j6027j2140p9075R4835j42501R8775k833O0144J17517
3315B52868N8643o9780j63042o0340J8261L8864O9658m2798j05427K18092k1011
3304A93988J46202K9267l12555K571Q8096q0643J44758N3823k88968J1205L2524
3293B0268j9318L034m6152j51J23850J41534j10475j00031J43877j03059p4919
3282b1542j601n8300m0607R8407O0434N3402k531K6735n5192o3810j63419J55521
3270a2503N9860k4585N0417L540O999J03793p7740J6236J35304r3202j91998K1837
3258b042j3063M948m8549m3849r1678J9648K46649J762q8645M5421R4747J22480
3246B47829j61548j15041J27764p4411n2287P8702n1689P967J00417J22122k9738
$$ y = [183404, 76023, 134173, 118146, 106006, 26931, 121766, -20735, 78040, 75207, 135351, 252868, 311511, 241731, 78689, 18349, 36610, 75474, 145132, 102334, -3093, 214999, 193988, 340190, 369457, 56902, 59473, 147569, 66926, 211684, 265507, -23461, -12256, 20268, 950, 3984, -42168, -42319, 81531, 223065, 112590, 12559, 156436, 53377, -21542, -23143, -81443, -122050, -23643, 36791, 90193, 87662, 114397, 59205, -4605, -168024, -12503, 47357, 22772, 73189, 76729, 83728, 187521, 109781, 126017, 261321, 168119, -23879, -2042, -15105, -10157, -58706, -102555, -194233, -174585, 72064, 73826, -14819, 30602, 125349, 247829, 86281, -28760, 99004, 24593, -27694, 51008, -681, 7286, 107703, 229825, 200087]
3235B00087j56141O5391q8847J1663J17314j40134J9162J03479j32177R8935K1523
3224A20255J01995q1142K7381o4537M1542L2331j01275J300k4627P0499P0074
3213A93796J3740j10457K5580M166j8875M7919j04653P2718j08268r2325J05120
3202B8461J03315p5033Q6883l5872O093k176M122k0841l454L3712J2201J23809
3190B61220J37675j49871M1528l9601j64669m8392Q0095N3622j30753k7891R1425
3179A04388J26073m9736o3762K66269j14816j78983l8988m5613K10912N4943k1109
3168B49578k8874J6129j1112r988k4325J64989o3868j89705P0936n9952n2026
3157F1782J94216o9880Q2307L3983m7353o9682o8176J84330k6968K14154j40976
$$ y = [200087, 43946, 109337, 20490, 32153, 149467, 9333, 28495, 131974, -203, 98732, 120255, 222250, 141108, 168489, 103952, 145494, 177825, 76550, 77850, 53223, 123722, 193796, 207536, 97079, 122659, 126825, 107950, 155869, 51216, 123934, 15666, -76659, 28461, 131776, 56743, 143626, 107754, 113847, 111671, 115793, 94952, 91498, 125210, 137411, 261220, 398895, 249024, 290552, 250951, 86282, 37890, 117985, 171607, 40854, 12963, 104388, 230461, 180725, 116963, 383232, 268416, 89433, 50445, 4832, 215744, 270687, 249578, 220704, 236833, 225721, 215733, 191408, 356397, 292529, 102824, 173760, 113808, 61782, 255998, 186118, 268425, 302408, 255055, 185373, 117197, 301527, 274559, 488713, 347737]
3146C47737j54996q2166J77900p8515O6706L3764n3629Q7172m4285l8644k751
3135B58293m0223J430P4158j9171P2122p4927r5243Q2338J29225j5609k3217k6700
3123C22476j74979l9767J4613J64856j9741N3917J70150k22987J56787p2941o9639
3112B82745j42017K9714J84461N5450j41855o6683M9883K3176j2639J7658N0104
3101C29997k43284N9252P5475M50K0268j32053J38450o0711L9512p9806n7100
3090I0450J64025r7758l6451j08340L8934N3860r8573J03983j23395k4961J19124
3079H0898Q4565m253J07601j03281m3890N9938J0251o684r5359J15889l0595k9318
3067A45762K0876R872l8703j43876N3249J11367J6570p3258J17528K901n15o9697
$$ y = [347737, 192741, 110575, 288475, 209960, 276666, 310430, 256801, 343973, 299688, 261044, 258293, 218070, 219500, 293658, 274487, 346609, 271682, 176439, 258777, 388002, 372393, 349176, 322476, 147497, 107730, 122343, 287199, 267458, 321375, 491525, 268538, 425325, 352384, 282745, 140728, 170442, 354903, 410353, 268498, 201815, 251698, 274874, 262235, 279893, 329997, 86713, 145965, 221440, 221890, 242158, 110105, 248555, 187844, 227356, 147550, 90450, 254475, 156717, 120266, 11926, 50860, 104720, 6147, 110130, -13265, -38226, 80898, 165463, 161210, 268811, 165530, 121640, 181578, 191829, 185145, 89786, 205675, 175080, 145762, 166638, 176510, 137807, -6069, 47180, 158547, 175117, 101859, 219387, 222288, 221773, 152076]
3055A52076j02501J56649n7793k5673M7642J00322k1070o3104O5058Q7255j11042
3044B27819j58755J6915M2366L8474j89999J59563N1125p5170L5960N921M0380
3033A94599Q5482p1524O8021j9270j16012K27182M3551M2144o6547k0200R8821
3022D66247k2836L4648Q3695j13338p4617p3625K7054N5227p9222J95745J51010
3011F49988J2794j02024m2981N6537M8830K7675m7467J21885m9734n531o2707
3000F07265Q6160o667K4176J83133p1764k3583J09175L4852l0752J93720J4373
2989A120088j38746k8151J59911p0573J36312R4814J17899J41509l8031P0033
2979A565065K5641l3295q701M3651K27102M5545l7015K20774J209r310O5742K6619
$$ y = [152076, 49575, 206224, 148431, 122758, 170400, 270722, 249652, 186548, 251606, 338861, 227819, 69064, 85979, 128345, 166819, -23180, 136383, 187508, 112338, 148298, 154219, 194599, 280081, 208557, 276578, 257308, 141296, 368478, 412029, 454173, 387626, 367426, 466247, 443411, 478059, 561754, 448416, 373799, 300174, 327228, 382455, 303233, 498978, 649988, 662782, 560758, 517777, 574314, 623144, 650819, 603352, 725237, 675503, 669972, 607265, 693425, 686758, 710934, 894067, 822303, 798720, 907895, 942747, 911995, 1105715, 1120088, 981342, 953191, 1113102, 1042529, 1178841, 1273655, 1391554, 1533063, 1495032, 1565065, 1590706, 1557411, 1548710, 1592361, 1819463, 1865008, 1827993, 2048767, 2049976, 2040666, 2106408, 2133027]
2967B133027J82665J86893J50466J04624l5097J08917K79286P0836J67223K80357
2957C629197L74625N4634K12419K32959K37763L38634K90694J99593J27537N69585
2947F267640L63014K07921K19467j6219N4676Q1776N230Q9261l5219Q6131K03069
2936G526747K00426M19572L97539N34320L46143K8120j94170n89273p88124p74515
2926G106785n75830o12111k20875l26109l04482m00588j66858L5367m7191p2210
2916D415898N3713J63273J92078L25985N12089P28480R25172J037489Q05932k18080
2906H942029m16443q36241j250416r83167n88687m92386l92574l34743m32325
2897C215047k04145j25853l7276j13656j23012l8997J12996J18394J38944L35562
$$ y = [2133027, 2315692, 2502585, 2653051, 2757675, 2722578, 2831495, 3110781, 3181617, 3348840, 3629197, 4003822, 4058456, 4270875, 4503834, 4741597, 5080231, 5370925, 5570518, 5698055, 6267640, 6630654, 6838575, 7058042, 7041823, 7096499, 7178275, 7183505, 7272766, 7237547, 7323678, 7526747, 7727173, 8146745, 8544284, 9078604, 9424747, 9452867, 9258697, 8669424, 7881300, 7106785, 6530955, 5918844, 5697969, 5371860, 5067378, 4666790, 4499932, 4535299, 4488108, 4415898, 4469611, 4632884, 4824962, 5150947, 5663036, 6391516, 7316688, 8354177, 9160109, 8942029, 8525586, 7689345, 6438929, 5455762, 4867075, 4374689, 3982115, 3647372, 3215047, 3010902, 2885049, 2847773, 2734117, 2611105, 2572108, 2685104, 2803498, 2942442, 3278004]
2887C278004K63444L68120M35876K85105r9637j09965n89808n68857m61285m92703
2877B308294l64786O5071j53009k64271j45722l15588q875J3217k2703l4598p0307
2866A006723k00270J23983m2187j68625l8533K4984l5708p1002P0725j32103o5143
2855D72844n7766J89457m9125p2756j5528M5363j24417q3940L9117n6543N1581
2844C38287N3054Q806j50190N1388O6568j95449J08835M6007J8493M1128r9592
2833B87335j1613j76716J64725Q6822L1487l60577O6049R4970J32564j74738N0529
2822A90837j24887l9054K72574j26200n3780Q8667n5194o8573k2323j2208L1332
2811H1191P8761m2968m5403K1938k0355k993j12516n1346L08200q462J5095j8316
$$ y = [3278004, 3541448, 3909568, 4345444, 4630549, 4530912, 4420947, 3831139, 3262282, 2800997, 2308294, 1943508, 2008579, 1855570, 1591299, 1445577, 1129989, 1121114, 1134331, 1111628, 1077030, 1006723, 806453, 930436, 888249, 719624, 681091, 706075, 670367, 599365, 670090, 537987, 472844, 415078, 604535, 555410, 482654, 467126, 512489, 388072, 304132, 343249, 286706, 338287, 391341, 400147, 249957, 301345, 367913, 172464, 281299, 327306, 345799, 386927, 287335, 275722, 99006, 263731, 350553, 382040, 21463, 87512, 182482, 315046, 140308, 190837, 65950, 26896, 299470, 173270, 119490, 208157, 152963, 84390, 62067, 49859, 81191, 159952, 116984, 71581, 93519, 73164, 70171, -42345, -93691, 214509, 206047, 221142, 202826]
2799B02826o3394q4108P2468J13740J9180j18741j29260M6851M4278R9295J5865
2788B19000j84578Q3253L5807j16507P464J07151O9921j63630r3288m9982j06230
2777a91619j06967K23935J46494J602j5285R1552o5597O578L622k8720m9460J11197
2765A27332k8301K9227K9652r4761N5374j2335Q0185m6883j43730O2125K535j1000
2753D9420O1673o7848J45528N2376J28380n1829j47960p1120j14423J29556J543
2742A15296o6304N1705K1016o7902m5079q2562J50979J20364m7095M1938n6590
2731A35766K5651J00086r015l9060J05217K0718l5872L9982M219M5193k107m9560
2719C41218l4300L971J52938P4797j8469L0686j4742J35942j08284m4162R3931
$$ y = [202826, 139432, 55324, 127792, 241532, 260712, 141971, 12711, 59562, 103840, 203135, 219000, 34422, 117675, 153482, 36975, 44439, 151590, 221511, 57881, -35407, -85389, -191619, -298586, -74651, 71843, 73445, 58160, 149712, 84115, 90693, 94315, 65595, 16135, 127332, 99031, 128258, 157910, 63149, 118523, 106188, 186373, 139490, -4240, 57885, 60420, 49420, 111093, 43245, 188773, 241149, 369529, 317700, 169740, 98620, -15803, 113753, 115296, 48992, 100697, 121713, 53811, 8732, -73830, 77149, 197513, 150418, 192356, 135766, 161417, 261503, 252488, 213428, 318645, 339363, 303491, 343473, 347692, 392885, 390778, 341218, 306918, 310889, 463827, 538624, 520155, 550841, 536099, 672041, 563757, 519595, 613526]
2708F13526j05411K519K14444n9214j24795L8793J60998J7949q2766R3015N1134
2697H20192m3945j18979J28845Q4144Q6207J03662l9020Q8043r6661k01005l671
2686H07812Q1734j44115J0097J6940r4169q7729r163j01013m4858J4158P4089
2675E23783n8747J87850k6086M9877j40248J09517l627j51285J10109J1962o9015
2664E44090j79926M1343L5656L3570l1997L0060m0875j5632K0965j53117q2703
2653B01434R5160N6625j08431l7393J76907j97058R854o5351L0168J1056j29487
2642D3484J12192J52734q7135l5166l5587p4772p4918J1902k05302O0274Q2452
2631d9842L2918M3190q0314J06514J12313r9696q332j19125o1243o817R8283J8143
$$ y = [613526, 508115, 510634, 725078, 665864, 541069, 579862, 740860, 758809, 676043, 769058, 820192, 776247, 657268, 786113, 870257, 956464, 1060126, 1021106, 1109149, 1012488, 811483, 807812, 889546, 745431, 755528, 772468, 678299, 590570, 581407, 480394, 435536, 449694, 523783, 465036, 652886, 626800, 676677, 536429, 645946, 642319, 491034, 601143, 613105, 544090, 364164, 405507, 441163, 474733, 442736, 472796, 431921, 416289, 437254, 284137, 201434, 296594, 353219, 244788, 207395, 384302, 187244, 197098, 131747, 161915, 172971, 43484, 155676, 308410, 221275, 186109, 150522, 75750, 832, 12734, -192568, -132294, -49842, -16924, 26266, -54048, 52466, 164779, 65083, 56751, -62374, -123617, -130434, -32151, -14008]
2619a4008K6707M8223j61791j29469Q6472P3879q150J6029n6120n3860j42385
2608c14473J74991J2909j09127o8169j06095L6388K69859n9382K3608J36558r554
2597a2487j40653q1681N4420N1599M7752N0053r718M9770m0895j67690k1639K20052
2585a117q2816k4507L0373K2904L6858J04623K6827j20190R703J47233j52598
2574b707m9935J24403q5372r9427j38352O6760q95j3145j2606J21266J8454p1383
2562a42939P6221m9135j11891J32007J99425k09137o8807N5351o6069k983Q6976
2551a00981m4143K0055J11326r4619j81292L7578L4877q67J50930N0773j32409
2540a48772K5791J545O2470M2157o8500P9152N768j23107O7331j08445r0348K86263
$$ y = [-14008, 12699, 60922, -100869, -230338, -143866, -69987, -78137, -62108, -118228, -172088, -314473, -139482, -126573, -235700, -303869, -409964, -373576, -103717, -163099, -139491, -2933, -12487, -153140, -234821, -180401, -128802, -81050, -30997, -40715, 9055, -31840, -199530, -221169, -1117, -83933, -108440, -78067, -55163, -18305, 86318, 113145, -7045, 2658, 149891, -2707, -52642, 71761, -13611, -113038, -251390, -184630, -185525, -198670, -211276, -90010, -71556, -142939, -66718, -115853, -227744, -95737, 103688, -105449, -174256, -118905, -184974, -187957, -100981, -145124, -125069, -13743, -108362, -289654, -252076, -217199, -218066, -67136, -16363, -148772, -122981, -121436, -58966, -16809, -85309, -6157, -389, -123496, -56165, -164610, -254958, 31305]
2528C1305l9489N130j59930J5683L0801P4306n7282j15539K31921J5064j04516
2517g2546L477n9509N2069J6610r5036n3608J04249P1162n2808l192K9986l2102
2505i1248K1895K7539j03604Q7229K1280O366M2803p9877j69808J18598J87476
2494F8649N1869j33204q1749J1461p513m813j52227J52254m7458R7482J615j29422
2482a73056P1893R0810J3696N2697j82895L7130J9490q4615k2277K02721m329
2471B1265l8996j32402o6355j3434M7680J07126M0254o9981j15041L7892L8633
2460a43359J2503R4117j33327j29795K43262N287J7648j14199j35076O3707J6841
2449b02391L8860K6662j33090K6518k0671P7003m8724J14460J08257q1821R1113
$$ y = [31305, -8184, -3054, -162984, -147301, -116500, -42194, -99476, -215015, 16906, 31970, -72546, -69069, -128578, -76509, -59899, -154935, -208543, -104294, -33132, -85940, -89132, -59146, -91248, -69353, -41814, -145418, -58189, -36909, -30543, 12260, -67617, -237425, -118827, 68649, 120518, -12686, -94435, -82974, -90487, -95300, -247527, -95273, -142731, -45249, -43634, -173056, -101163, -10353, 3343, 56040, -126855, -89725, -70235, -154850, -177127, 25594, 21265, -17731, -150133, -216488, -229922, -182242, -75116, -34862, -104843, -219884, -181992, -143359, -130856, -36739, -170066, -299861, -56599, -51312, -33664, -147863, -282939, -219232, -202391, -163531, -136869, -269959, -243441, -264112, -187109, -235833, -121373, -13116, -94937, -3824]
2438c824j69749j0646N4040K630J1884m1958J78238j52164P4937j36839k4126
2427b17577m5481l2917J48961q3764M1828j39407J97295j32611q5280K06008K47222
2416A04277j32296j30164R4244p8130j16635O7520l4801J79411J4062j8191j4064
2405f4767K167J79095l09165r1324K63862P5387k73489K0539J14450r6716p4239
2394b54200J24133P2096l4692r2157R759q0706M5775J20742M7678j00172j55823
2383b97567o3772K79141j01536n4324M745J5375k7500J47639j16372j7196N4042
2372a77325j9893r3562J36106J1567J48771j09900o2735Q9182k2475l3263l6148
2361a69675J640J00509n3054n6467N6766O7974R281N280K5457j12694l3823m3803
$$ y = [-3824, -173573, -184219, -130179, -127549, -115665, -157623, 20615, -131549, -56612, -193451, -217577, -263058, -295975, -147014, -230778, -188950, -328357, -131062, -263673, -348953, -142945, 104277, -28019, -158183, -63939, -142069, -258704, -191184, -225985, -46574, -32512, -50703, -64767, -62600, 116495, -192670, -283994, -20132, 55255, -218234, -197695, -83245, -179961, -254200, -130067, -57971, -92663, -184820, -175061, -255767, -209992, -89250, -41572, -141744, -297567, -361339, -82198, -183734, -238058, -233313, -217938, -245438, -97799, -214171, -231367, -177325, -197218, -290780, -154674, -143107, 5664, -104236, -166971, -77789, -100264, -133527, -169675, -168035, -67526, -120580, -177047, -120281, -52307, -43026, -37746, -12289, -124983, -158806, -202609]
2349b02609K01691k7637r6234L4965J75470q6144J73180m2202n0160j10400K3168
2338f912j69059J29640k1289j24078R6112o9247Q4146J3869Q7423j54474j31407
2327b65276J16008J99648n0473M342j52245j1856J29323p3849Q406n6490n4911
2316b07373Q0548M8137o395j5357r8892Q3320P2676n3586M4489q4387j09236J16011
2304a30045j15941R59o0743K09134L9207j9449M0655k3321J71042K1437o7497
2293F5438j03383J10462r4151J9060M3980q7161J6769K0005j6965Q4043M975j99359
2281a36287k3737R2171l4384J6314r1856J6866J39451L2606j05525j3940J17244
2270H923j9793p7638L258P8073L3662N4861J2951j31635n3094k1541j03428o9331
$$ y = [-202609, -918, -28555, -124789, -89824, 85646, -498, 172682, 130480, 80320, -30080, -6912, -175971, -46331, -67620, -191698, -95586, -164833, -80687, -66818, 20605, -133869, -265276, -149268, 50380, -93, 4249, -147996, -159852, -30529, -104378, -95972, -152462, -207373, -126825, -78688, -85083, -100440, -199332, -116012, -43336, -96922, -52433, -136820, -246056, -130045, -245986, -245027, -305770, -96636, -57429, -76878, -36223, -59544, 111498, 132935, 65438, -37945, 72517, -21634, -2574, 41406, -45755, -28986, -8981, -25946, 58097, 63072, -136287, -160024, -67853, -102237, -85923, -177779, -160913, -21462, 11144, -94381, -108321, 8923, -10870, -88508, -85250, -7177, 26485, 81346, 94297, -37338, -90432, -111973, -215401, -284732]
2258b84732L5897K95308q4037J21532k1175p7309Q0611O0445m5459j05665l7967
2247f2551K7822j04847K1870o9495K67110P5878k41756j8734M108N149O135J18792
2235B9481o2536o0815J19600j34261K6462J48036L892p2103j02691J01263r6106
2224i9778L3813P0900j64219K1264J47187m8755K6242m9389j15506J17770J28819
2213F8348M4841o5596l4161l0034r1162O2084M3192J27990j8963j47543J10334
2202F9330J09741J7533j10596l7459r0971M8682O9546n1043p0740l7985R0304
2191F342j02958J53064R0697J8380j89156O899J39688M6194j92827j6790J32280
2180I1813q4719K38689j16152q6112N3995p206P0613j304J52541r3955m1398P0481
$$ y = [-284732, -248835, 46473, -37564, 83968, 62793, -14516, 66095, 126540, 81081, -24584, -62551, -34729, -139576, -117706, -187201, 79909, 155787, -85969, -104703, -100595, -95446, -89311, 29481, -33055, -93870, 25730, -108531, -82069, 65967, 69859, -2244, -104935, -3672, -99778, -65965, 4935, -159284, -138020, 9167, -39588, -13346, -62735, -178241, -60471, 68348, 113189, 47593, 13432, -16602, -107764, -45680, -2488, 125502, 106539, -41004, 69330, 179071, 196604, 86008, 48549, -42422, 6260, 75806, 24763, -45977, -83962, 6342, -96616, 56448, 147145, 165525, -23631, -16732, 122956, 169150, -23677, -40467, 91813, 7094, 245783, 129631, 43519, 97514, 90308, 160921, 159617, 312158, 218203, 176805, 247286]
2168B47286J20406n3520N3464j23502L7814K5239P1693Q338j61334J16349N6368
2157C98601N1507K1228L21390k26172q2994J77093P767L549J10531O3020r7273
2146G48247L92o3719k5402K03915n081k0148J64486j39578J01744K9486l6929
2135I57413J21498P0770J00139N6887m8992k2818J20434J57520m7939Q6942K31333
2124A783187J72211m9305J32377J89622O4846J81080n4047K43387R2280K60080
2114C015718K75703R7986J48289M08550K21862L80378M07133O84233N33235O28193
2104F801280N52267O42194N21363J082454J020628J504614K147511K809505L712062
2095B0793878N190628N499237o64070m094675n453450m132998k732253k280739
$$ y = [247286, 367692, 314172, 367636, 244134, 281948, 307187, 378880, 387218, 225884, 342233, 398601, 450108, 471336, 792726, 566554, 483560, 660653, 668420, 671969, 782500, 845520, 748247, 748639, 684920, 659518, 863433, 858352, 838204, 1002690, 863112, 964856, 994342, 957413, 1078911, 1149681, 1249820, 1306707, 1257715, 1234897, 1355331, 1512851, 1464912, 1551854, 1783187, 1955398, 1906093, 2038470, 2228092, 2292938, 2474018, 2419971, 2663358, 2755638, 3015718, 3291421, 3389407, 3537696, 3946246, 4168108, 4548486, 4955619, 5639852, 6173087, 6801280, 7353547, 7995741, 8517104, 9599558, 10620186, 12124800, 14272311, 17081816, 20793878, 25984506, 31483743, 30819673, 26724998, 21271548, 17138550, 14406297, 12125558]
2087A2125558j880578j292589r10814r39063o29089m95789p23030n72925l65833
2078D315848m41168m40534k02618j83234l19023j39048j42862k15085Q437j77179
2068B063534j48091l2464j25902k00046n2427K7992l7132L4969j65092j73423
2058A191918r3209N819R8076j41796p5350q0144r3708j02751j26353N0125R9380
2047G32007N3231j79919k9573o3172q7173J5493p2704l0245o945k0144l3463P298
2035B84691K53233r6299k03119m5234o5898O8504l2621j4079K04611Q507p936
2024C54360O968j75426K1519m4528j63173J56526j08136J02973m6590J5041r0420
2013B9114J84428K4661q8541j9271Q1617J8770j59714j55176J91491r423k7669
$$ y = [12125558, 10244980, 8952391, 8041577, 7102514, 6473425, 5977636, 5254606, 4681681, 4315848, 3874680, 3434146, 3231528, 3048294, 2729271, 2590223, 2447361, 2232276, 2240713, 2063534, 1915443, 1882979, 1757077, 1557031, 1504604, 1532596, 1495464, 1530433, 1365341, 1191918, 1098709, 1104528, 1202604, 1060808, 985458, 905314, 811606, 708855, 582502, 632627, 732007, 785238, 605319, 575746, 512574, 425401, 440894, 368190, 337945, 331000, 310856, 277393, 284691, 537924, 441625, 238506, 193272, 127374, 195878, 163257, 149178, 353789, 362296, 354360, 361328, 185902, 207421, 162893, -280, 156246, 48110, 151083, 104493, 119534, 29114, 213542, 238203, 149662, 130391, 212008, 230778, 71064, -84112, 107379, 97956, 70287]
2002G0287Q7577j9253j75016J9086L5949M1951o9699l2516R1019M9564p3329j35109
1990a09489q1095M4639Q443P2338q0093n1343K08791o356N7519L7126J1470p1438
1978D0512l2276k0627O4750L6534p4743o2751L2372j1358m1765j78041J51607
1967i5786Q7634P269n6550J7316n7640N6367N1844l9621k45157K4445J80800n9709
1955a28788K4468J4508J46199p3913N3738R4223l7960q2784k7083L3746j39058
1944a22704J54395O4858j32437j08088l3860J52792L8292o4689J8243l270K1422
1933a5046j9848j17140K02650l5066j98221N0205K44792R7515k1726j17095n7699
1922A3321m3484j11066M4323O3359M203o4238O1594P3107k2233k8220L921M2228
$$ y = [70287, 157864, 138611, -36405, -17319, 18630, 60581, -9118, -41634, 49385, 98949, 25620, -109489, -190584, -145945, -137502, -65164, -145257, -196600, 12191, 5835, 63354, 100480, 111950, 40512, 8236, -12391, 52359, 88893, 14150, -48601, -16229, -27587, -69352, -247393, -95786, -8152, -883, -57433, -40117, -97757, -41390, 10454, -29167, -274324, -249879, -69079, -128788, -104320, -89812, 56387, -17526, 36212, 130435, 92475, 9691, -17392, 16354, -122704, 31691, 96549, -35888, -143976, -177836, -25044, 13248, -51441, -33198, -36468, -15046, -34894, -152034, 50616, 15550, -182671, -132466, 112326, 209841, 188115, 71020, 13321, -30163, -141229, -96906, -33547, -29344, -93582, -31988, 41119, 18886, -9334, -5413, 36815]
1910C6815k02861L9798N169R414j686J65051p9040j24617J00485M7377n40N936
1898A301r0356j5340K17997K0655r8553J09551J9023j36628L6058p1234m3553
1887e1079M8782K5390K8948j223K4967R7015k4370q138j91068n3189N181O6918
1875c1866L4654j4582j07124l4979J12792r2725J68694O7209j50525J1432O5353
1864B8333j7058J5037j82639J08488K098r6999J13122j79488J06666k5692p468
1853a35600p4642N8361k1412R9173J8686L3463r2144J02502j35678P0669m1915
1842a18537N9529L7686j0697P6678r4292r2773J62212O7814j96170N058J04285
1831G93O8148k12164l4167K3086P3693m3977j30620J17732Q6693m9993J12875
$$ y = [36815, -166046, -126248, -121079, -111665, -113351, 51700, -27340, -151957, -51472, -4095, -4635, 1301, -89055, -104395, 113602, 134257, 35704, 145255, 164278, 27650, 63708, -7526, -51079, -2297, 23093, 52041, 50818, 75785, 172800, 148430, 140292, -50776, -103965, -98784, -31866, 2788, -11794, -118918, -153897, -41105, -133830, 34864, 102073, -48452, -37020, 28333, 11275, 26312, -156327, -47839, -45741, -142740, -29618, -209106, -102440, -128132, -135600, -210242, -151881, -173293, -74120, -55434, -21971, -114115, -11613, -147291, -76622, -118537, -59008, -21322, -32019, 44659, -49633, -142406, 19806, 87620, -108550, -103492, 793, 68941, -143223, -177390, -154304, -80611, -124588, -255208, -137476, -50783, -100776, 12099]
1820A2099o7821j47156J60234J00366r1122j01428J25986L1165K4094l6769m3568
1809c3920P469n9467R1243K0127k53702R7296R5219j2187j8189o7414j46576j7506
1797b97607P6253j8715J4113J86821K3171m3719q32J4581n2632R8073J04236l5125
1785F8618j99626M1648k558m978J12307N7520k57845q8863J16726p0277K3905
1774b03423M9189P8595j0942L6253Q4472m3941j20828P3262m7345N4471r0971
1763a41208J34179j51334J54547j46881R3889j1282M7665m5371j25329Q6732J79685
1752G5292K1644j6719n5829o8576K0133m4411O4151n1197J25920Q8476j87872
1741b8988k877j36291R9947k8705m3090J03711J3901L0130j4484r2997J09748
$$ y = [12099, -55722, -202878, -42644, 57722, -33400, -134828, -8842, 22323, 46417, 9648, -33920, -26451, -85918, 5325, 25452, -228250, -130954, -35735, -47922, -66111, -133525, -280101, -297607, -221354, -240069, -225956, -39135, -15964, -59683, -60515, -45934, -98566, -493, 103743, 68618, -131008, -89360, -91918, -96896, 15411, 72931, -184914, -273777, -157051, -227328, -203423, -154234, -75639, -86581, -50328, 34144, -9797, -130625, -57363, -104708, -50237, -141208, -7029, -158363, -3816, -150697, -56808, -68090, -20425, -65796, -191125, -104393, 75292, 96936, 80217, 24388, -44188, -24055, -68466, -4315, -55512, 70408, 158884, -28988, -31865, -168156, -68209, -96914, -140004, -36293, -22392, 7738, -6746, -99743, 10005]
1730A0005j3214q2083q7464Q5668M1440n6116m3314K18678j39402j84644O8740
1719a81706J44318m5276Q1022j42034o1625Q1042m6809n457J27721K2427j35429
1708a61806J12332j46506o1443J05773P2250j9363J05167r2773j0163J08470m1810
1697b9872O3967n5946J5897j01298o7067J9771m8186M5732J39210j7000r3535
1686a28327J28722J50390o2644k36793J35932N6691R0892j50882q890j27521O3936
1675h8494M6472P099n3970J82778K6361j56069m5187O6580N1614P998l3077Q1996
1663I4101j62672N6959k3182M131J3162j23541l4572l9543J33994M2581J7479
1652b1103n9692L0372M0404K2408j11431l2681l0508J7345r2259Q4286P8960L3638
$$ y = [10005, -3209, -85292, -172756, -87088, -45648, -101764, -145078, 73600, -65802, -250446, -181706, -37388, -82664, -1642, -143676, -205301, -124259, -171068, -176525, -48804, -26377, -161806, -49474, -195980, -257423, -151650, -79400, -98763, 6404, -86369, -96532, 11938, -29872, 34095, -21851, -5954, -107252, -174319, -154548, -202734, -157002, -17792, -34792, -128327, 395, 150785, 88141, -148652, -12720, 43971, 134863, -16019, -24909, -152430, -88494, -42022, -34923, -88893, 93885, 120246, -35823, -81010, -14430, 37184, 45182, 12105, 94101, -68571, -11612, -34794, -30663, -17501, -141042, -175614, -215157, -81163, -38582, -21103, -80795, -50423, -10019, 12389, -99042, -131723, -162231, -144886, -237145, -152859, -73899, -40261]
1640d0261N1544p8820j66401j21o4051R9442N0579p5973J02249J62819n1782p0141
1628h0917R451l3120l3819p3J18574j38449J85636R8705J8373j56246J10697m1368
1616E7444l7441k1946k43017O2789J09281n8878J3792Q4822q4865o1163q275q7676
1604b75133P7004O6380l2228j0168L3319J02168O0302M2125L1422M6203j31405
1593I989j61115J84209o6879k6962j02314J61960k8504j3763J96483r1308j72400
1582a10604L0P7657J83804L756J5947k51767K997L121j46764J34841r0135j8137
1570a95254K00555n4999j50959J44474K0782j5648j29432j0588k633O1274k6577
1559a59005J36991m1172j22487k7621l5386Q4687L6557j12415J33494J5103J80032
$$ y = [-40261, 11283, -67537, -233938, -234059, -298110, -198668, -148089, -224062, -121813, 41006, -10776, -80917, -71466, -104586, -138405, -138478, -19904, -158353, 27283, 125988, 144361, -11885, 98812, 57444, 20003, -1943, -244960, -182171, -72890, -131768, -117976, -33154, -118019, -179182, -187457, -275133, -198129, -131749, -163977, -174145, -140826, -38658, 21644, 63769, 95191, 141394, 9989, -151126, 33083, -33796, -60758, -163072, -1112, -29616, -43379, 153104, 61796, -110604, -110574, -32917, 150887, 154643, 170590, -81177, -78180, -75059, -221823, -86982, -177117, -195254, 5301, -49698, -200657, -56183, -35401, -51049, -180481, -191069, -193702, -132428, -159005, -22014, -63186, -185673, -213294, -248680, -163993, -127436, -239851, -106357, -91254, 88778]
1548H8778k03745j2379p5733J28018J73764n5155L2577j16827J692l4501k7284
1537a00795l6831L7397J58862j00637j54323J47045L8511K4010j8876p8384q3530
1526a67551k1526K460K9447K6495J05859P815K0542j91640p6158J99591K05400
1515A40734r6852n2638J2075n9719J8393M8427k6180P1680j9200o1199n6166P776
1503g2869n1334J00294L2611r4926M12l651r1828l3009J53192j05615P6079J49190
1491E8546l9901p5156Q5103L9725j14214j40258J24728N5417j5017o4678L9641
1480d6064N624K540r2716J4633R4267m857J2659q8855n964J16286n3945o711K2649
1467c0454K9906R855J2716j70607Q3454N8408j13544R7320q1216J10335O7850
$$ y = [88778, -114967, -127346, -203079, -75061, 98703, 43548, 76125, -40702, -39010, -73511, -100795, -137626, -100229, 58633, -42004, -196327, -49282, -10771, 13239, -5637, -84021, -167551, -189077, -186617, -157170, -130675, -24816, -17001, 3541, -188099, -264257, -64666, 140734, 43882, -8756, 3319, -56400, -38007, 10420, -15760, 55920, 36720, -24479, -80645, -72869, -124203, -23909, 8702, -86224, -85812, -89463, -181291, -214300, -61108, -166723, -90644, 58546, 18645, -56511, 28592, 68317, -45897, -186155, -61427, -6010, -21027, -85705, -46064, -40440, -37900, -130616, -115983, -21716, -26573, -13914, -102769, -108733, 7553, -46392, -53103, -30454, -548, 9307, 22023, -148584, -65130, -6722, -120266, -22946, -104162, 6173, 74023]
1456G4023j89153k6237l3344J44486q4942K02127r4802K7905K5164j08206Q381
1445e4598R6557p8295m9604l9441N3411J32145n3015m9984P7022L0471L255o3382
1433D542k9843O1132K1707J8734r6606m9668L8746J6452p0912Q172P1573j17486
1421a23457o9400J06912o137N4827N494j12222O8379j9815N3418j93336J3344
1410b21993K22312k2776o5303j20954j9761r8017J85833P0943k1198r2651Q2792
1399a00773J4271R231r3772k6516J20201n6145R6224K3902l1030j61060m9873
1388b55340K42895j26882J8321J32544n1382o0142K7868N5569r8319O1179R4185
1377D0496j36492p6869k5927J50841N264o4171k27J09522j07522l6254j67467
$$ y = [74023, -115130, -141367, -174711, -30225, -115167, 86960, -7842, 20063, 45227, -62979, -54598, 41959, -36336, -85940, -125381, -71970, 60175, 7160, -42824, 34198, 64669, 67924, 4542, -25301, 35831, 57538, 76272, -20334, -70002, -31256, -14804, -85716, -77544, -5971, -123457, -192857, -85945, -92082, -37255, -31761, -143983, -75604, -95419, -42001, -235337, -221993, 319, -22457, -87760, -208714, -228475, -326492, -140659, -69716, -90914, -183565, -100773, -86502, -77271, -171043, -197559, -77358, -133503, -37279, -13377, -44407, -205467, -255340, -12445, -139327, -121006, 11538, -39844, -99986, -72118, -16549, -114868, -53689, 40496, -95996, -172865, -198792, -47951, -42687, -106858, -107085, 2437, -105085, -141339, -308806]
1366c08806O6646J39407R3118o4316l7658j25825O6670J04829N8451K9472p1928
1355d9940l4765N5437q6440K7573J2730k4498n9774J10085j8309J0237Q404l2919
1343h2179Q2955k3511J0150Q9485p9063k21248l2140K05696l5891J73030l9369
1332D7915M047j65689L3125j14203J11586M0547m0596N8034J3751R194r3695Q7385
1320h599o1628k1614j4424m5933J82626o4157j00206J03181j28259P4715N8749
1309b5549m7717Q0820J47472k03812j16673J81206M7926k1114j33467L8612N5936
1298C640j23327Q8529Q390R1288k32419M3946N6079J18662K8787j02804q8665
1287a07894K11348q8253P4268j73468j10549m7564J12775Q2699R392K6793M3655
$$ y = [-308806, -242160, -102753, -9635, -73951, -111609, -237434, -170764, -65935, -7484, 21988, -49940, -84705, -29268, -115708, -88135, -75405, -99903, -159677, -49592, -67901, -57664, -49260, -82179, 776, -22735, -12585, 76900, -2163, -223411, -255551, -49855, -85746, 87284, 47915, 51962, -113727, -80602, -194805, -83219, -42672, -83268, -25234, -11483, -2289, -95984, -8599, -70227, -91841, -106265, -152198, 30428, -33729, -133935, -30754, -159013, -84298, -25549, -73266, 7554, 155026, -48786, -165459, 15747, 63673, 42559, -90908, -52296, 3640, -119687, -31158, -22768, 68520, -163899, -119953, -63874, 54788, 83575, -19229, -107894, 103454, 15201, 89469, -83999, -194548, -242112, -129337, -46638, -37246, -10453, 33202]
1276C3202P3044M6734j52938R7714j5058r3701l9227o7089l1354N6172K5331K8374
1264c8796j8354k0768M6022q8395Q7040l2915M9792J873J14873K505n1494k5388
1252B5995m8536L5085q3689k2231O0292o4143J1061Q0184r6809J0842m9159J21543
1240a9565q7606m0102N3055P2524Q4592p7248j3690J68354r1310J8310o1036j10269
1228a03991J33427k3387J7124R4655j50945j23299M7711k3211o5209N8288q602
1217a47439J21933P5976n0096p9282O396M6230Q2406q3739j23880N7096Q4005
1206a0394L2663j15092J47484p9350l0393N5927m2419l4756j02508J51335j42614
1195a70117M1067L0755k9693O2549j1466K0770j4652J8087k1453J79464j3147
$$ y = [33202, 106246, 152980, 42, 97756, 82698, -11003, -50230, -117319, -148673, -92501, -67170, -38796, -57150, -77918, -31896, -120291, -33251, -66166, -16374, -14501, 100372, 102877, 51383, 25995, -22541, 12544, -71145, -93376, -33084, -97227, -86166, -5982, -102791, -91949, -141108, -19565, -107171, -147273, -94218, -21694, 62898, -14350, -28040, 140314, 49004, 67314, 6278, -103991, 29436, 6049, 23173, 117828, -33117, -156416, -108705, -131916, -197125, -138837, -147439, -25506, 50470, 374, -78908, -72512, -26282, 56124, -27615, -151495, -94399, -10394, 22269, -92823, 54661, -24689, -55082, 845, -41574, -76330, -178838, -27503, -170117, -129050, -98295, -127988, -65439, -76905, -56135, -70787, -52700, -74153, 105311, 92164]
1184I2164j88731j6538M3757J8460p8114j16627J45182K3881M7196M4977m074
1173A1533q5936J13503m7072q3172P8383O8569m0398m1577J05873q1714l173l8175
1161d3356M7318n9820r1363J29964p8737J33672n7599j12425m4407J14179q041
1150g0615Q19Q4914K0478m8813Q72Q2681j0548P2872n3506m7703p471j40024J54422
1137C8378j9687N9091j28898R0149j54197M9178l1910K02700N310j42500N6166
1126B3780q4760o5K3991m298n9312n431p8576J17810M6469N8655N6324o9466N3587
1113G8708N3101j56386J6088J2756l2019K090j05326J07366p7985j11883j04569
1102c18059P2857R5894m6721J72150n4667o622J22590j86236J37552J33169O788
$$ y = [92164, -96567, -113105, -69348, -50888, -129002, -245629, -100447, -76566, -29370, 15607, 11533, -74403, 39100, -7972, -91144, -12761, 55808, 15410, -26167, 79706, -2008, -5181, -43356, 3962, -55858, -147221, -17257, -95994, 37678, -19921, -132346, -176753, -62574, -70615, -69796, 15118, 35596, -13217, -12345, 70336, 59788, 132660, 79154, 31451, 23980, -116044, 38378, 18691, 77782, -51116, 39033, -115164, -65986, -97896, 104804, 110114, -32386, 23780, -60980, -61045, -37054, -41352, -100664, -106095, -184671, -66861, -20392, 38263, 94587, 25121, 78708, 131809, -24577, -8489, 4267, -27752, -25662, -130988, -23622, -101607, -213490, -318059, -245202, -149308, -196029, -23879, -78546, -85168, 37422, -148814, -11262, 121907, 128695]
1091A28695o592o2996j329m2495j21495P0144Q7554k0668k9095N0428R6539M6513
1079A95203R4320j52945p4376j71459P2502p2997j3724N6158J87765m0823j17277
1068c7653m7885P4372p5825j52469J77814K3895n3343J64232l9794o7130K9882
1057c904R6868j09805l1549J68966m5956Q3093j9092p6843R9416q4350n7205l6243
1045a6604k7489J1913J41998n8932l044o9808j2322J8898Q9251o763j3748l4042
1033A9308J3868K316j18746Q0323l4804p6563J10692j00595k929J24835J01460
1022A19165R1311l0164p2797j15039N2788J24947j25712l0191m978n04Q7993q511
1010H8308m2710o4594p6285J18557P8666j14211J02378j9373n556k20603Q6306
$$ y = [128695, 122103, 59107, 57778, 15283, -106212, -36068, 51486, 30818, 1723, 52151, 148690, 195203, 289523, 136578, 62202, -109257, -36755, -109752, -123476, -67318, 120447, 79624, -37653, -85538, -11166, -86991, -239460, -61646, -37751, -91094, 73138, 33344, -33786, -3904, 92964, -16841, -48390, 120576, 74620, 157713, 138621, 61778, 161194, 76844, 19639, -16604, -44093, -32180, 109818, 50886, 47842, -21966, -34288, -15390, 73861, 67098, 53350, 19308, 33176, 35492, -83254, -2931, -37735, -114298, -3606, -104201, -107130, 17705, 119165, 210476, 180312, 107515, -7524, 45264, 170211, 44499, 14308, 9330, 8826, 96819, 88308, 45598, -18996, -95281, 23276, 101942, -12269, 90109, 70736, 65180, -155423, -69117]
999f9117K96064o9500j20556J67624r1256j29872J6614P1139n1718k8410l6298
988d5286Q9471o0744R5595k7113J7783q661L8654j7454q1006J4201r5083j04923
976a84566O3040J85009o4140J29147l6409J14578j96178n3050p6879M3700O1389
965a4359k3765j14732N704J06491J7884J24754R437j97728p417m2671J18102J41118
953A22818j14425P512J4194L0169Q9111j01755L6961j95630J85011O5644j59964
942b0354N4738j09884O6140q6956L001L3271J07201J0135j67258j24252K79856
931D5638l2354j21019N1566N3035L9773m2157m2775L0657j4922j5177j8546N2968
919a3313o0293m5065N7733J99656p0289j20159O7307q9462M7912M3322m2292k9347
$$ y = [-69117, 226947, 157447, 36891, 204515, 113259, -16613, 1, 71140, 19422, -8988, -45286, 44185, -16559, 79036, 51923, 69706, 61045, 99699, 82245, 1239, 15440, -79643, -184566, -121526, 63483, -657, 128490, 92081, 206659, 10481, -42569, -119448, -75748, -14359, -38124, -152856, -147152, -40661, -22777, 101977, 111414, -86314, -93731, -136402, -18300, 122818, 8393, 15905, 30099, 60268, 149379, 47624, 84585, -111045, 73966, 139610, -20354, 34384, -75500, -9360, -96316, -93315, -60044, 47157, 57292, -109966, -234218, 45638, 13284, -107735, -56169, -3134, 36639, -5518, -48293, -17636, -32558, -47735, -66281, -13313, -73606, -118671, -60938, 138718, 68429, -51730, 15577, -73885, -25973, 17349, -24943, -54290]
907e4290J61768K2751j96750J5610J37912l6087L2727q4871n5942m0758O4092
896c3838M2835j08912Q129R0450R7138j32546j3729o6539J40517J55550j85906
885f851P5966M9158o5888Q7756j3016n1846m8002N8458l3825N0171O7676r8122
873G1635p5166J37361p1901j7608R618O7489n5284r5028M8683Q8370j53062K6734
861a8159J53849j09972p6269N9472M9026j11262L898P7366l1414l1963J1261j93125
849b17292O3336Q9830R8583J0897m3669J67500p7640k278m6366K9707o5348l5304
$$ y = [-54290, 107478, 130229, -66521, -50911, 87001, 50914, 83641, -1230, -57172, -97930, -33838, 8997, -99915, -91786, -1336, 95802, -36744, -50473, -117012, 23505, 179055, -6851, 69115, 118273, 52385, 140141, 127125, 75279, 27277, 85735, 51910, 102081, 169757, 71635, -3531, 133830, 61929, 44321, 53939, 121428, 66144, -28884, 19799, 108169, -44893, -18159, 135690, 25718, -50551, 8921, 57947, -53315, -49417, 27949, -3465, -35428, -24167, -217292, -153956, -64126, 34457, 45354, 1685, 169185, 91545, 89267, 42901, 72608, 7260, -28044]
$$ [...]
##END NTUPLES=NMR SPECTRUM
##END=
