##TITLE=1H_EC-3333(VI-2)
 CDCl3
 8 sc, 
 29.10.2024
##JCAMPDX= 6.0         $$ Bruker NMR JCAMP-DX V2.0
##DATA TYPE= NMR SPECTRUM
##DATA CLASS= NTUPLES
##ORIGIN= UXNMR, Bruker Analytische Messtechnik GmbH
##OWNER= root
$$ XWIN-NMR		Version 3.5
$$ Tue Oct 29 14:16:05 2024 Russian Standard Time (UT+4h)  she@DPX200
##.OBSERVE FREQUENCY= 200.1318
##.OBSERVE NUCLEUS= ^1H
##.ACQUISITION MODE= SIMULTANEOUS
##.ACQUISITION SCHEME= undefined
##.AVERAGES= 8
##.DIGITISER RES= 18
##SPECTROMETER/DATA SYSTEM= spect
##.PULSE SEQUENCE= zg30
##.SOLVENT NAME= CDCl3
##.SHIFT REFERENCE= (INTERNAL, CDCl3, 0, 20.9929)
##AUDIT TRAIL= $$ (NUMBER, WHEN, WHO, WHERE, WHAT)
$$ ##TITLE= Audit trail, XWIN-NMR		Version 3.5
$$ ##JCAMPDX= 5.01
$$ ##ORIGIN= Bruker BioSpin GmbH
$$ ##OWNER= she
$$ F:/spectra/data/she/nmr/H-F/1/pdata/1/auditp.txt
$$ ##AUDIT TRAIL=  $$ (NUMBER, WHEN, WHO, WHERE, WHAT)
(   1,<2024-10-29 14:14:39.96 +0400>,<she>,<DPX200>,
      <created by zg, POWCHK disabled, PULCHK disabled
       configuration hash MD5:
       00 E9 B6 7A A2 85 ED C7 34 08 36 98 17 FE 4E 26
       data hash MD5: 16K
       FA F3 20 CE 6D A4 EE 29 09 59 25 0B 2B 1F 82 3C>)
(   2,<2024-10-29 14:14:42.50 +0400>,<she>,<DPX200>,
      <Start of raw data processing
       efp BC_mod = 2 LB = 0.24 FT_mod = 6 PKNL = 1 PHC0 = -26347.94 PHC1 = 14.38743 SI = 16K 
       data hash MD5: 16K
       58 CC F3 4C D3 FB 3A F7 CF 48 D6 05 BA D9 FF 7C>)
(   3,<2024-10-29 14:15:10.84 +0400>,<she>,<DPX200>,
      <pk PHC0 = -0.6448599 PHC1 = 0 
       data hash MD5: 16K
       CA 86 B7 43 D5 72 A4 A8 EA 32 C5 96 36 F9 6D 3F>)
(   4,<2024-10-29 14:15:15.15 +0400>,<she>,<DPX200>,
      <abs ABSG = 5 
       data hash MD5: 16K
       3A 95 FF 1E A0 F0 69 1F 96 F9 E5 67 FA 3E CB 77>)
$$ ##END=
$$ 
$$ hash MD5
$$ 5C 36 9A C4 DB 6A 5C 11 93 F2 84 C7 76 A1 1F 1F
##$RELAX= 
##$RELAX= 
##$RELAX= 
##$RELAX= 
##$RELAX= 
##$RELAX= 
$$ Bruker specific parameters
$$ --------------------------
##$DU= <F:/spectra>
##$EXPNO= 1
##$NAME= <H-F>
##$PROCNO= 1
##$TYPE= <nmr>
##$USER= <she>
##$AMP= (0..31)
100 100 100 100 100 100 100 100 100 100 100 100 100 100 100 100 100 100 
100 100 100 100 100 100 100 100 100 100 100 100 100 100 
##$AQSEQ= 0
##$AQ_mod= 1
##$AUNM= <au_zg>
##$AUTOPOS= <>
##$BF1= 200.13
##$BF2= 200.13
##$BF3= 200.13
##$BF4= 200.13
##$BF5= 200.13
##$BF6= 200.13
##$BF7= 200.13
##$BF8= 200.13
##$BYTORDA= 1
##$CFDGTYP= 0
##$CFRGTYP= 5
##$CHEMSTR= <none>
##$CNST= (0..31)
1 1 145 1 1 1 1 1 1 1 1 1 1 1 1 1 1 1 1 1 1 1 1 1 1 1 1 1 1 1 1 1 
##$CPDPRG= <>
##$CPDPRG1= <>
##$CPDPRG2= <>
##$CPDPRG3= <>
##$CPDPRG4= <mlev>
##$CPDPRG5= <mlev>
##$CPDPRG6= <mlev>
##$CPDPRG7= <mlev>
##$CPDPRG8= <mlev>
##$CPDPRGB= <>
##$CPDPRGT= <>
##$D= (0..31)
0 1.2 0 0 0 0 0 0 0 0.06 0 0.03 0 0 0 0 0.0002 0 0 0 0 0 0 0 0 0 0 0 0 
0 0 0 
##$DATE= 1730196879
##$DBL= (0..7)
120 120 120 120 120 120 120 120 
##$DBP= (0..7)
150 150 150 150 150 150 150 150 
##$DBP07= 0
##$DBPNAM0= <>
##$DBPNAM1= <>
##$DBPNAM2= <>
##$DBPNAM3= <>
##$DBPNAM4= <>
$$ [...]
##$SUBNAM3= <"">
##$SUBNAM4= <"">
##$SUBNAM5= <"">
##$SUBNAM6= <"">
##$SUBNAM7= <"">
##$SUBNAM8= <"">
##$SUBNAM9= <"">
##$SW= 24.0689170037331
##$SWIBOX= (0..15)
0 0 2 0 0 0 0 0 0 0 0 0 0 0 0 0 
##$SW_h= 4816.95568400771
##$TD= 16384
##$TD0= 1
##$TE= 0
##$TE2= 300
##$TE3= 300
##$TEG= 300
##$TL= (0..7)
0 120 120 120 120 120 120 120 
##$TP= (0..7)
150 150 150 150 150 150 150 150 
##$TP07= 0
##$TPNAME0= <>
##$TPNAME1= <>
##$TPNAME2= <>
##$TPNAME3= <>
##$TPNAME4= <>
##$TPNAME5= <>
##$TPNAME6= <>
##$TPNAME7= <>
##$TPOAL= (0..7)
0.5 0.5 0.5 0.5 0.5 0.5 0.5 0.5 
##$TPOFFS= (0..7)
0 0 0 0 0 0 0 0 
##$TUNHIN= 0
##$TUNHOUT= 0
##$TUNXOUT= 0
##$USERA1= <user>
##$USERA2= <user>
##$USERA3= <user>
##$USERA4= <user>
##$USERA5= <user>
##$V9= 5
##$VALIST= <valist>
##$VCLIST= <CCCCCCCCCCCCCCC>
##$VD= 0
##$VDLIST= <DDDDDDDDDDDDDDD>
##$VPLIST= <PPPPPPPPPPPPPPP>
##$VTLIST= <TTTTTTTTTTTTTTT>
##$WBST= 1024
##$WBSW= 4
##$XGAIN= (0..3)
0 0 0 0 
##$XL= 0
##$YL= 0
##$YMAX_a= 187263
##$YMIN_a= -110531
##$ZGOPTNS= <>
##$ZL1= 120
##$ZL2= 120
##$ZL3= 120
##$ZL4= 120
##$ABSF1= 20.9684
##$ABSF2= -3.100733
##$ABSG= 5
##$ABSL= 3
##$ALPHA= 0
##$AQORDER= 0
##$ASSFAC= 0
##$ASSFACI= 0
##$ASSFACX= 0
##$ASSWID= 0
##$AUNMP= <proc_1d>
##$AZFE= 0.1
##$AZFW= 0.1
##$BCFW= 0
##$BC_mod= 2
##$BYTORDP= 0
##$COROFFS= 0
##$CY= -3
##$DATMOD= 1
##$DC= 0
##$DFILT= <>
##$DTYPP= 0
##$F1P= 0
##$F2P= 0
##$FCOR= 1
##$FTSIZE= 16384
##$FT_mod= 6
##$GAMMA= 0
##$GB= 0
##$INTBC= 1
##$INTSCL= 3.70164e-10
##$ISEN= 128
##$LB= 0.24
##$LEV0= 0
##$LPBIN= 0
##$MAXI= 10000
##$MC2= 0
##$MEAN= 0
##$ME_mod= 0
##$MI= 1.114404
##$NCOEF= 0
##$NC_proc= -7
##$NLEV= 6
##$NOISF1= 3.799351
##$NOISF2= 2.8
##$NSP= 0
##$NTH_PI= 0
##$NZP= 0
##$OFFSET= 20.99291
##$PC= 1
##$PHC0= -26348.58
##$PHC1= 14.38743
##$PH_mod= 1
##$PKNL= yes
##$PPARMOD= 0
##$PSCAL= 0
##$PSIGN= 0
##$REVERSE= no
##$SF= 200.130007166524
##$SI= 16384
##$SIGF1= 3
##$SIGF2= 2
##$SINO= 5.538805
##$SIOLD= 16384
##$SREGLST= <1H.CDCl3>
##$SSB= 0
##$STSI= 16384
##$STSR= 0
##$SW_p= 4816.95568400771
##$SYMM= 0
##$S_DEV= 0
##$TDeff= 16384
##$TDoff= 0
##$TI= <>
##$TILT= no
##$TM1= 0
##$TM2= 0
##$TOPLEV= 0
##$USERP1= <user>
##$USERP2= <user>
##$USERP3= <user>
##$USERP4= <user>
##$USERP5= <user>
##$WDW= 1
##$XDIM= 16384
##$YMAX_p= 359291232
##$YMIN_p= -1836921
$$ End of Bruker specific parameters
$$ ---------------------------------
##NTUPLES= NMR SPECTRUM
##VAR_NAME=  FREQUENCY,     SPECTRUM/REAL,   SPECTRUM/IMAG
##SYMBOL=    X,             R,               I
##VAR_TYPE=  INDEPENDENT,   DEPENDENT,       DEPENDENT
##VAR_FORM=  AFFN,          ASDF,            ASDF
##VAR_DIM=   16384,         16384,           16384
##UNITS=     HZ,            ARBITRARY UNITS, ARBITRARY UNITS
##FACTOR=    0.29402158847633, 1,            1
##FIRST=     4201.31130582263, 0,            0
##LAST=      -615.64437818508, 0,            0
##MIN=       -615.64437818508, -1836921,     0
##MAX=       4201.31130582263, 359291232,    0
$$ Real data points
##PAGE= N=1
##DATA TABLE= (X++(R..R)), XYDATA
$$ [...]
6923A5234560M94943O59547L17239o4870n9752L0914K45108N30508J17932N80422
$$ 15234560 15729503 16389050 16706289 16641419 16581667 16612581 16857689 17388197 17506129 18086551
6913A8086551J119442O87640R39983J366301J471666J681361J767918J676283
$$ 18086551 19205993 19893633 20833616 22199917 23671583 25352944 27120862 28797145
6905B8797145J767154K059495K807780K929639K255835J201458j40135n25140
$$ 28797145 30564299 32623794 35431574 38361213 40617048 41818506 41678371 41153231
6897D1153231r02277l6763J201185J736083J738492N38795j112469l152818l903566
$$ 41153231 40250954 40214191 41415376 43151459 44889951 45428746 44316277 41163459 37259893
6888C7259893l608070l006721k184532j700814j418796k70666r28943o61771R650
$$ 37259893 33651823 30645102 28460570 26759756 25340960 25070294 24141351 23479580 23489230
6879B3489230r9932K97710M77461L90813J080348J044989J384663J897245K735695
$$ 23489230 23389298 23687008 24164469 24555282 25635630 26680619 28065282 29962527 32698222
6870C2698222K934537K525105J249220J62167j182749j446797o50192J79158R01847
$$ 32698222 35632759 38157864 39407084 39569251 38386502 36939705 36289513 36468671 37370518
6861C7370518J297659P46925j089100k743176k941545l478397l348408k235984
$$ 37370518 38668177 39415102 38326002 35582826 32641281 29162884 25814476 23578492
6853B3578492k531296j661423q97720q68613r04982o55851q92945m71875n92239
$$ 23578492 21047196 19385773 18488053 17619440 16714458 16058607 15165662 14693787 14101548
6844A4101548m28277j07476o43974m93773r1237k83366l47437l02346j93606j17954
$$ 14101548 13673271 13565795 12921821 12428048 12336811 12053445 11706008 11403662 11210056 11092102
6834A1092102J86984j14654m00326k19454L29112k26249m13020J29551O15241
$$ 11092102 11279086 11164432 10764106 10544652 10873764 10647515 10234495 10364046 10979287
6825A0979287L70962K89398J11169m0052L07717K75050L59623O7799N23391O19513
$$ 10979287 11350249 11639647 11750816 11710764 12018481 12293531 12653154 12720953 13244344 13863857
6815A3863857M90235R18980J132377Q47231J302809J584179J788381J732059J064635
$$ 13863857 14354092 15273072 16405449 17252680 18555489 20139668 21928049 23660108 24724743
6806B4724743n59712o75168o60684p28218m4852O14262P09498N48668k61107j004456
$$ 24724743 24165031 23489863 22829179 22100961 22056109 22670371 23379869 23928537 23667430 22662974
6796B2662974j318385j217369j208415k53660j02864l06682M71417N5887K82281
$$ 22662974 21344589 20127220 18918805 18665145 18562281 18255599 18727016 18782903 19065184
6787A9065184O52077K65720O53934O60261J103996J139299J989971K342672K610982
$$ 19065184 19717261 19982981 20636915 21297176 22401172 23540471 25530442 27873114 30484096
6778C0484096L222096K254959J176642p00847j230183j121954j119905l87750
$$ 30484096 33706192 35961151 37137793 36436946 35206763 34084809 32964904 32577154
6770C2577154O50249P16960J13565j163190j621479k426485k662329k371721j568480
$$ 32577154 33227403 33944363 34057928 32894738 31273259 28846774 26184445 23812724 22244244
6761B2244244r98755r81076r46211j91185L06840J67167J69291m02568K9153L71079
$$ 22244244 21245489 20264413 19318202 19127017 19433857 19601024 19770315 19367747 19396900 19767979
6751A9767979J07610L93120R65339J090742J463713J206249K4461j076983j439586
$$ 19767979 19875589 20268709 21234048 22324790 23788503 24994752 25019213 23942230 22502644
6742B2502644p38181q04882n48327K03332M77095J18657r01095j412814j392226
$$ 22502644 21764463 20959581 20411254 20614586 21091681 21210338 20309243 18896429 17504203
6733A7504203j161929j166258p99612o31336o96687m51409n32780l49510k38535
$$ 17504203 16342274 15176016 14376404 13745068 13048381 12596972 12064192 11714682 11476147
6724A1476147J94451l81922o70746m20533j37561l33991O8102J54731k06525j44154
$$ 11476147 11670598 11288676 10617930 10197397 10059836 9725845 9793947 9948678 9742153 9597999
6714I597999n31397l27501k14939k79150k01605L3445k66295m17926j49085l11953
$$ 9597999 9066602 8739101 8524162 8245012 8043407 8076852 7810557 7392631 7243546 6931593
6704F931593J82410m58314M7785j71052j53583k25582j04624P1775M7007m30464
$$ 6931593 7114003 6655689 6703474 6532422 6378839 6153257 6048633 6120408 6167415 5736951
6694E736951O1770L6042l82237j5801k55111J92462j31129J02510L4309K13811
$$ 5736951 5798721 5834763 5452526 5436725 5181614 5374076 5242947 5345457 5379766 5593577
6684E593577k70071L1218J26721l20995l72891k64197J7302k39666o76275K73429
$$ 5593577 5323506 5354724 5481445 5160450 4787559 4523362 4540664 4300998 3624723 3898152
6674C898152J43064l12549j79835l78500r1831J06825k83691J21597J01365p044
$$ 3898152 4041216 3728667 3548832 3170332 3078501 3185326 2901635 3023232 3124597 3117553
6664C117553k90422k06400J85125J49258n1600l06466m09157k13630K74467N5608
$$ 3117553 2827131 2620731 2805856 2955114 2903514 2597048 2187891 1974261 2248728 2304336
6654B304336O9468N1355k26j44892j65386n7981K30516j79897k4544J87658M0973
$$ 2304336 2373804 2425159 2424933 2280041 2114655 2056674 2287190 2107293 2082749 2270407 2311380
6643B311380K69217k60037m25387K6425Q9173m45612J27551L4019m2934K40360
$$ 2311380 2580597 2320560 1895173 1921598 2010771 1565159 1692710 1726729 1683795 1924155
6633A924155m97543j87148K74567O0161r8841J43908m1102J94434K49559J03638
$$ 1924155 1426612 1239464 1514031 1574192 1475351 1619259 1578157 1772591 2022150 2125788
6623B125788k71680l94533M80787k22277L5597j14620j92934R188J93248l28162
$$ 2125788 1854108 1459575 1940362 1718085 1753682 1639062 1446128 1455316 1648564 1320402
6613A320402j78812l22645L56826J85738l98230J08099R8122Q4511J90743k30288
$$ 1320402 1141590 818945 1175771 1361509 963279 1071378 1169500 1254011 1444754 1214466
6603A214466j22130M50355o7052j56331k07658m0989r6741K18353N2316j60955
$$ 1214466 1092336 1542691 1475639 1319308 1111650 1070661 973920 1192273 1244589 1083634
6593A083634j57525J31152J26670k821j7669K71440j46967O7108k40527k5258
$$ 1083634 926109 1057261 1183931 1181110 1163441 1434881 1287914 1355022 1114495 1089237
6583A089237l65940K71714K24288j20998l7061j35717K7757J43048r8414j50292
$$ 1089237 723297 995011 1219299 1098301 1061240 925523 953280 1096328 997914 847622
6573H47622O2643J17943O4118Q9166j65065j68272p2883J00573r3956l0567J58233
$$ 847622 910265 1028208 1092326 1181492 1016427 848155 775272 875845 781889 751322 909555
6562I09555l3449n4324N7579j14828J09186j34472P8148L91024r5162j14348l37730
$$ 909555 876106 821782 879361 764533 873719 739247 817395 1208419 1113257 998909 661179
6551F61179P7085O4595J58466j06017J04784j13671M3212o6999J0586k04159J45774
$$ 661179 738264 802859 961325 855308 960092 846421 889633 822634 833220 629061 774835
6540G74835J17939K32270k3791J9246J76726J3883j98680K16218j09119M578p0259
$$ 774835 892774 1125044 1101253 1120499 1297225 1311108 1112428 1328646 1219527 1224105 1153846
6529A153846K28097r6366o2217K02043J29015J53716l00649n8797m09749Q8966
$$ 1153846 1381943 1285577 1223360 1425403 1554418 1708134 1407485 1348688 938939 1027905
6519A027905L36095N3141j64000j36810N1056k164k48074K04045r4518J63819
$$ 1027905 1364000 1417141 1253141 1116331 1167387 1165223 917149 1121194 1026676 1190495
6509A190495N9329l04489J58133M2381l29255L89439K54564j23358L288K58518
$$ 1190495 1249824 945335 1103468 1145849 816594 1206033 1460597 1337239 1340527 1599045
6499A599045K05521j02645n5074M0169j74681J04571Q1964p9522J21932M3861
$$ 1599045 1804566 1701921 1646847 1687016 1512335 1616906 1698870 1619348 1741280 1785141
6489A785141k51549k35945J892j93185j23505p3843j61110L2374j13237J79052
$$ 1785141 1533592 1297647 1299539 1106354 982849 909006 747896 780270 667033 846085
6479H46085J09104m30451j9391K39875J64763j22163o895k57512M31050j93478
$$ 846085 955189 524738 505347 745222 909985 787822 780927 523415 954465 760987
6469G60987j06066N6839k14879m6249J26406R0341J55231l48844K48395J02901
$$ 760987 654921 711760 496881 450632 577038 667379 822610 473766 722161 825062
6459H25062K0975k30308k34609J49405n6166j8352j48078J78870J08536j86524
$$ 825062 846037 615729 381120 530525 474359 456007 307929 486799 595335 408811
6449D08811r1054J74377L6772j08453r7757J33431l29728K51743j25066l21569
$$ 408811 317757 492134 528906 420453 322696 456127 126399 378142 253076 -68493
6439f8493J94679P7268p3973j5343O1136L8727L8868k61534O9425j1902j67852
$$ -68493 126186 203454 129481 114138 175274 214001 252869 -8665 60760 48858 -118994
6428a18994L35885j73030N1256k38421N1349j67J70180j06510J70857p6093O7846
$$ -118994 216891 43861 95117 -143304 -91955 -92122 78058 -28452 142405 66312 134158
6417A34158r7120J79160k53286Q707n382J67074r8619m6949J77107p9793Q2658
$$ 134158 37038 216198 -37088 -28381 -33763 133311 34692 -12257 164850 85057 167715
6406A67715p7254J6844j14190P9261J58212K75010k59500p848K37422J84897j30570
$$ 167715 90461 107305 -6885 72376 230588 505598 246098 238250 475672 660569 529999
6395E29999l82258k63265L44655p5768K25452K9522j61430l54257J76686J9261
$$ 529999 147741 -115524 229131 153363 378815 408337 246907 -107350 69336 88597
6385H8597j75633O1100R4887m2566l25273L91630K35382k25463j43200J35160
$$ 88597 -87036 -25936 68951 26385 -298888 92742 328124 102661 -40539 94621
6375I4621J27053l2077k91043O5243o1344K38961O4176l02973j8347k735j19542
$$ 94621 221674 189597 -101446 -36203 -97547 141414 205590 -97383 -115730 -118465 -238007
6364b38007J01556J33902m38598K43328L08894K1803j39987k80206L22863J91985
$$ -238007 -136451 -2549 -441147 -197819 111075 132878 -7109 -287315 35548 227533
6354B27533k05356J62285j03488R6750J5289l11120L04189K50195k93762R2647
$$ 227533 22177 184462 80974 177724 193013 -118107 186082 436277 142515 235162
6344B35162m2871k77540J92550l6811j83983M24303N0213k51525k40667K62381
$$ 235162 192291 -85249 107301 70490 -113493 310810 361023 109498 -131169 131212
6334A31212k4481k56364K1311j38464K73006P2325M1867k00115J35658J18561
$$ 131212 106731 -149633 -128322 -266786 6220 78545 120412 -79703 55955 174516
6324A74516r7229k27041j06845K58883P8415J0099J29711N2520j39472r8039R2921
$$ 174516 77287 -149754 -256599 2284 80699 90798 220509 273029 133557 35518 128439
6313A28439J66052l02642j59281N93201k62098l20767J50973J75327j62129m048
$$ 128439 294491 -8151 -167432 425769 163671 -157096 -6123 169204 7075 3027
6303C027j13723p1395J00058P2990j27041k26161Q4342j60729J32763k5540L67753
$$ 3027 -110696 -182091 -82033 -9043 -136084 -362245 -277903 -438632 -305869 -331409 36344
6292C6344J04441p6714j51210k23415K03367L04700j95425n8958j06801M370L1929
$$ 36344 140785 64071 -87139 -310554 -107187 197513 2088 -56870 -163671 -159301 -127372
6281a27372L80933J3184r7126o6546o5483n5667K18188J45941J34053P0507m12306
$$ -127372 253561 266745 169619 103073 37590 -18077 200111 346052 480105 550612 138306
6270A38306K4606k07196j9296L5702j06030J45455q083l60454K0977N20832k01720
$$ 138306 162912 -44284 -63580 -27878 -133908 11547 3464 -356990 -336013 184819 -16901
6259a6901j20456J04474k38780L5870L68509k42876K55113l43583j55543K63902
$$ -16901 -137357 -32883 -271663 -235793 132716 -110160 144953 -198630 -354173 -90271
6249i0271O8714J39052k92986K85275J88057k63604J79667J910L4817J16657k49151
$$ -90271 -21557 117495 -175491 109784 297841 34237 213904 215814 250631 367288 118137
6238A18137J25853l4668j50470r6199k256L34064L6250k14900K08631R49j44171
$$ 118137 243990 209322 58852 -37347 -39603 294461 330711 115811 324442 325391 181220
6227A81220l975k01817j44251K33612j09484O20490l49574k73788K44059n4608
$$ 181220 177245 -24572 -168823 64789 -44695 575795 226221 -47567 196492 141884
6217A41884j0649j3356n4178O5674r879j85523N4637j20880K7205L0587L0470
$$ 141884 131235 117879 63701 129375 119496 -66027 -11390 -132270 -105065 -74478 -44008
6206d4008j88780K14100J28534J33024k8343k91818J16072J2954M0443k16247
$$ -44008 -232788 -18688 109846 242870 214527 -77291 38781 51735 92178 -124069
6196a24069K3297K33401K4237K52652K638k44212j15917p1637K65310p6600k01396
$$ -124069 -100772 132629 156866 409518 412156 167944 52027 -19610 245700 169100 -32296
6185c2296J69194j78221J3261K6106q6941J30016j00972L22753j80510k4022J04139
$$ -32296 136898 -41323 -28062 -1956 -88897 41119 -59853 262900 82390 58368 162507
6174A62507q8989k52740K80763j97600K69836J53828j12088q2711J0950J25075
$$ 162507 73518 -179222 101541 -96059 173777 327605 215517 132806 143756 268831
6164B68831j10838K13698j72311k08277K2447Q1513p107j04202l4610J80202j99095
$$ 268831 157993 371691 199380 -8897 13550 95063 87956 -16246 -50856 129346 -69749
6153f9749j26479L99868o3745l09544j57821J9718K49029K3102j1460K3373K17819
$$ -69749 -196228 203640 139895 -169649 -327470 -307752 -58723 -35621 -47081 -23708 194111
6142A94111R2958p3135j0384k38073K29626K091J20271K78634k25722j27307K87883
$$ 194111 287069 213934 203550 -34523 195103 197194 317465 596099 370377 243070 530953
6131E30953k45152M2782K86051j27084n9821j87328J49890n3011j11428r571R7185
$$ 530953 285801 328583 614634 487550 427729 240401 390291 337280 225852 216281 313466
6120C13466j44659K80595n3140n0505j05699q0109o0156M1321O1830Q135P2759
$$ 313466 168807 449402 396262 345757 240058 159949 99793 141114 202944 211079 283838
6109B83838o6414O2572K15072m42622r8735K37921j66093o7989k0330L36209J01610
$$ 283838 217424 279996 495068 52446 -46289 191632 25539 -42450 -62780 273429 375039
6098C75039l18376J17363k76088J14107Q7781L0955k51885K01790J06153N9785
$$ 375039 56663 174026 -102062 12045 99826 130781 -121104 80686 186839 246624
6088B46624q0639L03983j52027m02117L93204k5642l06611J45230J54697m9096
$$ 246624 165985 469968 317941 -84176 309028 283386 -23225 122005 276702 227606
6078B27606J91797k76382K58061L63104j64076j93008K58905j56690j53785j89017
$$ 227606 419403 143021 401082 764186 600110 407102 666007 509317 355532 166515
6068A66515K88820N3222r6548n3506L3525J2200k58092J60923j81024J23146K37088
$$ 166515 455335 508557 412009 358503 392028 404228 146136 307059 126035 249181 486269
6057D86269K63285j07255l73632J65205j5985k91954p9135l4485J2158K78941
$$ 486269 749554 642299 268667 433872 417887 125933 46798 12313 24471 303412
6047C03412M1275k2000k68633j40902l8488L88914k77959K2098j98592L8057M23350
$$ 303412 344687 322687 54054 -86848 -125336 263578 -14381 7717 -190875 -152818 270532
6036B70532k27288J31931K64681j56905j52212P1050J91914k54622j86596K18544
$$ 270532 43244 175175 439856 282951 130739 201789 393703 139081 -47515 171029
6026A71029L08968j49124m39674K64437k143K92754j50171P9335k75156j76085
$$ 171029 479997 330873 -108801 155636 153493 446247 296076 375411 100255 -75830
6016g5830J09350L29506q9095J56457q1238J5820N9777k80479r8906R8203l6485
$$ -75830 33520 363026 273931 430388 349150 364970 424747 144268 45362 143565 107080
6005A07080J90184o4734k39436J38452n2510M8951N8310L0405M8671j739k12298
$$ 107080 297264 232530 -6906 131546 79036 127987 186297 216702 265373 263634 51336
5994E1336R4643R1922j46817J50506K53481P5507J10622j38936k78189j84049
$$ 51336 145979 237901 91084 241590 495071 570578 681200 542264 264075 80026
5984H0026K75327j35075R3430M4178J31774k85850K66436l5309j87396k81052
$$ 80026 355353 220278 313708 357886 489660 203810 470246 434937 247541 -33511
5974c3511J11628J88020J8243m995j24134L99520j54058k76937J84445L99313
$$ -33511 78117 266137 284380 279385 155251 554771 400713 123776 308221 707534
5964G07534k06772N8308k81417l5169n146j11410n1973J85682M39718k973j73760
$$ 707534 500762 559070 277653 242484 237338 125928 73955 259637 699355 696382 522622
5953E22622j46624P8080K71776K78251j99208O6056j73132Q1760m24759K58867
$$ 522622 375998 454078 725854 1004105 804897 870953 697821 779581 354822 613689
5943F13689R8025j38770L1634j98985n5798L30694j54385J42659Q5816l06496
$$ 613689 711714 572944 604578 405593 349795 680489 526104 668763 754579 448083
5933D48083J15069L59900J17136j46638K10371p6903Q8175J35057j4900L09575
$$ 448083 563152 923052 1040188 893550 1103921 1027018 1115193 1250250 1235350 1544925
5923A544925k05502m18512J32587J55992j65977K11223Q2303m73266J90200k78605
$$ 1544925 1339423 920911 1053498 1209490 1043513 1254736 1337039 863773 1053973 775368
5913G75368J60290j14219J51559O9473j40072K42425n5849r7720N4695N1972J65900
$$ 775368 935658 821439 972998 1042471 902399 1144824 1088975 991255 1045950 1097922 1263822
5902A263822k94664N6052l3938Q1780J47537j76602l540J32248N5850j23112N0063
$$ 1263822 969158 1025210 991272 1073052 1220589 1043987 1040447 1172695 1228545 1105433 1155496
5891A155496J79145j45974J04799K94724j03719K18513j69581j18472J90705l25593
$$ 1155496 1334641 1188667 1293466 1588190 1484471 1702984 1533403 1414931 1605636 1280043
5881A280043k95230L59999o6528K7508R8186l14205j56490J52156J00048R0844
$$ 1280043 984813 1344812 1278284 1305792 1403978 1089773 933283 1085439 1185487 1276331
5871A276331K17295L25556k03829k42696J3240R9993J54277j61183N8790L2682
$$ 1276331 1493626 1819182 1615353 1372657 1385897 1485890 1640167 1478984 1537774 1570456
5861A570456J08774k44515K24147j97821L4952l52849m38132K80246K20991L9916
$$ 1570456 1679230 1434715 1658862 1461041 1495993 1143144 705012 985258 1206249 1246165
5851A246165j87570J28401P3865k11800N3030K00782K7393k20174K04485M2638
$$ 1246165 1058595 1186996 1260861 1049061 1102091 1302873 1330266 1110092 1314577 1357215
5841A357215m50048L5236n4194k9141K06453m0393j0954K54012k09923J07173
$$ 1357215 907167 942403 888209 859068 1065521 1025128 1014174 1268186 1058263 1165436
5831A165436J34722j41827K37784j61462L36915q0956L8296Q3346k49185j08821
$$ 1165436 1300158 1158331 1396115 1234653 1571568 1490612 1528908 1612254 1363069 1254248
5821A254248j01707K23595O7784J3494k62704k4619J61072n9020M15092l9157
$$ 1254248 1152541 1376136 1443920 1457414 1194710 1170091 1331163 1272143 1687235 1648078
5811A648078k01105N3219L29139K18168J1499j4607k38058J52208M2288M8117
$$ 1648078 1446973 1500192 1829331 2047499 2058998 2044391 1806333 1958541 2000829 2048946
5801B048946j27296j43357o7607j67292j78273K46450R362j19982j996K3030q9658
$$ 2048946 1921650 1778293 1710686 1543394 1365121 1611571 1620933 1500951 1498955 1521985 1432327
5790A432327M1304M4280L14475m07341K4043P5325L69143l70648J12169J97528
$$ 1432327 1473631 1517911 1832386 1425045 1449088 1524413 1893556 1522908 1635077 1832605
5780A832605k53015K08022Q1541J94685J48712k04669N9078l99516j5894L77196
$$ 1832605 1579590 1787612 1869153 2063838 2212550 2007881 2066959 1667443 1651549 2028745
5770B028745j17843R8072j4727K19937J23840K34302J16r1611Q8452m4912K38696
$$ 2028745 1910902 2008974 1994247 2214184 2338024 2572326 2572442 2480831 2569283 2524371 2763067
5759B763067L95507p9298l45028l10933K25363n0512n9337k6729L84599L19250
$$ 2763067 3158574 3079276 2734248 2423315 2648678 2598166 2538829 2512100 2896699 3215949
5749C215949R0257P0444j97182J3969O9599k19382k2973K32416l45624l32731
$$ 3215949 3306206 3376650 3179468 3193437 3263036 3043654 3020681 3253097 2907473 2574742
5739B574742P2113r6631q1471j21346Q9456m61407K23463k8003J39094J31965
$$ 2574742 2646855 2550224 2468753 2347407 2436863 1975456 2198919 2170916 2310010 2441975
5729B441975J58069L17216k5904K90825L53335j11190R7245J40419l69913l03518
$$ 2441975 2600044 2917260 2891356 3182181 3535516 3424326 3521571 3661990 3292077 2988559
5719B988559k76928p8153k10445j65664j2992j72746n33358p6271l9022K00556
$$ 2988559 2711631 2633478 2423033 2257369 2244377 2071631 1538273 1462002 1422980 1623536
5709A623536K24090l24039j80699R7634j68640k55681L11545J02515j25252k8316
$$ 1623536 1847626 1523587 1342888 1440522 1271882 1016201 1327746 1430261 1305009 1276693
5699A276693J0958k05101j15142M07730l00842l45219K06620J10802j2971R6557
$$ 1276693 1287651 1082550 967408 1375138 1074296 729077 935697 1046499 1033528 1130085
5689A130085o6454m10323o8221J15476K30511j73864j29925L58432k27160L27724
$$ 1130085 1063631 653308 585087 700563 931074 757210 627285 985717 758557 1086281
5679A086281l453n24227J63879r0044J6404J19433k27256J71488L5663J45888
$$ 1086281 1082828 558601 722480 632436 648840 768273 541017 712505 748168 894056
5669H94056J16445j08686J04049J07008k16943M0328m53431J90113K35908k8696
$$ 894056 1010501 901815 1005864 1112872 895929 936257 482826 672939 908847 880151
5659H80151j57435l78053O4558k14j73547o781J27782O6202k61096M91194j25235
$$ 880151 722716 344663 409221 409007 235460 228679 356461 422663 161567 652761 527526
5648E27526j07862j09740n7921J77441j39144j25155q8783L17381k4298j44749
$$ 527526 419664 309924 252003 429444 290300 165145 76362 393743 369445 224696
5638B24696K09584P2746k34116K57320k03557M8198j94800j46372r0468R3717
$$ 224696 434280 507026 272910 530230 326673 374871 180071 33699 -56769 36948
5628C6948L63584K39872l93592M4377J20815J5830q9705J08728m9625j59586J0870
$$ 36948 400532 640404 246812 291189 412004 427834 338129 446857 397232 237646 248516
5617B48516P5515r4295L12439p3235K13577k66631P3505N8990K48458J07790q9562
$$ 248516 324031 229736 542175 468940 682517 415886 489391 548381 796839 904629 815067
5606H15067j02148j49514K9240j04337J02813k95000p4715K63278k99983L37349
$$ 815067 712919 563405 592645 488308 591121 296121 221406 484684 184701 522050
5596E22050k72301q8466N167l3532j1136K15470K07154m92967n9366J41663J37923
$$ 522050 249749 161283 166450 132918 121782 337252 544406 51439 -7927 133736 271659
5585B71659l66385L94913j31583j84812m0361q269J58543J90871n8511J22689
$$ 271659 -94726 300187 168604 -16208 -56569 -64838 93705 284576 226065 348754
5575C48754j96261L8891l65343L03294J6691J57764j01620m727K38350k04744
$$ 348754 152493 191384 -173959 129335 146026 303790 202170 197443 435793 231049
5565B31049j45234J53145j22044J54431j06152K58810p9926m44248K82253K27460
$$ 231049 85815 238960 116916 271347 165195 424005 344079 -100169 182084 409544
5555D09544o621m88431j83704N18178K95939k53565p2834K48452m16903o9750
$$ 409544 402923 -85508 -269212 248966 544905 291340 218506 466958 50055 -19695
5545a9695J9675l4291j07827J78836k578P8562K54388l07405L10879j49251k00754
$$ -19695 -20 -34311 -142138 36698 34120 112682 367070 59665 370544 221293 20539
5534B0539O8107m559p2840J01346J75642J64417k19487J2400N0558K45150j72656
$$ 20539 88646 84087 11247 112593 288235 452652 233165 245565 296123 541273 368617
5523C68617k94257M8255K9389N5071q0210j70726K61154j2961K5222o7080r2569
$$ 368617 74360 122615 152004 207075 126865 -43861 217293 204332 229554 162474 69905
5512F9905L10259m8535m18937o1774L98230j57365k0188J7775Q1034j32180o3120
$$ 69905 380164 331629 -87308 -149082 249148 91783 71595 89370 170404 38224 -24896
5501b4896m8508J99364L166K27675Q9884l13337L95651m78585J06484K7574o0742
$$ -24896 -73404 125960 129126 356801 446685 133348 528999 50414 156898 184472 123730
5490A23730m1218M15k0841j2182P625L69895j81348P620k44475k12671K79358
$$ 123730 82512 82927 62086 49904 57529 427424 246076 253696 9221 -203450 75908
5479G5908J50454L15961l76215j15172K97500q784j3894j68091j82158K90931
$$ 75908 226362 542323 166108 50936 348436 339652 325758 157667 -24491 266440
5469B66440j0985m8230O8390k5229q7574Q4912k17639K16383J47069j65933r6897
$$ 266440 255455 207225 275615 250386 162812 247724 30085 246468 393537 227604 130707
5458A30707m2278j01011J93835J27799q316j79133K1489J69723j33355k17109
$$ 130707 88429 -12582 181253 309052 300736 121603 143092 312815 179460 -37649
5448c7649L5691J7360k3769M73328k61449N8185R6499j84793j68368k29831J47710
$$ -37649 -1958 15402 -8367 464961 203512 261697 358196 173403 5035 -224796 -77086
5437g7086L01844k91746p2316Q1736p4827J67449N5305J12423N2868J17464p7927
$$ -77086 224758 -66988 -139304 -57568 -132395 35054 90359 202782 255650 373114 295187
5426B95187m73905K68829O06078n49353m48272P6684J85616j61726n9178J87026
$$ 295187 -178718 90111 696189 146836 -301436 -224752 -39136 -200862 -260040 -73014
5416g3014K41043j8844k8826N5374K5506j42980q1331L17704L4976j99568N5678
$$ -73014 168029 149185 120359 175733 201239 58259 -23072 294632 329608 130040 185718
5405A85718j97532K78227Q0487l27588l1297J59899K31369R9199J90058n64096
$$ 185718 -11814 266413 346900 19312 -11985 147914 379283 478482 668540 104444
5395A04444l3780K53543k50874k88339J45273L23620m55872J82914J01376k21416
$$ 104444 70664 324207 73333 -215006 -69733 253887 -201985 -19071 82305 -139111
5385a39111J18794K16145K34229j91515J68653j07871j84343j07677Q657k7641
$$ -139111 -20317 195828 430057 238542 407195 299324 114981 7304 15961 -11680
5375a1680j44130J15988K20152J43863p2638k13033j55009k59751J39308J72638
$$ -11680 -155810 -39822 180330 324193 251555 38522 -116487 -376238 -236930 -64292
5365f4292J53665m4478K48756J83393k77855M39053K18515k64994j58565m53219
$$ -64292 89373 44895 293651 477044 199189 638242 856757 591763 433198 -20021
5355b0021Q83L75060k35440k30393N6029M74002J28173j92622l20054K25614J39504
$$ -20021 -19138 355922 120482 -109911 -53882 420120 548293 355671 35617 261231 400735
5344D00735k03772m8104J26991k0560o223J6159o5415j66671L11150K30497j9783
$$ 400735 196963 148859 275850 255290 249067 265226 199811 33140 344290 574787 555004
5333E55004m03021l6846K50658J0847l5222k4700l63957r5097L14772k75098K55022
$$ 555004 151983 115137 365795 376642 341420 316720 -47237 -142334 172438 -102660 152362
5322A52362L772K56720l9974j46772K45881j66636k39106N63892j59494k14326
$$ 152362 156134 412854 372880 226108 471989 305353 66247 630139 470645 256319
5312B56319K22942k32870k27917J1996m4920J52235M67506l76952j17949L03002
$$ 256319 479261 246391 18474 30470 -14450 137785 605291 228339 110390 413392
5302D13392K2760L33837k25093j96097K4674l3177O647p0811j13941K28485j07770
$$ 413392 436152 769989 544896 348799 373473 340296 346943 276132 162191 390676 282906
5291B82906o7514j73812j70631k7954M85025k3433j28596L31469j59661L2437
$$ 282906 215392 41580 -129051 -157005 328020 304587 175991 507460 347799 380236
5281C80236j23283K71867K75426m7234k74714J77212j59591J50318Q649R7774
$$ 380236 256953 528820 804246 757012 482298 659510 499919 650237 658886 756660
5271G56660J03821q7119K3654J0019J57037L6728j20170K68878m7309j47106N7800
$$ 756660 860481 773362 797016 807035 964072 1000800 880630 1149508 1102199 955093 1012893
5260A012893k27607j21581J11579l39315l5670K09609J44305L06226J2154j05204
$$ 1012893 785286 663705 775284 435969 400299 609908 754213 1060439 1072593 967389
5250I67389k3416p5406K2144L93567J55139j56031k46619J81884J16735j76475
$$ 967389 943973 868567 890711 1284278 1439417 1283386 1036767 1218651 1335386 1158911
5240A158911K3616J32274j83785L41081k0354j64763l28990M7975L09053k17984
$$ 1158911 1182527 1314801 1131016 1472097 1451743 1286980 957990 1005965 1315018 1097034
5230A097034k42107K41304K8623m8944k32851J81522P4373j06508N8728k21776
$$ 1097034 854927 1096231 1124854 1075910 843059 1024581 1098954 992446 1051174 829398
5220H29398K49092n5712j50901J59369J40811k85747j24324K75625M37002j51313
$$ 829398 1078490 1022778 871877 1031246 1172057 886310 761986 1037611 1474613 1323300
5210A323300k7674j26867P7740o3398j68901Q2173K34154k35120Q4377q5085m3240
$$ 1323300 1295626 1168759 1246499 1183101 1014200 1096373 1330527 1095407 1179784 1094699 1051459
5199A051459J63157j35583l1149M12542l99867n58051O14891K5905j62072J26226
$$ 1051459 1214616 1079033 1047884 1460426 1060559 502508 1117399 1143304 981232 1107458
5189A107458R6776l21453M29009J08375j00373N10697j09380M825l23926O4622
$$ 1107458 1204234 882781 1311790 1420165 1319792 1830489 1721109 1725934 1402008 1466630
5179A466630L50894n09881l81236L68754J90341n7973J98050q6607j92551J60439
$$ 1466630 1817524 1307643 926407 1295161 1485502 1427529 1625579 1538972 1346421 1506860
5169A506860M2455p8550K36233k5800j27043P1092M3911o8652j13242L8915j75870
$$ 1506860 1549315 1470765 1706998 1681198 1554155 1625247 1669158 1600506 1487264 1526179 1350309
5158A350309L922K16199K95778m22913J34823n7128k35514o850M5239J16129J54443
$$ 1350309 1354231 1570430 1866208 1443295 1578118 1520990 1285476 1278626 1323865 1439994 1594437
5147A594437M53838m7137k05081J13121J3301m95192j72523k21142M05649k33
$$ 1594437 2048275 2001138 1796057 1909178 1922479 1427287 1254764 1033622 1439271 1439038
5137A439038K51781J50309p1720l38231L04089J12748l62047K8460L91846N5757
$$ 1439038 1690819 1841128 1769408 1431177 1735266 1848014 1485967 1514427 1906273 1962030
5127A962030J43900L3735p5330l5993K950L60817Q9443K9507Q3993p7580o5098
$$ 1962030 2105930 2139665 2064335 2028342 2031292 2392109 2481552 2511059 2595052 2517472 2452374
5116B452374j03812J76609n3224J81790J83958j43194j29773m9639l64737J30507
$$ 2452374 2348562 2525171 2471947 2653737 2837695 2694501 2564728 2515089 2150352 2280859
5106B280859L55484l9931L01745R4707n3050j39567P7154j69693J69493J06751
$$ 2280859 2636343 2596412 2898157 2992864 2939814 2800247 2877401 2707708 2877201 2983952
5096B983952k682J53255Q8637m14172N70794L21015P7783L17380n2628n1125p3125
$$ 2983952 2981270 3134525 3223162 2808990 3379784 3700799 3778582 4095962 4043334 3992209 3919084
5085C919084k51224J04072K63625l15679k9609K39761K81228j43009J92234M57479
$$ 3919084 3667860 3771932 4035557 3719878 3690269 3930030 4211258 4068249 4260483 4717962
5075D717962j65621K49972K76167K567k89973J84706n1903q5043L80154K00121
$$ 4717962 4552341 4802313 5078480 5081047 4791074 4975780 4923877 4838834 5218988 5419109
5065E419109K81825k41028R6184k44314M58782L02312L54828j14007L50181q7134
$$ 5419109 5700934 5459906 5556090 5311776 5770558 6072870 6427698 6313691 6663872 6576738
5055F576738n9755L00983k55894J40489j74509J21185J24657q6373Q4902L6421
$$ 6576738 6516983 6817966 6562072 6702561 6528052 6649237 6773894 6687521 6772423 6808844
5045F808844r9962K08422L50050M24115l46505J57265K13870K24309K64925M78689
$$ 6808844 6708882 6917304 7267354 7691469 7344964 7502229 7716099 7940408 8205333 8684022
5035H684022L48882Q9437J37079K35086j48330J70888n5547M07476M13028Q0429
$$ 8684022 9032904 9122341 9259420 9494506 9346176 9517064 9461517 9868993 10282021 10362450
5025A0362450K64360o0688K58266O6718M87012N21070L74636M67543L76229M28938
$$ 10362450 10626810 10566122 10824388 10891106 11378118 11899188 12273824 12741367 13117596 13546534
5015A3546534M44548O39786L62660N74232P04477O33720O51583J022505O62742
$$ 13546534 13991082 14630868 14993528 15567760 16272237 16905957 17557540 18580045 19242787
5006A9242787N16016R09663J385273J256609R48661J594743J565494J397829J601364
$$ 19242787 19758803 20668466 22053739 23310348 24259009 25853752 27419246 28817075 30418439
4997C0418439K453692K383233K566554L275783L969489N238947N676106O570794
$$ 30418439 32872131 35255364 37821918 41097701 45067190 50306137 55982243 62553037
4989F2553037N940249L289780J111004j321042j690323m31165J314061K628562
$$ 62553037 68493286 71783066 72894070 71573028 69882705 69451540 70765601 73394163
4981G3394163M166421N063065M374964L781847L245788M406375N970389N830305
$$ 73394163 77560584 82623649 86998613 90780460 94026248 98432623 104403012 110233317
4973A10233317M029911K349607J60249j488858j564455j598101k559358l335419
$$ 110233317 114263228 116612835 116773084 115284226 113719771 112121670 109562312 106226893
4965A06226893l460271l288339j544769Q80961K526037M697495N372153L686995
$$ 106226893 102766622 99478283 97933514 98814475 101340512 106038007 111410160 115097155
4957A15097155J271113P0805p1649J465944J935475J08459l194764o875155q835562
$$ 115097155 116368268 116439073 116367424 117833368 119768843 119877302 116682538 109807383 100971821
4948A00971821r280367q195926o772492n392004l809079k872651k666402j704809
$$ 100971821 91691454 83495528 76723036 71331032 67521953 64649302 61982900 60278091
4940F0278091r78349Q1168P06616J823436J970335K517567K258622O6692k484482
$$ 60278091 59299742 59380910 60087526 61910962 63881297 66398864 68657486 68724178 66239696
4931F6239696m054303n017438n138618m175377l916370l510136k688441k727319
$$ 66239696 62185393 57167955 52029337 47853960 43937590 40427454 37739013 35011694
4923C5011694k125763j751384j688407j631334j353721j399680j203780r80685
$$ 35011694 32885931 31134547 29446140 27814806 26461085 25061405 23857625 22876940
4915B2876940o87211o23098q53910j005780m68676n67066o16993p32549o79834
$$ 22876940 22189729 21566631 20712721 19706941 19238265 18671199 18054206 17321657 16641823
4906A6641823l25182n77572k78638n90349m32973k16706o3755p54447k67705j72270
$$ 16641823 16316641 15739069 15460431 14870082 14437109 14220403 14156648 13402201 13134496 12962226
4896A2962226k49097l28030l07025p7682k19701l58141k80016Q0211k41419m93675
$$ 12962226 12713129 12385099 12078074 12000392 11780691 11422550 11142534 11222745 10981326 10487651
4886A0487651k43848J28545q2357J24375m90596N0657J65989J57510N20489K61885
$$ 10487651 10243803 10372348 10289991 10414366 9923770 9974427 10140416 10297926 10818415 11080300
4876A1080300j29099K83798N26948L20577M85428K53778R1556k86066k29641k22011
$$ 11080300 10951201 11234999 11761947 12082524 12567952 12821730 12913286 12627220 12397579 12175568
4866A2175568k08745j62154l19650m14366R7798j1514J05087J06478M14410N57935
$$ 12175568 11966823 11804669 11485019 11070653 11168451 11156937 11262024 11368502 11782912 12340847
4856A2340847O48731M09553Q73557O16924Q07840O09994K04423m94144m07247
$$ 12340847 12989578 13399131 14272688 14889612 15697452 16307446 16511869 16017725 15610478
4847A5610478j296389j025169n72408o88137o19781o27025m74836k63990j28866
$$ 15610478 14314089 13288920 12716512 12028375 11408594 10781569 10306733 10042743 9913877
4838I913877r5790Q1749K21391N71283L5291K52337J01805k102k49190p7280r32678
$$ 9913877 9818087 9899836 10121227 10692510 10727801 10980138 11081943 11079841 10830651 10753371 9820693
4827I820693m92800m74484q49568m91658o07891n44912j07669J42562n79506j57473
$$ 9820693 9327893 8853409 8003841 7512183 6904292 6359380 6251711 6394273 5814767 5657294
4817E657294K13001l33197j3767n54809j17331l217k31519j50020J23823q157
$$ 5657294 5870295 5537098 5523331 4968522 4851191 4847974 4616455 4466435 4590258 4582101
4807D582101J82060m27719j19966M2992K82029l673k27316l90038j63623N0359
$$ 4582101 4764161 4336442 4216476 4259468 4541497 4537824 4310508 3920470 3756847 3807206
4797C807206l6289J90944k76042j72127O9740K22365P1597j92474j748L13484
$$ 3807206 3770917 3961861 3685819 3513692 3583432 3805797 3877394 3684920 3683172 3996656
4787C996656j22282j58475J85951p4872r5230J47387L02985j32945K0335L22094
$$ 3996656 3874374 3715899 3901850 3826978 3731748 3879135 4182120 4049175 4069510 4391604
4777D391604j35731O6642k16279M85883j60374J15298j20076k20808M66154O1360
$$ 4391604 4255873 4322515 4106236 4592119 4431745 4547043 4426967 4206159 4672313 4733673
4767D733673o4647K5669j19111O2356k11969j56660J47390J82215k4479j7748
$$ 4733673 4669026 4694695 4575584 4637940 4425971 4269311 4416701 4598916 4574437 4556689
4757D556689J98216j08649k32600N64129L68948j84262R933N0466j71610K16252
$$ 4556689 4754905 4646256 4413656 4977785 5346733 5162471 5172404 5222870 5051260 5267512
4747E267512L4559j55160J37366K80766M37688j00257P324J27678l5970L3579
$$ 5267512 5302071 5146911 5284277 5565043 6002731 5902474 5909798 6037476 6001506 6035085
4737F035085K5046R9737O25417l83216j51620j5342R5323l6403K17732J12779
$$ 6035085 6060131 6159868 6785285 6402069 6250449 6235107 6330430 6294027 6511759 6624538
4727F624538p0652K75987k43521K30403L1554n2939J12846K39906J61382j96903
$$ 6624538 6553886 6829873 6586352 6816755 6848309 6795370 6908216 7148122 7309504 7112601
4717G112601J87841j53542J18723J77168J71844L89330K76645j01897P6040K45919
$$ 7112601 7300442 7146900 7265623 7442791 7614635 8003965 8280610 8178713 8254753 8500672
4707H500672j7850J03259J53757M15792K91322M24892M68717o2075j83269M52869
$$ 8500672 8482822 8586081 8739838 9155630 9446952 9871844 10340561 10278486 10095217 10548086
4697A0548086J92003O1323p0731N44379L57904L18436j84142O45491P70715N87018
$$ 10548086 10740089 10801412 10730681 11275060 11632964 11951400 11767258 12412749 13183464 13770482
4687A3770482P58830J96790K84092O72954K72438M78603L22008N41796M44118
$$ 13770482 14529312 14726102 15010194 15683148 15955586 16434189 16756197 17297993 17742111
4678A7742111O64144N60411L91594M48328Q24454M71910O18569J083388R01956
$$ 17742111 18406255 18966666 19358260 19806588 20631042 21102952 21721521 22804909 23706865
4669B3706865R53835J092748J577784J673457K114645J564399K321330K541174
$$ 23706865 24660700 25753448 27331232 29004689 31119334 32683733 35005063 37546237
4661C7546237L067371L920931M413086N147780N172881L739931J269803r05077
$$ 37546237 40613608 44534539 48947625 54095405 59268286 63008217 64278020 63372943
4653F3372943k772564l303683k811375k000888j194395q09732L94667J153980
$$ 63372943 60600379 57296696 54485321 52484433 51290038 50480306 50874973 52028953
4645E2028953J929705K471565L566026M618231N901014P178989P838710P162992
$$ 52028953 53958658 56430223 59996249 64614480 70515494 77694483 85533193 92696185
4637I2696185L849292j352219n254103p868012p984610p086310n231868m112417
$$ 92696185 96545477 95193258 89939155 82071143 74086533 67000223 61768355 57655938
4629E7655938l192597k222377j325957r76346j51890N9068P46739J629727K034448
$$ 57655938 54463341 52240964 50915007 49938661 49786771 49845839 50592578 52222305 54256753
4620E4256753L053325J978146O04776j298788l209591m122243m263943l768125
$$ 54256753 57310078 59288224 59893000 58594212 55384621 51262378 46998435 43230310
4612D3230310l102140k640782k256395j716300j634651j285301j151505j101821
$$ 43230310 40128170 37487388 35230993 33514693 31880042 30594741 29443236 28341415
4604B8341415o25500r63981n44408k50052m8042m61173j40624L8695K30643p3777
$$ 28341415 27715915 26751934 26207526 25957474 25909432 25448259 25307635 25346330 25576973 25503196
4594B5503196N33293P32608L42176Q187k52924k55705M616j90173K07859P797
$$ 25503196 26036489 26769097 27111273 27119460 26866536 26610831 26615447 26425274 26633133 26640930
4584B6640930J7346N60777M65245Q08725Q78477P26957O35601P42614O52292J118041
$$ 26640930 26658276 27219053 27684298 28493023 29371500 30098457 30734058 31476672 32128964 33247005
4574C3247005J361684J064151J240184J852308J969700J737771J260839K344741
$$ 33247005 34608689 35672840 36913024 38765332 40735032 42472803 43733642 46078383
4566D6078383J627568J653287J935030J788261K071275K808242K734479K983707
$$ 46078383 47705951 49359238 51294268 53082529 55153804 57962046 60696525 63680232
4558F3680232L281658M160077M687005N538294O117099P551567Q698756R660884
$$ 63680232 66961890 71121967 75808972 81347266 87464365 95015932 103714688 113375572
4550A13375572J0890437J1593711J2172873J2010798J2131360J1428464R436894
$$ 113375572 124266009 135859720 148032593 160043391 172174751 183603215 193040109
4543A93040109O618506J360015l896992p503202r616548r391370q330536p715092
$$ 193040109 199658615 201018630 197121638 189618436 180001888 170610518 162279982 154564890
4535A54564890n983657m902416n588075n770856n246560l918433k209853j65421
$$ 154564890 148581233 143678817 138090742 132319886 127073326 123154893 120945040 120779619
4527A20779619p08382k189478l873960m533320l948498k589441k598685l483458
$$ 120779619 120071237 117881759 114007799 109474479 105525981 102936540 100337855 96854397
4519I6854397l815625l691947k580766j417184M61822J611000J632767N89686
$$ 96854397 93038772 89346825 86766059 85348875 85810697 87421697 89054464 89644150
4511H9644150k149835m518703n825492n560775n203980m417596l833453l754614
$$ 89644150 87494315 82975612 77150120 71589345 66385365 61967769 58134316 54379702
4503E4379702l034773k686026k364066k042005j390309j485644j135677n78496
$$ 54379702 51344929 48658903 46294837 44252832 42862523 41376879 40241202 39662706
4495C9662706q52544n25903m91082m65963j24467J62468n33161n91647r56320
$$ 39662706 38810162 38284259 37793177 37327214 37202747 37365215 36832054 36240407 35284087
4486C5284087j577689j687199j531211j519933j223065r63939r66431r08494k83945
$$ 35284087 33706398 32019199 30487988 28968055 27744990 26781051 25814620 24906126 24622181
4477B4622181q99009l35209l65426m32045m00463J53192m08447k17075j54572
$$ 24622181 23723172 23387963 23022537 22590492 22190029 22343221 21934774 21717699 21563127
4468B1563127p02187p73073j038869q32328q07280p44535o53263m66532l28803
$$ 21563127 20860940 20087867 19048998 18216670 17409390 16664855 16011592 15545060 15216257
4459A5216257o45650j27133m95882m91215l50981j40082l37396m59999J61831
$$ 15216257 14570607 14443474 13947592 13456377 13105396 12965314 12627918 12167919 12329750
4450A2329750l74470m3478N096k80646p2055l75021k80409J84219j76220j06233
$$ 12329750 11955280 11911802 11916898 11636252 11564197 11189176 10908767 11092986 10916766 10810533
4440A0810533L3964J673K04060K76248L05924O05744O91672P74872l43654m07661
$$ 10810533 10844497 10846170 11050230 11326478 11632402 12238146 12929818 13704690 13361036 12953375
4430A2953375r08168j013379m76569n51404m82958K9507r6392l07646J11419k79698
$$ 12953375 12045207 11031828 10555259 10003855 9520897 9550404 9454012 9146366 9257785 8978087
4420H978087m42872j95344k07254n08285j50763j67934m3408j74416j12372j38052
$$ 8978087 8535215 8339871 8132617 7624332 7473569 7305635 7262227 7087811 6975439 6837387
4410F837387l02867K7623J27046k84145J5631k72541K58952J70225l01587j83076
$$ 6837387 6534520 6562143 6689189 6405044 6420675 6148134 6407086 6577311 6275724 6092648
4400F092648j632L816k14180K6279l48516L62338n2419j63974r0104j54275l1082
$$ 6092648 6091016 6094832 5880652 5906931 5558415 5920753 5868334 5704360 5614256 5459981 5428899
4389E428899J29577K1231k0969j00954l07220l01597O7250k97248J35039j50447
$$ 5428899 5558476 5579707 5558738 5457784 5150564 4848967 4916217 4618969 4754008 4603561
4379D603561J42504K87249j31408N9796P0283k26795l73445l57365Q1611K0590
$$ 4603561 4746065 5033314 4901906 4961702 5031985 4805190 4431745 4074380 4155991 4176581
4369D176581k26764j35863P8974J75272j52680l28020M00749l77535L91057j21226
$$ 4176581 3949817 3813954 3892928 4068200 3915520 3587500 3988249 3610714 4001771 3880545
4359C880545j55520N1529K27254k89349j09511L34821j15072L2098m10559M9915
$$ 3880545 3725025 3776554 4003808 3714459 3604948 3939769 3824697 3856795 3446236 3496151
4349C496151L5777L43865l7645l49937L35063k06324n4690o3380J92496J42862
$$ 3496151 3531928 3875793 3838148 3488211 3823274 3616950 3562260 3498880 3691376 3834238
4339C834238o20186J72667J84734j12370k72180J2148p8238L49445K30123n08637
$$ 3834238 3214052 3386719 3571453 3459083 3186903 3199051 3120813 3470258 3700381 3191744
4329C191744K19324j46115J24833J6615j74798L04205L6271k4898k00444r474
$$ 3191744 3411068 3264953 3389786 3406401 3231603 3535808 3572079 3547181 3346737 3337263
4319C337263l1864k72180K38216J56696p6285Q2940k39890J30686l3916k14289
$$ 3337263 3305399 3033219 3271435 3428131 3351846 3434786 3194896 3325582 3291666 3077377
4309C077377J1738k74598K34413J07243K07096P2796m93757p2650J81601k26765
$$ 3077377 3089115 2814517 3048930 3156173 3363269 3436065 2942308 2869658 3051259 2824494
4299B824494K69978J65782k06337j44449L5525l4698K6510J61655j16387K9315
$$ 2824494 3094472 3260254 3053917 2909468 2944993 2910295 2936805 3098460 2982073 3011388
4289C011388R5260m1710J05043j38527j84313M59047j08553K21237j23170K82434
$$ 3011388 3106648 3064938 3169981 3031454 2847141 3306188 3197635 3418872 3295702 3578136
4279C578136l63328n4302r4907M13189l0651J22342j71306M6257Q7737J76977
$$ 3578136 3214808 3160506 3065599 3478788 3448137 3570479 3399173 3445430 3533167 3710144
4269C710144J57719k0871J31596j86136J13137k93748J59360K53842J45606M76481
$$ 3710144 3867863 3846992 3978588 3792452 3905589 3611841 3771201 4025043 4170649 4647130
4259D647130J05182K6935J0933k69643l03052j88255j44262m12992J30354j16113
$$ 4647130 4752312 4779247 4790180 4520537 4217485 4029230 3884968 3471976 3602330 3486217
4249C486217m1400j46267R6286k1070Q4041q3933p9162K08530m8422Q3965m13079
$$ 3486217 3444817 3298550 3394836 3373766 3457807 3373874 3294712 3503242 3454820 3538785 3125706
4238C125706r7652K78525J06152m2915L06555j26265J34262l25221K36409q331
$$ 3125706 3028054 3306579 3412731 3369816 3676371 3550106 3684368 3359147 3595556 3587225
4228C587225L132p9354q7929p8363K45044K54150l05572j63993K12194r4608o7376
$$ 3587225 3590357 3511003 3423074 3344711 3589755 3843905 3538333 3374340 3586534 3491926 3424550
4217C424550o0749J12565j3412N362L89266K41031j46063j42176L51300p9755
$$ 3424550 3363801 3476366 3462954 3468316 3857582 4098613 3952550 3810374 4161674 4081919
4207D081919n1440J46116K20497J76672K31483K3329K86822J59968j73798K76454
$$ 4081919 4030479 4176595 4397092 4573764 4805247 4828576 5115398 5275366 5101568 5378022
4197E378022J13934J67782J10089J29328L32543P8507K51894N80625J29502J57708
$$ 5378022 5491956 5659738 5769827 5899155 6231698 6310205 6562099 7142724 7272226 7429934
4187G429934J16579O68587M40675L5712Q08354Q25808R19431p795K9961m93144
$$ 7429934 7546513 8215100 8655775 8691487 9499841 10325649 11245080 11237285 11267246 10774102
4177A0774102o09224k45323l78097K6601j5689j5484R7413K37618o0731J91747
$$ 10774102 10164878 9919555 9541458 9568059 9552370 9536886 9634299 9871917 9811186 10002933
4167A0002933O19595J11987j82645l41160J49136j22707j50986j74850l8636o25586
$$ 10002933 10622528 10734515 10551870 10210710 10359846 10237139 10086153 9911303 9872667 9247081
4157I247081l20373j68864m15525m81298K63570l40674k39457K5203j5845j26435
$$ 9247081 8926708 8757844 8342319 7861021 8124591 7783917 7544460 7569663 7553818 7427383
4147G427383L80622n0946l16710p0903j49098J73211K40927l5404K20754J8071
$$ 7427383 7808005 7757059 7440349 7369446 7220348 7393559 7634486 7599082 7819836 7837907
4137G837907q4739K48242J2364k90818m4836K04306K56593M77211J45632L66779
$$ 7837907 7753168 8001410 8013774 7722956 7678120 7882426 8139019 8616230 8761862 9128641
4127I128641k20718r2056m8216r8959M08607M5395J51568K55380L70152Q4824
$$ 9128641 8907923 8815867 8767651 8668692 9077299 9122694 9274262 9529642 9899794 9984618
4117I984618K80204j78576l3237K28837j16932J82660K88087O43930N26562M28283
$$ 9984618 10264822 10086246 10053009 10281846 10164914 10347574 10635661 11279591 11806153 12234436
4107A2234436N9545L48751M13977L35378M16335K71295J15324O88221M54320N11946
$$ 12234436 12293981 12642732 13056709 13392087 13808422 14079717 14195041 14883262 15337582 15849528
4097A5849528O26269N92340J081390R70397J078082R55475J438597J042377J269682
$$ 15849528 16475797 17068137 18149527 19119924 20198006 21153481 22592078 23634455 24904137
4088B4904137J144046J061962J130597J372957J132432J216586J278412J678089
$$ 24904137 26048183 27110145 28240742 29613699 30746131 31962717 33241129 34919218
4080C4919218J308159J628110J729113J654966J941204J435660J791916J825423
$$ 34919218 36227377 37855487 39584600 41239566 43180770 44616430 46408346 48233769
4072D8233769J430350J947151K140974K253352K298087K821572L487440L596951
$$ 48233769 49664119 51611270 53752244 56005596 58303683 61125255 64612695 68209646
4064F8209646L657168L960368M003148L916457M092550M414572L931404L689463
$$ 68209646 71866814 75827182 79830330 83746787 87839337 92253909 96185313 99874776
4056I9874776L353716K966027L115960L643670L733195M600126M312517M616350
$$ 99874776 103228492 106194519 109310479 112954149 116687344 121287470 125599987 130216337
4048A30216337M913120N251483M775012M137581L852558L413276L496023L825227
$$ 130216337 135129457 140380940 145155952 149293533 153146091 156559367 160055390 163880617
4040A63880617L890944M505708L744248L754526L103077J739775P45845k95046
$$ 163880617 167771561 172277269 176021517 179776043 182879120 184618895 185364740 185069694
4032A85069694M6288K196707M975954R751998J5778435K2599102L1250285M1540754
$$ 185069694 185115982 187312689 192288643 202040641 217819076 240418178 271668463 313209217
4024C13209217M2004190M077825j9838135m0113463m7345453l7160262k8580482
$$ 313209217 355213407 359291232 339453097 299339634 251994181 214833919 186253437
4017A86253437k1071440j7192624j3348580j1184931r391547q328829o850737
$$ 186253437 165181997 147989373 134640793 123455862 114064315 105735486 98884749
4010I8884749n982497m452822l767009k990613k984985k881786l416289l164977
$$ 98884749 92902252 88449430 84682421 81691808 78706823 75825037 72408748 69243771
4002F9243771l165735k773676k779230j641101j997398j385092j222168j127457
$$ 69243771 66078036 63304360 60525130 58884029 56886631 55501539 54279371 53151914
3994E3151914j313175j272344j345070j596409q50124q13890q96279n66272k86342
$$ 53151914 51838739 50566395 49221325 47624916 46774792 45960902 45064623 44498351 44212009
3985D4212009J5681k6397J61673N61090N09803J262846J882983J909497K102929
$$ 44212009 44227690 44201293 44362966 44924056 45433859 46696705 48579688 50489185 52592114
3976E2592114J786368K041513J271785L73524L09327m74280j115374j397560j679403
$$ 52592114 54378482 56419995 57691780 58065304 58374631 57900351 56784977 55387417 53708014
3967E3708014j455148j435643j439683r85997p16977q00831p73734k058700k794789
$$ 53708014 52252866 50817223 49377540 48391543 47674566 46873735 46100001 44041301 41246512
3958D1246512k733130k597727k268735j845777j816067j522521r37931j140655
$$ 41246512 38513382 35915655 33646920 31801143 29985076 28462555 27524624 26383969
3950B6383969r49190p72479j097691p18343p71863q61209k67664n29351o43673
$$ 26383969 25434779 24662300 23564609 22846266 22074403 21213194 20945530 20416179 19772506
3941A9772506n16069o12318l58558n61096k61620l86033j17072k68902l64924
$$ 19772506 19256437 18644119 18285561 17724465 17462845 17076812 16959740 16690838 16325914
3932A6325914p52736j13820k19308j80706m73651j01386k72942l80763j16943
$$ 16325914 15573178 15459358 15240050 15059344 14585693 14484307 14211365 13830602 13713659
3923A3713659o2869l16254n8850n49616k64313L5921l19454O3428K31614k87538
$$ 13713659 13650790 13334536 13275686 12726070 12461757 12497678 12178224 12241652 12473266 12185728
3913A2185728k67726j85926k21067o5605l4877k00902j8980j69902j5066j5613
$$ 12185728 11918002 11732076 11511009 11445404 11410527 11209625 11190645 11020743 11005677 10990064
3903A0990064k13633J63128K59913l35345k15348O9520J45530K5674L0682k31432
$$ 10990064 10776431 10939559 11199472 10864127 10648779 10718299 10863829 10889503 10920185 10688753
3893A0688753K09855j26666L47579K88967J94310N44781M14858K7020L99836L12088
$$ 10688753 10898608 10771942 11119521 11408488 11602798 12147579 12562437 12589457 12989293 13301381
3883A3301381J47625J64150P3118O2139Q880M68672N03469L19452N70299N72206
$$ 13301381 13449006 13613156 13686274 13748413 13757293 14225965 14729434 15048886 15619185 16191391
3873A6191391L83682L08964J76222N09618Q93496Q00654L51921O70794J315028
$$ 16191391 16575073 16884037 17060259 17569877 18463373 19264027 19615948 20286742 21601770
3864B1601770J287237P35968J235105J266564J490712J249384J233273J105091
$$ 21601770 22889007 23624975 24860080 26126644 27617356 28866740 30100013 31205104
3856C1205104J626693J505221J610998J420578K296083J936622K018329K132989
$$ 31205104 32831797 34337018 35948016 37368594 39664677 41601299 43619628 45752617
3848D5752617K509219K319555L191003L755554M184237M752826N476266O314972
$$ 45752617 48261836 50581391 53772394 57527948 61712185 66465011 71941277 78256249
3840G8256249O912291Q381822J0213779J2152252J4800425J8035011K2060267
$$ 78256249 85168540 93550362 103764141 115916393 130716818 148751829 170812096
3833A70812096K6583083K8969667K4751103Q339448q115115j9453419k4362557
$$ 170812096 197395179 226364846 251115949 259455397 251340282 231886863 207524306
3826B07524306k1170785j7413352j4785582j3723196j2356611j1515640j0536588
$$ 207524306 186353521 168940169 154154587 140431391 128074780 116559140 106022552
3819A06022552q836800p733465o596713n452986m578425l653354l629012l143895
$$ 106022552 97185752 89452287 82855574 77402588 72824163 69170809 65541797 62397902
3811F2397902k776806l121515k733539k557762k577502k101366k248093k056459
$$ 62397902 59621096 56499581 53766042 51208280 48630778 46529412 44281319 42224860
3803D2224860k433036k098880j866908j924619j830870j619497j217292j038943
$$ 42224860 39791824 37692944 35826036 33901417 32070547 30451050 29233758 28194815
3795B8194815j022947o93552j024534q47841q23875p78366n75661n16087m84040
$$ 28194815 27171868 26478316 25453782 24605941 23782066 23003700 22428039 21911952 21427912
3786B1427912p33982p21523q31439m01268r17413r75661o05416m39724m60079
$$ 21427912 20693930 19972407 19140968 18739700 17822287 16846626 16241210 15801486 15341407
3777A5341407k72798p88931m446n97930k29529m7805l72381m04839p48206N0448
$$ 15341407 15068609 14279678 14275232 13677302 13447773 13399968 13027587 12622748 11874542 11924990
3767A1924990m39549q32419j91960k1233m02932j82941o8194j79304l58032J5499
$$ 11924990 11485441 10653022 10461062 10439829 10036897 9853956 9785762 9606458 9248426 9263925
3757I263925j025k23963k01400M9720k11874k69955J68766J14825j10285l16701
$$ 9263925 9262900 9038937 8837537 8887257 8675383 8405428 8574194 8689019 8578734 8262033
3747H262033M977J83648n05338p3125L05284n01463n5922j44272r0676n6276O2496
$$ 8262033 8267010 8450658 7945320 7872195 8177479 7676016 7620094 7475822 7385146 7328870 7391366
3736G391366n0769J05753j48014k42938J05969q0354L807k00720K6943m70635
$$ 7391366 7340597 7446350 7298336 7055398 7161367 7081013 7084820 6884100 6911043 6440408
3726F440408k48210J97183l7834l2237L46618L9940l67447j50791J55273j21483
$$ 6440408 6192198 6389381 6351547 6319310 6665928 6705868 6338421 6187630 6342903 6221420
3716F221420k53570k0932k46691l86445J40392M4874J21281J77249m2499l55009
$$ 6221420 5967850 5946918 5700227 5313782 5454174 5499048 5620329 5797578 5755079 5400070
3706E400070j9903M052J26213q1056R933K06907n00019J50917R6797k86177j56560
$$ 5400070 5380167 5384219 5510432 5429376 5439309 5646216 5146197 5297114 5393911 5107734 4951174
3695D951174M952O6825L8894j68646k65278P7415K20739J9576q0015j21244K61538
$$ 4951174 4956126 5022951 5061845 4893199 4627921 4705336 4926075 4945651 4865636 4744392 5005930
3684E005930J0727R723K958k29717q8723k18424J87210K22968j15428l481K4352
$$ 5005930 5016657 5026380 5029338 4799621 4710898 4492474 4679684 4902652 4787224 4783743 4808095
3673D808095j64799N7825j20364M66309m3940q4317K78874j17141J73427L30265
$$ 4808095 4643296 4701121 4580757 5047066 5003126 4918809 5197683 5080542 5253969 5584234
3663E584234j4264k20880L14986J60750J76666M68037P03026J83900P67074l00846
$$ 5584234 5569970 5349090 5664076 5824826 6001492 6469529 7172555 7356455 8123529 7822683
3653G822683q1216l20393o92931o81129k42309j60261J59743J99996n1494j10794
$$ 7822683 7741467 7421074 6728143 6047014 5804705 5644444 5804187 6004183 5952689 5841895
3643E841895L6360j09768R7063j75304J28673L47069k08688L61052p7318k33665
$$ 5841895 5878255 5768487 5865550 5690246 5818919 6165988 5957300 6318352 6241034 6007369
3633F007369M36968j90305J61418L28652q4383P822L70328K34858L61744j57490
$$ 6007369 6444337 6254032 6415450 6744102 6659719 6667541 7037869 7272727 7634471 7476981
3623G476981j96396K58386J91190O5869J01920L94182J58282K82198l6335M78107
$$ 7476981 7280585 7538971 7730161 7796030 7897950 8292132 8450414 8732612 8696277 9174384
3613I174384K11171M15340Q3805J49371L56682L81734m1541O51048M07746L60513
$$ 9174384 9385555 9800895 9884700 10034071 10390753 10772487 10730946 11381994 11789740 12150253
3603A2150253P26221O94035K20512o7825k1794K39216L26833M13404O8820N93273
$$ 12150253 12876474 13570509 13791021 13723196 13701402 13940618 14267451 14680855 14749675 15342948
3593A5342948M78442M98535K47485k79813N75680M00646L67569K90194N96534
$$ 15342948 15821390 16319925 16567410 16287597 16863277 17263923 17631492 17921686 18518220
3584A8518220J87846M9643r110L51324J14212j29748J60140J48362n265j5622
$$ 18518220 18706066 18755709 18746599 19097923 19212135 19082387 19242527 19390889 19385624 19370002
3574A9370002k02670q1321j11647R884j82441m20674k2633j08866l18279m53368
$$ 19370002 19167332 19086011 18974364 18984248 18801807 18381133 18358500 18249634 17931355 17477987
3564A7477987j99660o7605j39279l98140l26357l57414o97931q15291k59285j29626
$$ 17477987 17278327 17210722 17071443 16673303 16346946 15989532 15291601 14476310 14217025 14087399
3554A4087399o32413k12086j83915l05026l0116m76041p4552k90371q74944m19272
$$ 14087399 13454986 13242900 13058985 12753959 12723843 12247802 12173250 11882879 11007935 10588663
3544A0588663l90210n23312k54495l2692p04107l62897j19028O9261n04563j95382
$$ 10588663 10198453 9675141 9420646 9387954 8683847 8320950 8201922 8271183 7766620 7571238
3534G571238m01994k87964l33450j58999Q2422n12858J76120j3037j03390l70864
$$ 7571238 7169244 6881280 6547830 6388831 6471253 5958395 6134515 6121478 6018088 5647224
3524E647224L76450k77342j04333L6519l43848j53539R6773n48015P0944j66442
$$ 5647224 6023674 5746332 5641999 5678518 5334670 5181131 5277904 4729889 4800833 4634391
3514D634391M3937k02502j14507J12955k97989j63518K79198k28385K18658j16904
$$ 4634391 4678328 4475826 4361319 4474274 4176285 4012767 4291965 4063580 4282238 4165334
3504D165334k9345l26819k10936N9929m40988L43143J31392L9303l16389k12553
$$ 4165334 4135989 3809170 3598234 3658163 3217175 3560318 3691710 3731013 3414624 3202071
3494C202071L8141Q4212M8059p3684L74453k22502N7493J15210k32449l32363
$$ 3202071 3240212 3324424 3372483 3298799 3673252 3450750 3508243 3623453 3391004 3058641
3484C058641k09575R1578J60218j39474o8068J28449k84746M8592k4029r8832
$$ 3058641 2849066 2940644 3100862 2961388 2893320 3021769 2737023 2785615 2761586 2662754
3474B662754j77871J81894j08760k13267j3767j05495K05240j44128q4135L14410
$$ 2662754 2484883 2666777 2558017 2344750 2330983 2225488 2430728 2286600 2202465 2516875
3464B516875p3800o8587k83352L15889l58402R573J54216O4322J3427m9183r7245
$$ 2516875 2443075 2374488 2091136 2407025 2048623 2058196 2212412 2276734 2290161 2240978 2143733
3453B143733j64849r2296L8197N8883O0846o6914K10452p9411l71023J4789O8684
$$ 2143733 1978884 1886588 1924785 1983668 2044514 1977600 2188052 2108641 1737618 1752407 1821091
3442A821091j8993J70219J62873k74459o8625r157J20306q1284l60829L00858
$$ 1821091 1802098 1972317 2135190 1860731 1792106 1782949 1903255 1821971 1461142 1762000
3432A762000J20444k93109q9869L41712j72363p7264J43083R428j70104J53373
$$ 1762000 1882444 1589335 1499466 1841178 1668815 1591551 1734634 1744062 1573958 1727331
3422A727331M72614j72487p1236j8610k87535J63129j49831p7970Q3962k28260
$$ 1727331 2199945 2027458 1956222 1937612 1650077 1813206 1663375 1585405 1669367 1441107
3412A441107k05215p3584K9272K73603j36326M77858m65310%j1079k24760Q2622
$$ 1441107 1235892 1162308 1191580 1465183 1328857 1806715 1341405 1341405 1330326 1105566 1188188
3401A188188k8506P6365k7836l28680Q2544J42750K0218j19268O1908J28253Q0546
$$ 1188188 1159682 1236047 1208211 879531 962075 1104825 1125043 1005775 1067683 1195936 1276482
3390A276482Q9136k20618R2029m5502P8239j2599k12723J9024J1648n3505J51535
$$ 1276482 1365618 1145000 1237029 1191527 1269766 1257167 1044444 1063468 1075116 1021611 1173146
3379A173146o6417j95420k20734J3660q8806K39459m21752Q2210J97766j54893
$$ 1173146 1106729 911309 690575 704235 615429 854888 433136 515346 713112 558219
3369E58219N71082j27697j61983j43605K39272K55314k62569k42615j11708J03072
$$ 558219 1129301 1001604 839621 696016 935288 1190602 928033 685418 573710 676782
3359F76782l3401j50702q0939M76629k37634M4333M9034J92209J58295r4477m7739
$$ 676782 643381 492679 411740 888369 650735 695068 744102 936311 1094606 1000129 952390
3348I52390k17738k76950M4138J98998J5210k16075J29903k34236K68454M906
$$ 952390 734652 457702 501840 700838 716048 499973 629876 395640 664094 669000
3338F69000L3024L1860o2278K13960o4259j58714n9913J80555J16879k57690J24737
$$ 669000 702024 733884 671606 885566 821307 662593 602680 783235 900114 642424 767161
3327G67161j19386K76276j21356r4260O8479j07077j48203J67425J96126k22231
$$ 767161 647775 924051 802695 708435 776914 669837 521634 689059 885185 662954
3317F62954l2992K55208O8077R960j49951k15531j20887j12855J90762M7702L4049
$$ 662954 629962 885170 953247 963207 813256 597725 476838 363983 554745 602447 636496
3306F36496j30536n5887K70427R3905k39694o7009j27459J69483j94845k70303
$$ 636496 505960 450073 720500 814405 574711 507702 380243 549726 354881 84578
3296H4578P0732P8104L50423r4513k58275N9275K17895m7763O7648K83986m79418
$$ 84578 155310 233414 583837 489324 231049 290324 508219 460456 528104 812090 332672
3285C32672K74462M423j65959J77807p1347K1630J69582j1243m3525J76859Q4257
$$ 332672 607134 611557 445598 623405 552058 573688 743270 732027 688502 865361 949618
3274I49618j97834j26732K14285j98360j24618K76137M2007k86743J10037K89107
$$ 949618 751784 625052 839337 640977 516359 792496 834503 547760 657797 946904
3264I46904o4767J09470k17117J6573q0641k97535J38492R9794j61018L66626
$$ 946904 882137 991607 774490 791063 710422 412887 551379 651173 490155 856781
3254H56781J16873o08039J17994K69780l9578Q231q7282M2874r5122l13326o7874
$$ 856781 973654 365615 483609 753389 713811 722042 634760 677634 582512 269186 201312
3243B01312K59128L23603K90100j69465j84431J33884J76475P837k80597M6687
$$ 201312 460440 784043 1074143 904678 720247 854131 1030606 1038443 757846 804533
3233H04533j07498O7593L3841J64923p8296l60654L40281K3099r7018m0153J68338
$$ 804533 697035 764628 798469 963392 885096 524442 864723 887822 790804 750651 918989
3222I18989j04106k70447J28822N0924J47497M3537k06818K12436M3866m6857
$$ 918989 814883 544436 673258 724182 871679 915216 708398 920834 964700 917843
3212I17843j22007o422r2998k2147K3603K1243j71171M7621J51986k29493K73916
$$ 917843 795836 789414 696416 674269 697872 719115 547944 595565 747551 518058 791974
3201G91974M6066j00702J31035K94933N922L6620k61582k82493j4592J01081J40959
$$ 791974 838040 737338 868373 1163306 1169228 1205848 944266 661773 647181 748262 889221
3190H89221j39761M4443j15969L03419K75368q4848k73838n9587J28789k97622
$$ 889221 749460 793903 677934 981353 1256721 1171873 898035 838448 967237 669615
3180F69615N3539K83829l06944M2295K41848j97496j0253J56253o9726n8599q8826
$$ 669615 723154 1006983 700039 742334 984182 786686 776433 932686 862960 804361 715535
3169G15535L16027L95055m65444j61412J48696k38474K43719k56996j15353K87954
$$ 715535 1031562 1426617 961173 799761 948457 709983 953702 696706 581353 869307
3159H69307O5075o8545o3230n5826J95390k90841P4215J65092j66785J49913l08751
$$ 869307 934382 865837 802607 746781 942171 651330 725545 890637 723852 873765 565014
3148E65014K11218J10293k6857M6697L38000j63221j7134k75081r2182J24963
$$ 565014 776232 886525 859668 906365 1244365 1081144 1064010 788929 696747 821710
3138H21710M1279J94484k80066l29207L12644M55019k42039J72947j96707K4348
$$ 821710 862989 1057473 777407 448200 760844 1215863 973824 1146771 950064 974412
3128I74412k7025l76725n3808J31807J05692J82829l67522O0975L69444J80400
$$ 974412 947387 570662 516854 648661 754353 937182 569660 630635 1000079 1180479
3118A180479m2343j45358M7573o8929L7015j45164M0015Q2345j8358J16614l0044
$$ 1180479 1138136 992778 1040351 971422 1008437 863273 903288 985633 967275 1083889 1053845
3107A053845k82207k84138O018N16290q5178M0621q1579j89314J25364J16228
$$ 1053845 771638 487500 493518 1009808 924630 965251 883672 694358 819722 935950
3097I35950Q3127p2318k33057J4103R3850m9965J19870j77173r8146K66395N7159
$$ 935950 1019077 946759 713702 727805 821655 771690 891560 714387 616241 882636 939795
3086I39795j70896j19903j77900q4683J10261K29375L53848k89750P0702p7991
$$ 939795 768899 648996 471096 386413 496674 726049 1079897 790147 860849 782858
3076G82858J42191l68217L0916K59027l18859o859o3408K63537K95034l5517k88630
$$ 782858 925049 556832 587748 846775 527916 521057 457649 721186 1016220 980703 692073
3065F92073M00493j2318K8664j05573m20610O4101l3460K99359n3618J82549P234
$$ 692073 1092566 1080248 1108912 1003339 582729 646830 613370 912729 859111 1041660 1048894
3054A048894O7654q4012j99857P7002L20557K4995k11414l31304j18417L04050
$$ 1048894 1116548 1032536 832679 909681 1230238 1255233 1043819 712515 594098 898148
3044H98148J10295K56201l20890k4701K2438j0513J68931j14265K0105m7484l3254
$$ 898148 1008443 1264644 943754 919053 941491 930978 1099909 985644 1005749 958265 925011
3033I25011K0690N48161M0214l33718k13488K65874M14738K57267j79282o0782
$$ 925011 945701 1493862 1534076 1200358 986870 1252744 1667482 1924749 1745467 1684685
3023A684685K06097k31542L366j6598J62422j42172J40977O9113K147j8260O9983
$$ 1684685 1890782 1659240 1662606 1646008 1808430 1666258 1807235 1876348 1878495 1860235 1930218
3012A930218J27297K00013l2980n87801M61630J86020M5464k22287k2330M27125
$$ 1930218 2057515 2257528 2224548 1636747 2098377 2284397 2329861 2107574 2085244 2512369
3002B512369j01526L7634n0541K99216J3557Q1421k03729m6107m4607M36843L00994
$$ 2512369 2410843 2448477 2397936 2697152 2710709 2792130 2588401 2542294 2497687 2934530 3235524
2991C235524q538K20972J41068o6250K59315p011j3200L1969m6809K90868N05297
$$ 3235524 3226986 3447958 3589026 3522776 3782091 3775080 3761880 3793849 3747040 4037908 4543205
2980D543205J11690J26000M14558K02163j24997L77337J52343p539J46920J03334
$$ 4543205 4654895 4780895 5195453 5397616 5272619 5649956 5802299 5794760 5941680 6045014
2970F045014M58490K17905K83839M12198K00535J17583K16575M81137P25166K24500
$$ 6045014 6503504 6721409 7005248 7417446 7617981 7735564 7952139 8433276 9158442 9382942
2960I382942L52818J009242N08500O76028O77074R46647O32513Q78532J275328
$$ 9382942 9735760 10745002 11253502 11929530 12606604 13553251 14185764 15064296 16339624
2951A6339624Q33923N70385J006733P33996l63939l49902r03470j045388p68631
$$ 16339624 17173547 17743932 18750665 19484661 19120722 18770820 17867350 16821962 16053331
2942A6053331n66483j135691l50693l57506l62798J22195l25310n62841l23145
$$ 16053331 15486848 14351157 14000464 13642958 13280160 13402355 13077045 12514204 12191059
2933A2191059K4415j63526j61040l47615k3962K43289J08291L61351O45862M49623
$$ 12191059 12215474 12051948 11890908 11543293 11519331 11762620 11870911 12232262 12878124 13327747
2923A3327747j68330o84294j088770j082452j135548l92997q39908o38922l31697
$$ 13327747 13159417 12475123 11386353 10303901 9168353 8775356 7935448 7296526 6964829
2914F964829k64009j39396n78333r4137j44098k1340j19555l90385q0567m6486
$$ 6964829 6700820 6561424 5983091 5888954 5744856 5723516 5603961 5213576 5133009 5086523
2904E086523K97468J64057L48310L19992N01888k7948n90676m16124q28456o63592
$$ 5086523 5383991 5548048 5896358 6216350 6718238 6690290 6099614 5683490 4855034 4191442
2894D191442R6858k67512k31402N8783k9307l67816j55915K91131l83188n70680
$$ 4191442 4288300 4020788 3789386 3848169 3818862 3451046 3295131 3586262 3203074 2632394
2884B632394j76186K76155k08696j76740P0049K65916o0143l57987J73833o9919
$$ 2632394 2456208 2732363 2523667 2346927 2416976 2682892 2622749 2264762 2438595 2368676
2874B368676k86561J39606J15308k79324P9501k79780j7772L73651q4785k85710
$$ 2368676 2082115 2221721 2337029 2057705 2137206 1857426 1839654 2213305 2128520 1842810
2864A842810N7437j03954j62669p5306k8997o1761p4633J35834K05914j16548
$$ 1842810 1900247 1796293 1633624 1558318 1529321 1467560 1392927 1528761 1734675 1618127
2854A618127j39761M639k13483l7516K33707J82597R1861r1861L7616j60101k2594
$$ 1618127 1478366 1483005 1269522 1232006 1465713 1648310 1740171 1648310 1685926 1525825 1503231
2843A503231k03684j03390J16682j12729L62016j98135k80258K11511r2200j70503
$$ 1503231 1299547 1196157 1312839 1200110 1562126 1363991 1083733 1295244 1203044 1032541
2833A032541L09570m7480r6908K54749j6823l22159J36079n857j85215K8483j71373
$$ 1032541 1342111 1294631 1197723 1452472 1435649 1113490 1249569 1243712 1058497 1086980 915607
2822I15607J89302L74748j84912p6317j74224l5779J63117R1032m00570J22356
$$ 915607 1104909 1479657 1294745 1218428 1044204 1008425 1171542 1262574 862004 984360
2812I84360K28456k75598j28151J69373j12345K73169l8803j87843j07852n4706
$$ 984360 1212816 937218 809067 978440 866095 1139264 1100461 912618 804766 750060
2802G50060N5371J67589J60000l26235P2544L16848n08189J82459k54102J63527
$$ 750060 805431 973020 1133020 806785 879329 1196177 687988 870447 616345 779872
2792G79872J56874k33734K92316J27421m08881o8095J67566k21805K9654J40866
$$ 779872 936746 703012 995328 1122749 713868 645773 813339 591534 621188 762054
2782G62054K7196L94j19493j82024J79847J48397k264l25545J06964L85781q7826
$$ 762054 789250 789644 670151 488127 667974 816371 814107 488562 595526 981307 893481
2771H93481j42224N2061j59671N8539j29811J54475L1166O1894n3998n7474o52
$$ 893481 751257 803318 643647 702186 572375 726850 758016 819910 765912 708438 707786
2760G07786j49466K34012J38960J97964k11941j70990K71334r4953j0257P1439
$$ 707786 558320 792332 931292 1129256 917315 746325 1017659 922706 912449 983888
2750I83888j78837K00428k06128K60697O2037k58709N7444N520l6677J03503R0596
$$ 983888 805051 1005479 799351 1060048 1122085 863376 920820 926340 889663 993166 1083762
2739A083762j3883L3150k08749K94308n0576o7187l0886L90530k36559m6238J33706
$$ 1083762 1069879 1103029 894280 1188588 1138012 1070825 1039939 1430469 1193910 1147672 1281378
2728A281378L27805n3300Q8424q6277R9004J74563J28174p2344Q2581m88K87961
$$ 1281378 1609183 1555883 1644307 1558030 1657034 1831597 1959771 1887427 1970008 1969520 2257481
2717B257481J86744p6579l60391K60606K03986k39084P0617J11511K44716K04490
$$ 2257481 2444225 2367646 2007255 2267861 2471847 2232763 2303380 2414891 2659607 2864097
2707B864097j44792q4637L0571K81726K84078J10525j4150Q3979Q4549J72970
$$ 2864097 2719305 2634668 2665239 2946965 3231043 3341568 3327418 3411397 3495946 3668916
2697C668916K46020K90736Q263j00920J70099k18942j74998J66080k46922l47036
$$ 3668916 3914936 4205672 4213935 4113015 4283114 4064172 3889174 4055254 3808332 3461296
2687C461296J61251J3785r4845K15438j35537j89404n4446K28841O08268j91488
$$ 3461296 3622547 3636332 3541487 3756925 3621388 3431984 3377538 3606379 4214647 4023159
2677D023159M0907p6491j61311K03123J75676j27510j79068m0397j16393n678
$$ 4023159 4064066 3987575 3826264 4029387 4205063 4077553 3898485 3858088 3741695 3736017
2667C736017k63241m83917J37056Q9184k75696p3167M5504j20942R1735j49967
$$ 3736017 3472776 2988859 3125915 3215099 2939403 2866236 2911740 2790798 2882533 2732566
2657B732566j0119n1095J44136k20575j79358J11141K59486k89375j41173m08476
$$ 2732566 2722447 2671352 2815488 2594913 2415555 2526696 2786182 2496807 2355634 1947158
2647A947158L0213k01247J3271l54706O2319M9551j42601k8749r8505j288j3375
$$ 1947158 1977371 1776124 1789395 1434689 1497008 1546559 1403958 1375209 1276704 1275416 1262041
2636A262041j97288J09074q6735j89682J41623J78392j2972k88727N8317j5156
$$ 1262041 1064753 1173827 1087092 897410 1039033 1217425 1204453 915726 974043 958887
2626I58887o9293j95328k92219J56219M63812l49134j57782M84601l99826k35970
$$ 958887 889594 694266 402047 558266 1022078 672944 515162 999763 599937 363967
2616C63967K3918R7885j07215l84691J22732J57633J55380J50401k1821j6944
$$ 363967 387885 485770 378555 -6136 116596 274229 429609 580010 558189 541245
2606E41245k91574J06728j87144J68646L54891j26088n4710n366l04578r7117
$$ 541245 249671 356399 169255 337901 692792 566704 511994 506628 202050 104933
2596A04933K42117q154J09030O2398j28627j31011k08892O6565K75478J5853R3174
$$ 104933 347050 338896 447926 510324 381697 250686 41794 108359 383837 399690 492864
2585D92864J29458k49753k42914k35228L78887j03057o4408K69843k19495J98922
$$ 492864 622322 372569 129655 -105573 273314 170257 105849 375692 156197 355119
2575C55119l35430O4808K10254L22297k0268K9369n50692J28557j16622l24709
$$ 355119 19689 84497 294751 617048 596780 626149 75457 204014 87392 -237317
2565b37317j27524K27263Q6502J87465L5758k82324O8231K06166j09758m8391
$$ -237317 -364841 -137578 -51076 136389 172147 -110177 -41946 164220 54462 6071
2555F071k03746J69067p8837L13323k1706k23859p1264J5941J53557J32560k959
$$ 6071 -197675 -28608 -107445 205878 184172 -39687 -110951 -95010 58547 191107 188148
2544A88148k15256l1795L16490j8942j96676J34529m2270J46816p9596r0358J35879
$$ 188148 -27108 -58903 257587 238645 41969 176498 134228 281044 201448 111090 246969
2533B46969m52839K24578J59955j23535q6489r4487K00980K0117J70479l5769
$$ 246969 -205870 18708 178663 55128 -31361 -125848 75132 95249 265728 229959
2523B29959j9809J65913l883J92059n47601K77021J37875l00274k02j55161n8258
$$ 229959 210150 376063 372180 564239 16638 293659 431534 131260 131058 -24103 -82361
2512h2361Q412J14985p6252j67480r1560L15656n3357j48448o1859J95205P3683
$$ -82361 -73949 41036 -35216 -202696 -294256 21400 -31957 -180405 -242264 -47059 26624
2501B6624p1218j96542L28710k58598J01209o2388K5085k2055j78485J40781L30033
$$ 26624 -44594 -241136 87574 -171024 -69815 -132203 -107118 -129173 -307658 -166877 163156
2490A63156M5854k64820M5471l5791R0743J17186k67045j14308J24922L0346j0769
$$ 163156 209010 -55810 -10339 -46130 44613 161799 -105246 -219554 -94632 -64286 -75055
2479g5055p3154L14923J33382k75838j38665K25877J26416j80802l98576L0866
$$ -75055 -148209 166714 300096 24258 -114407 111470 237886 57084 -341492 -310626
2469c10626M28498j07340N1452J55746j76096J5050p2933K21284k06724j39732
$$ -310626 117872 10532 61984 217730 41634 56684 -16249 205035 -1689 -141421
2459a41421J92877r3724K06192K355l4354j99680J84172j40405M0643j6090K9833
$$ -141421 51456 -42268 163924 166279 131925 -67755 116417 -23988 16655 565 30398
2448C0398J41077k31901k42474P5391L47272J9262j06184K51717L0653j20539
$$ 30398 171475 -60426 -302900 -227509 119763 139025 32841 284558 315211 194672
2438A94672k50517n6412L8127J16280k16868M1631l5206K80213n5505k16513l2669
$$ 194672 -55845 -112257 -74130 42150 -174718 -133087 -168293 111920 56415 -160098 -192767
2427a92767Q0327J5615J01338R4947k34196J29996j97728k9322K6089J1440K68802
$$ -192767 -112440 -96825 4513 99460 -134736 -4740 -202468 -231790 -205701 -194261 74541
2416G4541k25267j28339J07808K46232J75961k10335L2805j93142j7170K00741
$$ 74541 -150726 -279065 -171257 74975 250936 40601 73406 -119736 -136906 63835
2406F3835r1020Q5091K4135j59601K13395k87904j66572L96662O0595J29139j21024
$$ 63835 -27185 57906 82041 -77560 135835 -152069 -318641 78021 138616 267755 146731
2395A46731k85782j07089M53229j88133R5600M0907j42097k04871J45742J20092
$$ 146731 -139051 -246140 207089 18956 114556 155463 13366 -191505 -45763 74329
2385G4329j90874L01257J0396l53813N3500J41848k82751K01693K36136k66880
$$ 74329 -116545 184712 195108 -158705 -105205 36643 -246108 -44415 191721 -75159
2375g5159q7723M9337k16136R0301L8849J35239L2537J61550P1388K36847k78443
$$ -75159 -162882 -113545 -329681 -239380 -200531 -65292 -32755 128795 200183 437030 158587
2364A58587j46640J5575L147K4233O1180j56230J39498o98M691j89709J92084
$$ 158587 11947 27522 30669 54902 116082 -40148 99350 98652 103343 -86366 105718
2353A05718J63446O1244l56115Q6177O0055J48958n1921j35175j10328r7671k03511
$$ 105718 269164 330408 -25707 60470 120525 269483 217562 82387 -27941 -125612 -329123
2342c29123J67708J35623P8453n9696j36208K12615n3837R0689m1600J43821l65166
$$ -329123 -161415 -25792 52661 -7035 -143243 69372 15535 106224 64624 208445 -156721
2331a56721n3833j26725K45230j80345k01227K24928K80442P0333m12894O7337
$$ -156721 -210554 -337279 -92049 -272394 -473621 -248693 31749 102082 -310812 -243475
2321b43475j78594J00895M20268j48266N9527k04086k93132K23301L42599N3722
$$ -243475 -422069 -321174 99094 -49172 10355 -193731 -486863 -263562 79037 132759
2311A32759k7476p4111r3894j106J44162j33320L5617K39891o6696L0094N8154
$$ 132759 105283 31172 -62722 -63828 80334 -52986 -17369 222522 155826 185920 244074
2300B44074m7383n00K08626K74096o8871j50317j65219L02659P4375k57612k75486
$$ 244074 196691 196191 404817 678913 610042 459725 294506 597165 671540 413928 138442
2289A38442j5270j0787r8089K80680k42303O8097l59761Q5832K51646m6736P741
$$ 138442 123172 112385 14296 294976 52673 120770 -238991 -153159 98487 51751 59492
2278E9492L7196m2483J44572N0938j27628J04111M9408j33150j61995j90457J07169
$$ 59492 96688 54205 198777 249715 122087 226198 275606 142456 -19539 -209996 -102827
2267a02827p0677R6243N6799j557K537L23117p1612k20204j66640j40259N04675
$$ -102827 -173504 -77261 -20462 -22019 -19482 303635 232023 11819 -154821 -295080 209595
2256B09595Q9580j70735q3902K572L90814j65240j85977J89118k61293O008K54491
$$ 209595 299175 128440 44538 47110 437924 272684 86707 275825 14532 20540 275031
2245B75031m0384j84278o1026O8338j55820L1262J03750k46775R6292O0610K55326
$$ 275031 234647 50369 -10657 57681 -98139 -66877 36873 -209902 -113610 -53000 202326
2234B02326Q6986j60029O388o3114L2596n0946j77812O6224K48619K26788m47294
$$ 202326 289312 129283 135671 72557 105153 54207 -123605 -57381 191238 418026 -29268
2223b9268j41059m6301M18923j33009N1358k449j59251K426L85111l79658J9102
$$ -29268 -170327 -216628 202295 69286 120644 118195 -41056 -38630 346481 -33177 -14075
2212a4075k86891K50054J96696n4936j33849m8521J20887J85660P9527J33245
$$ -14075 -300966 -50912 145784 90848 -43001 -91522 29365 215025 294552 427797
2202D27797k4273k56874K12628K7147l8077K387k50276l9840k44815J11845K38939
$$ 427797 403524 146650 359278 386425 348348 350735 100459 60619 -184196 -72351 166588
2191A66588k61335Q6261L120J83258J14296K74893L37633j96319j29745q0382
$$ 166588 -94747 -8486 -5366 177892 292188 567081 904714 708395 578650 498268
2181D98268J5638J16531r0788J36255j23588K6214N67j54481P7948q5779o1043
$$ 498268 513906 630437 539649 675904 552316 578530 579097 424616 502564 416785 355742
2170C55742J16694M1020J06818k47862J76230J4373J4479j04363L7315l6070K36103
$$ 355742 472436 513456 620274 372412 548642 563015 577494 473131 510446 474376 710479
2159G10479R0447k33534Q4962L04572j12402J15629M3222q236J73864J27243l2588
$$ 710479 800926 567392 652354 956926 844524 960153 1003375 995139 1169003 1296246 1263658
2148A263658P5111L50196j29357N9130J15356j01492J37920K90098J05847J42573
$$ 1263658 1338769 1688965 1559608 1618738 1734094 1632602 1770522 2060620 2166467 2309040
2138B309040J52017J00129J78848j29760o4576K66132K25489L27553l0232J91970
$$ 2309040 2461057 2561186 2740034 2610274 2545698 2811830 3037319 3364872 3334640 3526610
2128C526610L53980K35492J58873J01442J95887J88015O64176L85881O6947J88078
$$ 3526610 3880590 4116082 4274955 4376397 4572284 4760299 5424475 5810356 5877303 6065381
2118F065381O10897L94005O73530K86437K04407L68418M58309O76291R56650J045952
$$ 6065381 6676278 7070283 7743813 8030250 8234657 8603075 9061384 9737675 10694325 11740277
2108A1740277J308952J112784J257278J598718J249947J949891K679590L120424
$$ 11740277 13049229 14162013 15419291 17018009 18267956 20217847 22897437 26017861
2100B6017861M571396N178198P793602R817769J2910241L363418m365062p770347
$$ 26017861 30589257 35767455 43561057 53378826 66289067 69652485 65287423 57517076
2092E7517076j1493279q637914o886674m528948l372658k548794j985455j440192
$$ 57517076 46023797 37385883 30499209 25970261 22597603 20048809 18063354 16623162
2084A6623162j391810j375663j681239j166716j346154p89208o05718l46914p03069
$$ 16623162 15231352 13855689 12174450 11007734 9661580 8872372 8266654 7919740 7216671
2075G216671l81300o51084m62989o99317j59988j41923m52147o9271j74686l1355
$$ 7216671 6835371 6184287 5721298 5021981 4861993 4720070 4267923 4198652 4023966 3992611
2065C992611r6544l57167k21401j57257l02391R6168k56191q3173L86313l37032
$$ 3992611 3896067 3538900 3317499 3160242 2857851 2954019 2697828 2614655 3000968 2663936
2055B663936m40485q3851j79515J34624J57583o17229L06742j86567j26763J55404
$$ 2663936 2223451 2139600 1960085 2094709 2252292 1635063 1941805 1755238 1628475 1783879
2045A783879j84824k65672K44435q6331L6551J33192n21412Q6057O9333m9172
$$ 1783879 1599055 1333383 1577818 1491487 1528038 1661230 1139818 1225875 1295208 1246036
2035A246036l7244l32133K03577R5947L7871l54433j78794q6954K35301J74793
$$ 1246036 1208792 876659 1080236 1176183 1214054 859621 680827 593873 829174 1003967
2025A003967p7313q3250M5076o6818k14156N5251m7750j17629J21830l36021K51253
$$ 1003967 926654 843404 888480 821662 607506 662757 615007 497378 619208 283187 534440
2014E34440P553l76787L45319K3896j2878M893l0973j35782p3079J52245k42217
$$ 534440 541993 165206 510525 534421 521543 526436 495463 359681 286602 438847 196630
2003A96630n1965K00399j30335m9295r2727o8474M67338K1931k05360O5723j84926
$$ 196630 144665 345064 214729 165434 72707 4233 471571 493502 288142 353865 168939
1992A68939K33600k39101J02666l68108K70291O5298K9581j68180p9839L59365
$$ 168939 402539 163438 266104 -102004 168287 233585 263166 94986 15147 374512
1982C74512R5277l29083k01663N2918J36984j27716o0607K04659K59606j30372
$$ 374512 469789 140706 -60957 -8039 128945 1229 -59378 145281 404887 274515
1972B74515N5426j86500l64721K72884K69316j70560L47516J28287m15386j05212
$$ 274515 329941 143441 -221280 51604 320920 150360 497876 626163 210777 105565
1962A05565O1542l7304j09117J50604R3854q6310k07491J10224K44236K57128
$$ 105565 167107 129803 20686 171290 265144 178834 -28657 81567 325803 582931
1952E82931l49134N8095j40434j37196K99442P274J4975l16293o6779k6300K06796
$$ 582931 233797 291892 151458 14262 313704 320978 335953 19660 -47119 -73419 133377
1941A33377j88901J20146L03997j42294l78616o9912k5231l1788Q2548M9954k29541
$$ 133377 -55524 64622 368619 226325 -152291 -222203 -247434 -279222 -196674 -146720 -376261
1930c76261J01536J66945k2182J05800r9993K7301n7409J61832k02185O0388O00223
$$ -376261 -274725 -107780 -129962 -24162 -124155 -96854 -154263 7569 -194616 -134228 465995
1919D65995K0578k28263J11736j37121n1869j98703j92557J34002K03675l5858
$$ 465995 486573 258310 370046 232925 181056 -17647 -210204 -76202 127473 91615
1909I1615j59559O2571J73079n5598O5232M6544k11528K4070J36255M1527j14971
$$ 91615 -67944 -5373 167706 112108 177340 223884 12356 36426 172681 214208 99237
1898I9237j45394K92920J30912L02446k1171n341k3500m76576L9206K01834k50714
$$ 99237 -46157 246763 377675 680121 658950 653609 630109 153533 192739 394573 143859
1887A43859O5412k53493J43899j21842j20907j95465J73936J41130M5763o4643
$$ 143859 209271 -44222 99677 -22165 -143072 -338537 -164601 -23471 22292 -42351
1877d2351L3057J77019j63857m2157k29925L30706Q1917J73421p8031J44446k46373
$$ -42351 -9294 167725 3868 -38289 -268214 62492 144409 317830 239799 384245 137872
1866A37872J01960j15040j50750r6803k02080K50932k25566k74755K37081J20177
$$ 137872 239832 124792 -25958 -122761 -324841 -73909 -299475 -574230 -337149 -216972
1856b16972J7396K51423K9091j84024M38137O5839k91502k55488q7748K26271
$$ -216972 -199576 51847 80938 -103086 335051 400890 109388 -146100 -233848 -7577
1846g577j09441N1946Q2100j0150o693J01685K3889j47405j81163J50701L4087
$$ -7577 -117018 -65072 17028 6878 185 101870 125759 -21646 -202809 -52108 -18021
1835a8021P3805M3395r588n1790L06537j01993j10710m4843k24128k23881J89894
$$ -18021 55784 99179 89591 37801 344338 242345 131635 86792 -137336 -361217 -171323
1824a71323j3514K57062k2089j46299J39041K09734k06573M55n3752j51108L14111
$$ -171323 -184837 72225 50136 -96163 42878 252612 46039 46494 -7258 -158366 155745
1813A55745K34923l76126j36024K14513N3993j3434j07657j52286N9395k70747
$$ 155745 390668 14542 -121482 93031 147024 133590 25933 -126353 -66958 -337705
1803c37705K87222K24204q4097L15388k19004j54393k68663P5116q316M8000K68724
$$ -337705 -50483 173721 89624 405012 186008 31615 -237048 -161932 -170248 -122248 146476
1792A46476j62841j73079L51038j11247o1145j03463j73701l90708M0937J30652
$$ 146476 -16365 -189444 161594 50347 -10798 -114261 -287962 -678670 -637733 -507081
1782e07081N08668J51283L7493l720J43459m8622j24170J43146m3335j51290k84156
$$ -507081 1587 152870 190363 186643 330102 281480 157310 300456 257121 105831 -178325
1771a78325j09826M76661K51842l57252k66113M1134J43946J9386L6364l9175
$$ -178325 -288151 188510 440352 83100 -183013 -141879 2067 21453 57817 18642
1761A8642m83595J15294J83504J35207j16049j6481J15208J24082O751j06957
$$ 18642 -464953 -349659 -166155 -30948 -146997 -163478 -48270 75812 82563 -24394
1751b4394j85664K6857K8148L16890k09244J0089O879J38130l0016k00385j12434
$$ -24394 -210058 -183201 -155053 161837 -47407 -37318 -30439 107691 77675 -122710 -235144
1740b35144L47099p176k24315Q8666K3014p202K4056O5247L6818k1329K6440O9141
$$ -235144 111955 104779 -119536 -30870 -7856 -15058 8998 74245 111063 89734 116174 185315
1728A85315j34763L2699m39738K66095k54121j55221K61851L65068j68768r6576
$$ 185315 50552 83251 -356487 -90392 -344513 -499734 -237883 127185 -41583 -138159
1718a38159J59719n8847m0052r3182o9892K14330r020o6173M501p1607J97910
$$ -138159 21560 -37287 -77339 -170521 -240413 -26083 -35103 -101276 -96775 -168382 29528
1707B9528m9648J18731j43884N9299K78266k62498K6861j59148j12791P3426K55090
$$ 29528 -20120 98611 -45273 14026 292292 29794 56655 -102493 -215284 -141858 113232
1696A13232o8289k8068K831l02401K98002l3181P1882R5740p8081L87722k75112
$$ 113232 44943 16875 19706 -282695 15307 -17874 54008 149748 71667 459389 184277
1685A84277k35091j08265M09862j3886L7384l53884K78589K41471m58491j95683
$$ 184277 -50814 -159079 250783 236897 274281 -79603 198986 440457 -18034 -213717
1675b13717J47819p4063R0106L9901L4990k50012L47369Q8540k97859j8508M4484
$$ -213717 -65898 -139961 -49855 -9954 25036 -224976 122393 210933 -86926 -105434 -60950
1664f0950p128l7393j15897j32075R3875K05118k04566K33444j55206k09249J10875
$$ -60950 -68078 -105471 -221368 -353443 -259568 -54450 -259016 -25572 -180778 -390027 -279152
1653b79152J41914K1787r6573K55748l76716O1018k7485K51580L18421j60506
$$ -279152 -137238 -115451 -212024 43724 -332992 -271974 -299459 -47879 270542 110036
1643A10036j25546J09378j40882m0573J84809j55315L862j13292n9482L46782
$$ 110036 -15510 93868 -47014 -87587 97222 -58093 -54231 -167523 -227005 119777
1633A19777J26520l48027M7174j89668j40946J90448L1454O6931M0275k347q3457
$$ 119777 246297 -101730 -54556 -244224 -385170 -194722 -163268 -96337 -56062 -58409 -141866
1622a41866K06958k22879L3981j72651J69119M80954q2042m43791J06834k24553
$$ -141866 65092 -157787 -123806 -296457 -127338 353616 271574 -172217 -65383 -289936
1612b89936l56K94073K6308j80777M7549P1597o9946L06811j47624j22900J67471
$$ -289936 -290292 3781 30089 -150688 -103139 -31542 -101488 205323 57699 -65201 102270
1601A02270k69933L2579K78656j04102k36164M32096j15269n5599r0757L0130
$$ 102270 -167663 -135084 143572 39470 -196694 235402 120133 64534 -26223 3907
1591C907n1510J8738q3338k32434J60828N495P2530q4187J03985k9809K28858
$$ 3907 -47603 -28865 -112203 -344637 -183809 -178314 -105784 -189971 -85986 -115795 113063
1580A13063P4871k21174p6295r3418K12282O1634q2927N44k8144j17695J57184
$$ 113063 187934 -33240 -109535 -202953 9329 70963 -11964 -11420 -39564 -157259 -75
1569g5J41204k04890k61231K1190J99598K62771m86164Q0990K28127J9319j22343
$$ -75 141129 -63761 -324992 -303802 -104204 158567 -327597 -246607 -18480 839 -121504
1558a21504k92861j84807J60317Q3468L06879q2376k00376K17235j46581k18553
$$ -121504 -414365 -599172 -438855 -355387 -48508 -130884 -331260 -114025 -260606 -479159
1548d79159J35111L26129j22536N7589j21369Q9122j49971K55241k3427k6286
$$ -479159 -344048 -17919 -140455 -82866 -204235 -115113 -265084 -9843 -33270 -59556
1538e9556K99690o66388J57247L01796L1637n02833M6352K80893P0800J62021
$$ -59556 240134 -426254 -269007 32789 64426 -438407 -392055 -111162 -40362 121659
1528A21659k30552p6710n0711M07399j92859k04193K10659p6062m26462P3950
$$ 121659 -108893 -185603 -236314 171085 -21774 -225967 -15308 -91370 -517832 -443882
1518d43882J78937J70992r2216l3808K75330j99754K9410n1313k83579J17621
$$ -443882 -264945 -93953 -186169 -219977 55353 -144401 -114991 -166304 -449883 -332262
1508c32262o6955J55090k28199q377R4528L46181p6826j90856N8192M0722j00210
$$ -332262 -399217 -244127 -472326 -480703 -386175 -39994 -116820 -307676 -249484 -208762 -308972
1497c08972m7151L19508j77720R0397p616J71259p7410J13948j26919j37013J00650
$$ -308972 -356123 -36615 -214335 -123938 -131554 39705 -37705 76243 -50676 -187689 -87039
1486h7039K44456J44143k73241J55127j93068l6893n69p8224J568J03776J37970
$$ -87039 157417 301560 28319 183446 -9622 -46515 -47084 -125308 -123740 -19964 118006
1475A18006l04517k32071L63898m9485m03548K02840N2082L2332M3374j73702
$$ 118006 -186511 -418582 -54684 -104169 -507717 -304877 -252795 -220463 -177089 -350791
1465c50791Q9722J20775n0136q2804M4269J03342K35945l34943J23765K50803
$$ -350791 -261069 -140294 -190430 -273234 -228965 -125623 110322 -224621 -100856 149947
1455A49947l95656J92765k62463R7738K65287m25882J54096R7979L45889k21104
$$ 149947 -245709 -52944 -315407 -217669 47618 -378264 -224168 -126189 219700 -1404
1445a404k3094L2399L5220K9489o9796k53661K51480n8759j60048q3719J18176
$$ -1404 -24498 7901 43121 72610 2814 -250847 633 -58126 -218174 -301893 -183717
1434a83717n2371J19356J19107M4552k0320l76672K70758K04982j4008j5K47732
$$ -183717 -236088 -116732 2375 46927 26607 -350065 -79307 125675 111667 111652 359384
1423C59384l33514J22513o6758p2461O5488o1990K13282j90020L7701K63525r5237
$$ 359384 25870 148383 81625 9164 74652 12662 225944 35924 73625 337150 241913
1412B41913j26822j12036O5215M7138l47373J34645q8593J66051m1973P7048J37172
$$ 241913 115091 3055 68270 115408 -231965 -97320 -185913 -19862 -61835 15213 152385
1401A52385M4602k18178r4972M2370o7244J98966j17972L72826o7540k10306m61285
$$ 152385 196987 -21191 -116163 -73793 -141037 57929 -60043 312783 245243 34937 -426348
1390d26348O72171n9960J44063M566k50940m1894O8432l584n85104J56210N10099
$$ -426348 245823 185863 329926 334492 83552 41658 110090 106506 -478598 -322388 187711
1379A87711r674k4562j45899m0880K0358j73491P9179j09002N6159K91530q8468
$$ 187711 178037 153475 7576 -33304 -12946 -186437 -107258 -216260 -160101 131429 42961
1368D2961j96309L58878l6821j8439Q9464k51760J03449j87561K53965K06874
$$ 42961 -153348 205530 168709 150270 239734 -12026 91423 -96138 157827 364701
1358C64701k74516k22071n3516P2269J20109J79401m74908m6778K21088J30120
$$ 364701 90185 -131886 -185402 -113133 6976 186377 -288531 -335309 -114221 15899
1348A5899n7629p9211p1809n0535p0885J39767L71112j85252j70178K08117K41689
$$ 15899 -41730 -120941 -192750 -243285 -314170 -174403 196709 11457 -158721 49396 291085
1337B91085P6079j47070j88033o7987N2584J32393l32118J02823Q5580j38621
$$ 291085 367164 220094 32061 -35926 16658 149051 -183067 -80244 5336 -133285
1327a33285O9315J52458j21336p7764L4897K19409k27952j01546K07276J44808
$$ -133285 -63970 88488 -32848 -110612 -75715 143694 -84258 -185804 21472 166280
1317A66280q6533Q1440o8853m65132N282q7123M19963m9608j32696r6481J76329
$$ 166280 79747 161187 92334 -372798 -367516 -454639 -34676 -84284 -216980 -313461 -137132
1306a37132J62578J02681j73959j6644k2316Q1900L709k04147N9507J23232K18961
$$ -137132 25446 128127 -45832 -62476 -84792 -2892 817 -203330 -143823 -20591 198370
1295A98370j69537m01623K70842L5504o6071r3194L0035J71879k56097K13836
$$ 198370 28833 -372790 -101948 -66444 -132515 -225709 -195674 -23795 -279892 -66056
1285f6056M23837k9051k66185k15595J41908j55858J96767M7195K06407K7873
$$ -66056 357781 328730 62545 -153050 -11142 -167000 29767 76962 283369 311242
1275C11242n08363J56385J8618J48266j40886J2484J8037P3442l13254R5385K56085
$$ 311242 -197121 -40736 -22118 126148 -14738 -2254 15783 89225 -224029 -128644 127441
1264A27441K11969O2472o90646N9789L93292Q745P1186L6051l27315J40872R7408
$$ 127441 339410 401882 -288764 -228975 164317 173062 244248 280299 -47016 93856 191264
1253A91264k21712J41369j95879J02106J90392p5719k28423l6625J87770J31916
$$ 191264 -30448 110921 -84958 17148 207540 131821 -96602 -133227 54543 186459
1243A86459j01775k17841Q43Q9538J19803J59046J7770j77443m8135J92178J34891
$$ 186459 84684 -133157 -132314 -42776 77027 236073 253843 76400 28265 220443 355334
1232C55334k60799p5194P2492j94548o462j12172r959r3340L66302J199P2879
$$ 355334 94535 19341 91833 -102715 -109177 -221349 -231308 -324648 41654 42853 115732
1221A15732k60743j04980K03474J76338m5417J70859q7550k5335m12105K35643
$$ 115732 -145011 -249991 -46517 129821 84404 255263 167713 142378 -269727 -34084
1211c4084J47076k86882J85653k5543k35182j16078K66763L9192O8321k53626
$$ -34084 112992 -173890 11763 -13780 -248962 -365040 -98277 -59085 9236 -244390
1201b44390L91394m3911j4677M7520R5733J67689k50067j99997j34130r2180J49153
$$ -244390 147004 103093 88416 135936 231669 399358 149291 -50706 -184836 -277016 -127863
1190a27863k5835L43326j26652Q3366j22664k10554P3171j26744p3636L36832
$$ -127863 -153698 189628 62976 146342 23678 -186876 -113705 -240449 -314085 22747
1180B2747p1007J43582k84705J36415J68259O2837k35377J1247q1835r334P0047
$$ 22747 -48260 95322 -189383 -52968 115291 178128 -57249 -46002 -127837 -137171 -67124
1169f7124Q3444J57861r6913l30633O32504j04970q0239N8653J5121p9792p9658
$$ -67124 16320 174181 77268 -253365 379139 274169 193930 252583 267704 187912 108254
1158A08254q6052N2175J10054l91689R5069r4610K88895J25967q666k87660J30111
$$ 108254 22202 74377 184431 -207258 -112189 -206799 82096 208063 199397 -88263 41848
1147D1848m1626o4840O1657k60388Q0690J60984l17487M22509p8063o8128Q2264
$$ 41848 222 -64618 -2961 -263349 -182659 -21675 -339162 83347 5284 -62844 19420
1136A9420j93888j13084L58045n83740Q5099L81044n574k20334j21728J17836
$$ 19420 -174468 -287552 70493 -513247 -428148 -47104 -52678 -273012 -394740 -276904
1126b76904Q7887O7021K4338K65553q6911K43679k62532l29027n5847Q416J05035
$$ -276904 -189017 -121996 -97658 167895 80984 324663 62131 -266896 -322743 -314327 -209292
1115b09292O8004J89886K34165k36353q7116K82052K00588j74931k67419O8331
$$ -209292 -141288 48598 282763 46410 -40706 241346 441934 267003 -416 67915
1105F7915N2813k60704k32210l2154Q5400K72638l15353J73278K72315J25837
$$ 67915 120728 -139976 -372186 -404340 -318940 -46302 -361655 -188377 83938 209775
1095B09775P4798j42330P3926j28429n8843j45788K45850N1253m22335Q0486M38713
$$ 209775 284573 142243 216169 87740 28897 -116891 128959 180212 -242123 -161637 277076
1084B77076j02762n07181M15498P957p6987j32166N9933J5410Q5935j38189n2597
$$ 277076 174314 -332867 82631 90588 13601 -118565 -58632 -43222 42713 -95476 -148073
1073a48073J67654J84407r1829k02092J27883J98234j56885J40168N1465k58605
$$ -148073 19581 203988 112159 -89933 37950 236184 79299 219467 270932 12327
1063A2327J95234k6700j37178n3495n998J17848J16882j92097Q3785k09099j04797
$$ 12327 207561 180861 43683 -9812 -15810 102038 218920 26823 110608 -98491 -203288
1052b03288J69281K41011r7945k44800j92622J13037j21181K21722K33095l79299
$$ -203288 -34007 207004 109059 -135741 -328363 -215326 -336507 -114785 118310 -260989
1042b60989J76342K46776J88321l12836l3597K5931k48674J45901k06363K79250
$$ -260989 -84647 162129 350450 37614 4017 29948 -218726 -72825 -279188 62
1032F2J61890K1007L25794k75900k53049K02153K08783k36728j12168N099m6649
$$ 62 161952 182959 508753 232853 -20196 181957 390740 154012 41844 46943 294
1021B94j60610j8789J01069K65434n07265J4485K64497k2325R1533R1494J44488
$$ 294 -160316 -179105 -78036 187398 -319867 -305382 -40885 -63210 28323 119817 264305
$$ [...]
##END NTUPLES=NMR SPECTRUM
##END=
