##TITLE=1H_EC-3333(IV-3)
 200.13MHz, CDCl3,
 8 sc
 
 21.1.2025
##JCAMPDX= 6.0         $$ Bruker NMR JCAMP-DX V2.0
##DATA TYPE= NMR SPECTRUM
##DATA CLASS= NTUPLES
##ORIGIN= UXNMR, Bruker Analytische Messtechnik GmbH
##OWNER= pz
$$ XWIN-NMR		Version 3.5
$$ Tue Jan 21 14:26:39 2025 Russian Standard Time (UT+4h)  she@DPX200
##.OBSERVE FREQUENCY= 200.1313
##.OBSERVE NUCLEUS= ^1H
##.ACQUISITION MODE= SIMULTANEOUS
##.ACQUISITION SCHEME= undefined
##.AVERAGES= 8
##.DIGITISER RES= 18
##SPECTROMETER/DATA SYSTEM= spect
##.PULSE SEQUENCE= zg30
##.SOLVENT NAME= D2O
##.SHIFT REFERENCE= (INTERNAL, D2O, 0, 15.4836)
##AUDIT TRAIL= $$ (NUMBER, WHEN, WHO, WHERE, WHAT)
$$ ##TITLE= Audit trail, XWIN-NMR		Version 3.5
$$ ##JCAMPDX= 5.01
$$ ##ORIGIN= Bruker BioSpin GmbH
$$ ##OWNER= she
$$ F:/spectra/data/she/nmr/H-C/1/pdata/1/auditp.txt
$$ ##AUDIT TRAIL=  $$ (NUMBER, WHEN, WHO, WHERE, WHAT)
(   1,<2025-01-21 14:24:09.70 +0400>,<she>,<DPX200>,
      <created by zg, POWCHK disabled, PULCHK disabled
       configuration hash MD5:
       00 E9 B6 7A A2 85 ED C7 34 08 36 98 17 FE 4E 26
       data hash MD5: 16K
       9E AE 66 04 06 FC 21 F0 80 3D 12 E1 EF 6E 1F 96>)
(   2,<2025-01-21 14:24:19.85 +0400>,<she>,<DPX200>,
      <Start of raw data processing
       efp BC_mod = 2 LB = 0.25 FT_mod = 6 PKNL = 1 PHC0 = 252.117 PHC1 = 12.9922 SI = 16K 
       data hash MD5: 16K
       52 62 04 43 8D BD 1E 87 49 B4 A3 0A 44 12 DE B7>)
(   3,<2025-01-21 14:24:38.51 +0400>,<she>,<DPX200>,
      <pk PHC0 = 2.467053 PHC1 = -4.2 
       data hash MD5: 16K
       86 CC 2B 54 D6 8F 60 E3 AC 44 AB A3 19 FB 21 13>)
(   4,<2025-01-21 14:24:42.57 +0400>,<she>,<DPX200>,
      <abs ABSG = 5 
       data hash MD5: 16K
       91 2D 73 25 88 54 E4 AF 7D C4 79 4A DA 89 B3 CE>)
(   5,<2025-01-21 14:25:36.00 +0400>,<she>,<DPX200>,
      <abs ABSG = 5 
       data hash MD5: 16K
       3F C4 DF A1 70 7A AB EA 57 DB 11 65 E3 41 7E EE>)
$$ ##END=
$$ 
$$ hash MD5
$$ 35 89 FB 6B 6B 0E 95 A4 77 CA 10 9D BD B4 12 00
##$RELAX= 
##$RELAX= 
##$RELAX= 
##$RELAX= 
##$RELAX= 
##$RELAX= 
$$ Bruker specific parameters
$$ --------------------------
##$DU= <F:/spectra>
##$EXPNO= 1
##$NAME= <H-C>
##$PROCNO= 1
##$TYPE= <nmr>
##$USER= <she>
##$AMP= (0..31)
100 100 100 100 100 100 100 100 100 100 100 100 100 100 100 100 100 100 
100 100 100 100 100 100 100 100 100 100 100 100 100 100 
##$AQSEQ= 0
##$AQ_mod= 1
##$AUNM= <au_zg>
##$AUTOPOS= <>
##$BF1= 200.13
##$BF2= 200.13
##$BF3= 200.13
##$BF4= 200.13
##$BF5= 200.13
##$BF6= 200.13
##$BF7= 200.13
##$BF8= 200.13
##$BYTORDA= 1
##$CFDGTYP= 0
##$CFRGTYP= 5
##$CHEMSTR= <none>
##$CNST= (0..31)
1 1 145 1 1 1 1 1 1 1 1 1 1 1 1 1 1 1 1 1 1 1 1 1 1 1 1 1 1 1 1 1 
##$CPDPRG= <>
##$CPDPRG1= <>
##$CPDPRG2= <>
##$CPDPRG3= <>
##$CPDPRG4= <mlev>
##$CPDPRG5= <mlev>
##$CPDPRG6= <mlev>
##$CPDPRG7= <mlev>
##$CPDPRG8= <mlev>
##$CPDPRGB= <>
##$CPDPRGT= <>
##$D= (0..31)
0 0.7 0 0 0 0 0 0 0 0 0 0.03 0 0 0 0 0 0 0 0 0 0 0 0 0 0 0 0 0 0 0 0 
##$DATE= 1737455048
##$DBL= (0..7)
$$ [...]
##$SUBNAM3= <"">
##$SUBNAM4= <"">
##$SUBNAM5= <"">
##$SUBNAM6= <"">
##$SUBNAM7= <"">
##$SUBNAM8= <"">
##$SUBNAM9= <"">
##$SW= 18.0517328524113
##$SWIBOX= (0..15)
0 0 2 0 0 0 0 0 0 0 0 0 0 0 0 0 
##$SW_h= 3612.71676300578
##$TD= 16384
##$TD0= 1
##$TE= 0
##$TE2= 300
##$TE3= 300
##$TEG= 300
##$TL= (0..7)
0 120 120 120 120 120 120 120 
##$TP= (0..7)
150 150 150 150 150 150 150 150 
##$TP07= 0
##$TPNAME0= <>
##$TPNAME1= <>
##$TPNAME2= <>
##$TPNAME3= <>
##$TPNAME4= <>
##$TPNAME5= <>
##$TPNAME6= <>
##$TPNAME7= <>
##$TPOAL= (0..7)
0.5 0.5 0.5 0.5 0.5 0.5 0.5 0.5 
##$TPOFFS= (0..7)
0 0 0 0 0 0 0 0 
##$TUNHIN= 0
##$TUNHOUT= 0
##$TUNXOUT= 0
##$USERA1= <user>
##$USERA2= <user>
##$USERA3= <user>
##$USERA4= <user>
##$USERA5= <user>
##$V9= 5
##$VALIST= <valist>
##$VCLIST= <CCCCCCCCCCCCCCC>
##$VD= 0
##$VDLIST= <DDDDDDDDDDDDDDD>
##$VPLIST= <PPPPPPPPPPPPPPP>
##$VTLIST= <TTTTTTTTTTTTTTT>
##$WBST= 1024
##$WBSW= 4
##$XGAIN= (0..3)
0 0 0 0 
##$XL= 0
##$YL= 0
##$YMAX_a= 263271
##$YMIN_a= -317188
##$ZGOPTNS= <>
##$ZL1= 120
##$ZL2= 120
##$ZL3= 120
##$ZL4= 120
##$ABSF1= 15.42296
##$ABSF2= -2.628887
##$ABSG= 5
##$ABSL= 3
##$ALPHA= 0
##$AQORDER= 0
##$ASSFAC= 0
##$ASSFACI= 0
##$ASSFACX= 0
##$ASSWID= 0
##$AUNMP= <proc_1d>
##$AZFE= 0.1
##$AZFW= 0.1
##$BCFW= 0
##$BC_mod= 2
##$BYTORDP= 0
##$COROFFS= 0
##$CY= -3
##$DATMOD= 1
##$DC= 0
##$DFILT= <>
##$DTYPP= 0
##$F1P= 0
##$F2P= 0
##$FCOR= 1
##$FTSIZE= 16384
##$FT_mod= 6
##$GAMMA= 0
##$GB= 0
##$INTBC= 1
##$INTSCL= 3.241238e-09
##$ISEN= 128
##$LB= 0.25
##$LEV0= 0
##$LPBIN= 0
##$MAXI= 10000
##$MC2= 0
##$MEAN= 0
##$ME_mod= 0
##$MI= 1.114404
##$NCOEF= 0
##$NC_proc= -6
##$NLEV= 6
##$NOISF1= 3.799351
##$NOISF2= 2.8
##$NSP= 0
##$NTH_PI= 0
##$NZP= 0
##$OFFSET= 15.48356
##$PC= 1
##$PHC0= 254.5841
##$PHC1= 8.7922
##$PH_mod= 1
##$PKNL= yes
##$PPARMOD= 0
##$PSCAL= 0
##$PSIGN= 0
##$REVERSE= no
##$SF= 200.130007632864
##$SI= 16384
##$SIGF1= 3
##$SIGF2= 2
##$SINO= 0.751879
##$SIOLD= 32768
##$SREGLST= <19F.Aceton>
##$SSB= 0
##$STSI= 16384
##$STSR= 0
##$SW_p= 3612.71676300578
##$SYMM= 0
##$S_DEV= 0
##$TDeff= 16384
##$TDoff= 0
##$TI= <>
##$TILT= no
##$TM1= 0
##$TM2= 0
##$TOPLEV= 0
##$USERP1= <user>
##$USERP2= <user>
##$USERP3= <user>
##$USERP4= <user>
##$USERP5= <user>
##$WDW= 1
##$XDIM= 16384
##$YMAX_p= 320773564
##$YMIN_p= -339721
$$ End of Bruker specific parameters
$$ ---------------------------------
##NTUPLES= NMR SPECTRUM
##VAR_NAME=  FREQUENCY,     SPECTRUM/REAL,   SPECTRUM/IMAG
##SYMBOL=    X,             R,               I
##VAR_TYPE=  INDEPENDENT,   DEPENDENT,       DEPENDENT
##VAR_FORM=  AFFN,          ASDF,            ASDF
##VAR_DIM=   16384,         16384,           16384
##UNITS=     HZ,            ARBITRARY UNITS, ARBITRARY UNITS
##FACTOR=    0.220516191357247, 1,           1
##FIRST=     3098.7249026249, 0,             0
##LAST=      -513.991860380881, 0,           0
##MIN=       -513.991860380881, -339721,     0
##MAX=       3098.7249026249, 320773564,     0
$$ Real data points
##PAGE= N=1
##DATA TABLE= (X++(R..R)), XYDATA
$$ [...]
10335 -48791 26246 135943 108871 36360 -27492 7012 110864 41286 -27222 -7425 -22799
10324 -22799 -76862 -17789 -14713 28264 -41647 -81967 28755 53654 8996 -133561 -205240
10313 -205240 -203145 -124890 -172781 -36314 -125206 -174256 -128506 -170224 -110397 -108010 -109543 -230001
10301 -230001 -85204 -92659 -97122 -155512 -30209 167664 69593 110385 32869 -132586 -158273
10290 -158273 -129158 -87347 -87473 -145899 -6440 -123873 14546 139171 -28039 -33603 -57855
10279 -57855 -42043 28294 -43122 61320 136361 124051 -32573 -74167 13534 43740 -4173
10268 -4173 -127954 -179766 -92485 -16269 -12348 -33335 -129567 -101397 -99867 -36982 -14502 21301
10256 21301 -43950 -101269 -119156 -63504 62602 90489 14711 56189 -142560 -61467 55086
10245 55086 57296 -23504 -92160 -112618 -40068 -12155 -128150 -115469 -116902 -83624 -115891 -153988
10233 -153988 -138173 -93421 -10268 -3276 -151171 -62434 7968 -110188 -100013 -121637 -95076
10222 -95076 7107 -88596 -61382 86244 92347 68300 12449 72691 128152 150295 141369 -9332
10210 -9332 -43341 -158496 -157253 39435 193241 83523 -38672 -74541 -59406 13125 -72470
10199 -72470 -141390 -123650 -118518 -31179 28138 17878 -60667 -32501 27272 44173 12754 15384
10187 15384 -7232 9372 -11901 -104949 -264141 -200639 -180829 -218166 -36653 46115 -135564
10176 -135564 -225222 -43662 -109687 -69931 -10916 11050 -69253 -18423 -18034 3303 -163879
10165 -163879 -29295 -120850 -62488 -55805 -87721 10571 1670 -25714 53355 93554 -81362
10154 -81362 -11827 -23177 -85333 4901 70955 22655 62244 147607 17852 -88030 -78664
10143 -78664 -65616 51153 -111394 -4779 128393 -10477 -94722 122540 50697 -81219
10133 -81219 -98241 -17544 46523 -41069 -75448 100155 48734 -27793 -73600 -9518 81945
10122 81945 6461 52973 -47551 -43216 49977 44768 57344 54076 -11205 -84083 -75806 -60389
10110 -60389 -76797 -96508 3913 -100916 -156081 -32709 15811 91184 43913 9260 169236
10099 169236 105745 -37190 -86368 -135625 12065 50251 53545 72330 -121493 -93638 -16860
10088 -16860 -3527 58314 30845 9815 -34343 -106659 -26014 43369 95000 7480 -39351 -174669
10076 -174669 -3317 38752 -59734 79219 80327 -142950 -92893 -55309 -114402 62749 80009
10065 80009 -27886 -152866 -240300 -237395 -125435 -127146 -111566 -49489 85745 25821 -58322
10054 -58322 -39697 55282 81526 62087 -83300 -95602 -68680 79958 34796 75781 28643
10043 28643 -7521 -137093 -243362 -84078 5917 70936 25692 -86676 -110890 -104613 -179566
10032 -179566 -248176 -83504 -40778 -14372 -41864 -139389 -100480 -42162 -58182 -100180 -25314
10021 -25314 -10182 -68466 -94823 -218068 -63464 -76791 -193550 -161698 -36494 -15251 -39230
10010 -39230 -126911 -130956 13098 -31405 7154 51665 1871 -119659 -96827 -76211 -122315
9999 -122315 -140495 -101247 -113454 -94603 -42904 -21788 -69577 -38714 11652 148751 127419
9988 127419 -45048 -24990 8859 23058 97430 7514 -33947 -40074 94516 -72947 -191657
9977 -191657 -248190 -75195 53421 57945 -35848 69782 55886 123434 145572 73923 164495
9966 164495 121189 5511 -1132 10047 -18591 -5803 -46585 -79756 -166303 -207036 -195650 -57685
9954 -57685 20521 24855 -160020 -141233 -12305 44724 2015 -87471 -209018 -188292 -43528
9943 -43528 -51645 -161981 -164575 -40907 -15985 -129247 -286343 -220253 -90720 -77535 44084
9932 44084 -84904 -5555 77521 67466 47564 -39494 -45013 -62304 13183 169129 251718 105855
9920 105855 -56321 48488 107525 73477 -94090 -65046 30138 -170045 -89175 34506 -51458
9909 -51458 -56111 -55375 -69020 5208 25191 36173 9470 46516 62384 102173 9055 4097 134661
9896 134661 133518 -22169 -75171 54089 44652 82224 53804 -17457 26769 7840 -99348
9885 -99348 75749 -135074 -188646 -199071 -26057 -63335 -94695 13372 -126752 -48840 -157772
9874 -157772 -88367 58138 103376 15839 -2384 16736 28954 -80315 33573 73224 -13219
9863 -13219 33799 32546 -24456 -5475 -53688 -84731 -97583 -33285 -56563 32273 47292 23417
9851 23417 91708 2297 -127342 -169764 -13896 18810 184221 46306 92140 159380 114688
9840 114688 193864 24032 -35900 -149923 -4020 85064 -45550 -52315 61911 43184 -36808
9829 -36808 1511 57312 79023 -4080 -5071 59830 -38262 -94343 -17130 -69549 -91076 -122628
9817 -122628 -196966 -55760 13701 28731 -32939 -69257 -126213 -152942 -62956 -24062 26590
9806 26590 -58698 -99914 -64227 -43297 -48331 -47936 -83208 78677 45604 -60941 20859 -39908
9794 -39908 -90229 -192472 -135933 28595 47628 -4310 -85151 20403 6815 63217 -10404
9783 -10404 -278 48502 -85281 -81015 -55121 -167799 -163563 -7463 -50701 -125597 -188578 -6904
9771 -6904 55287 -2423 -8314 127021 87565 134 -11885 -43415 -99010 -92219 39231 37093
9759 37093 21599 30567 -3551 46499 -7231 62641 39960 12467 2022 41150 -90445 -154439
9747 -154439 41206 80966 170366 17735 14439 85069 193561 135993 89432 38053 -115882
9736 -115882 -20578 45324 -16210 -64083 2028 93755 138342 97799 81672 146733 77423 -9499
9724 -9499 -100194 -156096 -136166 -146307 -97963 31590 -97192 -20383 -56795 -55860 38192 60797
9712 60797 -50990 -17403 135353 191576 163506 83985 90785 87421 -56535 1616 17677 40486
9700 40486 118 -8933 22644 -7607 74652 32315 110572 761 51926 52722 78868 20973
9688 20973 18938 13474 -63196 -20307 -35180 -107462 -20082 -60536 90258 100159 42292 -54815
9676 -54815 -3568 151272 25565 19330 58292 -6526 12570 10914 6036 -21825 -16713 -8726
9664 -8726 39359 68724 44716 100720 147599 182352 145777 185227 198319 105585 43399 -1470
9652 -1470 -22146 128642 106048 8142 -48588 124218 224435 180495 33020 119709 194066
9641 194066 159022 217867 202941 156660 151533 106333 83762 1961 55235 -4710 684 67330
9629 67330 30930 78530 116588 154217 94138 102254 -73236 -95006 -115166 23816 21330 -5209
9617 -5209 563 -35020 76956 106924 190631 137311 117819 102616 49767 65 -52519 -68765
9605 -68765 -126488 -60544 -25986 -26978 34538 31052 -76051 4396 -136429 -58966 38471 22892
9593 22892 -41711 -23654 85245 52986 -4759 -25642 23537 122123 49930 -17666 75500 120518
9581 120518 164168 100355 106847 62543 111215 72000 47670 30914 22007 -49768 93912 93475
9569 93475 75456 136627 130811 65766 27776 -37223 -26507 15958 1884 10303 149091 79528
9557 79528 36008 28981 -27008 171933 116688 101470 71003 -70129 27680 52807 -73027
9546 -73027 -48221 45769 97820 129241 117229 214332 176525 145264 186243 108577 107572 190340
9534 190340 84389 12239 14226 25671 67386 143652 18536 83716 138297 117310 79032
9523 79032 17810 18808 -12486 -31237 -3755 213743 90159 -68583 -114607 -20056 30985 79632
9511 79632 77105 169096 147612 82096 116716 148742 223354 241526 164291 169086 157417 187662
9499 187662 185506 157996 99830 -25262 48718 80780 89944 124285 157312 114790 -6169 -44333
9487 -44333 6184 38112 63859 110372 141047 95500 -40537 66794 94161 120368 206971
9476 206971 238000 196620 141685 180643 205392 144074 186481 257801 128206 173003 271021
9465 271021 87452 4705 101586 239938 242665 186551 135244 153414 171878 140917 229134
9454 229134 207482 169292 169894 199516 159248 16773 22812 167782 240516 156662 286891 329704
9442 329704 266184 180057 49563 120233 93424 88245 200542 187201 160862 162874 250711 173244
9430 173244 104362 33536 95646 162828 215233 163285 149419 29822 116979 162294 134956
9419 134956 240520 208186 184547 151542 183536 262605 396914 358363 353889 329565 273310
9408 273310 231532 352480 387287 345090 287351 300022 305422 420841 426204 470040 462094 641168
9396 641168 773547 717386 579394 408175 302786 330222 163275 12033 57034 153875
9386 153875 62601 18032 76621 85042 117258 208712 230985 154112 21 23066 143197
9375 143197 180000 82790 65099 116887 102935 94043 139356 3497 -22806 62038 35727 38885
9363 38885 144365 121906 31730 189875 43849 112450 -38003 -69124 952 45738 107540
9352 107540 168946 160108 80939 72452 70482 67067 138159 126218 43850 91292 44959 71778
9340 71778 57808 49647 47314 108058 150158 136510 32401 127818 76183 23488 47112 169443
9328 169443 107098 23916 24845 -6863 71684 124772 112327 22380 37621 158199 109565 30804
9316 30804 104093 73031 2258 -78940 -96447 37378 89690 -1791 51502 34313 113826 188479
9304 188479 80234 143997 215301 83520 64714 29218 158964 133358 -51953 29748 44338
9293 44338 78846 85373 18147 10633 325 118316 115929 79546 51357 209460 100897 48506
9281 48506 51450 86167 216612 319487 353181 210935 151364 164705 171207 198145 54095
9270 54095 -38929 -78006 38657 104565 179073 290335 259085 220098 284948 213275 134955
9259 134955 109856 156082 83271 136567 270620 163562 122711 155710 118494 184438 181477
9248 181477 74352 159148 254501 176814 20258 60344 138413 214477 232981 242140 235484 295836
9236 295836 293555 134698 200060 410049 480275 211287 30192 190224 169986 118432 157191
9225 157191 155351 268087 404154 301492 281242 251284 188293 158796 169384 140748 172224
9214 172224 215626 202144 303227 297513 229892 413773 324829 209165 151565 215147 266547
9203 266547 140427 134812 293694 312403 271627 286181 379478 259370 254183 311786 306176 266544
9191 266544 252116 239010 267752 287462 281662 244323 161459 346968 433847 367155 364401 388542
9179 388542 444766 346358 291903 188580 231485 296002 271096 282031 270702 349137 385847
9168 385847 277976 229650 355311 313674 345177 354406 329553 288796 246349 290315 277442
9157 277442 309582 232168 279714 315818 113399 241400 378882 300033 313676 335824 459476
9146 459476 426071 354010 338051 176747 152947 308498 348827 368187 407009 395448 409303
9135 409303 321238 254778 389949 434928 359160 354211 363794 321242 441476 464740 410091 404239
9123 404239 396211 368701 405862 467840 482620 618941 574536 575644 606632 568036 424873 470771
9111 470771 443333 484159 582926 628621 545466 512875 641472 621948 573445 539131 660500
9100 660500 805465 773438 733903 725595 625514 569152 698447 789979 853884 852119 793505
9089 793505 770901 904216 971549 986573 1021220 840551 707675 744607 771011 679576 605075
9078 605075 755280 836819 814323 762838 928100 964837 872092 713114 684628 803372 842245
9067 842245 782195 805951 807023 909971 908784 981678 1072548 1102046 1122231 1084451 1124123 1102695
9055 1102695 989610 1087756 1106398 1041234 1069271 1069806 1148052 1150132 1160642 1138924 1228549 1192605
9043 1192605 1151058 1243409 1222069 1242832 1273899 1225676 1383346 1370818 1326605 1311239 1416426
9032 1416426 1447332 1372591 1425062 1510027 1576607 1628011 1510025 1549435 1652651 1723378 1873838
9021 1873838 1965273 2013029 2035134 1994689 1938193 2015282 2151238 2287195 2220885 2138043 2326691
9010 2326691 2465346 2569926 2725516 2670571 2689536 2844059 2903102 2943478 3068846 3134806
9000 3134806 3120608 3057458 3268187 3245492 3357233 3467774 3520577 3583979 3509100 3590309 3715917
8989 3715917 3780063 3786148 3912722 3937044 4013872 4106558 4269603 4539838 4728174 4787464 4997081
8978 4997081 5089329 5274472 5531730 5785371 5970340 6000681 6192660 6250157 6336186 6525744
8968 6525744 6620411 6913369 7221651 7419333 7551880 7696402 8056392 8384330 8570497 9047360
8958 9047360 9309382 9589053 9898260 10162371 10329237 10540431 10825550 11240209 11314252 11487273
8948 11487273 11811003 12346300 12806902 13604375 14423823 15267665 16208886 17437977 18510021
8939 18510021 19949376 21752409 23723180 25613954 27950673 30384720 33334976 36863683
8931 36863683 41694671 48227450 57269701 68509222 84258389 104937610 132053319 151936458
8923 151936458 142837069 119069785 94031443 73981676 59607259 48785382 40801146
8916 40801146 34860611 30491701 27101351 24417452 22113820 20651978 19748151 18895898
8908 18895898 18034085 17130666 16470703 16031903 15577606 15247328 14887003 14556611 14347968
8899 14347968 14165148 13899966 13639906 13285610 13056605 13117976 13118286 13103248 13330895 13671811
8889 13671811 13997496 14460178 14979100 15672491 16736469 18077612 19902891 21828989 23696729
8880 23696729 24989673 25304433 24478174 22873789 21133379 19498688 18125033 17104878
8872 17104878 16304622 16017902 15701980 15637428 15934042 16370578 17179892 18420346 19812002
8863 19812002 21517047 23589835 25297835 26140512 26008540 24849394 23078862 21153963
8855 21153963 19518124 18429333 17569572 16899074 16492883 16327125 16289026 16665013 17197221
8846 17197221 18065305 19224450 20907708 23134523 25502972 27967393 29687199 30281904
8838 30281904 29613969 27710420 25327099 23005199 20988069 19618964 18381487 17542535
8830 17542535 16971138 16625678 16858310 17435422 18288670 19488101 21046671 23154055 25477949
8821 25477949 27422602 28457255 28151396 26702896 24273503 21393911 18881727 16930108
8813 16930108 15415632 13965918 12776019 11812020 11226612 10711434 10372688 10092811 9780940
8804 9780940 9720808 9560919 9423483 9370366 9196937 9086709 9069785 8904851 8971910 9030212
8794 9030212 9050553 8945959 8779758 8818005 8992467 9090136 9247805 9670045 9926222 10085528
8784 10085528 10264291 10196860 9997820 9621540 9314376 9166936 9083443 8986847 8960618 9060471
8774 9060471 9080202 9088239 9223813 9488207 9755187 9957372 10514820 11005908 11252953 11502345
8764 11502345 11642449 11616204 11416106 11259113 11214824 11165614 11118553 11180965 11364835 11753438
8754 11753438 12058224 12372827 12823693 13482491 14182129 15057759 16083896 17258848 18448012
8745 18448012 19548740 20541862 21449986 22217317 23299771 24998667 27230520 29719914 31893069
8736 31893069 33250596 33384738 32474551 30963597 29541288 28768658 28763578 29597502 31212436
8727 31212436 33722615 35943026 36938861 36470517 34412118 31222451 27745068 24606230
8719 24606230 22232433 20377033 18967241 17867671 16918912 16367510 15802449 15402259 15117557
8710 15117557 15018985 15093692 15240685 15401758 15703294 16066128 16506582 16874231 17485592 18211409
8700 18211409 18816675 19556292 20883856 22738443 25013051 27493415 29769092 31286633
8692 31286633 31616300 30547502 28771383 26980512 25794447 25316275 25654440 26723484 28380435
8683 28380435 30081000 30986605 30627424 28907790 26217480 23276799 20585485 18084206
8675 18084206 16289721 14787869 13670680 12677007 11906273 11408939 10967731 10589884 10049651
8666 10049651 9767177 9619572 9232432 9053753 8816790 8494671 8318068 8241418 8087507 7932458
8656 7932458 7809934 7710461 7610028 7372101 7338032 7309493 7156011 7043845 6985618 6821193
8646 6821193 6850419 6906613 6808696 6663002 6640479 6657742 6636846 6575156 6524854 6588875 6616066
8635 6616066 6734694 6958606 7037177 7094962 7163163 7231890 7461041 7635231 7906129 7951009
8625 7951009 8130594 8463791 8696831 8947874 9267988 9540462 10018058 10624176 11382670 12253440
8615 12253440 13140836 14533123 16233704 17911814 18973293 18898946 17894368 16730080 15639297
8606 15639297 14945723 14600414 14759499 15371430 16092727 16997231 17833597 17775107 16913948 15731560
8596 15731560 14436808 13276489 12628034 12109777 11857143 11743240 11664360 11765154 11833620
8587 11833620 11959834 12145522 12533179 13037601 13388595 13736616 14035217 14389699 14680094
8578 14680094 15344224 16223160 17427099 18679291 20420655 22889527 25417328 27767547
8570 27767547 29261977 29668831 28649256 26957822 24997281 23545138 22613907 22336196 22731782
8561 22731782 23590967 24661190 25321278 25525731 24838409 23013393 20797936 18797773 17140521
8552 17140521 15647234 14645692 13855877 13233829 12874523 12702483 12658696 12686976 12790367
8543 12790367 13177598 13496815 13669428 13788646 13669810 13519749 13426832 13340684 13623685 14255574
8533 14255574 15091549 16243538 17362242 18579039 19535148 19501003 18556428 17245605 15908085
8524 15908085 14888022 14361078 14134820 13952545 14294145 14975298 15491507 15414941 14832877
8515 14832877 13851681 12590115 11573860 10576719 9979390 9331976 8825822 8445402 8162654
8506 8162654 7929198 7876645 7876734 7829098 7832027 7859433 7766141 7597211 7247815 7017669 6929696
8495 6929696 6665270 6586644 6584902 6416826 6346997 6425488 6414609 6356766 6243516 6096404 5914203
8484 5914203 5641654 5423774 5324215 5237201 5123388 4989671 4806928 4736231 4729690 4635409 4618970
8473 4618970 4731130 4784584 4493424 4254324 4102497 4057438 3834089 3733124 3761272 3759293
8463 3759293 3801347 3815561 3608342 3696403 3754022 3649241 3442176 3394314 3243280 3221663 3381863
8452 3381863 3419314 3421537 3341394 3393882 3540153 3570493 3561601 3478168 3177520 3017239 2973435
8441 2973435 2793914 2576990 2467685 2462799 2492727 2510670 2406592 2405536 2303387 2247058 2123946
8430 2123946 2204062 2220098 2119195 2129892 2074036 2052082 2030010 2035130 1966795 2046749 1973626
8419 1973626 1707867 1735600 1638595 1608205 1732199 1656556 1527794 1348357 1313910 1357909 1353191
8408 1353191 1296541 1500757 1521056 1488290 1545012 1603656 1572915 1656927 1662150 1617459 1541158
8397 1541158 1366028 1394289 1507137 1499092 1329735 1335045 1303601 1274350 1351237 1368246 1350234
8386 1350234 1265865 1260976 1385729 1303694 1137429 1148675 1149964 1079300 1187118 1215487 1141157
8375 1141157 1129856 1126213 1261198 1237442 1245410 1242735 1352354 1346929 1310369 1339940 1262321 1255983
8363 1255983 1275907 1047642 914342 874089 1043159 955293 787880 832055 782938 723624 740350
8352 740350 697964 587012 620540 719841 726270 816891 802144 754792 673070 545375 688589
8341 688589 684345 717252 680993 759538 718765 674269 661486 612592 576399 692987 756702 690574
8329 690574 754638 752730 748143 920769 901415 827713 806945 732336 862168 884728 879717 783339
8317 783339 674943 839131 914205 1005460 918835 714524 804448 637602 656628 609484 561633
8306 561633 573261 578214 675428 654789 455772 502835 538732 457613 473581 555308 566859 524509
8294 524509 587405 626651 661621 528860 476221 498540 503892 372215 381217 404493 549112
8283 549112 637321 588598 519530 676013 651439 691581 791559 666534 637655 625898 566140
8272 566140 625836 734761 682611 553012 496349 452886 540982 609946 651710 696208 557260
8261 557260 537301 570498 549854 494658 586007 603231 629947 586511 735041 873796 876640
8250 876640 913177 904731 1057279 1126879 1114472 1091070 1054408 1028785 956135 1020013 1054801 1038830
8238 1038830 1184281 1132948 1081405 1135412 1006359 830531 790252 946488 972367 890888 817994
8227 817994 735595 725065 648996 669508 799273 759151 730825 696520 743534 761564 638615
8216 638615 666257 677031 547194 554953 584534 629414 621647 732559 856763 850597 1004243
8205 1004243 1005363 1008288 1081714 1028992 1087031 1158706 1046963 976636 879072 976427 842119
8194 842119 865216 1016849 1254772 1127116 1027490 1046437 913196 861317 721745 778075 761424
8183 761424 576412 570893 578251 522194 412048 416979 463405 369191 451769 442717 360563 291775
8171 291775 313352 291445 254910 355520 461643 417669 491962 322195 312378 463925 374489
8160 374489 380104 561913 610518 624170 433658 258811 311737 454974 630405 597375 516448
8149 516448 417195 469830 583263 526028 438770 439301 388103 261057 234140 188324 220958 167129
8137 167129 108012 199996 209888 218822 264213 116681 5021 74844 40865 39898 -49909 -5079
8125 -5079 19616 74018 188452 124459 107771 117467 147842 157381 100056 39212 -10602 114723
8113 114723 153556 191899 105278 5788 139950 53753 34879 -63617 -106357 40988 128557
8102 128557 84513 53772 79686 55499 83769 143463 65431 94533 87024 27992 -89022 -138466
8090 -138466 -25092 -11314 -24862 -71295 -18206 12326 69610 95704 58914 -53944 -110797
8079 -110797 -15279 63721 81283 106159 66025 20855 15304 -132856 -75501 -85650 -130322 25934
8067 25934 94104 20104 -58035 -2797 110102 77511 -2977 -33983 -84232 -87335 -54540 -123935
8055 -123935 -61917 -26379 -121702 -122258 -76662 -8683 -64601 -127793 19120 -70345 -102742 -124589
8043 -124589 -105216 26534 -90368 -186623 -126767 -62060 -137061 -105835 10117 -539 -119340
8032 -119340 -195730 -150469 61610 97249 48126 -67092 -168185 -116481 23883 55034 135312
8021 135312 138691 127478 125776 -8555 -21486 97820 41671 12914 84363 55917 -34109 -117539
8009 -117539 -59955 -115251 -148964 -89832 -67845 62489 93532 22233 74603 66677 22996 -48628
7997 -48628 -58009 92987 147090 33561 -111295 51785 77466 -79445 -20948 36983 7599
7986 7599 10298 -94406 -146615 -103173 -52980 -33641 9396 137116 81044 20509 3256 -102643
7974 -102643 -56168 -91660 14408 84028 30213 5631 28535 37212 -668 -27359 85083
7963 85083 74967 -98592 11790 -27117 -95589 -44127 -55385 -76910 -90195 -41435 -12385
7952 -12385 -32642 -10864 -26300 -99211 -44621 19498 36610 8008 18145 -20838 -197593 -174828
7940 -174828 -128026 -111345 -121754 -110135 -157921 -66697 -72366 922 922 -6692 -85772 -100174 -53091
7927 -53091 -133926 -24707 -50394 -20380 -31114 -114833 2936 109519 42975 -106077 -72442
7916 -72442 -123740 -42929 -36065 -111723 -97448 -82453 -48145 -15675 -96088 -104675 -96999 -77592
7904 -77592 25849 -78112 -113065 -55915 -122223 -99939 -83449 -94143 -84847 -103024 -51894 -68103
7892 -68103 -39818 -51331 -124965 -106627 -176370 -217941 -220155 -201405 -81262 -124071 -88733 -225221
7880 -225221 -260044 -153893 -122405 -52582 -126961 -110442 -18754 -62826 -12918 -34417 -95285
7869 -95285 -95458 -33764 -97492 -213466 -260588 -228641 -190218 -172801 -153464 -103684 27026 -56788
7857 -56788 -6944 13080 9604 -21401 15466 -2173 -20242 54985 -22591 -103155 54389 2430
7845 2430 -9043 57384 77617 52826 28192 51461 8715 -69684 -115941 -57728 -34476 -41149
7833 -41149 -77157 24088 -18434 -57684 -190034 -164075 -54687 69563 13965 -3345 -71513
7822 -71513 -157134 -151216 -129385 -172008 -155941 -229381 -154909 -137625 -158154 -272021 -39455 -7562
7810 -7562 -39100 -66393 -212183 -190412 -141556 24460 10606 -37814 -87621 74667 -18845
7799 -18845 -183323 -160707 -66530 66739 68493 -58474 -80974 -124091 -31062 153401 61787
7788 61787 -125129 -18600 39909 39450 1766 -23408 -115296 -49465 -132740 -65854 -92624 -130201
7776 -130201 -16807 -173470 -171068 -65796 -141715 -109690 -65677 -66650 -94272 -88875 -13857 14395
7764 14395 -41460 -89624 -71528 -56842 -102230 -56670 39692 -30169 -40702 -41248 -120461 -147740
7752 -147740 -142155 -119794 -92076 551 120828 4177 -54586 -120004 -64896 21691 88279
7741 88279 84987 41289 -20820 -73336 -3081 -15222 365 48180 -2594 -32056 -64166 -100969
7729 -100969 -11839 -65079 -1269 80749 76307 -717 55777 110825 162751 -77072 -45199 147037
7717 147037 112718 227322 197407 184827 164547 57888 78138 176596 203622 277015 304262
7706 304262 295195 92205 64675 198436 170324 91613 124892 132211 85880 93429 22094 78222
7694 78222 -17027 -86975 17303 133342 273680 339368 294788 222154 104238 -19399 38565
7683 38565 -65344 37158 36387 -42305 -42947 26063 12195 -101650 -141516 -7062 135345 201954
7671 201954 216095 173456 143361 164325 94623 25366 6565 80143 176406 166780 12664 136570
7659 136570 175539 209348 251119 123602 124872 129466 106728 94168 60721 -8499 13291 27580
7647 27580 54124 48798 55245 208686 252587 124025 205516 220147 85483 -31603 119891
7636 119891 127388 74663 139697 69795 85344 186821 131437 189680 294574 310625 259671
7625 259671 302988 320172 286847 370615 402858 230084 174487 155985 70864 94483 133696
7614 133696 164607 105400 -18826 22380 2077 106765 30852 65532 95973 107384 272824
7603 272824 78496 37055 82987 73696 45568 24836 1873 197540 185443 83776 103305
7592 103305 105065 90706 141931 202353 35607 62048 -54415 -123998 -39085 25822 96851
7581 96851 63843 34030 -85013 -138622 -54315 20374 -81484 -51031 -24520 -30807 105617
7570 105617 173983 154868 110371 113825 68435 51559 116094 147051 88058 57193 36293 -10314
7558 -10314 18001 -11447 42687 93487 102958 38347 -15598 65684 75731 94376 79941 76108
7546 76108 66534 109084 -34412 -77237 -40923 126469 143992 170897 74597 47965 152214
7535 152214 96712 130820 -8820 53234 390 76143 114285 197257 149120 131048 176128
7524 176128 229145 261389 94490 92357 256255 312747 190314 156335 149751 129470 169093
7513 169093 124219 137616 139332 96945 74323 43517 54308 -23972 22858 170125 214327 180731
7501 180731 209192 184351 190575 201507 123913 109354 17544 117648 247308 230388 94394
7490 94394 223256 127209 191262 308030 250328 301308 229938 121011 107773 191887 158016
7479 158016 238679 249336 366419 409991 351276 367729 381109 284575 243290 208214 284329
7468 284329 395333 292768 254481 287835 139191 171407 223501 428452 379078 340609 404870
7457 404870 267991 237859 320543 374971 426239 507622 455422 454316 422535 440362 497035 418315
7445 418315 552287 731280 784348 730973 718417 774923 768785 860690 844501 720202 797937
7434 797937 920685 885867 863208 797887 757667 769064 803418 733905 645465 554405 553550 647301
7422 647301 654518 516868 635565 714581 691178 708703 695282 735900 736000 585193 575736 643446
7410 643446 624944 725016 695527 522720 463037 451362 544497 579257 512246 658728 716850
7399 716850 838617 743365 771904 840352 646388 658055 704961 736455 741785 796172 886243
7388 886243 1006655 974427 870698 873268 860203 904011 829610 908001 982538 878285 853688
7377 853688 733949 751710 892808 754190 581501 609048 674072 652192 573267 593170 747213
7366 747213 757094 696838 647447 586215 593420 730359 766009 645657 755267 809998 843901
7355 843901 801485 739618 706345 770973 712864 561310 538583 676971 817068 642936 520739
7344 520739 600222 632311 661670 749369 662773 553717 628812 772116 830130 571403 605085
7333 605085 787812 759463 634772 544089 551149 527502 605989 622717 640188 562314 567119 672408
7321 672408 789746 745955 724489 763091 632201 555009 657864 651393 681021 753148 679441
7310 679441 599039 632020 731167 817038 788427 742404 766171 797915 849497 782879 757600 824502
7298 824502 838812 854183 747586 763928 923450 877727 889078 828170 660506 729333 999873
7287 999873 1043218 1034437 1108435 1067189 957828 925773 944073 1046698 1163323 1188541 1325570
7276 1325570 1334988 1348342 1366911 1360544 1429109 1348535 1261880 1137174 1243280 1220058 1072513
7265 1072513 983502 1035684 1089944 872085 832015 986689 910749 948277 1023140 895628 829484
7254 829484 804804 833667 707430 688113 720025 796491 889672 976581 991233 949822 1028221
7243 1028221 954217 987933 1062664 950803 942741 965553 984298 993520 1010693 1085916 1244626
7232 1244626 1230963 1147191 1219326 1366016 1468109 1483146 1583329 1631551 1622684 1738114 1797295
7221 1797295 1884442 1929535 2088900 2018835 2012471 2143211 2093126 1985898 1886373 1868691 1855988
7210 1855988 1828174 1713869 1838111 1645137 1605645 1557693 1503410 1685334 1676761 1694320 1703523
7199 1703523 1811261 1872444 1998795 2030563 1984442 1950030 1840921 1761599 1719585 1731146 1689303
7188 1689303 1646635 1571179 1454696 1417688 1474282 1430282 1414575 1375738 1430512 1455765 1383722
7177 1383722 1358376 1497058 1675402 1669768 1702377 1691105 1852147 1972137 2213549 2418891
7167 2418891 2542024 2814508 3122240 3246064 3098151 2914582 2761078 2520660 2301294 2080778
7157 2080778 1863919 1618183 1548531 1433223 1241957 1090123 1115605 1134697 1023562 1033733
7147 1033733 945149 977555 903443 862635 813930 616580 650804 674392 737930 708999 545220
7136 545220 607359 541355 554968 579029 555697 529541 547797 483218 445687 409217 409643 444186
7124 444186 524657 531293 478966 453693 468693 470087 517908 526527 455185 333818 377363 384060
7112 384060 477203 465688 326148 441389 551643 543220 388947 365290 381762 308140 332699
7101 332699 349149 323207 314503 303714 280367 230526 259924 396811 350396 158424 149250 287362
7089 287362 358813 214376 210779 207754 249604 165329 214427 233920 149574 262996 313883 300499
7077 300499 208377 130998 158204 154760 206054 115105 2346 43687 -47592 -6101 140072
7066 140072 77831 22183 11463 121570 238037 213670 73574 88098 27876 -23842 -7337
7055 -7337 54301 3690 58280 151150 54404 6108 -10424 114738 132873 -4393 109761
7044 109761 95137 36514 44411 -46303 107826 93196 17745 92707 88235 98423 -35065 -98497
7032 -98497 46056 117478 77226 40889 67098 75397 169478 156948 108428 153303 193347 166245
7020 166245 100213 44198 -54001 7337 170621 218986 137416 55883 80020 135958 271523
7009 271523 302026 267717 207386 158621 -17023 100819 91597 138589 109373 -17139 27773
6998 27773 55084 -2808 -54614 -15176 50856 80029 48388 50151 14591 -54522 -28337 95101
6986 95101 146179 131287 37349 -33063 9255 61367 128940 53960 -1551 122040 77939 1963
6974 1963 -71781 -76326 6863 50153 42969 8489 -91039 -142417 -10046 86344 59049 52338
6962 52338 79219 206293 168856 138132 77905 101996 71120 57191 70295 170249 98762 25895
6950 25895 144597 115905 53972 781 -192414 -175458 -62807 48585 99960 101746 27775
6939 27775 29608 -34178 -93432 -27011 -41018 -82989 -68134 -28705 -34767 23911 -24307 -42108
6927 -42108 -120958 892 1294 -125042 66836 92265 63925 96023 90547 199312 226544 208453
6915 208453 207678 236436 239393 244830 149129 89786 129473 47914 -88057 -15854 13250 62779
6903 62779 116363 138820 -15063 -83324 -44057 613 47528 69945 82744 -3290 -101638 -15015
6891 -15015 28858 53649 147029 148693 121046 102303 20637 -42049 -38880 36798 20464 -30751
6879 -30751 -76625 108608 158189 136469 25547 -18370 -20832 -65337 -63754 26560 21468 -114713
6867 -114713 -106461 -107087 -167817 -105728 29458 6044 108494 59658 5206 93357 63488 -831
6855 -831 -97667 58477 162707 72767 -71690 -66512 104414 77682 -103274 -161130 -170336 -170778
6843 -170778 -63083 -89108 -3946 -79631 66775 19705 -51931 47873 116348 -53367 -41878
6832 -41878 -10838 108309 57053 59109 -56394 -28381 -3311 62126 187849 13881 63984
6821 63984 138720 156253 122662 99938 78901 23589 141065 77584 -34084 128781 129282 57561
6809 57561 164718 81805 -25329 28447 22375 -18802 115116 32850 -109864 17122 30483
6798 30483 58129 104698 221447 150800 178741 27254 -8650 -8610 -5980 5369 75386 21739
6786 21739 35322 185152 147983 194229 104957 40236 140796 18639 40103 71180 17401
6775 17401 49492 124740 115022 156038 88035 38103 -1819 -47967 -72976 13645 105167 158488
6763 158488 107479 -39352 75043 66932 129243 44952 -32709 98050 114074 42540 55460
6752 55460 41739 48114 106535 59695 -41163 -82737 -8415 48171 -13389 20975 193541 195462
6740 195462 189304 200915 238834 261424 142070 -5166 -104135 -38986 -36544 30392 22870 -6863
6728 -6863 -37567 38007 105501 88605 147107 87135 70373 63532 88914 152539 239619 199481
6716 199481 113451 185717 165317 187632 236040 169749 192892 36471 -52953 -53912 -51678 -57168
6704 -57168 48427 123036 124305 116643 118712 143304 43135 174770 139317 56254 48136 112717
6692 112717 21245 85663 84615 32627 93212 -14477 13692 97305 198079 154181 154581 116282
6680 116282 79119 7743 26326 1805 82980 10785 66384 74775 70410 157009 137317 177358
6668 177358 212482 307223 266707 124796 172320 213424 252976 229895 59896 30487 107542
6657 107542 117002 91214 13131 -7789 152479 212889 264537 239788 216742 278642 347069 237928
6645 237928 249571 254449 326801 280163 174449 194643 265138 280039 228366 359281 283424
6634 283424 244220 238046 105804 179065 188444 200016 214966 200218 276075 199624 114395 306863
6622 306863 205647 169156 114208 160759 274171 135116 68575 116091 337816 302315 236100
6611 236100 202096 299997 250685 130938 68677 53623 268451 195671 164720 249562 319365
6600 319365 308442 279702 421418 471826 363902 289104 291770 217167 296478 343788 366029
6589 366029 313777 286195 415982 401408 300351 201412 257416 331466 249332 352010 376168
6578 376168 378184 411361 463944 467317 274214 263490 267230 443841 556282 694919 611223
6567 611223 410034 380977 336993 372978 562034 404841 521225 523489 510699 573328 604551
6556 604551 704562 670304 654389 627580 688548 689335 682336 722552 681498 674240 639353 694316
6544 694316 665080 576277 798615 782616 844605 933796 929548 983591 1097762 1162833 1255795
6533 1255795 1332352 1274894 1209425 1241944 1231002 1171776 1066513 1123971 1055527 1135314 1154678
6522 1154678 1135486 1021826 960438 1018189 985566 928554 906450 897865 860639 955786 927684
6511 927684 807997 867326 851728 877138 870708 861312 781963 775864 782655 765649 786093 827402
6499 827402 878462 800673 718537 741230 735969 775404 744649 763426 721577 720558 745156 719222
6487 719222 791398 699689 668306 612782 719001 729109 856218 861473 848852 840733 689101
6476 689101 735370 764235 754960 676828 592784 610602 697058 754272 805780 641451 624791 661329
6464 661329 750615 714513 713423 713751 744393 827213 716032 700693 654113 659615 658137 732302
6452 732302 802531 834928 828798 825367 839513 905819 869227 791090 783989 798707 874168 919447
6440 919447 895245 847520 825880 827661 817734 930554 976457 924320 874173 835771 830822 896895
6428 896895 959533 959186 827719 851151 1006074 1102877 1025045 975156 1022701 1074683 1171819 1181822
6416 1181822 1112580 1099334 1128188 1157360 961022 964798 882369 778746 868511 854524 894071
6405 894071 966778 969172 921810 921051 847175 794661 922192 959214 981104 889675 1035148 1123661
6393 1123661 953384 963602 972599 1010893 993563 1027596 979556 909954 1014952 911993 1008282
6382 1008282 990419 943878 883752 893335 1059302 961032 1026065 1124795 1151434 1260435 1226966
6371 1226966 1073280 970385 1032317 1033224 1198441 1412005 1315327 1381377 1555660 1600692 1459739
6360 1459739 1466932 1455452 1470374 1506971 1605530 1619468 1578527 1440815 1380316 1477932 1477034 1356235
6348 1356235 1347636 1424276 1401629 1411684 1539934 1421483 1561596 1516822 1608099 1721121 1702077
6337 1702077 1644058 1615762 1537950 1572900 1583040 1547142 1617320 1695581 1834565 1725948 1709399
6326 1709399 1719006 1734984 1612428 1675876 1685976 1755240 1823618 1923099 1947188 1964690 1963938 1926458
6314 1926458 1900681 1997385 2107515 2017901 2020816 2009962 1961166 2050215 2160840 2285708 2297002
6303 2297002 2290368 2396746 2402692 2431000 2484880 2435744 2555833 2685595 2759683 2736606 2710966
6292 2710966 2735601 2713077 2798402 2876190 3021511 3079336 3155998 3144982 3070244 3090081 3098695
6281 3098695 3334006 3398481 3294325 3373971 3515128 3517850 3558169 3773131 3888018 4035105
6271 4035105 4125551 4111642 4165415 4324744 4313008 4329263 4445955 4572494 4631905 4695867 4577702
6260 4577702 4614783 4725289 4734113 4783079 4886454 5012422 5234079 5418794 5379158 5473135 5590296
6249 5590296 5850602 5827869 5832443 6120596 6452857 6617385 6529788 6569752 6682586 6751591 6816123
6238 6816123 7021512 7154436 7281097 7302644 7331661 7529677 7573691 7649395 7908434 8122499
6228 8122499 8263745 8383416 8602824 8722722 8839995 9137834 9493472 9714300 9813285 10029346
6218 10029346 10366233 10718840 10968455 11129553 11417240 11828778 12065148 12391270 12792233
6209 12792233 12873978 13287051 13625797 14024064 14704028 15183213 15760030 16489471 17117165 17697098
6199 17697098 18383505 19255532 20157080 21188654 22412597 23472861 24622085 26168553 28286166
6190 28286166 30743474 33602907 37026411 41244949 45983041 51019211 54585060 55195858
6182 55195858 53329411 50621871 48083497 46602176 45935740 46081479 47370272 49606125
6174 49606125 52662098 56445140 60104855 62345001 63532158 64613479 66688885 70191100
6166 70191100 74774245 79752559 83563001 85710749 85910784 84896413 83229473 81312846
6158 81312846 79554297 78122968 77134299 75440069 72318158 68721438 65631071 63748952
6150 63748952 63344093 64207948 66202337 69510610 74137925 79267520 83449868 85115174
6142 85115174 84418330 82796228 82131694 82828155 84980271 87661764 89590721 89190080 85899395
6133 85899395 79935447 72898376 65919873 59597268 54245944 50085970 46775909 44174770
6125 44174770 42193975 40637164 39405280 38523371 37949037 37716312 38028060 38498318 39515182
6116 39515182 40944947 42874528 45262978 47958985 50444085 52005946 51735304 49719574
6108 49719574 46429396 42521714 38693469 35397217 32410684 29852236 27717699 25953738
6100 25953738 24354148 23101725 21902149 20834857 19888457 18888893 18126934 17267938 16678721
6091 16678721 16025505 15316343 14808285 14339088 13864991 13554178 13183790 12859687 12533584
6082 12533584 12113928 12013889 11892089 11642759 11339639 10914875 10718324 10574079 10441861
6073 10441861 10214589 10046014 9778599 9457009 9227198 9060440 8888922 8663860 8375800
6064 8375800 8385578 8202358 8059178 7998426 7967316 7882890 7777287 7600570 7529034 7409406 7260002
6053 7260002 7261798 7295240 7137913 7070784 7016886 6881926 6903121 6875884 6872413 6870223 6892819 7044827
6041 7044827 7166867 7160268 7307211 7391886 7597484 7679962 7879896 8152550 8360470 8561005
6031 8561005 8842861 9021124 9359250 9560603 9627755 9608620 9433488 9195605 8983188 8694762
6021 8694762 8513368 8353961 8072837 7967320 7963801 8002894 7975542 8002590 8162467 8294800
6011 8294800 8579401 8887203 9336284 9693923 10082007 10738336 11438647 12263359 13133265 13689527
6001 13689527 13801359 13637612 13217817 12505596 11572260 10747014 9902427 9237755 8625773
5992 8625773 8187198 7971577 7776900 7618223 7370451 7219130 7070117 7160299 7139682 7157450
5982 7157450 7272458 7475750 7722906 7885172 8122618 8497931 8790860 8906420 8813676 8381818
5972 8381818 7945630 7422852 6882256 6521931 6174383 5917774 5609472 5283692 4961801 4773395
5962 4773395 4681405 4478590 4306847 4209316 4185620 3993381 3740982 3674006 3723633 3473218
5952 3473218 3477310 3516485 3512242 3442725 3274218 3167677 3119935 3099345 3155590 3076864 2972761
5941 2972761 2823299 2627918 2643263 2681267 2665724 2699874 2612888 2601249 2591251 2542040 2520382
5930 2520382 2615107 2665990 2605152 2505612 2440420 2463305 2507908 2444962 2334059 2435074 2413782
5919 2413782 2422846 2426625 2597674 2579311 2531343 2594381 2696051 2616939 2671904 2694211 2668937
5908 2668937 2708038 2760750 2807466 2785189 2753497 2729486 2696783 2630191 2681336 2808866 2899266
5897 2899266 3110258 3031374 2879674 3032145 3132089 3147429 3134069 3117713 3095712 3159030 3098478
5886 3098478 3025779 3083786 3072662 2974001 3051081 3132093 3032593 2967999 3034834 2990194 2994467 3008890
5874 3008890 3069245 3158805 3126459 3229214 3255598 3289920 3339904 3333322 3525306 3507867 3475268
5863 3475268 3410439 3401553 3304629 3375224 3519732 3617372 3704128 3746344 3733453 3785633 3953617
5852 3953617 4074811 4028746 4148415 4221888 4109878 4011967 4000193 4017626 3965014 4086000 4210448
5841 4210448 4163651 4084133 4204480 4261584 4306268 4098312 4139507 4341693 4313147 4276134 4479814
5830 4479814 4483058 4565110 4675217 4747158 4800234 4842853 5004434 5045048 5164761 5046029 5023628
5819 5023628 5145745 5230145 5218961 5251601 5159538 5267638 5319570 5515002 5571677 5599566 5744387
5808 5744387 5656168 5748300 5853217 5947011 6089939 6209242 6344577 6471529 6558472 6676180
5798 6676180 6746447 6817482 6898149 7034133 6966130 7102077 7232450 7538537 7671334 7747525
5788 7747525 7745094 7777403 7954607 8113716 8282272 8416015 8770019 9032522 9103688 9265092
5778 9265092 9523247 9687593 9871949 10122019 10308168 10576975 10666488 10752948 11091727 11413155
5768 11413155 11712020 11867539 12227513 12592896 12816628 13186127 13534308 13978545 14295925
5759 14295925 14726995 15314985 15884060 16651470 17331508 18221955 19105495 20153039 21376877
5750 21376877 22746201 24386581 26188556 28165048 30671527 33530635 36947702 40750975
5742 40750975 44593287 47676899 49051795 48342332 46088578 43038501 40036257 37373188
5734 37373188 35335949 33836285 32744993 32240787 32148040 32440966 32961041 33851634 35000014
5725 35000014 36493030 38486788 40863458 44048220 48133379 53054615 59276340 66082280
5717 66082280 72711474 77260338 78241868 75225650 69440328 62881682 56591657 51019106
5709 51019106 46788523 43468287 40586758 38071575 36165098 34688672 33659120 32872062
5701 32872062 32458109 32459551 32952655 33598942 34429392 35874812 37545453 39665876 41873391
5692 41873391 43927163 45271493 45265302 43861604 41175739 38013954 35044008 32539945 30532600
5683 30532600 28769066 27539480 26594689 26120106 25869551 26060914 26428293 26698535 26316414
5674 26316414 25250153 24234534 23091784 22231463 21531919 20833911 20198832 19739887 19236871
5665 19236871 18844936 18620376 18442494 18383760 18208981 18223274 18253144 18370000 18448089 18575957
5655 18575957 18751368 18993069 19251992 19529420 20050075 20586026 21224997 21911064 22881100
5646 22881100 23971663 25243199 26040386 25678693 24933501 24113254 23466139 23068619 22795207
5637 22795207 22860323 22930912 23100597 23373144 23705498 24118648 24650990 25209399 26000259 26556282
5627 26556282 27164295 27966371 28761937 29522142 30338183 31317896 32218734 33313963 34417983
5618 34417983 35516177 36672504 37876249 39229197 40780281 42671188 44445834 46064099
5610 46064099 47704353 49673367 52319513 55219921 58679319 62693593 67509441 72750319
5602 72750319 78735256 85403822 92343866 99318222 106280717 113265624 120541810 128077277
5594 128077277 135583160 142447669 148052657 151791282 154138392 154541382 151775088 145777079
5586 145777079 137992362 129831865 121969132 114749266 108344218 102940795 98760658 96082325
5578 96082325 94390710 92329878 89160480 85392234 82081269 79871860 79190105 79990848
5570 79990848 81783609 83417706 83598038 81717758 78254496 74686387 71867311 70308481
5562 70308481 69550726 69270077 67806174 65025055 61769393 58977280 57115069 56192798 56079461
5553 56079461 56815348 58428005 60839891 63805920 66220446 66386505 64077822 59851208
5545 59851208 55095035 50682807 46685915 43101295 40093552 37645318 35480915 33710692
5537 33710692 32149462 30776875 29660371 28686023 27905775 27222778 26632563 26146129 25793571
5528 25793571 25483752 25253211 25137533 24977882 24942445 25168503 25579399 26088883 26486176 26563846
5518 26563846 26179983 25302802 24180397 22882843 21678349 20592111 19478227 18506030 17707025
5509 17707025 16904985 16386193 15947241 15595705 15259494 15146179 14911863 14751004 14482015
5500 14482015 14311668 14368875 14310074 14269410 14231502 14212049 14314858 14288212 14085214 13729605
5490 13729605 13188316 12590795 11963098 11478326 11016832 10539405 10208521 9977838 9764641
5481 9764641 9508824 9311289 9121539 8945814 8644583 8567944 8619271 8328695 8137710 8101631
5471 8101631 7952338 7741163 7620434 7423951 7461625 7454824 7378402 7265131 7020968 6905921
5461 6905921 6887567 6851648 6852264 6818587 6838641 6873553 6749308 6648721 6595370 6484464 6394291
5450 6394291 6222619 6189280 6176338 6214810 6198562 6336268 6361208 6417783 6543412 6627891 6739480
5439 6739480 6978192 7234113 7479322 7914899 8339989 8708900 8852987 8965774 9057818 9213768
5429 9213768 9666325 10427322 11608654 12411153 11905545 10716576 9361683 8287758 7347380
5420 7347380 6798054 6352390 5924467 5687419 5502554 5390471 5325315 5248682 5166187 5044800
5410 5044800 5066304 5091804 5023841 5074858 5077918 5162823 5253473 5351368 5285467 5171359 5022667
5399 5022667 4960240 4764367 4774674 4764520 4703059 4604892 4400033 4425692 4558685 4661258 4662193
5388 4662193 4708747 4713841 4714549 4674551 4729392 4801844 4826572 5001764 5075200 5051898 5057835 4787705
5376 4787705 4438897 4196692 4030758 3979119 3846567 3811579 3716890 3574800 3710950 3714200
5366 3714200 3660283 3648578 3666716 3603298 3645752 3499289 3413565 3425583 3326807 3150989 3047205
5355 3047205 3069076 3036233 3077391 2907782 2710220 2627870 2654421 2711838 2723006 2721923 2600956
5344 2600956 2604861 2608172 2618410 2554798 2482553 2524517 2684717 2668130 2594443 2517145 2546131 2660002
5332 2660002 2552691 2515820 2459223 2506686 2491515 2546473 2438545 2347888 2488685 2512152 2423082
5321 2423082 2517695 2518414 2545233 2573973 2458975 2520010 2345521 2299539 2329605 2249716 2183970
5310 2183970 2281742 2272490 2142483 2048048 2206244 2336983 2290363 2297475 2372557 2288214 2215456
5299 2215456 2244609 2213439 2160339 2256601 2379432 2365597 2375622 2309869 2279678 2427746 2545284
5288 2545284 2545658 2523548 2528944 2443002 2305452 2337804 2290214 2263473 2237716 2263325 2229439 2297671
5276 2297671 2258395 2179454 2171003 2208539 2127394 2026311 2105478 2013497 2090888 2052579 1974161
5265 1974161 2050238 1977266 2139206 2136358 2071613 2116240 2146105 2181734 2101894 2057883 2085070
5254 2085070 2106542 2074678 2143415 2129238 2109068 2164755 2139843 2088969 2124288 2162686 2222011
5243 2222011 2323493 2302018 2235679 2133934 2268175 2348176 2455586 2302517 2242437 2141825
5233 2141825 2198080 2234359 2140145 2202997 2287403 2350947 2358792 2317988 2346063 2360148 2317567 2387324
5221 2387324 2325695 2345510 2345325 2369449 2492094 2642618 2662908 2833743 3004390 3189375 3293970
5210 3293970 3233789 3004908 2886185 2730283 2686209 2656469 2639277 2648977 2457943 2318948 2289650
5199 2289650 2335974 2334457 2124820 2160393 2019435 2184506 2296341 2106918 2143329 2099104 2172404
5188 2172404 2179316 2207285 2066239 2018997 2107203 2208981 2194964 2178040 2120843 2236684 2325453
5177 2325453 2307279 2359800 2466326 2411471 2266358 2284406 2327915 2412396 2437016 2291014 2238464
5166 2238464 2223301 2165735 2122250 2147306 2216890 2364793 2261794 2271031 2380597 2351328 2345193
5155 2345193 2301923 2327907 2361025 2446531 2449559 2435767 2371691 2362156 2330303 2412183 2546167 2598368
5143 2598368 2553287 2513715 2620331 2658319 2778040 2853669 2860608 3038774 3093227 3046961 3113834
5132 3113834 2988583 3007935 3082649 3192566 3329908 3300000 3319536 3461313 3605736 3579653
5122 3579653 3628354 3573769 3443125 3620297 3737639 3750778 3981911 4097406 4132282 4153866
5112 4153866 4312491 4365124 4431305 4546498 4691670 4919486 5001665 5059154 5177754 5353363
5102 5353363 5484298 5648557 5989801 6048285 6143297 6324672 6408126 6567551 6497862 6410348
5092 6410348 6251822 6187281 6079912 5933588 5845784 5752198 5844633 5724940 5765970 5732885 5697226
5081 5697226 5839758 5997855 5843977 5660264 5383318 5194159 5140899 5195549 5177652 5078621
5071 5078621 4950550 4982299 4834008 4975635 5148438 5208153 5366634 5513705 5657598 5726594
5061 5726594 5679196 5593804 5686745 5606591 5577889 5504209 5485987 5436859 5350266 5389250 5418287
5050 5418287 5434501 5475166 5576540 5534536 5590399 5673331 5690063 5771432 5797186 5961585 6055107
5039 6055107 6161535 6369132 6495427 6609995 6896271 7057010 6896149 6868016 7012213 6961539
5029 6961539 7029738 7209324 7417269 7527937 7568877 7649855 7817494 7829753 7750044 7770211 7889459
5018 7889459 8059406 8189452 8222797 8593119 8783924 8856877 9051984 9267288 9391437 9588168
5008 9588168 9684635 9924863 10142470 10528145 10846713 11024590 11164443 11448643 11846405 12132014
4998 12132014 12521626 12912904 13187430 13744876 14256547 14731344 15235250 15883997 16430716
4989 16430716 17083387 17655796 18388957 18982186 19604348 20226856 20937668 21435235 22100425
4980 22100425 22778047 23474700 24217372 24713269 25488823 26353671 27204561 28013719 28729073
4971 28729073 29569004 30520502 31230674 31957969 32740251 33378075 34128362 34803665 35381916
4962 35381916 36049694 36788859 37753260 38890294 40283998 41889845 43833455 45893044 48106348
4953 48106348 50298575 52585499 54659829 56769380 58864224 60990119 63292079 65702708
4945 65702708 67866027 69841296 71233478 72219880 73156648 74160507 75418933 77154960
4937 77154960 79074983 81267793 83615083 85996905 88499826 91271918 94155742 96944976
4929 96944976 99570091 101838367 103736629 105129035 106103578 107076841 108264232 109790762
4921 109790762 111960073 114817927 118208860 121553695 124243189 126374572 127535608 127970451
4913 127970451 127562462 126392162 124689166 122847171 121545291 121242545 122387129 125585459
4905 125585459 131501971 141408127 155640080 175007829 200610208 234282494 275483206
4898 275483206 315543796 320773564 288766324 244430384 202008035 168892674 143175070
4891 143175070 123545248 108633127 97222293 87981135 80471997 74059378 69278829 65748280
4883 65748280 63197089 60715820 58753807 57137574 55671626 54408751 53579953 52694220
4875 52694220 51624643 50457670 49027393 47168047 45296251 43190796 41426261 39640791
4867 39640791 38233515 36866122 36030882 35402018 34704334 34222339 33880897 33468984 33066265
4858 33066265 32491284 31760337 31018386 30399643 29864159 29211476 28601728 28308791 28084777
4849 28084777 27908810 27724191 27783414 28056047 28481790 29047656 29829170 30896177 32265159
4840 32265159 33938237 35825859 37764330 39723983 41486647 43253566 44465339 45018886
4832 45018886 45138005 44788141 44106111 43202813 41909186 40450725 39138422 37917836 36693602
4823 36693602 35772056 34996838 34507232 34291768 33611250 32401340 30615022 28592242 26659220
4814 26659220 25016387 23730297 22510108 21476181 20574206 19741915 18948337 18196199 17443878
4805 17443878 16888665 16389119 15973634 15627946 15365532 15148906 14842427 14636081 14449570
4796 14449570 14161636 13757557 13466021 13273547 12885224 12509824 12245709 12120960 11846930
4787 11846930 11440118 11168704 10900652 10848229 10820665 10632815 10454918 10347228 10121702 9912914
4777 9912914 10030362 9930895 9690389 9577267 9339496 9171207 8951097 8814660 8729192 8586457
4767 8586457 8487013 8482526 8350964 8310242 8287511 8196517 8011393 7968156 8073143 8087221 8017514
4756 8017514 7967332 7889008 7767690 7622234 7611780 7513578 7488175 7287862 7244230 7347675 7447350
4745 7447350 7433549 7345014 7345725 7293536 7242077 7297745 7381408 7319399 7388944 7423588 7432560 7533683
4733 7533683 7496991 7615638 7623123 7665894 7783526 8067966 8126922 8166717 8194894 8361756 8453175
4722 8453175 8638902 8798675 8855838 8908950 9114493 9398033 9405160 9504467 9837804 10044562
4712 10044562 10130363 10086208 10083934 10111732 10219200 10316395 10417579 10505846 10682122 10941767 11198053
4701 11198053 11482363 11734243 11983391 12319718 12609342 13015491 13308146 13689943 13800254
4692 13800254 14097187 14513385 14823755 15136550 15532931 15923638 16405000 17005555 17431321
4683 17431321 17902361 18336574 18837568 19409243 20137297 20912729 21644671 22262309 22985079
4674 22985079 23590247 24385190 24990702 25587889 26255121 26931386 27789998 28742441 29787265
4665 29787265 31084194 32551545 34350932 36350662 38521766 40770648 43625931 46880826
4657 46880826 50431500 54308950 58603767 63368146 68631143 74486121 81655683 90389471
4649 90389471 101178486 114789033 131415399 151314789 174680378 199315167 219786676
4642 219786676 227164091 218430023 199279189 177524179 158145374 142773931 130753194
4635 130753194 120359489 110364723 100751085 91601146 83340600 76305038 70257951 65134197
4627 65134197 60766592 57174736 54179302 51556625 49511992 47655404 45944456 44362049
4619 44362049 42736076 41288072 39683745 38194879 36854005 35451868 34255383 33136831
4611 33136831 32207516 31280251 30302858 29207107 28061563 26789145 25417990 24277950 23081593
4602 23081593 21946042 21077202 20315439 19524298 18780532 18084976 17507458 17004575 16422433
4593 16422433 15971047 15471788 14960029 14499855 14210585 13854867 13558370 13333331 13070258
4584 13070258 12895186 12742599 12708331 12444641 12234349 11815330 11374785 10944013 10561254 10195658
4574 10195658 9988603 9532612 9362728 9069569 8733670 8602880 8347998 8172273 8128471 8095722
4564 8095722 7920541 7914234 7797879 7683035 7582141 7342814 7306345 7218656 7102332 7032588
4554 7032588 6893503 6883888 6899332 6962363 6939571 6832893 6763650 6667715 6685135 6727189 6816212
4543 6816212 6764671 6764790 6804657 6868038 6852589 6922090 6969173 6872248 6799109 6716465 6791914 6917096
4531 6917096 6978306 6893850 6854438 6928587 6939646 6947218 6948970 7102259 7096182 7083008 7261488 7284904
4519 7284904 7189192 7204332 7121959 7194414 7220239 7284041 7444675 7419379 7517586 7579728 7493479
4508 7493479 7433658 7392025 7396313 7429584 7357869 7381002 7317187 7397581 7340455 7378443 7620337
4497 7620337 7593503 7710525 7610235 7474693 7511049 7533857 7485671 7475849 7531507 7454828 7489773
4486 7489773 7551559 7405630 7478689 7570504 7452773 7398269 7256504 7254325 7232541 7351019 7280949
4475 7280949 7353808 7539789 7512353 7555137 7535291 7391273 7135940 7041288 7151997 7108869 6980112
4464 6980112 6884941 6931448 6919846 6734741 6721363 6690495 6701763 6676902 6603892 6497988 6405746
4453 6405746 6376312 6331309 6144597 6138496 5961089 5887677 5820304 5632557 5500416 5449686 5425207
4442 5425207 5439196 5371729 5422961 5373577 5271560 5161671 5095443 5134583 4925131 4866054 4823596
4431 4823596 4828542 4803665 4772898 4696397 4759819 4728622 4697165 4713297 4688868 4761729 4787533 4757331
4419 4757331 4753656 4959409 5172599 5068081 5192504 5415353 5535237 5734926 5992635 6368461
4409 6368461 6670297 6504007 6151852 5720368 5199665 4736702 4404801 4044044 3699426 3570862
4399 3570862 3582395 3463701 3465811 3434950 3373603 3337822 3307654 3187675 3333955 3350168 3254984
4388 3254984 3149291 3150780 3267530 3394818 3308034 3202386 3205233 3179558 3107847 3010414 2859176
4377 2859176 2818408 2791464 2688277 2692193 2622436 2507749 2571455 2446937 2475700 2433785 2520331
4366 2520331 2662422 2586238 2585302 2565467 2454938 2484282 2465526 2457493 2464914 2460284 2554136 2570304
4354 2570304 2483359 2584561 2592972 2510221 2595101 2484750 2560616 2366824 2534434 2667019 2713609
4343 2713609 2763383 2981105 2930146 2968239 3159686 3104537 3121150 3059584 2796467 2719379 2676938
4332 2676938 2772883 2478991 2552917 2583733 2381700 2359696 2460306 2376767 2304892 2371007 2279856
4321 2279856 2247205 2193061 2246580 2405705 2368927 2306691 2227896 2130043 2153134 2095751 2163222
4310 2163222 2216930 2241040 2354957 2344536 2328615 2503127 2584239 2573224 2677974 2784507 2812518
4299 2812518 2823140 2769971 2842657 2905200 2984795 3046830 3077865 3074632 3314111 3489720 3516627
4288 3516627 3677347 3656435 3758474 3939706 3921694 3820109 3828753 3781235 3695260 3627513 3446407
4277 3446407 3439085 3535922 3575785 3557697 3492546 3479032 3395407 3181295 3065568 2854830 2758365
4266 2758365 2683293 2662507 2640831 2539818 2276695 2199542 2219165 2199244 2090302 2009265 1990288
4255 1990288 1996671 2055127 1870972 1788462 1791988 1663241 1617568 1576039 1523377 1531214 1484504 1510972
4243 1510972 1570961 1491329 1597054 1500559 1436601 1491246 1404249 1484821 1420115 1449246 1396194
4232 1396194 1388744 1298218 1265936 1329420 1210133 1182119 1209273 1138014 1089211 1040631 1008550
4221 1008550 1021532 1167229 1237253 1149628 1009997 985008 1113919 1186136 1199802 1198209 1151022
4210 1151022 1110334 1128507 1116641 1060039 857177 873084 905409 985984 1147511 1040238 977288
4199 977288 872703 983639 1055727 1191660 1149306 947089 990367 1068112 1174841 1079800 1072080
4188 1072080 1033062 994255 1012875 948860 1010317 1093358 1043926 1086150 1054431 965816 807389
4177 807389 833682 862330 963987 986954 985633 991634 939684 920414 963498 977590 905114 878440
4165 878440 764303 713810 875590 908195 790523 694869 808229 991207 893295 833497 742329
4154 742329 810410 958210 788430 764136 873066 964486 972615 899783 748305 913651 921282
4143 921282 914750 801257 717424 835071 709059 678521 727291 737183 732574 756957 805158 721748
4131 721748 623856 681600 759002 793176 721039 683935 749179 654873 691930 772552 800222 804477
4119 804477 802703 871128 834269 880661 870854 732672 731605 743706 638359 739953 775766 605337
4107 605337 551562 681244 721702 726934 636995 634034 714862 623584 597182 695117 718357 710891
4095 710891 653862 624852 587910 627073 598670 721148 692120 648623 449874 572365 539517
4084 539517 514914 587227 502896 477359 474251 557267 561175 518736 437078 398091 362451 305713
4072 305713 219186 356759 447720 248893 168905 260495 379599 435063 344509 254521 231722
4061 231722 335821 381063 319862 323718 266354 306601 203111 310737 347285 356899 397047
4050 397047 373926 342151 315802 179703 245839 229941 145690 229882 194065 269500 241545
4039 241545 237826 374873 431127 362849 233718 251907 279991 259893 303860 269183 384848
4028 384848 385072 408431 375466 395866 318675 299935 171159 72517 26296 199536 120103 173846
4016 173846 194201 267379 447992 311362 319652 314997 248888 180940 134588 203025 290422 211789
4004 211789 99802 212442 372121 385252 287703 273044 211906 172636 137330 111960 84316
3993 84316 82386 -19940 74644 353827 275058 141043 224630 244936 301751 372673 250773
3982 250773 142594 162479 112100 158254 282569 209986 203927 232885 145152 97018 -45875
3971 -45875 -59568 37811 125152 176056 69794 189932 234774 157651 106707 33940 38167 -47568
3959 -47568 -75745 19557 134287 159556 184739 185664 194178 72349 79135 188510 204883 216085
3947 216085 202232 61888 -8874 74505 6959 98001 183958 62542 20886 8149 33617
3936 33617 52024 2201 -13734 -43673 -64131 -8501 -16321 -52548 -16405 -9955 -13315 -26376
3924 -26376 -8279 -98957 -25849 62013 119202 48218 30520 54405 21096 -99820 -103160 -15750
3912 -15750 6086 -49348 56524 16621 -42430 -59226 -2362 25753 30411 44357 35579 -74897
3900 -74897 2924 -7109 6208 -26999 -49603 -39197 -34703 -103393 -39599 30693 62624 20494
3888 20494 10697 -65199 -87219 56321 54043 -13833 -13256 -6703 40635 83553 -21282 -33704
3876 -33704 -64095 7131 -15947 75376 180094 126514 -34645 137772 123858 23418 -2887
3865 -2887 -105237 -72579 108993 178627 71141 17556 84795 90258 62702 122324 246456
3854 246456 225860 187773 195770 148542 173282 107738 64615 155960 80159 86918 95116 32362
3842 32362 25289 152771 31656 108894 39572 95640 175879 57337 33205 -122552 -26734
3831 -26734 158067 113578 70210 19762 53112 58755 -11734 103671 146016 174619 213987 74373
3819 74373 -40121 46548 36084 96551 36048 -51344 -11423 62569 132882 196979 131364 153049
3807 153049 109817 117369 199320 177768 193678 73473 -40345 -96885 15029 83917 159009
3796 159009 111050 51676 -34155 -34058 -41081 -195483 -10641 121352 922 -84933 -3942 176719
3784 176719 73589 87070 -20252 -82739 65054 51024 27300 160119 222965 195241 198970
3773 198970 244295 246074 265084 240830 274499 224963 107856 66046 606 105194 103574 65226
3761 65226 10227 131814 118336 129396 167531 205267 61226 87367 148912 241135 251565
3750 251565 169892 249054 314824 215106 182888 137197 229206 365913 272898 303384 132020
3739 132020 69696 148637 78851 157758 220803 163994 82196 134450 213781 119565 145801 242403
3727 242403 143453 182289 110562 123620 127773 162293 110815 124878 97795 157947 235972 234704
3715 234704 184096 148649 191456 139358 41754 -53825 225826 266364 352727 445250 388659
3704 388659 155731 145949 159785 127380 185436 211613 100072 119101 201116 217578 151316
3693 151316 182886 191872 179620 160181 163700 195304 112363 42022 70820 60203 122113 163157
3681 163157 79174 146896 189650 171203 83175 -1059 68245 -28057 7318 -28361 66095 193647
3669 193647 139382 157234 50635 3020 121742 110961 63567 170578 109157 72003 77552
3658 77552 88412 63715 109640 60139 148891 10273 -43821 3833 61124 115736 147754 217760
3646 217760 55089 -34175 -120845 -56630 53138 50645 43202 74974 103054 103009 78131 54424
3634 54424 96617 -10192 6532 128400 165025 137339 202281 220089 144275 150160 106155 -94475
3622 -94475 -24874 142947 25635 86324 75397 103384 199777 68869 -134073 -112648 -80741
3611 -80741 -108307 -176043 -96383 75929 177107 212434 144690 218874 180596 250377 269079
3600 269079 277500 272188 69029 194748 325317 249232 203928 152281 160624 162366 151243 77131
3588 77131 101555 208490 338973 270036 173967 288773 316560 317991 154757 132658 173109
3577 173109 323022 256384 276823 397799 396000 415046 397193 380942 252010 256119 228930
3566 228930 189431 260489 284635 377272 421700 363917 353545 438178 502653 455724 327491
3555 327491 399651 484010 476851 452266 458162 389148 289255 336386 301232 453833 507528 613266
3543 613266 671591 553009 593332 547392 493761 534303 617975 631961 689126 541189 515314
3532 515314 605465 580799 595643 615028 704594 708962 661027 710542 787058 828017 844738 764609
3520 764609 801589 790541 855029 725418 732069 906326 940490 942231 979892 1052567 1080299 1177386
3508 1177386 1234456 1237152 1288480 1238839 1254604 1308181 1396595 1456825 1606952 1657047 1725734
3497 1725734 1833008 1841613 1806933 1829822 1815449 1851391 1889044 1884602 2016030 2100672 2105067 2229942
3485 2229942 2407631 2450057 2542446 2627631 2617762 2667156 2790331 2982114 3260682 3460153 3572540
3474 3572540 3599669 3903322 4122362 4351213 4782523 5045163 5321579 5373659 5685057 5972957
3464 5972957 6081196 6258519 6530497 7085177 7497741 8120588 8967086 10138980 11079831
3455 11079831 10870769 9927850 8915349 7906706 7168496 6693529 6317120 5900233 5823680
3446 5823680 5634181 5408575 5235160 5058467 4773806 4639247 4656175 4632693 4617046 4706134
3436 4706134 4758552 4812806 4957392 4997635 5174494 5560768 6130260 6718741 7623472 9124605
3426 9124605 10832722 12964629 14332862 13623033 11625146 9540071 7853548 6546288
3418 6546288 5524071 4799710 4395844 3946914 3606268 3311905 3029480 2807693 2723437 2780975
3408 2780975 2826949 2762178 2637814 2698125 2677434 2678330 2746933 2845222 3098372 3192774 3502171
3397 3502171 3841749 4291111 4869495 5768087 6888467 7344658 6750167 5676303 4712515
3388 4712515 3844861 3154040 2805423 2362731 2078099 1834767 1708413 1510305 1451553 1348025
3378 1348025 1258685 1162763 1161686 1091715 923107 888836 859499 898537 854088 840843 899938
3367 899938 886174 913837 865486 713842 686690 662019 557994 535476 663283 688544 647389
3356 647389 530935 506342 422399 319631 337942 479619 473040 387015 380880 421622 377362
3345 377362 437153 433621 444334 373643 326547 151526 142631 149366 217118 267553 340440 415227
3333 415227 479585 307316 192504 212877 168120 169930 87504 51492 145532 99951 71379
3322 71379 140837 189976 157790 175031 109127 147894 192565 125937 57671 38765 134258 78584
3310 78584 152209 172667 205185 171362 168539 102582 113171 62273 81266 183238 119744 104843
3298 104843 48034 88542 117688 72963 60623 56810 120467 62730 114228 14516 69882 50872
3286 50872 112228 117273 189946 211795 240485 210517 180595 159006 11576 49465 172727 70426
3274 70426 240 77175 59264 126200 194136 231223 194352 148136 7176 11463 93620 129077
3262 129077 64826 36770 -51263 1313 99926 62630 32128 -38670 81021 130514 22726
3251 22726 71856 80649 38741 37486 95525 159552 94732 172426 221162 175518 55916 30421
3239 30421 92616 121946 82186 21915 -11342 46672 106351 91965 57351 56760 50380 102343
3227 102343 83604 61852 142204 131184 77538 77407 100898 119332 169984 129897 190877 -4196
3215 -4196 6445 33599 -54634 -55424 -76013 -79702 -4285 2026 53159 52000 45300 -40259 69154
3202 69154 179667 61733 2293 60672 65369 29481 -57127 -101853 -106395 -13840 -13146 -10522
3190 -10522 -50059 -47226 -115407 -88941 -40779 -93375 53296 40749 92614 47338 2198 26753
3178 26753 -4233 -36098 27983 -935 132816 223742 176464 142804 91546 5184 64566 66484
3166 66484 212235 226973 183694 152659 227016 305415 431336 390157 232474 338353 363559
3155 363559 361963 306260 315371 366298 378546 319428 294567 382930 338567 271514 363255 216762
3143 216762 187166 248772 369024 418691 323415 332495 471486 577556 578093 598043 457988
3132 457988 390463 480959 536158 534992 477683 466359 354837 479540 529853 419570 342470
3121 342470 196976 340905 545399 435926 325623 241947 267892 255916 221843 280222 272935
3110 272935 359138 201678 273297 220091 187699 179522 137986 182221 218796 137212 124954 231120
3098 231120 349481 310917 245065 303657 223853 236714 298824 209379 233756 147432 164460
3087 164460 251672 138750 117914 155483 173491 98741 101463 147669 260627 177239 -8798
3076 -8798 7812 93130 4141 24540 -48368 -99495 -11937 62555 117714 110145 -23219 -148014
3064 -148014 30422 -1152 11159 -22088 -125524 -48098 35136 88692 -74286 6382 32264
3053 32264 6034 -110835 41903 -88345 -126944 -165275 -137042 75833 16848 -65473 72522
3042 72522 12459 12801 45450 -53781 4340 -28791 22360 32066 -22326 9069 23101 22430 -84069
3029 -84069 -145185 -102162 -117536 -157721 -138895 -62848 -144598 -9132 54058 39374 -128678
3018 -128678 -190267 -172144 -60927 -55728 22036 -44382 -185656 -253078 -169923 -38492 51019
3007 51019 68063 43341 -4992 27235 1144 -36771 -123887 -149546 -90500 4348 92153 80445
2995 80445 64115 116556 59569 -106851 -108428 109548 76402 -76841 -84651 -33315 -10352 -57502
2983 -57502 -166565 -128282 -65303 -18263 -99904 -61719 -170367 -196937 -99854 -2598 72719
2972 72719 -47573 12258 54892 75629 -76494 -62485 48052 8510 -121042 -10047 -143837
2961 -143837 -130548 -199976 -211796 -216444 -318629 -208269 -137826 -118948 -100227 -187831 -204678
2950 -204678 -147985 -118783 -164735 -123023 -170458 -73126 2327 21992 21148 6346 -46932 -150915
2938 -150915 -251378 -177361 -278898 -282057 -170260 -195956 -143961 -119397 -12895 30225 -39380
2927 -39380 -48238 -148388 -57204 51629 -22814 -131023 -245390 -261167 -217427 -218503 -217929 -102125
2915 -102125 -152702 -168605 -208631 -289488 -205483 -79400 -70767 -110917 -230430 -152753 -196237
2904 -196237 -278945 -254273 -186089 -211655 -206444 -81854 -57466 -71856 89080 38812 -107514
2893 -107514 -80137 7554 108424 54615 93841 -32177 -21206 -78744 -150941 -165452 -152218
2882 -152218 -113493 -173950 -137200 -177066 -128162 -219790 -90257 -73815 -112560 -125245 -35605
2871 -35605 13586 -15608 -51062 -11184 -45694 -151848 -224462 -157036 -213267 -339721 -300955
2860 -300955 -267048 -196161 -16857 -56695 -101014 -61383 82672 30944 -123780 -115446 -63682
2849 -63682 -76908 -127651 -103350 -201512 -208957 -241249 -159600 -195180 -117033 -25816 43498 -90365
2837 -90365 -107384 -115402 -163875 -127152 -125940 -121623 -90225 -95096 -141852 -66803 -104371 -131185 -52361
2824 -52361 -67582 2950 -25087 -21474 -76552 -70394 -50347 -77385 -66910 -14082 -61408 -152525
2812 -152525 -50609 6980 -70488 -14878 -91626 -192200 -98702 -140442 -153035 -194812 -109609
2801 -109609 -98069 -227677 -161186 -157842 -145241 -122606 -117145 -121201 -146601 -54385 -101720 -73357
2789 -73357 -96258 44091 26752 -156357 -34788 -73678 -65438 20400 -52894 -106815 -197422
2778 -197422 -142823 -118445 -146473 -48107 -3276 -59877 -104555 -132217 -132622 -149834 -49579 -100480
2766 -100480 -42047 -59550 -4615 -38148 -45690 -1127 -212565 -276197 -121542 -59029 -172326
2755 -172326 -82027 -97591 -70946 -104709 -98054 -28500 -138616 -128864 -208450 -171673 -7477 -55023
2743 -55023 -163726 -50401 67604 -48470 -141874 -133048 -247439 -156958 -72418 -26557 60740
2732 60740 -15635 -56095 -141923 -75345 -38164 -85724 -91016 72481 -44076 -128557 -108186 -155786
2720 -155786 -117959 -87455 -111480 -165000 -240261 -199854 -158923 4508 115744 14365 -27502
2709 -27502 -110348 -156663 -32136 -48750 -34428 -87112 -154966 -52483 -24582 61640 49483
2698 49483 -91427 -157004 -170986 -86414 -19095 26977 16329 -11230 -92074 -206559 -197101 -147049
2686 -147049 -87424 -58253 -20629 -129419 -141714 -165061 -85193 46713 -158056 -123148 -99629
2675 -99629 -71657 -71644 28565 -135861 -231120 -111125 -118600 -193198 -88285 -172083 -122546 81384
2663 81384 -12026 -137318 -190895 -26680 37618 75718 -22634 20754 -81873 -61467 -21049
2652 -21049 -108518 -131170 -159953 -104557 -14714 -93670 34669 61839 -86060 -75252 -1121
2641 -1121 28061 46181 40963 -4663 -87426 -59699 -88685 -205672 -54704 31219 -37016 3727
2629 3727 12857 35476 -9179 -7217 -55824 -126845 -88234 -36535 -10571 -70256 -51944 34589
2617 34589 20481 -39631 1871 28948 144723 -51066 -77228 -49631 -106748 -36496 -90325
2606 -90325 -3675 66101 25953 -61801 -59249 31571 33999 -22740 -14001 9971 43611 101853
2594 101853 73255 31445 86295 45431 -93865 -178795 -38595 51334 31144 -15293 31816
2583 31816 117614 -35077 -56161 -61256 -80913 -40145 -9995 66506 -3928 -28636 11882 -16350
2571 -16350 -239525 -213704 -160343 -146633 -151064 -123546 -82295 -148588 -30500 33771 -76687
2560 -76687 -115946 -85626 -4447 -4268 -52733 11540 124647 38362 55643 -36287 -179850 -69157
2548 -69157 40986 31356 -6283 -47329 45967 98844 2796 27364 14230 -50291 -136711 -162791
2536 -162791 -135721 -109903 -112740 -45184 18515 53944 130878 -21169 -157737 9527 -17535
2525 -17535 18966 -869 -22435 -4582 56024 -73433 -14599 112740 44158 68476 56646
2514 56646 70996 13794 21117 94656 94047 131634 184907 13328 -85868 -175774 -120492 -38086
2502 -38086 -77861 -31710 74966 116316 -4116 -39825 -99749 -88181 -106736 -67515 80648
2491 80648 166598 161854 172000 166135 97982 99410 108916 32581 65951 66698 49291 -114899 74385
2478 74385 145736 83182 6312 37827 -2683 -48123 49419 12866 -59236 -151529 -86806 -68970
2466 -68970 -36563 26735 74292 68113 113392 173234 22348 42624 91504 199283 182968 187015
2454 187015 137170 93175 135637 178488 -16019 -182104 -10593 24681 16566 16859 53175 132875
2442 132875 305160 394117 281782 167039 207979 279254 270242 240540 174838 84593 276318
2431 276318 153347 210485 278484 358447 327925 334407 558143 494982 440755 308133 328640
2420 328640 484879 463494 408052 339712 384504 340320 489295 518208 466294 530142 627940
2409 627940 634920 598625 522783 583130 591076 579413 582419 735811 620414 565102 608978 636661
2397 636661 688733 564363 624182 709144 695295 647695 738578 764034 898505 802285 821361
2386 821361 924093 865024 1069498 993392 1028659 1163302 1207821 1276194 1284043 1249534 1269506
2375 1269506 1430262 1487870 1463814 1500555 1470026 1522895 1629498 1659832 1684788 1759796 1887697
2364 1887697 2065803 2118735 2096753 2198947 2363159 2397871 2283818 2372816 2565471 2675606
2354 2675606 2787796 3034863 3247965 3429103 3695181 3903688 4220981 4664007 5181297 5553986
2344 5553986 5792459 6230926 6694696 7218085 7821587 8641682 9735358 11174793 13230066
2335 13230066 15840729 19210732 23618791 29578698 35570775 35571145 30489686 24400780 19073056
2326 19073056 15247023 12388141 10305941 8670185 7441259 6422499 5750694 5300415
2318 5300415 5074618 4780851 4547934 4338813 3955543 3582903 3397174 3191195 2922095 2890127
2308 2890127 2608005 2399245 2312862 2119501 1998958 1865642 1664870 1652333 1549221 1531381
2298 1531381 1446471 1420678 1267036 1169159 1184979 1105701 1006473 889499 927969 899328 913856
2287 913856 1000132 1042685 929504 821010 717480 588071 594792 593406 576897 687336 641484
2276 641484 536385 522277 513691 541249 552921 450291 521053 623691 434326 406815 327054
2265 327054 226875 311216 294904 242750 284711 372430 345048 399529 337566 266390 282738
2254 282738 335741 319976 170230 233273 227224 198252 141609 36208 147281 77790 101342
2243 101342 143556 151741 174339 239312 293136 302269 175535 76309 232554 385933 288134
2232 288134 254358 220342 23882 -10158 94191 117123 75107 51171 102501 251776 158067
2221 158067 104050 79233 2314 35598 15543 143118 176086 133434 101025 68776 146851
2210 146851 58903 140404 154190 82890 195248 152923 213594 176567 -19346 -555 15879
2199 15879 -43456 75145 74996 38820 -36273 -31667 59008 -17174 -70439 35792 168651 169294
2187 169294 162404 163497 156655 221782 130774 12920 89167 115758 63121 -80917 -117551 -84022
2175 -84022 -68914 -5070 39136 133108 121173 43243 -30787 -25947 14972 -24349 -119260 -48602
2163 -48602 17926 108381 152148 27405 14539 44238 -28120 28598 82088 -55202 -151199
2152 -151199 3091 33308 25169 57912 -51295 -48003 35568 187377 118171 145612 211584
2141 211584 104154 87727 29094 -11551 5803 7015 -71938 2058 39175 122219 61039 82769
2129 82769 124337 86892 112105 1385 -11173 100915 225472 152085 128000 148109 195570
2118 195570 59176 7106 17575 26563 -75051 24796 -18945 -5143 -26676 -74510 -45050
2107 -45050 29863 -39025 -15539 69284 27627 1289 -18726 -85664 -168867 -130098 -149356 -71305
2095 -71305 -85832 -103693 -97117 -107734 36030 78752 116848 120148 47534 42726 -42955 -59655
2083 -59655 -81875 40524 82881 64467 -43161 -76044 13662 -41970 19557 84101 11030
2072 11030 -144006 -7913 203144 193710 -40440 41179 132396 2098 31876 137553 178694
2061 178694 132172 128307 95265 132341 -13058 13946 22951 -11628 -39927 -19577 12192 14006
2049 14006 41301 22687 -96087 -24371 -73718 -71692 49249 -67201 -252806 -180414 -69137
2038 -69137 -49551 -23409 -2867 -78304 -57693 -47291 -103438 -399 205560 142878 -94238
2027 -94238 -87387 -185993 -141235 -113081 -137317 -128461 -60445 -116357 -190964 -143968 -61610 -56369
2015 -56369 -44572 -87922 -195732 -61939 79052 65379 85311 57548 22489 -73592 -122196
2004 -122196 -34417 -58642 -40731 -18225 -70432 -98769 -54053 105532 -6308 -56385 6085
1993 6085 -99334 -72954 -53759 11395 50291 24390 -51166 16676 650 -40979 57292 -69777
1981 -69777 -95868 -128226 -41316 25886 64634 102747 54090 -6755 63918 -39592 -164973
1970 -164973 -67731 -117472 -92068 -101454 -64675 15449 -89950 -181046 -83454 -97755 -139653 -52957
1958 -52957 -48488 9327 -11517 -5451 -13823 47276 116967 -30566 -36280 72945 29287 -45987
1946 -45987 115656 115644 41225 -73752 -48007 -25158 18211 84244 34116 -60860 -115634 86015
1934 86015 48550 -56247 22672 -64780 -58904 -4288 29582 1233 -62420 55401 10850 -147978
1922 -147978 -4918 146980 106658 103523 152904 213197 108467 5462 73250 -58283 -32655
1911 -32655 55605 166260 139378 135672 145079 54091 10610 4419 121157 167587 62352 -12987
1899 -12987 -67296 -42596 -17570 -94838 106428 200063 109296 60922 73975 1469 49587 13361
1887 13361 35201 105130 110655 -3068 -52405 -46542 16878 -75099 -106328 26466 -8921 -48225
1875 -48225 -5293 40357 29753 30832 -52075 -29734 5535 16394 -81398 -4266 -35530 -106281
1863 -106281 -83426 -14446 -31505 89866 115943 26949 121358 23968 72731 121 94601
1852 94601 159169 74989 36820 46560 95924 -5672 63544 -47719 -29716 -56067 -96001 -40377
1840 -40377 -56922 -78197 -235090 -219045 -63483 67667 34327 68004 -66097 -220092 -149414
1829 -149414 -114793 -94254 -8788 48792 -2782 66610 -26169 -115605 -61155 -186240 -169637
1818 -169637 -204276 -97906 -84844 -61247 -119310 21840 128991 53774 43852 -83062 19877
1807 19877 9430 73299 45994 56448 4288 -39907 38335 95256 72380 58648 46987 51117
1795 51117 -26283 -53303 -132628 -218026 -86303 -65339 -108186 -174029 -136151 -133295 -61940 -69996
1783 -69996 55388 125937 163252 137946 134025 13934 14136 57283 40967 54247 -40528 -101514
1771 -101514 -166848 -73013 -2521 -36768 7809 107859 118608 73682 171006 149275 103022
1760 103022 125104 51127 -35435 -58346 -18151 58742 -2189 8846 59717 -114879 -94806
1749 -94806 -59891 -6440 -75666 -145524 -138748 62969 67521 -40742 -15956 43906 -40152 -78544
1737 -78544 -84117 -63615 -170508 -191982 -45289 -53429 -23864 -77182 -257580 -192397 -171795 -165345
1725 -165345 -148589 -124030 -197087 -209735 -51304 -141868 -23525 30620 -150794 -101746 -130260
1714 -130260 -43005 39892 -136292 -50076 -134132 -222861 17891 107379 5074 22019 -21552
1703 -21552 -65177 -101164 42346 22575 -40499 46779 81427 -1585 -92066 -62683 47960
1692 47960 125069 42033 56593 49003 78371 -24715 -106274 5130 -8610 -152781 -92789
1681 -92789 -138142 -107252 -22729 -118202 -40890 43079 21404 -27864 -72312 -89616 -57731 3415
1669 3415 -2811 -30430 -47140 -23921 -45677 -120261 -157291 -216650 -196194 -112887 -45011 -19051
1657 -19051 -104338 -151188 -70377 -59780 -52327 41460 82149 133942 86669 43846 32559 -26975
1645 -26975 -22452 -39771 13682 -7693 -107503 4491 28921 1829 -33746 -28872 57877 45519
1633 45519 5529 -35540 -51631 -60387 -45762 -31044 54864 -4084 1746 55596 4561 -31104
1621 -31104 -152264 -180707 -6422 -83572 -173296 -43136 -10473 121676 132183 67397 65925
1610 65925 -75485 7064 -58814 -69906 24390 -25321 -43530 29143 -3377 -17331 3543 -36289
1598 -36289 -124473 -137441 -122066 -62626 -112 18096 97547 19210 -49176 -155 -8730 -36939
1586 -36939 -6200 -60740 -166741 -129779 -55453 -104886 -81657 -32259 -34067 -75334 -57003 -14019
1574 -14019 8580 -45593 503 -30900 -126319 -5395 -42585 -49829 -129616 -81512 -22751 -41116
1562 -41116 -19790 8990 20595 -99857 -74186 72717 35544 -29671 -17714 -134583 -124070
1551 -124070 -65200 -133076 -171862 -135655 -197319 -314640 -112930 44856 29335 74973 75987
1540 75987 -105181 -61355 30617 104101 74029 93281 82200 21964 97370 62465 56397 -152640
1528 -152640 -61530 -44595 -12780 -126275 -19686 -54644 -46393 -23658 -51234 -57094 -34224 -52297
1516 -52297 -134900 -164965 -124264 -44467 -117033 -32272 -89916 -134155 -195820 -232740 -134670 -149296
1504 -149296 -111359 5409 -47704 17503 -3673 15493 17554 2574 -146161 -150893 17209
1493 17209 65706 38321 -61376 -151146 -11869 176674 77444 43417 7099 30393 39293 65588
1481 65588 8862 -44414 -69235 -19505 -49454 -153450 -119868 -44107 46880 -37616 -22582 154693
1469 154693 47234 -21939 32217 -31728 -65313 -81751 -42426 -74501 -116842 -160942 -137863
1458 -137863 -33766 11470 39263 -93316 -166647 8195 93315 -42332 -23348 -46072 -76615
1447 -76615 -115550 -76468 -13335 -100096 -122706 -31344 69526 14229 114062 -22813 31011
1436 31011 14316 -145146 -106622 25978 -18275 -107754 -161712 -101125 -61645 -119168 41887
1425 41887 18722 -19725 -70309 -106251 -100698 -56444 -1104 -39775 -102729 -26198 151356 116524
1413 116524 -56592 -50274 104448 93073 -23052 -34160 81110 149152 39737 -50709 67017
1402 67017 7950 -180633 -227491 -75571 -39466 -66649 -129144 -120622 41212 17251 16173 -108699
1390 -108699 -132153 -284096 -143156 -61110 -69299 68166 83143 58690 -81787 -131420 -116378
1379 -116378 119404 179673 94559 31760 -54739 27957 133657 54801 33354 -55924 -70720
1368 -70720 -174392 31257 77414 -1145 29045 7625 -53908 -92516 -82695 -198217 -126343
1357 -126343 -95306 -167434 -63598 21459 -19700 -76585 -125674 121551 75856 -72572 -31036
1346 -31036 -65280 -117932 -59874 -49149 -65832 -109639 -10748 31945 69694 114667 93564 129979
1334 129979 -35495 -66909 44692 27048 -58500 -18183 28684 8192 1126 -128937 34564
1323 34564 147689 138493 122721 64135 148342 35476 51913 91324 70213 77710 72150 82449
1311 82449 -23653 38821 113956 109943 114606 -23596 -65392 -57863 -61461 -8712 -46571 6610
1299 6610 -87399 -222178 -166040 -160074 -125049 -82756 -1987 26111 -17910 -31493 -10271 -116667
1287 -116667 -73742 -68494 -49852 -101292 -126621 -116976 -110051 -59186 -200977 -10572 -13527 49151
1275 49151 53711 9985 29200 40650 -21484 -69173 -21579 -104247 -14418 -33638 -77345 -47438
1263 -47438 -46715 -17417 -1390 -18656 -11081 17695 118498 101048 52070 164565 33145 7594
1251 7594 -87008 -106728 40818 -3691 33302 35821 27380 125936 59162 41418 125830 28750
1239 28750 41170 113928 -8904 -13018 13096 71118 52842 46926 69242 -95260 -111345 -78177
1227 -78177 45910 -48806 -65246 46814 36941 -33749 -37292 31246 58072 44675 -26356 -114167
1215 -114167 -80638 -52647 -78077 46167 36636 22620 73874 -18644 -20335 -13066 -116059 -33856
1203 -33856 26928 -10570 -22111 -103436 -33201 -123616 -75062 -8383 -18062 1152 34301 181624
1191 181624 222908 114622 -65390 -30491 2222 -85780 -135337 -147661 -149213 -127197 -115021
1180 -115021 -9124 -31433 -75059 -144638 -33917 -6921 -6373 -95113 -90447 -86525 -18300 150794
1168 150794 155905 29492 -57552 -61749 -166056 -29868 -133234 15508 3080 -24504 -28914
1157 -28914 -27745 -11297 -64661 -53498 -22484 3702 -22947 -43700 -60262 -156447 -83890 -258838
1145 -258838 -199246 -32417 60209 -20643 -99363 51155 1844 -98548 -6809 -38981 -55808
1134 -55808 -54311 -17704 18756 -7563 11522 6005 96456 1883 44719 -35405 -27822 -25238 24243
1121 24243 56087 110899 112818 4218 -45819 -29290 -61558 -58962 -153945 -113992 -12104 -24354
1109 -24354 -129392 -39342 -18551 -76996 -91361 -9700 -169785 -107810 -63545 -141538 -21949
1098 -21949 107573 57784 -35060 -22549 -41273 133733 142933 55898 47827 107354 113443 119307
1086 119307 129101 41798 46844 51618 92165 -5944 34850 14889 30521 131283 72136 19741
1074 19741 -13264 12742 32194 -116028 29799 78833 129906 97185 59814 133469 -32007
1063 -32007 -14354 -74391 53152 140266 96381 94964 153136 187062 204103 112288 119634 -13479
1051 -13479 65825 124895 129485 -42662 21616 61835 35502 40106 13310 -21802 -118762 -29365
1039 -29365 -84665 -104939 -185030 -167082 -54802 -47715 -14653 -45912 12376 110204 62980 47695
1027 47695 -62950 -71464 -4886 52286 93436 147512 250570 84675 -7753 68989 78254 -1415
1015 -1415 -36673 -100449 -55183 45010 104510 78697 39002 35402 49756 73356 68337 76029
1003 76029 85649 69208 32210 63934 110499 121472 92170 48149 75235 30851 57450 101397
991 101397 -12909 -65031 -44492 36103 77727 62181 117710 37848 122791 163343 242940 183353
979 183353 87994 29503 190546 186489 59546 -9923 -15214 -13994 -18359 16414 -83370 116374
967 116374 180464 82320 42379 190191 228281 131316 33466 173683 243642 117587 145495
956 145495 107498 -50275 37296 -75692 107615 -2225 -86618 14891 -25217 -46179 -68784
945 -68784 -73199 -111432 -71017 83372 73099 92039 53998 139954 56641 -41543 -9034 32086
933 32086 1409 -45216 109784 155987 1681 -43731 3107 2815 -21249 57872 52156 -34028
921 -34028 112676 57920 -9850 29685 34962 -33221 -101296 -14906 -21268 66346 154109 131813
909 131813 174224 121137 65648 133573 92280 103781 191643 26968 84886 107604 106106 100616
897 100616 18876 -124786 -25122 -87448 -115795 -86178 -87312 -66791 -41667 134000 -4990
886 -4990 -158627 -153282 -76227 -105584 -18522 -25487 -100329 128800 118820 25329 38959 -5194
874 -5194 49350 -16374 -172321 -58656 19579 79508 41823 12350 32582 -82858 -169660 -146171
862 -146171 -135513 -96584 -96578 -10531 48879 31305 -36424 43268 3183 -20952 -72635 -100905 -87858
849 -87858 -24481 -30633 136952 203569 140007 136990 71412 52991 53619 -20062 -138417 -55169
837 -55169 -113690 -146049 -17798 107340 134815 -63564 -23963 144536 123539 98435 88479
826 88479 -1041 -6799 105785 190074 160945 68459 226951 65569 -30031 -142448 -15040
815 -15040 -87294 -135329 50824 129432 127660 -16943 31712 17601 59549 -17825 53883 -69
803 -69 11785 100680 95970 52168 35869 -37273 8795 -68538 -48890 64437 2301 87817 25647
790 25647 24739 -64726 -84962 -77755 -64216 -4593 34397 -64325 -170905 -46592 53318 38587
778 38587 138278 -1330 -19979 17692 33536 75235 263463 255407 154405 95970 941 34483
766 34483 66642 93066 -43841 -70731 90122 96185 42002 -34667 -134448 -176285 -137063 -113052
754 -113052 -105230 -9093 10659 -46556 -63523 -67747 9624 -37433 -93882 -39349 36869 38195
742 38195 29173 -35421 -115238 -195517 -39894 -59180 -73052 -1652 -34043 -105566 -151011 8444
730 8444 -101929 -72700 -60122 28265 41557 -71249 2794 43977 4934 40241 35597 -64305
718 -64305 -79488 185718 180562 112884 53299 -79716 -35802 -65265 -99358 -68686 -14117 -33848
706 -33848 34334 25759 45666 -20109 113832 75298 110498 106203 -90426 -54298 -118377 -65547
694 -65547 -142455 -85457 -49565 34017 844 19558 -24679 -67602 27007 17200 64612 160251
682 160251 114823 142157 59776 -29328 -108870 -81990 3122 77537 97299 -18316 -74548 -10256
670 -10256 90252 16319 -55772 -2154 110349 95442 91712 90359 27983 47680 -8569 -42552
658 -42552 -82727 -117721 8211 90895 156336 80633 44465 -110900 -44075 49399 -24306 -23321
646 -23321 -4244 -134978 -240293 -59480 -26694 -292 26719 -136562 -104016 29476 -2162
635 -2162 9689 -151510 -213931 -64159 1836 12781 16158 15937 141837 140660 18368 -41031
623 -41031 40457 100235 -42882 19630 19864 90434 125739 88739 165555 186410 210880 130179
611 130179 137839 70237 -5572 26019 62790 -22022 63049 20603 -42269 -59916 -88509 -56493
599 -56493 -28396 55445 25514 35934 42633 -24658 -63590 16118 -14893 54510 139489 141265
587 141265 -89645 -103472 -44800 -45696 -1024 49193 34235 9974 73138 -2495 -14804 74792
575 74792 6523 15493 11946 -81956 -8061 -46628 60002 54081 76300 129760 143801 55516
563 55516 -74707 -65583 6251 93616 105949 58991 169229 91565 37604 131672 48359 -3349
551 -3349 -51464 61167 -3118 -76714 -79166 -42476 12482 -9982 -131038 -85454 -63012 45184
539 45184 35057 -20085 53404 137229 53516 115727 14805 -21586 47879 -80780 -116301 -67253
527 -67253 -54097 -56121 -124457 -137154 -166827 -64600 55142 -155216 -192036 -221144 -167066 -44603
515 -44603 -74638 -111722 28186 17816 1585 -27024 161075 143416 39018 93775 52194
504 52194 22281 -68658 -94919 -79048 -32602 95444 114423 51350 69761 74147 44136 -54994
492 -54994 40895 55394 43098 15782 60878 127930 31630 -22208 -11889 63863 95271 64150
480 64150 58138 81382 -74641 42880 143474 184568 74373 35267 49192 99112 100330 144087
468 144087 104425 -9735 146031 101318 42430 170364 198221 57265 42677 111622 53189
457 53189 -72419 -72224 46640 101591 -32504 8598 150496 -42226 -12550 -22354 102217
446 102217 88121 109168 177056 178400 152996 36814 105042 -27390 -42214 8704 3493 -21238
434 -21238 73634 74167 117884 93916 100893 173368 49168 -67351 35312 120137 150508 160174
422 160174 113357 43594 -65093 -53501 -14758 0 11688 -59957 -52964 -52532 -20332 -30281
410 -30281 -13448 70847 7731 -103438 39418 52062 58965 -82550 71985 187084 18889
399 18889 31380 -11260 81768 37621 110727 80755 105225 80658 -24235 84283 60823 -5529
387 -5529 24505 81480 -48298 -140808 -110794 5431 -47572 -148832 -45622 -52452 32625 132433
375 132433 159520 -623 5420 -8324 -20846 1029 10066 161717 109513 143882 105281 2924
363 2924 -64370 -153849 -73738 -120764 -110798 -55026 54155 106809 141725 99834 13614 25573
351 25573 -23563 18829 26683 -49740 -78502 -132811 -3416 -493 -77088 79660 134611 122136
339 122136 35140 138836 77839 77717 86152 -1127 27895 -77234 5195 128730 39430 -99056
327 -99056 -78622 56065 -7833 -74236 11132 108651 50621 66380 91407 47490 92606 71180
315 71180 127582 142822 232421 155831 83185 99443 -13210 -1793 61267 -30482 -59711 30783
303 30783 12088 5648 -20420 -17571 -59127 26300 12940 -16696 14919 -80946 -91642 -172448
291 -172448 -68262 69343 9744 -66985 10585 46638 -45271 67808 -10749 23961 64465
280 64465 -32156 18479 -82703 25049 179420 132169 91725 130739 98783 12131 174002
269 174002 168950 59477 146067 92563 -35529 -22229 70882 196182 182610 80920 5566
258 5566 24193 11193 39411 10417 70475 4095 -53988 40430 81668 115965 66922 -22311
246 -22311 -87403 25827 100980 103146 156965 144165 61150 35516 65625 222049 137210 -10113
234 -10113 104086 12727 24765 35509 -1858 -22278 47357 201175 131319 -29180 -226907
223 -226907 -175427 -82273 48048 169521 162908 90472 53674 -13227 -43931 119362 23784
212 23784 7011 33196 -75417 -90730 -64704 79099 143096 5913 48307 198404 160328
201 160328 81837 35222 93223 -8624 21296 89776 121450 51027 -66646 -82049 40260
190 40260 77258 -27485 1839 121608 90795 -814 -178178 -160031 -87542 -31006 -23976 -91950
178 -91950 -17785 -33095 -58945 -29511 -29183 -31973 61743 58002 42673 92881 28697 33876 69267
165 69267 129023 73542 79794 126402 83977 89232 42657 7335 93144 109656 13117 -73287
153 -73287 22106 90512 96465 126792 60994 -71234 -135357 -37185 12305 84964 33833 36959
141 36959 11716 10398 6258 71364 84656 -42382 -4157 76864 -51370 -12171 39273 -5776
129 -5776 59184 -8991 -49521 44851 98544 159477 141658 137513 199091 75956 -4342 9641
117 9641 36446 62257 92220 128306 139965 114650 78866 108416 178118 183358 70481 92484
105 92484 -39560 28957 125929 78437 53241 60734 11686 14933 91124 101514 68206 -22689
93 -22689 22549 76413 75540 104255 105755 72330 79422 173794 150803 91669 121486 137078 52632
80 52632 66983 91807 -17742 -55148 -11305 20577 -16083 -48077 26327 128309 67854 48907
68 48907 -33507 12207 -2062 115687 187580 21070 78296 122719 34128 -7751 -52377 44290
56 44290 40111 9045 81445 22669 22027 79743 -3787 -73727 -32239 98505 102562 51594 59388
43 59388 85570 144401 33206 7062 39327 -6670 91473 84082 -21591 117 103519 364
31 364 -39158 9071 34016 66394 39872 73726 68947 118492 106474 41779 47558 108353 132489
18 132489 150975 115073 195844 152184 144071 78926 -32487 31499 31855 -7905 18989 10887 93561
5 93561 50561 58812 53096 33205 40068
0 40068
$$ Imaginary data points
##PAGE= N=2
##DATA TABLE= (X++(I..I)), XYDATA
16383 -618913 -644296 -559467 -555629 -526421 -611709 -564742 -552308 -562616 -553778 -556855 -486167 -487617
16371 -487617 -548578 -491025 -504482 -409835 -351042 -444084 -315496 -302464 -374581 -420489 -362132
16360 -362132 -309588 -229720 -138704 -152968 -256660 -215197 -191551 -183930 -258392 -256310 -167945 -167216
16348 -167216 -190881 -217809 -201840 -100528 -18360 -26319 -8522 90687 73850 55587 73789
16337 73789 71989 75917 47686 25420 28915 100694 9420 -5068 142500 238884 311879 292909
16325 292909 305372 258834 254997 309635 248613 203200 342956 349169 327791 313870 356618 297750
16313 297750 270499 344394 416963 497658 406456 429160 476648 499161 500827 449449 492286 573832
16301 573832 615586 552141 641733 668254 604994 632846 563170 662741 645409 637680 605314 722213
16289 722213 737719 700523 696723 735383 788335 823857 769209 719284 735018 820128 781413 719758
16277 719758 762377 727293 771486 776033 886071 868365 935135 1022697 940358 1069990 1095806
16266 1095806 1065467 946615 1066301 1102962 986494 1090866 1117799 1125660 1086852 1116198 1207911
16255 1207911 1241663 1106129 1125069 1180581 1148336 1072406 1003863 978151 994947 975340 1206608
16244 1206608 1275040 1242326 1205862 1212832 1290947 1335672 1296671 1318382 1311527 1078967 958380
16233 958380 1147037 1179460 1170592 1218401 1282748 1240380 1238217 1345095 1369157 1303053 1406383
16222 1406383 1481881 1422141 1448278 1460771 1477018 1460769 1453546 1501087 1403606 1399494 1402956 1339914
16210 1339914 1431674 1402973 1406422 1461943 1493304 1387724 1449955 1428006 1374477 1340315 1395851
16199 1395851 1440669 1545157 1603198 1586833 1603751 1598645 1609263 1598531 1479549 1513292 1542391
16188 1542391 1528298 1502651 1591847 1475949 1350586 1492405 1508207 1587253 1627486 1744185
16178 1744185 1734625 1699830 1645985 1530038 1514843 1602931 1675643 1774862 1702266 1622218 1619332
16167 1619332 1694899 1701340 1677969 1726226 1852486 1901398 1754590 1656638 1509626 1602041 1652617
16156 1652617 1702340 1741576 1654057 1596778 1677947 1680322 1728682 1707674 1747681 1732689 1632054
16145 1632054 1769995 1819036 1774879 1782777 1810060 1898394 1919704 1840043 1847549 1836965 1793705
16134 1793705 1798643 1832703 1763270 1585758 1617206 1654696 1637399 1626973 1644870 1567031 1647117
16123 1647117 1692905 1669540 1677011 1714340 1878167 1893485 1785068 1787686 1857778 1916483 2007526
16112 2007526 1906939 1793874 1815278 1840619 1719604 1710873 1835742 1871128 1786252 1765645 1801506
16101 1801506 1862216 1779442 1812315 1998796 1909802 1813698 1763993 1589053 1712187 1770877 1739775
16090 1739775 1795558 1805280 1882278 1848341 1947999 1874751 1748830 1908674 2090654 2025668 1840593
16079 1840593 1821890 1757753 1820002 1783907 1741718 1722562 1754176 1861968 1805140 1660200 1774334
16068 1774334 1947987 1980972 1965603 1981140 1783519 1759731 1768716 1739344 1767121 1748325 1776833
16057 1776833 1760884 1848384 1881728 1863935 1934491 1906151 1844538 1934161 2076163 2047505 1998763
16046 1998763 1922718 1801579 1872163 1814072 1761705 1874670 1880732 1849050 1953604 2045218 1775596
16035 1775596 1676649 1738244 1715654 1834714 1980588 1879174 1886360 1931208 1934590 1911634 1818026
16024 1818026 1853762 1821606 2007974 2027379 1962154 1966631 1990856 1966176 1993680 1913592 1886175
16013 1886175 1943062 2038004 1976919 2014064 2040324 1927540 1925286 1925668 1868489 1913091 2061681
16002 2061681 1982324 1871410 1905852 1905025 1927952 1940086 1894024 1778382 1798923 1799193 1798513 1918676
15990 1918676 1915455 1960527 1946938 1966832 1946031 1980276 2025049 1805885 1814559 1886683 1901188
15979 1901188 1805923 1842083 1993594 1894856 1770200 1775287 1864209 1882419 1865795 1980936 2086330
15968 2086330 2029596 2022829 1902622 1896503 1867519 1827482 1891738 1884486 1807200 1826193 1875811 1910339
15956 1910339 1966054 1878847 1862550 1838887 1835710 1850419 1769692 1787691 1685886 1826319 1856807
15945 1856807 1918161 1970514 2015086 2092786 2083460 2008521 1957040 1834151 1742759 1824527 1951649
15934 1951649 1841324 1735528 1920542 1836808 1928772 2071118 1917318 1877631 1906122 1916992
15924 1916992 1939402 1902671 1958933 2023879 1964294 1931388 1982636 1910215 2024550 2020051 1893785
15913 1893785 1979439 2012835 1955506 1878039 2031312 2085020 1982553 1905118 1851007 1780193 1768756
15902 1768756 1922364 1878416 1761789 1843188 1953876 2020273 1968786 1936232 1915762 1805710
15892 1805710 1896742 2014500 1875245 1821019 1984194 1930700 1919443 1898147 1900367 1925433 1960372
15881 1960372 1928707 1905593 1827140 1887009 1906858 1904866 1985616 1862009 1729168 1850656 1874755
15870 1874755 1913482 1831695 2009794 2084371 1929736 1849370 1857414 1867623 1900170 2088845 2049554
15859 2049554 1945218 2004536 1798040 1793185 1913706 1886620 1902385 1817968 1901747 2094679 2149702
15848 2149702 2149910 2000240 1883896 1969628 2090342 2122335 1947085 2013609 1930396 1875401 1958890
15837 1958890 2005660 1933737 2045321 1929875 1899234 1976888 2006762 1992572 1920512 1974345 1949903
15826 1949903 1892312 1909667 1964602 1958732 2011743 2000036 2007620 1998403 1899231 1925165 1925445 1884774
15814 1884774 1901874 1975097 2027074 1951465 1922364 1898505 1838358 1867929 1923874 1977794 1884775
15803 1884775 1934132 1920671 1820550 1742961 1740247 1834214 2048754 2113803 2028026 1908931 2031837
15792 2031837 2046764 1904364 1740266 1812702 1829079 1755168 1815836 1850139 1991230 1939143 1805083
15781 1805083 1788147 1864143 1955543 2002734 2059389 1975251 1949078 1868796 1889221 1839669 1935266
15770 1935266 1863862 1762424 1949230 2032770 1987379 1935664 2004738 2003177 1972360 1965156 2017572
15759 2017572 1953605 1975028 1913065 1897116 1906381 1905367 1851334 1852528 1882137 1942158 1977114 1982882
15747 1982882 2022860 1967038 1930573 2000280 2057923 2023649 1870021 1939486 2012958 1976600 1916653
15736 1916653 1976069 1864282 1828068 1902519 1906394 1887616 1899828 1930327 2060335 1940414 1889641
15725 1889641 1952996 1959821 1888350 1897185 2032203 1864684 1809633 1881059 1825848 1796352 1817131
15714 1817131 2013468 2048390 1959961 1874651 1852765 1921430 1815951 1832202 1863264 1845622 1957108
15703 1957108 2079576 2010997 1871243 1900080 1943418 1961378 1959547 1862099 1775910 1892816 2041190
15692 2041190 2061109 1984691 1953289 1995836 2005518 1957201 1923666 1975986 1924813 1973651 1956682
15681 1956682 1979622 2073371 2101863 2170694 2136146 2022365 1977828 1988049 2008057 1978048 1959957
15670 1959957 1873874 1861833 1884996 1855908 1881044 1833046 1739181 1794621 1905359 1881696 1828974
15659 1828974 1860367 2036232 2049685 1995990 2062231 2012954 1940445 1915166 1921087 1935281 2072686
15648 2072686 2088536 1906539 1931746 1888319 1901190 1967735 1995305 1908709 1953531 1920738 1838331
15637 1838331 1905214 2053114 1938744 1943969 2062508 1931677 1874127 1931236 1940392 1827704 1884381
15626 1884381 2042184 1824509 1812225 1878229 1839586 1954538 1956253 1907766 1891797 1857359 1750071
15615 1750071 1928652 2062616 2054951 1950161 2036288 2047893 2063665 2048700 2019155 2022055 2100972
$$ [...]
##END NTUPLES=NMR SPECTRUM
##END=
