##TITLE=1H_EC-3333(IV-2)
 200.13MHz, CDCl3,
 8 sc
 
 21.1.2025
##JCAMPDX= 6.0         $$ Bruker NMR JCAMP-DX V2.0
##DATA TYPE= NMR SPECTRUM
##DATA CLASS= NTUPLES
##ORIGIN= UXNMR, Bruker Analytische Messtechnik GmbH
##OWNER= pz
$$ XWIN-NMR		Version 3.5
$$ Tue Jan 21 14:31:55 2025 Russian Standard Time (UT+4h)  she@DPX200
##.OBSERVE FREQUENCY= 200.1313
##.OBSERVE NUCLEUS= ^1H
##.ACQUISITION MODE= SIMULTANEOUS
##.ACQUISITION SCHEME= undefined
##.AVERAGES= 8
##.DIGITISER RES= 18
##SPECTROMETER/DATA SYSTEM= spect
##.PULSE SEQUENCE= zg30
##.SOLVENT NAME= D2O
##.SHIFT REFERENCE= (INTERNAL, D2O, 0, 15.4858)
##AUDIT TRAIL= $$ (NUMBER, WHEN, WHO, WHERE, WHAT)
$$ ##TITLE= Audit trail, XWIN-NMR		Version 3.5
$$ ##JCAMPDX= 5.01
$$ ##ORIGIN= Bruker BioSpin GmbH
$$ ##OWNER= she
$$ F:/spectra/data/she/nmr/H-C/1/pdata/1/auditp.txt
$$ ##AUDIT TRAIL=  $$ (NUMBER, WHEN, WHO, WHERE, WHAT)
(   1,<2025-01-21 14:30:45.73 +0400>,<she>,<DPX200>,
      <created by zg, POWCHK disabled, PULCHK disabled
       configuration hash MD5:
       00 E9 B6 7A A2 85 ED C7 34 08 36 98 17 FE 4E 26
       data hash MD5: 16K
       11 38 6B AD E9 55 57 CA E8 C1 D2 5C 78 2D 51 D6>)
(   2,<2025-01-21 14:30:48.06 +0400>,<she>,<DPX200>,
      <Start of raw data processing
       efp BC_mod = 2 LB = 0.25 FT_mod = 6 PKNL = 1 PHC0 = 254.5841 PHC1 = 8.7922 SI = 16K 
       data hash MD5: 16K
       A1 68 00 4F E1 C5 83 B9 AA 18 D5 87 23 DC 52 DF>)
(   3,<2025-01-21 14:31:04.59 +0400>,<she>,<DPX200>,
      <pk PHC0 = -2.868165 PHC1 = 4 
       data hash MD5: 16K
       86 B2 2A 39 75 D3 1A FB E9 57 8E F8 E3 32 B5 B2>)
(   4,<2025-01-21 14:31:07.92 +0400>,<she>,<DPX200>,
      <abs ABSG = 5 
       data hash MD5: 16K
       D6 4B BC 5E 57 D6 48 CB C8 7E FD 1D 88 44 CF F8>)
$$ ##END=
$$ 
$$ hash MD5
$$ 8A 80 4F DD D5 86 8D 90 11 DC 1A 74 54 7D CC 20
##$RELAX= 
##$RELAX= 
##$RELAX= 
##$RELAX= 
##$RELAX= 
##$RELAX= 
$$ Bruker specific parameters
$$ --------------------------
##$DU= <F:/spectra>
##$EXPNO= 1
##$NAME= <H-C>
##$PROCNO= 1
##$TYPE= <nmr>
##$USER= <she>
##$AMP= (0..31)
100 100 100 100 100 100 100 100 100 100 100 100 100 100 100 100 100 100 
100 100 100 100 100 100 100 100 100 100 100 100 100 100 
##$AQSEQ= 0
##$AQ_mod= 1
##$AUNM= <au_zg>
##$AUTOPOS= <>
##$BF1= 200.13
##$BF2= 200.13
##$BF3= 200.13
##$BF4= 200.13
##$BF5= 200.13
##$BF6= 200.13
##$BF7= 200.13
##$BF8= 200.13
##$BYTORDA= 1
##$CFDGTYP= 0
##$CFRGTYP= 5
##$CHEMSTR= <none>
##$CNST= (0..31)
1 1 145 1 1 1 1 1 1 1 1 1 1 1 1 1 1 1 1 1 1 1 1 1 1 1 1 1 1 1 1 1 
##$CPDPRG= <>
##$CPDPRG1= <>
##$CPDPRG2= <>
##$CPDPRG3= <>
##$CPDPRG4= <mlev>
##$CPDPRG5= <mlev>
##$CPDPRG6= <mlev>
##$CPDPRG7= <mlev>
##$CPDPRG8= <mlev>
##$CPDPRGB= <>
##$CPDPRGT= <>
##$D= (0..31)
0 0.7 0 0 0 0 0 0 0 0 0 0.03 0 0 0 0 0 0 0 0 0 0 0 0 0 0 0 0 0 0 0 0 
##$DATE= 1737455445
##$DBL= (0..7)
120 120 120 120 120 120 120 120 
##$DBP= (0..7)
150 150 150 150 150 150 150 150 
##$DBP07= 0
##$DBPNAM0= <>
##$DBPNAM1= <>
##$DBPNAM2= <>
##$DBPNAM3= <>
##$DBPNAM4= <>
##$DBPNAM5= <>
$$ [...]
##$SUBNAM3= <"">
##$SUBNAM4= <"">
##$SUBNAM5= <"">
##$SUBNAM6= <"">
##$SUBNAM7= <"">
##$SUBNAM8= <"">
##$SUBNAM9= <"">
##$SW= 18.0517328524113
##$SWIBOX= (0..15)
0 0 2 0 0 0 0 0 0 0 0 0 0 0 0 0 
##$SW_h= 3612.71676300578
##$TD= 16384
##$TD0= 1
##$TE= 0
##$TE2= 300
##$TE3= 300
##$TEG= 300
##$TL= (0..7)
0 120 120 120 120 120 120 120 
##$TP= (0..7)
150 150 150 150 150 150 150 150 
##$TP07= 0
##$TPNAME0= <>
##$TPNAME1= <>
##$TPNAME2= <>
##$TPNAME3= <>
##$TPNAME4= <>
##$TPNAME5= <>
##$TPNAME6= <>
##$TPNAME7= <>
##$TPOAL= (0..7)
0.5 0.5 0.5 0.5 0.5 0.5 0.5 0.5 
##$TPOFFS= (0..7)
0 0 0 0 0 0 0 0 
##$TUNHIN= 0
##$TUNHOUT= 0
##$TUNXOUT= 0
##$USERA1= <user>
##$USERA2= <user>
##$USERA3= <user>
##$USERA4= <user>
##$USERA5= <user>
##$V9= 5
##$VALIST= <valist>
##$VCLIST= <CCCCCCCCCCCCCCC>
##$VD= 0
##$VDLIST= <DDDDDDDDDDDDDDD>
##$VPLIST= <PPPPPPPPPPPPPPP>
##$VTLIST= <TTTTTTTTTTTTTTT>
##$WBST= 1024
##$WBSW= 4
##$XGAIN= (0..3)
0 0 0 0 
##$XL= 0
##$YL= 0
##$YMAX_a= 203185
##$YMIN_a= -258901
##$ZGOPTNS= <>
##$ZL1= 120
##$ZL2= 120
##$ZL3= 120
##$ZL4= 120
##$ABSF1= 15.48356
##$ABSF2= -2.56829
##$ABSG= 5
##$ABSL= 3
##$ALPHA= 0
##$AQORDER= 0
##$ASSFAC= 0
##$ASSFACI= 0
##$ASSFACX= 0
##$ASSWID= 0
##$AUNMP= <proc_1d>
##$AZFE= 0.1
##$AZFW= 0.1
##$BCFW= 0
##$BC_mod= 2
##$BYTORDP= 0
##$COROFFS= 0
##$CY= -3
##$DATMOD= 1
##$DC= 0
##$DFILT= <>
##$DTYPP= 0
##$F1P= 0
##$F2P= 0
##$FCOR= 1
##$FTSIZE= 16384
##$FT_mod= 6
##$GAMMA= 0
##$GB= 0
##$INTBC= 1
##$INTSCL= 3.241238e-09
##$ISEN= 128
##$LB= 0.25
##$LEV0= 0
##$LPBIN= 0
##$MAXI= 10000
##$MC2= 0
##$MEAN= 0
##$ME_mod= 0
##$MI= 1.114404
##$NCOEF= 0
##$NC_proc= -7
##$NLEV= 6
##$NOISF1= 3.799351
##$NOISF2= 2.8
##$NSP= 0
##$NTH_PI= 0
##$NZP= 0
##$OFFSET= 15.48576
##$PC= 1
##$PHC0= 251.7159
##$PHC1= 12.7922
##$PH_mod= 1
##$PKNL= yes
##$PPARMOD= 0
##$PSCAL= 0
##$PSIGN= 0
##$REVERSE= no
##$SF= 200.130007191867
##$SI= 16384
##$SIGF1= 3
##$SIGF2= 2
##$SINO= 0.751879
##$SIOLD= 32768
##$SREGLST= <19F.Aceton>
##$SSB= 0
##$STSI= 16384
##$STSR= 0
##$SW_p= 3612.71676300578
##$SYMM= 0
##$S_DEV= 0
##$TDeff= 16384
##$TDoff= 0
##$TI= <>
##$TILT= no
##$TM1= 0
##$TM2= 0
##$TOPLEV= 0
##$USERP1= <user>
##$USERP2= <user>
##$USERP3= <user>
##$USERP4= <user>
##$USERP5= <user>
##$WDW= 1
##$XDIM= 16384
##$YMAX_p= 487753688
##$YMIN_p= -624229
$$ End of Bruker specific parameters
$$ ---------------------------------
##NTUPLES= NMR SPECTRUM
##VAR_NAME=  FREQUENCY,     SPECTRUM/REAL,   SPECTRUM/IMAG
##SYMBOL=    X,             R,               I
##VAR_TYPE=  INDEPENDENT,   DEPENDENT,       DEPENDENT
##VAR_FORM=  AFFN,          ASDF,            ASDF
##VAR_DIM=   16384,         16384,           16384
##UNITS=     HZ,            ARBITRARY UNITS, ARBITRARY UNITS
##FACTOR=    0.220516191357247, 1,           1
##FIRST=     3099.16520715857, 0,            0
##LAST=      -513.551555847208, 0,           0
##MIN=       -513.551555847208, -624229,     0
##MAX=       3099.16520715857, 487753688,    0
$$ Real data points
##PAGE= N=1
##DATA TABLE= (X++(R..R)), XYDATA
$$ [...]
7781C0553K50442L3753O3000k46600l567J2551o6166N3930k82060J60095o8554
7770f2623Q0617L6089j34720o4462J08135l9025O3140J01934k69677J36909m7302
7759i0985J3884j45378k77987M06173o9824l774M5638j32825K9418J1023J58045
7748e6592J55246o8851J1579k23389P4388K57278m4645J1462p2807r5310N3829
7737B188k6977o889J26697J26774j1454k68224J08189O0699R3113p5278Q4447
7726B13285K57484k26913p3155J54802j66622L9529r0327j2440k9213N8606K03990
7715C29026j0064l0398J4483O4933K99349J04943j12664J96311K46062j04884
7705I97097j31470l07132K07372M0543j49457J18810j91924R1181j02577l77030
$$ plain form
7781 30553 280995 314748 377748 131148 127581 140132 73966 127896 -154164 5931 -62623
7770 -62623 17994 54083 -80637 -145099 -36964 -75989 -12849 89085 -180592 -43683 -90985
7759 -90985 -77101 -222479 -500466 -94293 -164117 -167891 -122253 -255078 -225660 -214637 -56592
7748 -56592 98654 29803 41382 -182007 -107619 149659 105014 116476 43669 -51641 2188
7737 2188 -24789 -31678 95019 221793 210339 -57885 50304 111003 204116 128838 213285
7726 213285 470769 243856 170701 325503 158881 198410 108083 95643 66430 125036 329026
7715 329026 318962 288564 303047 367980 667329 772272 659608 855919 1101981 997097
7705 997097 865627 558495 765867 806410 656953 775763 583839 675020 572443 195413
7695A95413N5519J06401J8613o01j65377j59002J35646Q5412j02108N9580r3982
7684A35514m6522K10103Q1560k327L8639R7350k28907l51418L73280l2411j96887
7673G7974P9714K42725l6003j37988J08104Q6919j97968j12720O0055r993L7796
7662A98615j70086J0687o4764j63177Q0393J21634o1778L3271l5813J5308K61053
7651B25343J49994m6823j22191N86j74038N8215K02480j0545R2019m0578J5051
7640C49513K60992J11969j01045k05393K3748L27896O2374j80410n3186R9946
7630F96404J52326K30312J30437m29093j69943J68245j18630K9851p2904P9489
7620F96494O5626K03524k26297J72173k33428j75401J14770j60044K0395j1277
$$ plain form
7695 195413 250932 357333 375946 375345 209968 50966 186612 272024 169916 229496 135514
7684 135514 88992 299095 380655 378328 416967 514317 285410 -66008 307272 274861 77974
7673 77974 157688 400413 364410 226422 334526 421445 223477 110757 170812 160819 198615
7662 198615 28529 39216 -25548 -188725 -108332 13302 -48476 -15205 -51018 -35710 225343
7651 225343 375337 328514 206323 206909 32871 91086 293566 283021 375040 334462 349513
7640 349513 610505 722474 621429 416036 439784 767680 830054 649644 596458 696404
7630 696404 848730 1079042 1209479 780386 610443 778688 660058 689909 617005 696494
7620 696494 762120 965644 739347 911520 678092 502691 617461 457417 477812 466535
7610D66535J43164j93751r7628P2527k15062p2608L89553n6287J45371N8730q8906
7599E51638k17341P2560P1613j35280k11280J25506J85530J01970j70282j20462
7589B54172q1334j00892J27143J67303p348k06343J05317K03002J6009j39299
7579C37730L7827J24727J3420j10795j04393J42083J39180k36519p5129M974J59972
7568D33077j3164J91382K9511k16812L37136K70993m96418j03109R1513P6648
7558F00757J89829k13272K5838J02292k7132k07115k5999K18535M9625k06014
7548E07344j07460R299Q8211L0436J27129J57722R1916J71723J69878k36650m412
7537A005136J1412J14357L1699J8035K40340j8544O8211j99278R183K15737J39778
$$ plain form
7610 466535 609699 415948 318320 390847 175785 103177 492730 436443 581814 640544 551638
7599 551638 334297 406857 478470 343190 131910 257416 442946 544916 374634 254172
7589 254172 172838 71946 199089 366392 359044 152701 258018 461020 477029 337730
7579 337730 375557 500284 513704 402909 298516 440599 579779 343260 268131 273105 433077
7568 433077 419913 611295 640806 423994 761130 1032123 535705 432596 524109 600757
7558 600757 790586 577314 603152 705444 678312 471197 445198 663733 713358 507344
7548 507344 399884 409183 497394 527830 654959 812681 904597 1076320 1246198 1009548 1005136
7537 1005136 1016548 1130905 1162604 1180639 1420979 1402435 1470646 1271368 1280551 1496288 1636066
7526A636066N08412K96943J51820K58705K62829L92965L42257J66190k10392k28557
7516C577238J68735P9293k17163m54345r6616k24466l28499j17125m86290k43312
7506A657450j43374j43896K08947n6640n2725l13874j42092K47185Q8330J6286
7496A365597R5146q5179j73048J01408o2332L98822l4017j84013Q4619M1847P579
7485A556429k20900M5210K04834M4087K34299m4880Q3398k8723q4996J31244J16798
7474B036800K17067L69853K24343J04946L8354J31001L91566R7920k4171J63502
7464C751181q10J74654k15466l82437n88248j4102J00370j51581k37549l23209
7454B112803k11389R3583J93685j74192k61397k66515Q9992p8723j37074j10159
$$ plain form
7526 1636066 2144478 2441421 2593241 2851946 3114775 3507740 3849997 4016187 3805795 3577238
7516 3577238 3745973 3825266 3608103 3153758 3057142 2832676 2504177 2387052 1900762 1657450
7506 1657450 1514076 1370180 1579127 1522487 1469762 1155888 1013796 1260981 1349311 1365597
7496 1365597 1460743 1375564 1202516 1303924 1241592 1640414 1606397 1422384 1507003 1548850 1556429
7485 1556429 1335529 1380739 1585573 1629660 1863959 1819079 1902477 1873754 1788758 1920002 2036800
7474 2036800 2253867 2623720 2848063 2953009 2991363 3122364 3513930 3611850 3587679 3751181
7464 3751181 3750371 3925025 3709559 3327122 2738874 2724772 2825142 2673561 2436012 2112803
7454 2112803 1901414 1994997 2188682 2014490 1753093 1486578 1576570 1497847 1360773 1250614
7444A250614J33566j96717L39248K31023J63742K00624j81314n373k7499j07793
7434A800121J84991n3388J00506J71017j21604l91273r9170n1304K25844M6112
7424A811852j78337m5010J2344O0955J00273J1742m1226o3213k48527L26567J10240
7413A857660j65161k33162P269L45878J95985J08365K19650j13987N8028j59930
7403B120595k02852K21432J03382n0022J53494k31027q911P1925O9698K7011O1488
7392B336213q1453J6545J92931j76728Q8256J51972j11876K35600K13183j73629
7382B691014O8533J83281J2871q5480p8541n3756J24641j40568p5029j71955K74521
7371B749532K47292K73531Q2041L09193M74578M63036J18524Q6390q1731j95467
$$ plain form
7444 1250614 1384180 1187463 1526711 1757734 1921476 2122100 1940786 1935413 1907914 1800121
7434 1800121 1985112 1931724 2032230 2203247 2081643 1690370 1591200 1539896 1765740 1811852
7424 1811852 1633515 1588505 1600849 1661804 1762077 1773819 1732593 1669380 1420853 1747420 1857660
7413 1857660 1692499 1459337 1466606 1812484 2008469 2116834 2336484 2222497 2280525 2120595
7403 2120595 1917743 2139175 2242557 2192535 2346029 2115002 2106091 2178016 2247714 2274725 2336213
7392 2336213 2254760 2271305 2464236 2287508 2375764 2527736 2415860 2651460 2864643 2691014
7382 2691014 2759547 2942828 2955699 2870219 2791678 2737922 2862563 2721995 2646966 2475011 2749532
7371 2749532 2996824 3270355 3352396 3661589 4136167 4599203 4717727 4804117 4722386 4526919
7361D526919K10482N0716J8011q5451q2227k09339l15607m84968l35016J9189
7351C312709N7503m92730k11821L01172J50595m27413k4252j28869R1847j60040
7341B468701j87120j31112P3978N0920j580j06594q1119J71479J33261J71925
7331B562739j68741r9031J14458j2803j02342R6265k36098M5908j73373j76559
7321A850423o6710o815J87630j39579k51331m6589p7431K80486J07834K4793Q0194
7310A942905k1523j74527o1522L31727j3298O7815J89071L6175o2919P3252N6596
7299B363752k94971m0759K93609J72433K8434r0869P1763L20666L4712J46374
7289C005144Q8711P5384N72762N67623L34169p35j17218J06412K5981L50545j62154
$$ plain form
7361 4526919 4737401 4788117 4806128 4720677 4638450 4429111 4113504 3628536 3293520 3312709
7351 3312709 3370212 2877482 2665661 2966833 3117428 2690015 2665763 2536894 2628741 2468701
7341 2468701 2281581 2150469 2224447 2275367 2273787 2167193 2086074 2257553 2390814 2562739
7331 2562739 2393998 2294967 2409425 2396622 2294280 2390545 2154447 2200355 2026982 1850423
7321 1850423 1783713 1776898 1964528 1824949 1573618 1527029 1449598 1730084 1837918 1862711 1942905
7310 1942905 1921382 1746855 1685333 2017060 2003762 2071577 2260648 2296823 2233904 2307156 2363752
7299 2363752 2068781 2028022 2321631 2494064 2522498 2431629 2503392 2824058 2858770 3005144
7289 3005144 3093855 3169239 3742001 4309624 4643793 4643058 4525840 4632252 4658233 5008778 4846624
7278D846624L51924O6820l09371o43554l37240j44151m17715k77610p6070j23798
7268B935859l20299M0505J5423J00965l07782N6684k80975m8259j02981j08795
7258A980345o3583K24671Q6912p0721Q7022p1073J35095J52506R0284q1218j90251
7247B279989R5191l5907J99622J4139k40548L81030K93611K0391P2922j19465
7237B960975k91357M5274K12884r7372J17516o1644R309P1743j58685j78206K6161
7226B656598L69905m7903q5267Q4790K10273o4215j73956J22574M82357R3143
7216C648299q9454M3033M66220l8839M45367N32819K18798L84512L29641M94792
7206F435188N28946M40373P31878J111205J097553J303747J273005J397145J121840
$$ plain form
7278 4846624 5198548 5265368 4955997 4312443 3975203 3831052 3413337 3135727 3059657 2935859
7268 2935859 2615560 2656065 2671488 2772453 2464671 2521355 2240380 2192121 2089140 1980345
7258 1980345 1916762 2141433 2228345 2157624 2244646 2173573 2308668 2461174 2551458 2470240 2279989
7247 2279989 2375180 2339273 2538895 2553034 2312486 2693516 2987127 3007518 3080440 2960975
7237 2960975 2669618 2714892 2927776 2830404 2947920 2886276 2895585 2967328 2808643 2630437 2656598
7226 2656598 3026503 2978600 2893333 2978123 3188396 3124181 2950225 3072799 3555156 3648299
7216 3648299 3558845 3601878 4068098 4029259 4474626 5007445 5226243 5610755 5940396 6435188
7206 6435188 6964134 7404507 8136385 9247590 10345143 11648890 12921895 14319040 15440880
7197A5440880O08544n01138p40989j198585j420789j458543j155419r19234n81606
7188H073121o00533o20884n37811o34316p5539l35484o8350j18885m28722r0737
7178D561860L6612m22567n8489M81282O9286k27371L35990L5161j34561K97288
7168D974491K8288J89089J54218o1522j19159j44475m92832l12923l70836l11594
7158C532745l76316k81379q0454j04182j32481j51806m40919p4679N6017l46458
7148A600088r6976Q417j26793K1875p4906j69529R688p315k0864j96298Q3106
7137A030493k8505p991M3065j22170q9515L00334J15334j71677p6401k08792N1557
7126H35732L6146R994J66341k88932o9249K55760p0431k76548o1926O1381J8398
$$ plain form
7197 15440880 16049424 15548286 14807297 13608712 12187923 10729380 9573961 8654727 8073121
7188 8073121 7472588 6851704 6313893 5679577 5604038 5268554 5200204 5081319 4652597 4561860
7178 4561860 4598472 4175905 4117416 4598698 4667984 4440613 4776603 4811764 4677203 4974491
7168 4974491 5002779 5191868 5346086 5284564 5165405 5020930 4528098 4215175 3844339 3532745
7158 3532745 3156429 2875050 2794596 2690414 2557933 2406127 1965208 1890529 1946546 1600088
7148 1600088 1503112 1511529 1384736 1406611 1331705 1162176 1171864 1164549 1143685 947387 1030493
7137 1030493 1001988 993997 1037062 914892 825377 1125711 1241045 1069368 992967 784175 835732
7126 835732 871878 881872 1048213 759281 690032 945792 875361 598813 536887 598268 616666
7115F16666O0132l8412n893j96583J72256m666j65593Q6095L9206j60478M4632
7104D47362K65867j7024j34465n566j05473j15480K3680r8322O7684R4777k99253
7093A23787p0418L23133J89767j05194j03166N1386Q9859j77546o8012j38210
7083A15386j30832K42146L70103k49807k95711J42553Q9321J8837j07904M8639
7073B42731k3330j1237j62195N1739l8463J54729j81886J58390j70064m5434k9420
7062e4440J22911K60763M8486L2824j94194j18790O9886j54007N0399J37119L8464
7051B39421k26222Q3829o5975N1341M8036K85135L2454R7368N3594k88387N9686
7040C70280r982j96350k89700K66580m8139J04073K3547O1831M1023M2486N1681
$$ plain form
7115 616666 676798 638386 632493 435910 608166 603500 437907 524002 563208 402730 447362
7104 447362 713229 696205 561740 556174 450701 335221 358901 260579 328263 423040 123787
7093 123787 53369 376502 566269 461075 357909 409295 499154 321608 253596 115386
7083 115386 -15446 226700 596803 346996 51285 193838 283159 301996 194092 242731
7073 242731 219401 208164 45969 97708 59245 213974 32088 190478 20414 -25020 -54440
7062 -54440 68471 329234 377720 410544 216350 97560 167446 13439 63838 200957 239421
7051 239421 13199 97028 31053 82394 130430 415565 448019 545387 598981 310594 370280
7040 370280 360298 163948 -125752 140828 92689 196762 220309 282140 323163 365649 417330
7029D17330j03483J3445J69818Q440k78137o9516K04730j20592M6872j26493j8818
7018A43596J42535q2047j40587K44904J88249l1544j25294k29647r1116N6539
7008G5588R0530M3972J94611K5860j59025j10659o9422R8258q575J08270J7073
6997C06481k05282q2530J36756J18374J41274k93659J05689j98301j19630P1607
6987a9221K53655K00286r0929q7010M2659J7183m9493Q2159o7435j099l8371j06407
6975A35977L8162L06909J48614l29242M6260N1775Q8305r74M1041j16222j68758
6964B41847m2557q8140M4140L15101J98002l21982O1525p5927k25836j81259J17831
6953D2745K56798K6328j02768j74704j6055K93508j45163j01715m6451R0445J51170
$$ plain form
7029 417330 313847 327292 497110 505550 227413 157897 362627 242035 288907 162414 143596
7018 143596 286131 204084 63497 308401 496650 465106 339812 110165 19049 75588
7008 75588 166118 210090 404701 430561 271536 160877 91455 189713 181138 289408 306481
6997 306481 101199 18669 155425 273799 415073 121414 227103 28802 -90828 -19221
6987 -19221 234434 434720 343791 256781 299440 316623 267130 349289 281854 280755 242384 135977
6975 135977 174139 481048 629662 300420 346680 398455 486760 485786 526827 410605 241847
6964 241847 199290 111150 155290 470391 668393 346411 407936 332009 106173 -75086 42745
6953 42745 299543 325871 223103 48399 32344 325852 180689 78974 32523 122968 274138
6942B74138r4827O173Q6484J21633L3485j92009j19011R2412J30110Q1349j00038
6931C19899j81007k57399J73981P6407l8526N3019R7694L6549p6850J37135L9474
6920C80376j0717K3622j69843l1255j04285J70677N8497K1436j07185k03499J39459
6909A67283k28900r7347J47271K80353j44637J97061L48028j25458l91253r4851
6899E7550o1757R0028N8465O1180j2471q6925j18488J36696J4774M4730N5478
6888B39260k1093j11958J31963K42987l55246j95189L18730j99410o4292m061
6878a8309Q6974J09635P5030m9149J05661L0440k15289l30681K29397K2601m9824
6867c514J63324l6033J09933O7171j92739k53555k8460O3699K57357J47972p3931
$$ plain form
6942 274138 179311 185484 271968 393601 427086 235077 116066 208478 338588 419937 319899
6931 319899 138892 -118507 55474 131881 93355 146374 244068 280617 203767 340902 380376
6920 380376 369659 393281 223438 192183 87898 258575 317072 338508 231323 27824 167283
6909 167283 -61617 -158964 -11693 268660 124023 321084 669112 543654 152401 57550
6899 57550 -4207 85821 144286 205466 192995 106070 -12418 124278 139052 183782 239260
6888 239260 218167 106209 238172 481159 125913 -69276 249454 50044 -14248 -18309
6878 -18309 68665 178300 253330 204181 309842 340282 124993 -205688 23709 46310 -3514
6867 -3514 159810 123777 233710 300881 108142 -145413 -173873 -110174 147183 295155 221224
6856B21224J8483P6661p7414K13427m6773k38604J6991J33290j17543O7924k1043
6845B46623J99698k07503R9155m4515k07511L857o8968J48950K87764j85126q7446
6834A84978l2946k06639j29650L85305J40699p4103q6699o3938J94040L9856o8432
6823B82471j56072o7421K48452j40104q0398N6718J33684J7314j10051p2625M8045
6812A60013K50076j44824j17910j7142J51104j20698K95891j72696J64951K5034
6802D73799j95837N8822N1859J57708j25953j8254r5510M8989J73698j27271j38335
6791B63715p5701J60948O2388l22420J55513k53480L88311k57739k8693L82664
6781D75506J1214p7575M3466L14756k33594j87526j55553J72492j65150M0340
$$ plain form
6856 221224 239707 316368 238954 452381 405608 167004 183995 317285 199742 267666 246623
6845 246623 446321 238818 337973 293458 85947 89804 20836 169786 457550 272424 184978
6834 184978 152032 -54607 -184257 201048 341747 267644 180945 117007 311047 350903 282471
6823 282471 126399 58978 307430 167326 86928 143646 277330 294644 184593 111968 160013
6812 160013 410089 265265 147355 130213 281317 160619 456510 283814 448765 473799
6802 473799 277962 336784 388643 546351 420398 402144 306634 355623 529321 402050 263715
6791 263715 188014 348962 411350 88930 244443 -9037 379274 121535 92842 475506
6781 475506 486720 409145 452611 767367 533773 346247 190694 363186 198036 238376
6771B38376J01368j72710L4230p6027j26803L5055j7501L31730K12381n6767k37711
6760B65621k34433j61080M2547K04715K3475r9161J28145J83772n9540J21778
6750D15839l1468k4403j19050J34738j48728J2303L47443k52361n5060J1122L68165
6739F58540r2865m35539k95149R3473K94823l9886N7344J25614N858r8985j95311
6728G7917R4794K00090R6883M4036j49821o0083l1025M62571l08268r8961L88979
6717G17112j88424l09109j02778o9436n053K5644J04028J0428r6297N3887Q6239
6706B26241K1121k3679J11581P885M8312p8987N4708q4109j38552R0227J36091
6695C70839N168j29139p4707K8989J75470Q7476j82305N587J43449O7328J62886
$$ plain form
6771 238376 339744 167034 201264 125237 -1566 33489 15988 347718 560099 503332 265621
6760 265621 31188 -129892 -87345 117370 140845 41684 169829 353601 294061 415839
6750 415839 384371 359968 240918 375656 226928 239231 586674 334313 279253 290375 658540
6739 658540 565675 130136 -165013 -71540 223283 183397 240741 366355 372213 273228 77917
6728 77917 172711 372801 469684 513720 363899 303816 272791 735362 427094 328133 717112
6717 717112 528688 219579 116801 47365 42312 67956 171984 182412 86115 140002 226241
6706 226241 247362 223683 335264 343149 391461 312474 367182 283073 144521 234748 370839
6695 370839 376007 246868 172161 201150 376620 464096 281791 287378 430827 498155 661041
6684F61041O52j90150j04181J98514j58728j07926r8101p0472J37505K6143n3773
6673B40524K47783R2001j22736L77198j49940j55616J942q5461K8329J82400j44098
6662E12326j03031N8336j21311J96498J81983R6606j62604j59994J04569j88081
6652D15297O2831l9238J57118J59216r4716n248L7329k28698P8686k45871j3140
6641B83566K14829N5737k06582r9870J79177J65974J01942k61062J48407K32271
6631H14389j28933q4352R8277j42947q4787J9932o4720j050K61866K04358J18196
6620A010229L7434j25646L9342M0502j29485j20028J89809R7582j43240L62232
6610A258731j72756n1261k30849M9924M2924j95193P613J07327K33708j83135
$$ plain form
6684 661041 661693 471543 367362 565876 407148 299222 201121 130649 268154 294297 240524
6673 240524 488307 580308 457572 834770 684830 529214 531156 445695 474024 656424 512326
6662 512326 409295 467631 346320 542818 724801 821407 658803 498809 603378 415297
6652 415297 478128 438890 596008 755224 660508 655260 692589 463891 542577 296706 283566
6641 283566 498395 554132 347550 247680 426857 592831 694773 433711 582118 814389
6631 814389 685456 601104 699381 556434 471647 491579 426859 425809 687675 892033 1010229
6620 1010229 1047663 922017 961359 1001861 872376 752348 942157 1039739 896499 1258731
6610 1258731 1085975 1034714 803865 853789 896713 701520 709133 816460 1050168 867033
6600H67033J6133n6540J13893k4545q0499J96107k79593J45346P6845L06622P822
6589A288624j83629L1263j11474J09474K3706P5144N9345J35301k7615j59696
6579A240443o3678k19354K67279J93556k380J71473p5501K51014Q5868Q6029J33572
6568B068321J53790J45555L27073K28809N8071L04928J2010J52371L44389O4903
6558C860220J30380m9061j9257l93049l76373L698k2805j3511j27391o3193j83727
6547B745931j11080j4786j8349O4822k36362o1151K865J77675k33352m6197L25864
6536B595880K55722p2877k7367K79362j53300j20763j47949j17820j42673j57162
6526B191053L8601J45933j77410O3107R5909k59927k19517j4525r5008J56748
$$ plain form
6600 867033 883166 826626 940519 915974 835475 1031582 751989 897335 974180 1280802 1288624
6589 1288624 1104995 1136258 1024784 1134258 1157964 1233108 1292453 1427754 1400139 1240443
6579 1240443 1176765 957411 1224690 1418246 1415866 1587339 1511838 1762852 1848720 1934749 2068321
6568 2068321 2222111 2367666 2694739 2923548 2981619 3286547 3298557 3450928 3795317 3860220
6558 3860220 3990600 3941539 3922282 3529233 3152860 3156558 3133753 3120242 2992851 2929658 2745931
6547 2745931 2634851 2620065 2601716 2666538 2430176 2369025 2371890 2549565 2316213 2270016 2595880
6536 2595880 2851602 2778725 2751358 3030720 2877420 2756657 2608708 2490888 2348215 2191053
6526 2191053 2229654 2375587 2198177 2261284 2357193 2097266 1877749 1863224 1768216 1924964
6516A924964J75297n4213j25777k927j55774K16181P6126j13336n268J07414N2042
6505B094729Q4769j82041O6652J01934j24233J56716l26613R448m1160o1635J68315
6494A946881l78476o6594Q7584M4184P4479j15653O0674n5201K03603J55380m8856
6483A908005o0390M7483n6690p7772k45843R8439o7542j6734K47494o8960j60905
6472A546585J0541K78112P1821k00349l04035J50822J59379j91031M9014J44603
6462A715462O0030Q9328l2743j39266J58897Q1858r7444J40137j53089J318L49686
6451B174174L085J35238J43267j68186K16604L0822J58817J27459j97640j73735
6441B449905l5327K7608J8879O4167R6555N5829n4704q6012K04142K30416j24964
$$ plain form
6516 1924964 2100261 2046048 1920271 1917344 1761570 1977751 2053877 1940541 1935273 2042687 2094729
6505 2094729 2179498 1997457 2064109 2166043 2041810 2198526 1871913 1881361 1840201 1778566 1946881
6494 1946881 1568405 1501811 1589395 1633579 1708058 1592405 1653079 1597878 1801481 1956861 1908005
6483 1908005 1847615 1895098 1838408 1760636 1514793 1613232 1545690 1528956 1776450 1707490 1546585
6472 1546585 1557126 1835238 1907059 1706710 1402675 1553497 1712876 1521845 1570859 1715462
6462 1715462 1775492 1864820 1832077 1692811 1851708 1933566 1836122 1976259 1823170 1824488 2174174
6451 2174174 2177259 2312497 2455764 2287578 2504182 2535004 2693821 2821280 2623640 2449905
6441 2449905 2414578 2442186 2461065 2525232 2621787 2677616 2622912 2536900 2741042 2971458 2846494
6430B846494l91038L0436k054l6472m8592k08226J90930j1997j53656J46558p4609
6419B287774M0153L51345K282k90084k10791K40275j44742j39202m9263p001M6050
6408B126796j11374P485L3119r5908J5372m8992R0109n7750M43081K05425l15036
6397B292327J53002L11874j58739k22083K09256K59367K18708K50213j34536n068
6387C174321k1427l6924j05387j98902M6235K24736J67195K855M0864J13620L62500
6376C769686K95070n6943k9345p018K33919J18808j00983l15172J80004K36396
6366D324422j78014l67511J56876J10849k48256J84484j2009M1500L8295j81629
6356C869007n9171j1234j16005q6494k7031L04041j35096K63096J39230o6110
$$ plain form
6430 2846494 2455456 2485892 2483838 2447366 2398774 2190548 2381478 2369481 2215825 2362383 2287774
6419 2287774 2327927 2679272 2681554 2391470 2180679 2420954 2276212 2137010 2087747 2080746 2126796
6408 2126796 2015422 2022907 2056026 1960118 1975490 1926498 2016607 1958857 2401938 2607363 2292327
6397 2292327 2445329 2757203 2598464 2376381 2585637 2845004 3063712 3313925 3179389 3174321
6387 3174321 3152894 3115970 3010583 2811681 2857916 3082652 3249847 3252702 3293566 3407186 3769686
6376 3769686 4064756 4007813 3978468 3971450 4205369 4324177 4223194 3908022 4088026 4324422
6366 4324422 4146408 3778897 3935773 4046622 3798366 3982850 3970841 4012341 4050636 3869007
6356 3869007 3809836 3798602 3682597 3596103 3569072 3873113 3738017 4001113 4140343 4074233
6346D074233R8365q1542P4130L44275j2176j81573j3928K17772L5974j22231j47124
6335D286175J56140L1546J13850R5770L17686j71896J21260J64231K00980L03706
6325E619448J28673M28417L86122L77720K72498L37134J6009J57630J48657O193
6315G878501k47439j31955P289J14616o6571R0768K73336J22430M51225L45011
6305H837211K07850Q5752J0871O04607O25647L21533O54648L90527K04026N71839
6295A2514511O2369j63297j96684j07968N1076p8029K41428J19681J08571J89787
6285A2741445K87510O96985P30380N30939M44474O07261L59482N12602M04904
6276A7315982K24312L4490J22464J2377l48130j59579M3407j44492j39073j18947
$$ plain form
6346 4074233 4172598 4091056 4165186 4509461 4497285 4315712 4301784 4519556 4555530 4433299 4286175
6335 4286175 4442315 4473861 4587711 4683481 5001167 4829271 4950531 5114762 5315742 5619448
6325 5619448 5748121 6176538 6562660 6940380 7212878 7550012 7566021 7723651 7872308 7878501
6315 7878501 7631062 7499107 7506396 7621012 7554441 7645209 7918545 8040975 8492200 8837211
6305 8837211 9045061 9130813 9141684 9746291 10371938 10693471 11348119 11738646 11942672 12514511
6295 12514511 12576880 12413583 12216899 12108931 12160007 12081978 12323406 12443087 12551658 12741445
6285 12741445 13028955 13725940 14456320 14987259 15431733 16038994 16398476 16911078 17315982
6276 17315982 17540294 17574784 17697248 17709625 17361495 17201916 17245323 17100831 16961758 16842811
6266A6842811l26963p5889k82395j53989j91211q4481M15829L85922L23313O48447
6256A7501394M76983N96018M67565J91390L53662K85630M61607N07861K16841
6247B1058951O32653L28463o3283j79737j53649k41676m05669n79427k49131l38266
6237A9809229m55738l34602m9864k9626m4408L19414K55062O9425M912J86868
6227A9730672L71622N40434O99055P93278N96605O13216K82705N98937J45325
6218B4371849K15455L24508K64815J01013L07729K40222Q1808K48880O81342P69307
6208B7606928O42429R66906O79710P28548P76505P65181R27542J026899J226254
6199C5346902J727185J622458J515814K227936K485447L066825L406184M321408
$$ plain form
6266 16842811 16515848 16439959 16157564 16003575 15812364 15727883 16143712 16529634 16852947 17501394
6256 17501394 17978377 18574395 19041960 19233350 19587012 19872642 20334249 20842110 21058951
6247 21058951 21691604 22020067 21956784 21777047 21623398 21381722 20976053 20396626 20147495 19809229
6237 19809229 19353491 19018889 18969025 18939399 18894991 19214405 19469467 19538892 19543804 19730672
6227 19730672 20102294 20642728 21341783 22135061 22731666 23344882 23627587 24226524 24371849
6218 24371849 24587304 24911812 25176627 25277640 25585369 25825591 25907399 26156279 26837621 27606928
6208 27606928 28249357 29216263 29895973 30624521 31401026 32166207 33093749 34120648 35346902
6199 35346902 37074087 38696545 40212359 42440295 44925742 47992567 51398751 55720159
6191E5720159N197718O244316P150817P559298O443313L447079q20585l223664
6183H7718451l475495k980815j435090M73563J965954L384251M098251M655916
6175I4404986N211592M090503J912280J603734K320306M098172O143551P549566
6167A27334690P190159M717361K107251m51457j485881k419657k417870k082622
6159A32491974j738756j921001l759758n533072n566995m527738k228346n0756
6151A07165552J998236M137319N803766O478255O342283M410779J23626k065161
6143A34394655j812941r3510K442971M026072M502954K617314j375718o446005
6135A38255792j0309256j1808459j1595056j0089689q170456o008593m892989
$$ plain form
6191 55720159 60917877 67162193 74313010 81872308 88315621 91762700 90942115 87718451
6183 87718451 84242956 81262141 79827051 80300614 82266568 85650819 89749070 94404986
6175 94404986 99616578 103707081 105619361 107223095 109543401 113641573 119785124 127334690
6167 127334690 134524849 139242210 141349461 140898004 139412123 136992466 134574596 132491974
6159 132491974 130753218 128832217 125072459 119539387 113972392 109444654 107216308 107165552
6151 107165552 109163788 113301107 119104873 125583128 131925411 136336190 136459816 134394655
6143 134394655 132581714 132488204 134931175 138957247 143460201 146077515 144701797 138255792
6135 138255792 127946536 116138077 104543021 94453332 86282876 80274283 75381294
6128G5381294m498462l498648k783231k084420j549671p08847m00943K81834R90401
6119F1129307J680545K314168K983564L810756L893519L267855J361779j233457
6111G9208036l647146n604260o345680n921599m916679m338507l733665l383294
6103D1317206k747945k509244k492197k128432j675069j939978j478967j061555
6095B5283819j101409j149293q54051p85423q07365n46245n47533p85172n00563
6086A8206765o12481m65150m07923k60008j87920k67931m62254j43473k57270
6077A5142355n86238j69225n61799l87059n81447m20231m35024l71611m28925
6068A1200796m07535m23883k12613n76663M8459J39779k12843p907q3436m87859
$$ plain form
6128 75381294 70882832 67384184 64600953 62516533 60966862 60258015 59857072 60138906 61129307
6119 61129307 62809852 65124020 68107584 71918340 75811859 79079714 80441493 79208036
6111 79208036 75560890 69956630 63610950 57689351 52772672 48434165 44700500 41317206
6103 41317206 38569261 36060017 33567820 31439388 29764319 27824341 26345374 25283819
6095 25283819 24182410 23033117 22179066 21393643 20586278 20040033 19492500 18707328 18206765
6086 18206765 17594284 17129134 16721211 16461203 16273283 16005352 15543098 15399625 15142355
6077 15142355 14556117 14386892 13825093 13438034 12856587 12436356 12001332 11629721 11200796
6068 11200796 10793261 10369378 10156765 9580102 9628561 9768340 9555497 9547590 9464154 8976295
6058H976295k77309l04377j77060j11290k2202q3766m00122k85588J24286J20931
6048G559798k96048j81799K1959k23989j84888o8549O6951Q9523m1819p9726l94192
6037F267221R8602p0914j32564k655J73089r2052q8451K34303K9167J98826J43155
6026F757727r5372k41684j47678K59279j83568l69694j43559L05113J64788j26719
6016F178633q3625l31792j72945J51886j00990l11986J14341K40142P8971k10458
6006E552177J35443J5748J79801J37560P2447K8128R3079P61K64420M0459j65565
5995F354458k40510J22363k44640k57081J85565o6074r2530p436j38162o2369
5985E553584k29099l63935L7613K84056l03521k56298L49669J00790K17443q6467
$$ plain form
6058 8976295 8698986 8394609 8217549 8106259 8084057 8000291 7600169 7314581 7438867 7559798
6048 7559798 7263750 7081951 7103910 6879921 6695033 6626484 6693435 6782958 6741139 6661413 6267221
6037 6267221 6365823 6294909 6162345 6159690 6332779 6240727 6152276 6386579 6415746 6614572 6757727
6026 6757727 6662355 6420671 6272993 6532272 6348704 5979010 5835451 6140564 6305352 6178633
6016 6178633 6095008 5763216 5590271 5742157 5641167 5329181 5443522 5683664 5762635 5552177
6006 5552177 5687620 5703368 5883169 6020729 6093176 6121304 6214383 6215144 6479564 6520023 6354458
5995 6354458 6113948 6236311 5991671 5734590 5920155 5854081 5761551 5754115 5615953 5553584
5985 5553584 5324485 4960550 4998163 5282219 4978698 4722400 5072069 5172859 5390302 5303835
5975E303835J03911J17200P3437k6986m1353l31883O0224l5127k47505j49602
5965D826151o3100J45800j18515j280r5278n6893j1490j81409k74960K35989q3210
5954D321805o0745J88472l169m5356k79893O8384J54253r5827j81937L01369J09255
5943D476611K9350j46426j00397L1629k68723M0037J17455Q2668O2780N8770K66530
5932D650284J36520n3515k0625M436J7042l09423q9721N64296J4201j48455K29111
5921D994151j36433J14594K00993j54220o8744j36900J76944J55750K79856k09617
5911E216374p4949J65698K79658j31886J64847J44077j53133M6892K91693K33923
5901F183194M3832J25189o5119N33827J81616j08158J26665J05269J12072j64398
$$ plain form
5975 5303835 5407746 5524946 5598383 5571397 5530044 5198161 5258385 5223258 4975753 4826151
5965 4826151 4763051 4908851 4790336 4789056 4693778 4636885 4625395 4443986 4169026 4405015 4321805
5954 4321805 4261060 4449532 4446363 4401007 4121114 4189498 4343751 4247924 4065987 4367356 4476611
5943 4476611 4505961 4359535 4259138 4290767 4022044 4062081 4179536 4262204 4324984 4383754 4650284
5932 4650284 4786804 4733289 4712664 4717100 4734142 4424719 4334998 4899294 4913495 4765040 4994151
5921 4994151 4857718 4972312 5173305 5019085 4950341 4813441 4990385 5146135 5425991 5216374
5911 5216374 5141425 5307123 5586781 5454895 5619742 5763819 5610686 5657578 5949271 6183194
5901 6183194 6227026 6352215 6287096 6820923 7002539 6894381 7021046 7126315 7238387 7073989
5891G073989L8006N5837M6786j61856m7450k4694J99322L71234l09012m962J43009
5880G380209K20404K18067O4463J25134K32408K77704K09562k32467J77992K11860
5870H885336K77600L28608K10460K39614M6344j79880J81247N1098J02536J50419
5860A0293382J27513M4811m8189k15467K01906M74574k02205K41741l148k98111
5850A0616807R8951J47438O86k3451R9848J01825Q8001l7866m4144l1233j1550
5839A1005312l7259K75199L27474K22486J91894J5921J29614K87505K98830M0693
5829A2757669j39638M29656M5785j28863n7368r1340L80399P3818P0132j10137
5819A3230113K96568N58018L20928K03087L983m0261K35375L77254L19781L35104
$$ plain form
5891 7073989 7111995 7167832 7214618 7052762 7005312 6980618 7179940 7551174 7242162 7237200 7380209
5880 7380209 7600613 7818680 7883143 8008277 8240685 8518389 8727951 8495484 8673476 8885336
5870 8885336 9162936 9491544 9702004 9941618 9987962 9808082 9989329 10040427 10142963 10293382
5860 10293382 10420895 10465706 10417517 10202050 10403956 10878530 10676325 10918066 10914918 10616807
5850 10616807 10715758 10863196 10863882 10840431 10940279 11042104 11130105 11092239 11048095 11016862 11005312
5839 11005312 10968053 11243252 11570726 11793212 11985106 12001027 12130641 12418146 12716976 12757669
5829 12757669 12618031 13047687 13093472 12964609 12907241 12815901 13196300 13270118 13340250 13230113
5819 13230113 13526681 14084699 14405627 14608714 14612697 14572436 14807811 15185065 15504846 15839950
5809A5839950J70448L4777M75832L37269L61026K98816K79579j1678K15503M53793
5799A8455315J77336r0606K35479L93487L80961M15429L09885P46699O53744M09018
5789B2086747N96348O20153P49663O63118P54844J039933Q69222P57937R4146
5780B8232111K22236j75893o4728L24055J01614J13352J83972M79125L89351K70205
5770C0075400O82893L44202N79171N38552M84529Q70020Q86968J202178J089666
5761C6753579J245542J405659J319749J576948J582397J502313J751730J701719
5753D8839636J393225J595462K323182K940578L193866L736985M399324M902508
5745G3324766N489491N387304L765083J440257j392390l834848m876319m758646
$$ plain form
5809 15839950 16010398 16045175 16521007 16858276 17219302 17518118 17797697 17786019 18001522 18455315
5799 18455315 18632651 18542045 18777524 19171011 19551972 19967401 20277286 21023985 21677729 22086747
5789 22086747 22683095 23303248 24052911 24716029 25470873 26510806 27380028 28137965 28232111
5780 28232111 28454347 28278454 28213726 28537781 28639395 28752747 28936719 29415844 29805195 30075400
5770 30075400 30758293 31102495 31681666 32220218 32704747 33574767 34461735 35663913 36753579
5761 36753579 37999121 39404780 40724529 42301477 43883874 45386187 47137917 48839636
5753 48839636 50232861 51828323 54151505 57092083 60285949 64022934 68422258 73324766
5745 73324766 78814257 84201561 87966644 89406901 88014511 84179663 79303344 74544698
5737G4544698m055128k916810j942466j335408n87457r9336M51480J381176J586508
5728F7027257K002061K559397K720037L829135N322024O474633P479757Q681633
5720A06095934R710911R076407N922132J20845n174052r494828j0539772r845448
5712I5872129q520973o630694n195240l730985l248029k460467k338999j883743
5704F1862999j288305q08056m97378M94205J009561J258905J848836K467581K720464
5695F9068812L145333K811351J771311J51540k445709l919526m083938l911640
5687F2587534l403595k991927k631942k377076k422461j982510j787911j766335
5679D3223777j634806j589606j542755j296240q33136j010402j162468n50037
$$ plain form
5737 74544698 70489570 67572760 65630294 64294886 63707429 63608093 64059573 65440749 67027257
5728 67027257 69029318 71588715 74308752 78137887 83459911 89934544 97414301 106095934
5720 106095934 115806845 124883252 130805384 130926229 125752177 116257349 105717577 95872129
5712 95872129 87351156 80720462 75525222 71794237 68546208 66085741 63746742 61862999
5704 61862999 60574694 59766638 59269260 59763465 60773026 62031931 63880767 66348348 69068812
5695 69068812 72214145 75025496 76796807 76948347 74502638 70583112 66499174 62587534
5687 62587534 59183939 56192012 53560070 51182994 48760533 46778023 44990112 43223777
5679 43223777 41588971 39999365 38456610 37160370 36327234 35316832 34154364 33604327
5671C3604327p14913m98657l20254m99691l35322l40791N3078P6994p2555K336
5661C0954552j42242J31436K62334N25629O27589J74603L79595j61839k62644
5652C2489013m97783k15389k97955j33124o6464j4892L98772K62210N11661O44100
5642C3080149N28636P25866Q37415P18982P84208Q25259R47848J116807O20230
5633D0185400O49119J448071R70906J366233J549916J273002J638296J551467
5625E0632410J608902J650835J747285J886261J482389J708025J979290J856191
5617F4551588J663193J771499K214810K166504K093981K201428J972613K195990
5609H0831606K308183K573059L394917M108905N063560N489726O519708P634272
$$ plain form
5671 33604327 32889414 32390757 32070503 31570812 31235490 30894699 30947777 31024771 30952216 30954552
5661 30954552 30812310 30943746 31206080 31731709 32359298 32533901 32913496 32751657 32489013
5652 32489013 31991230 31775841 31477886 31344762 31278298 31263406 31662178 31924388 32436049 33080149
5642 33080149 33608785 34334651 35172066 35891048 36675256 37500515 38448363 39565170 40185400
5633 40185400 40834519 42282590 43253496 44619729 46169645 47442647 49080943 50632410
5625 50632410 52241312 53892147 55639432 57525693 59008082 60716107 62695397 64551588
5617 64551588 66214781 67986280 70201090 72367594 74461575 76663003 78635616 80831606
5609 80831606 83139789 85712848 89107765 93216670 98280230 103769956 110289664 117923936
5601A17923936Q784995R977644J0750555J1213533J1886711J2735879J3329441
5594A96602694J4043055J3909370J1705969N284383l607788r920120j2985401
5587B15032162j2823000j0688100q773287p081257o799377n953862m965863n114460
5579A52832956o334791p476753p026965n142158k507371L27662J929201K527148
5571A29128929R20448k294861m805383n932222n306318l735862j842223r93528
5563A05138980j949861l714680m665022m555618l453319j946934n08743R22752
5555H5267555J944171K886313L889582L176673P55404l082810o233339p913556
5547H0689993p258309n713836n068106l905449l278724k958305k954047k741101
$$ plain form
5601 117923936 126708931 136686575 147437130 158650663 170537374 183273253 196602694
5594 196602694 210645749 224555119 236261088 241545471 237937683 228017563 215032162
5587 215032162 202209162 191521062 182747775 175666518 168867141 162913279 157947416 152832956
5579 152832956 146498165 139021412 131994447 126852289 124344918 124672580 126601781 129128929
5571 129128929 130049377 127754516 122949133 117016911 111710593 107974731 106132508 105138980
5563 105138980 103189119 99474439 94809417 90253799 86800480 84853546 84344803 85267555
5555 85267555 87211726 90098039 93987621 97164294 97919698 94836888 88603549 80689993
5547 80689993 73431684 67717848 62649742 58744293 55465569 52507264 49553217 46812116
5539D6812116k539788k229396k134235j610716j474561j460952j182773m57948
5531C3721747o05719j027919j065954p80718r59973j304828j116989q12220p37290
5522B5310137j027428n15699j16281o58306l52794p05903n14760k02405n02666
5513B0713895m47582m74395q9499n40991n43623l66636k62522m16531m30981J11801
5503A7252936l48831m53721j97830n69612k49143n53690l14850k79566n27493
5494A3758200j6292j00745k72891j68762n20555j58732k83027n36838j24330L029
5484A1579057r9301j14227k73000Q5419n9935K3961k2949k13499m6216l27260
5474A0532050l98687o7315m31633l28635k9060K15155l07500l25781r2692j84738
$$ plain form
5539 46812116 44272328 42042932 39908697 38297981 36823420 35362468 34179695 33721747
5531 33721747 33116028 32088109 31022155 30241437 29281464 27976636 26859647 26047427 25310137
5522 25310137 24282709 23767010 23650729 22992423 22639629 21933726 21418966 21216561 20713895
5513 20713895 20266313 19791918 19702419 19161428 18617805 18251169 17988647 17572116 17141135 17252936
5503 17252936 16904105 16450384 16252554 15682942 15433799 14880109 14565259 14285693 13758200
5494 13758200 13741908 13641163 13368272 13199510 12678955 12520223 12237196 11700358 11576028 11579057
5484 11579057 11479756 11365529 11092529 11177948 11118013 11141974 11119025 10905526 10859310 10532050
5474 10532050 10133363 10066048 9634415 9305780 9276720 9491875 9184375 8858594 8765902 8581164
5464H581164j14932K963k36075l50428N8180l48735k8816R8335j00311o3960J14459
5453G611844j27234l2946j13714j95017k69309r1836j95482k23255J34271j06030
5443F391292l3059m8740p5931k57809j37795r1499k17210M01985k74578m34790
5433E221866J07882m1177K26545k09995j82603j16848N8491L05316N9049r3440
5423E335086N0491j04774J8764p2673k38154j85147p5656O1742j59760K2463j32550
5412D519832K34842j25214r3040j71763m1961R2817j77098q4873k16602M5782
5402C982722J94675K48873k28610j31723q6365O8749j35961K1343K81954r538
5392D206119j38548J0856p5986k58228l0553N4152k69509j10029J45117j998J30
$$ plain form
5464 8581164 8466232 8469195 8233120 7882692 7940872 7592137 7563321 7661656 7561345 7497385 7611844
5453 7611844 7484610 7451664 7337950 7142933 6873624 6781788 6586306 6363051 6497322 6391292
5443 6391292 6358233 6309493 6233562 5975753 5837958 5746459 5529249 5931234 5656656 5221866
5433 5221866 5329748 5288571 5515116 5305121 5122518 5005670 5064161 5369477 5428526 5335086
5423 5335086 5385577 5280803 5299567 5226894 4988740 4803593 4727937 4789679 4629919 4652382 4519832
5412 4519832 4754674 4629460 4536420 4364657 4322696 4415513 4238415 4153542 3936940 3982722
5402 3982722 4177397 4426270 4197660 4065937 3979572 4048321 3912360 3933703 4215657 4206119
5392 4206119 4067571 4078427 4002441 3744213 3713660 3767812 3498303 3388274 3533391 3531393 3531523
5381C531523m0402k12357p5934R3967j67768J36784p2381J52483Q5135j01640
5371C329410l73238j01775K28333J67213R9496K6533P7734N6023J44O2740K35496
5360C808109m45197k26304j05502j37425p7j03832n91L92616M0466j56289j21046
5349B944928j3253l2578k3481Q8824n3239J2565k55810L12758k85273k76739R7898
5338B516600L53284q7677k28896L3361k8762P8265m1912J67260r4150J92332j0669
5327B849036k78908J99312l649o4756Q7407R2807j64467n0653o7468L4413J43305
5316B776379k7261o5453k38416K02813L04527k65662j07525L4892j45440L37065
5306B805919R3715K6514k07917k21843Q9390J42557K4002j26220J87121L4363
$$ plain form
5381 3531523 3491121 3278764 3202830 3296797 3129029 3265813 3193432 3345915 3431050 3329410
5371 3329410 2956172 2854397 3082730 3249943 3349439 3375972 3453706 3509729 3509873 3572613 3808109
5360 3808109 3362912 3136608 3031106 2893681 2893604 2789772 2789181 3181797 3222263 3065974 2944928
5349 2944928 2931675 2899097 2875616 2964440 2911201 2923766 2667956 2980714 2695441 2418702 2516600
5338 2516600 2869884 2782207 2553311 2586672 2557910 2636175 2594263 2761523 2667373 2859705 2849036
5327 2849036 2570128 2769440 2765791 2701035 2788442 2881249 2716782 2666129 2598661 2633074 2776379
5316 2776379 2749118 2683665 2445249 2648062 2952589 2686927 2579402 2614294 2468854 2805919
5306 2805919 2899634 2926148 2718231 2496388 2585778 2728335 2752337 2626117 2813238 2847601
5296B847601j1838P7998L1069L3095J74089j23897R1544j53085J46941J21856
5286C235373J15133r886j19010o342j60657J74790r3561r0467n4081k30607K34095
5275B994780r6741j0084J59313O4898l8103l45539J11372J98705o5455P9926R0817
5264C143889N8247J68436L2097m38868m01669L11209K65564M3206N9547L2981
5254C274639J14965J15789j46910j1960k4712R8958Q324q932k9829J19173M0285
5243C549790j27104L80402K25031r6668j18938K5578K83457k89775n3409J70720
5233C949084K1805k6922L14415M9400k7430l78127R9097K3124K25040J7604K98003
5222D565093M4103j85419L4486L11549J7091K32214M96563J98659J35138L45178
$$ plain form
5296 2847601 2835763 2913761 2944830 2977925 3152014 3028117 3119661 2966576 3113517 3235373
5286 3235373 3350506 3340620 3221610 3215268 3054611 3229401 3135840 3045373 2991292 2760685 2994780
5275 2994780 2898039 2887955 3047268 3112166 3074063 2728524 2839896 3038601 2973146 3053072 3143889
5264 3143889 3202136 3370572 3402669 2963801 2562132 2873341 3138905 3182111 3241658 3274639
5254 3274639 3389604 3505393 3358483 3346523 3321811 3420769 3429093 3420161 3390332 3509505 3549790
5243 3549790 3422686 3803088 4028119 3931451 3812513 3838091 4121548 3831773 3778364 3949084
5233 3949084 3970889 3943967 4258382 4307782 4280352 3902225 4001322 4024446 4249486 4267090 4565093
5222 4565093 4609196 4423777 4458263 4769812 4786903 5019117 5515680 5714339 5849477 6194655
5212F194655J6777n0394j51641l02536l9687k10598p463L2284p2623j44329J13089
5201E377534j38852j72353j71045m4990j29760J4002k7495Q7766j33412q5493
5191D575902K19197j52684J43567l3983l04071J06519j50998J7098J8372J4046
5181D452965J83774K44638R4938K49306o8916k76017M37600L77842J47034j31101
5171E712063q5863R8404K07327J72373k27047K18290N1802J70540J48041K17069
5161F682999l32752k2917K21425M03737M7359J2704n5816o7114m2659k9708j01836
5150F715422o224J20908p5994K77706J51200j42280l0048J25356L82783L39442
5140G858271K55151N40542L71841J16707M22083K03789L65089k79564K8282L41886
$$ plain form
5212 6194655 6211432 6161038 6009397 5706861 5667174 5456576 5449113 5481397 5408774 5264445 5377534
5201 5377534 5238682 5066329 4895284 4850294 4720534 4734536 4707041 4794807 4661395 4575902
5191 4575902 4795099 4642415 4785982 4751999 4447928 4554447 4403449 4420547 4438919 4452965
5181 4452965 4636739 4881377 4976315 5225621 5156705 4880688 5318288 5696130 5843164 5712063
5171 5712063 5626200 5724604 5931931 6104304 5877257 6095547 6147349 6317889 6465930 6682999
5161 6682999 6350247 6327330 6548755 6952492 6999851 7012555 6956739 6889625 6846966 6817258 6715422
5150 6715422 6709198 6830106 6754112 7031818 7183018 7040738 7010690 7136046 7518829 7858271
5140 7858271 8113422 8653964 9025805 9142512 9564595 9768384 10133473 9853909 9882191 10224077
5130A0224077J2122J67484J24312J39173L8007L33902N42620O18845J79976K60794
5120A2641312P33159Q71443P16514N39729Q10903J317001J741282J560685K178552
5111B3110580K426105K393014J679104r13770j836366k210601k216119j545026
5103B0886921j117581j051130j054456q35991p44564k24722m02511q75428m43608
5094A4136930l54996l21410l48638m98971o6327j27515J5570M2894l26565J34540
5084A2285512M16925K56237K22648m0472k14288j58288l65065n07840k04018k8419
5074A1662932j61077k18735k04695R9477j01318L33376K59307J14609j17554R6785
5064A1763107R8959o5854K02808M42052K23094J7592Q1025O3443J21679M31983
$$ plain form
5130 10224077 10236199 10403683 10527995 10667168 10705175 11039077 11581697 12200542 12380518 12641312
5120 12641312 13374471 14245914 14962428 15502157 16313060 17630061 19371343 20932028 23110580
5111 23110580 25536685 27929699 29608803 28695033 26858667 24648066 22431947 20886921
5103 20886921 19769340 18718210 17663754 16827763 16083199 15858477 15455966 14580538 14136930
5094 14136930 13781934 13460524 13111886 12612915 12546588 12419073 12434643 12477537 12150972 12285512
5084 12285512 12702437 12958674 13181322 13140850 12926562 12768274 12403209 11895369 11691351 11662932
5074 11662932 11501855 11283120 11078425 11177902 11076584 11409960 11669267 11783876 11666322 11763107
5064 11763107 11862066 11796212 11999020 12441072 12664166 12681758 12762783 12826226 12947905 13379888
5054A3379888J65611J3897O6520K41455K77330K72504L56470L20086O07935O47137
5044A6348833R65141J212905J364152J768406K161208K791126K807191K381108
5036C1800070n55899k609563k851596k601047k033808j556792r66457o77993o64532
5027A7282383M27315J94630m47402l34339m34772Q7795Q1149q5272N7768N3192
5017A6882447J99025j29951L45885N93657q7046J01420J91439J83723M62435K97485
5007A9040519K72098J77342N39649M81127K55096J27493M26002M87298N33299
4998B2339923Q71515N49443R65219Q39188Q61473Q97647J057808J513044J542481
4989C1437741J522978J789013J253784N39065L21167K62414Q47561P22773R37408
$$ plain form
5054 13379888 13545499 13559396 13625916 13867371 14144701 14417205 14773675 15093761 15701696 16348833
5044 16348833 17313974 18526879 19891031 21659437 23820645 26611771 29418962 31800070
5036 31800070 31244171 28634608 25783012 23181965 21148157 19591365 18624908 17946915 17282383
5027 17282383 17709698 17904328 17456926 17122587 16687815 16775610 16856759 16771487 16829255 16882447
5017 16882447 17081472 16951521 17297406 17891063 17804017 17905437 18096876 18280599 18743034 19040519
5007 19040519 19312617 19489959 20029608 20510735 20765831 20893324 21319326 21806624 22339923
4998 22339923 23211438 23760881 24726100 25565288 26426761 27324408 28382216 29895260 31437741
4989 31437741 32960719 34749732 36003516 36542581 36863748 37126162 37973723 38696496 39633904
4980C9633904P64418P66766P59510P82188M63868J151201J389199R78785J261603
4971D7951442J580019J513424J208736J579857J109249J241076P23666R82493
4963E7889962P77837R56270J232186J715079K095391K241713K378027K592960
4955G1879425K935025L073267L409901L577159L578824L538571L338214L689981
4947I9020367L775277M186382L633102L291946K382558K008838J615772K060752
4939A21974994K168046K216883K478150K948501L528231L534532L539256M206069
4931A46594662M139968M729314M322743M072688L211219L237359K887488K851211
4923A76046652L042139L301104K146426J980347K442606L269988M079919M086749
$$ plain form
4980 39633904 40398322 41165088 41924598 42706786 43170654 44321855 45711054 46689839 47951442
4971 47951442 49531461 51044885 52253621 53833478 54942727 56183803 56907469 57889962
4963 57889962 58667799 59624069 60856255 62571334 64666725 66908438 69286465 71879425
4955 71879425 74814450 77887717 81297618 84874777 88453601 91992172 95330386 99020367
4947 99020367 102795644 106982026 110615128 113907074 116289632 118298470 119914242 121974994
4939 121974994 124143040 126359923 128838073 131786574 135314805 138849337 142388593 146594662
4931 146594662 150734630 155463944 159786687 163859375 167070594 170307953 173195441 176046652
4923 176046652 179088791 182389895 184536321 186516668 188959274 192229262 196309181 200395930
4915B00395930L484981L206348J544563N62693j167297j101770q47894J919597
4907B07997151N815668J2097832J9105201K7348908L4289263M6004007N5614694
4900D08272724N6675003K2805961l4438246n3217174n8248026m9662581l7400950
4893B54786711k7501619k0301540j4843588j2326235j3391584j5942972j5058403
4886A35420770j3323472j1219190r072622o557809n110027m147761l194364k440647
4878H0354878k111860j311251j179356j730706j694977k265845k664205k753636
4870F4643042k927340k442307k431486k132615j955012j505263q93592r23847
4862D9431580j054686j212332j330249j274826j148601j526107j538392j457946
$$ plain form
4915 200395930 203880911 207087259 208631822 209194515 208027218 206925448 206077554 207997151
4907 207997151 213812819 225910651 245015852 272364760 306654023 352658030 408272724
4900 408272724 464947727 487753688 453315442 400098268 341850242 292187661 254786711
4893 254786711 227285092 206983552 192139964 179813729 166422145 150479173 135420770
4886 135420770 122097298 110878108 101805486 95247677 90137650 85989889 82795525 80354878
4878 80354878 78243018 76931767 75752411 74021705 72326728 70060883 67396678 64643042
4870 64643042 61715702 59273395 56841909 54709294 52754282 51249019 50355427 49431580
4862 49431580 48376894 47164562 45834313 44559487 43410886 41884779 40346387 38888441
4854C8888441j342163j512849j063467p48933q52852o87430n40919o89640m70641
4845C0979547l98486q9788l82208m26248m2045J54114j7749L01952J76010m48844
4835B9806255o00745l45222o30553m73777m24527L6463j5725K55369N53092Q39313
4825B8999943N13300N85396P73271R08407O42878M05610M96893L55203o8941j46562
4815C3465398J26958K61865N07872J018170J396901J951107K343051K788155K429952
4806D6289429P79880k300902l298004l786556l142099k472622j781142j675210
4798B8612774j083960p64218r41434j058415j061355o09905o10522r73306p10115
4789B0799544n86880m12589j27737m00972n44443j24168k83226J25811k43289
$$ plain form
4854 38888441 37546278 36033429 34969962 34221029 33368177 32680747 32139828 31450188 30979547
4845 30979547 30581061 30491273 30109065 29682817 29640772 29794886 29777137 30079089 30255099 29806255
4835 29806255 29205510 28860288 28229735 27755958 27331431 27367894 27352169 27607538 28160630 28999943
4825 28999943 29513243 30098639 30871910 31780317 32423195 32828805 33325698 33680901 33611960 33465398
4815 33465398 33592356 33854221 34362093 35380263 36777164 38728271 41071322 43859477 46289429
4806 46289429 47069309 44768407 41470403 37683847 34541748 32069126 30287984 28612774
4798 28612774 27528814 26764596 25823162 24764747 23703392 23093487 22482965 21509659 20799544
4789 20799544 20212664 19800075 19672338 19271366 18726923 18602755 18319529 18445340 18202051
4780A8202051j62684k30420k86473j52362l96179m54652k81081m18410k53764
4771A5566026j75856m68697m20562j51155l61104k36450k44587l80436P6328K9219
4761A3232726R2287L2601j92114j0103l66873l84348J49598n2711k29054l85001
4751A1887008J08382m71437j41367K5294j37761k98156j00652k64353R1487K14763
4741A0913208J90210n2419j2830j00486j46394J43227o0240r8882p6563O2542
4731A0761373J84416P8382J61081Q2673l4215k99165K07468J91323m1362L532
4721A1295506M37738M19151K81222K48091L67752L83688K34994K02344n32r6826
4711A3773128J82788J82957J23317K40917K90219K09050K32714r7090K01333O12065
$$ plain form
4780 18202051 18039367 17808947 17522474 17370112 16973933 16519281 16238200 15819790 15566026
4771 15566026 15390170 14921473 14500911 14349756 13988652 13752202 13507615 13127179 13203507 13232726
4761 13232726 13325013 13357614 13165500 13155397 12788524 12404176 12553774 12501063 12272009 11887008
4751 11887008 11995390 11523953 11382586 11407880 11270119 10971963 10871311 10606958 10698445 10913208
4741 10913208 11103418 11050999 11038169 10937683 10791289 10934516 10874276 10775394 10698831 10761373
4731 10761373 10945789 11024171 11185252 11267925 11233710 10934545 11142013 11333336 11291974 11295506
4721 11295506 11733244 12152395 12433617 12681708 13049460 13433148 13668142 13870486 13869954 13773128
4711 13773128 13955916 14138873 14262190 14503107 14793326 15002376 15235090 15138000 15339333 15951398
4701A5951398L64672L77930N28977n249N03272L07669L63827J042718O27342O30070
4691B0692626Q59707N67496M11088P32367O78365P19785P18806N18536Q30854
4682B6729630O74538O64361P10876O36587R70438P10523R31510R62211R84782
4673C3975456J262552J377511J399596J053232J488573J635249J499269J744672
4665D5436110K321115K777563L020549L308645L605684L770855L950234M099107
4657G2289862M079282M559473N531841N970213O846128Q269675R549463J1922950
4649A29018887J5332727J9422174K3527350K7565137L1340556L3863129K9604434
4642C09674394J5190288q533753k7783068l5862018l5391856l0227262k3553085
$$ plain form
4701 15951398 16316070 16694000 17222977 17217728 17721000 18028669 18392496 19435214 20062556 20692626
4691 20692626 21552333 22119829 22530917 23263284 23941649 24661434 25380240 25898776 26729630
4682 26729630 27404168 28068529 28779405 29415992 30386430 31096953 32028463 32990674 33975456
4673 33975456 35238008 36615519 38015115 39068347 40556920 42192169 43691438 45436110
4665 45436110 47757225 50534788 53555337 56863982 60469666 64240521 68190755 72289862
4657 72289862 76369144 80928617 86460458 92430671 99276799 107546474 117095937 129018887
4649 129018887 144351614 163773788 187301138 214866275 246206831 280069960 309674394
4642 309674394 324864682 316330929 288547861 252685843 217293987 187066725 163513640
4635A63513640j8188226j4460912j1414866r662685p970290o766311n474671m678927
4627H4896752l135192k624895k012593j123798k33369J61940l08820n56201p43238
4618G4320586p95664j458232k363294l277047l538902m009496l804470k989551
4610E2083930k447473k257268k184100k382635k447178k377665k266543k219928
4602C3501140j692292j106476j391926r91977q13601q50215n63686n80759l73106
4593B5137102q99911o80119o06954o23582r59409p28790p32982o01890l92653
4584A8910812o11495l17868m65396m37347m51235q29521q03160m94803p38103
4575A3761884n11927k56051k80203m34695m02944J37982l9819l4888M0241m90553
$$ plain form
4635 163513640 145325414 130864502 119449636 109786951 101816661 95050350 89575679 84896752
4627 84896752 81761560 79136665 77124072 76000274 75766905 75928845 75620025 75063824 74320586
4618 74320586 73524922 72066690 69703396 66426349 62887447 58877951 55073481 52083930
4610 52083930 49636457 47379189 45195089 42812454 40365276 37987611 35721068 33501140
4602 33501140 31808848 30702372 29310446 28318469 27504868 26654653 26090967 25510208 25137102
4593 25137102 24237191 23557072 22950118 22326536 21367127 20638337 19905355 19303465 18910812
4584 18910812 18299317 17981449 17516053 17078706 16627471 15797950 14994790 14499987 13761884
4575 13761884 13249957 12993906 12713703 12279008 11876064 12014046 11974227 11939339 11979580 11489027
4565A1489027j8573m51107l49131R2J4081j30293l83185Q6675k85315k26458m2234
4554I703579K31600J15681J05115K31971K07822K26567J72714K4487Q0975j64171
4544A0936340l18059K67785J19915L29460n4220j45921J55836j53394p83547m04437
4534I949758Q5255j73545j17075k02946j47613k24622O5269Q0436m6478J76165
4524I444604J74499K08059p3083k8373K4286O9530j68204R5937J36899j6031k98945
4513I569178k12343J05281K26496k26306j77770j05747J1601K71256j64711P4765
4503I371700R3103j23687q6501J56315J00618N0888j57118j13339l4975l6549
4493I220455R7813j78724m50177l34581l9800K20042L36307j21685j76235K89627
$$ plain form
4565 11489027 11470454 11019347 10670216 10670308 10684389 10554096 10170911 10257586 9972271 9745813 9703579
4554 9703579 9935179 10050860 10155975 10387946 10595768 10822335 10995049 11019536 11100511 10936340
4544 10936340 10618281 10886066 11005981 11335441 11281221 11135300 11291136 11137742 10354195 9949758
4534 9949758 10035013 9861468 9744393 9541447 9393834 9169212 9234481 9314917 9268439 9444604
4524 9444604 9619103 9827162 9754079 9725706 9749992 9819522 9651318 9747255 9884154 9868123 9569178
4513 9569178 9356835 9462116 9688612 9462306 9284536 9178789 9190390 9461646 9296935 9371700
4503 9371700 9464803 9341116 9254615 9410930 9511548 9562436 9405318 9291979 9257004 9220455
4493 9220455 9318268 9139544 8689367 8354786 8314986 8535028 8871335 8749650 8573415 8863042
4483H863042K19838r6710L51506O35455O08189Q51187R38441J270677J461177
4474A5102802J538622J612892J193350K27081q81189j560539j860867j488846
4466A3883306j446301j179331p20767p02065n93095l80594k69224p89215p27486
4457G075228k22580j97821n9446k73905j26574k16613k38891r965l11437Q8273
4447E506269k32425j94937L17217j98422j02051k75829k57532l0740J47739j9952
4437D659337k16101p310j21778J32452P8194p7415J01740q5789k85707L46300
4427D523923j0622J56473L45932j25737K9445L54970K45183j85246J66535L34746
4417E835602K99494M22671O72114R39706Q52410J060279J334529J648440J627010
$$ plain form
4483 8863042 9082880 8986170 9337676 9973131 10581320 11432507 12370948 13641625 15102802
4474 15102802 16641424 18254316 19447666 19674747 18793558 17233019 15372152 13883306
4466 13883306 12437005 11257674 10536907 9834842 9241747 8861153 8591929 7802714 7075228
4457 7075228 6852648 6654827 6595381 6321476 6194902 5978289 5739398 5729433 5417996 5506269
4447 5506269 5273844 5078907 5396124 5197702 5095651 4819822 4562290 4531550 4679289 4659337
4437 4659337 4443236 4435926 4314148 4446600 4524794 4447379 4549119 4463330 4177623 4523923
4427 4523923 4513301 4669774 5015706 4889969 4919414 5274384 5519567 5334321 5500856 5835602
4417 5835602 6135096 6557767 7229881 8169587 9021997 10082276 11416805 13065245 14692255
4408A4692255M63984j170839j664994k035460j835655j230747o33185l62378n01031
4399E721950j43511J8325l78714l82703q7805J87952r5310l32670j66792j00453
4389D240269m5312N01843j0562k16129m0081n6986K95259r5560J77322N8963j46600
4378D662426j15039j09922R6353l38155p3785K33236J76635m8611j19796K66459
4368D629801N5636l115O1982N5866k33085J95240K03586J27901J47115K45206
4358E486133P3607p3350r4676j60552K95498R5995r6501K29602N5832J31168K19613
4347F162369Q2112P6293O9725M36861J95870J42997L41260N34901L17528j44223
4337H215693p4835j60191j4675j67984q3130K56636K34219K19229N4285J95198
$$ plain form
4408 14692255 15156239 13985400 12320406 10284946 8449291 7218544 6585359 6222981 5721950
4399 5721950 5578439 5596764 5218050 4835347 4747542 4935494 4840184 4507514 4340722 4240269
4389 4240269 4194957 4696800 4686238 4470109 4430028 4373042 4668301 4572741 4750063 4809026 4662426
4378 4662426 4547387 4437465 4533818 4195663 4121878 4355114 4531749 4483138 4363342 4629801
4368 4629801 4685437 4682322 4744304 4800170 4567085 4762325 4965911 5093812 5240927 5486133
4358 5486133 5559740 5486390 5391714 5231162 5526660 5622655 5526154 5755756 5811588 5942756 6162369
4347 6162369 6244481 6320774 6390499 6827360 7023230 7166227 7507487 8042388 8359916 8215693
4337 8215693 8140858 7980667 7965992 7798008 7714878 7971514 8205733 8424962 8479247 8674445
4327H674445J05109K16149Q3394J35970J73261O04976O79550M80820K43396L36391
4317A1733461L92030Q59859Q14819O86027N25911N08053P63973J227068J644802
4308A9156003K231993L009039L789823M819399N929603P550055Q781949N187034
4300F0454898n610948q366318q418819o979950m430806l168419j911887j650022
4292A9917729j170307q11931m56243l90712k22700n7181L7888J12279J54553P7680
4282A7191055k03416m92752n03817m51945j46754k16362n36034k45431o324k74433
4272A4113787k27639n09057J06905r1631K61286j89763k15694J23313q6273k54683
4262A3030551j249n7259j12964Q2114L07919K3849K5101K54694q2353j35760k0790
$$ plain form
4327 8674445 8779554 8995703 9079097 9215067 9388328 9993304 10672854 11153674 11397070 11733461
4317 11733461 12125491 12985350 13800169 14486196 15012107 15520160 16284133 17511201 19156003
4308 19156003 21387996 24397035 28186858 33006257 38935860 46485915 55267864 60454898
4300 60454898 54843950 46477632 38058813 31078863 26648057 23479638 21567751 19917729
4292 19917729 18747422 17935491 17479248 17088536 16865836 16808655 16846543 16958822 17113375 17191055
4282 17191055 16987639 16494887 15991070 15539125 15392371 15176009 14639975 14394544 14388220 14113787
4272 14113787 13886148 13377091 13483996 13392365 13653651 13463888 13248194 13371507 13285234 13030551
4262 13030551 13029302 12972043 12859079 12941193 13249112 13272961 13298062 13552756 13470403 13334643 13313853
4251A3313853K63598R6228N8634O7179j34729P891P5713J18841l1530j6172k9412
4240A3790094N0854J9561j3572k62797m44959k52965j94066k04628p3212k5322
4230A2388988l40865m98514l5118m75997n27679k06462k28226k17857k86387k56700
4220I315183k37128j14647k98609j86768j56518r5677r8979J85658l92158j59909
4210G760448O9973l47584l50941m35933j58651l5392l4509j11658M4948j68621
4200F232080k29230l99493k25935k0856J8714J3872j87852J62170j69580l7185
4190E156705j94494j03655k16043l06731L25133k74200J72385k95979k99933k27370
4180C735818p1186K13818Q5906o5345j50042j07641j94947J1253L0584L7437k02146
$$ plain form
4251 13313853 13577451 13673679 13732313 13799492 13664763 13672654 13748367 13867208 13835678 13819506 13790094
4240 13790094 13840948 13860509 13846937 13584140 13139181 12886216 12692150 12487522 12414310 12388988
4230 12388988 12048123 11549609 11514491 11038494 10510815 10304353 10076127 9858270 9571883 9315183
4220 9315183 9078055 8963408 8664799 8478031 8321513 8225836 8126857 8312515 7920357 7760448
4210 7760448 7830421 7482837 7131896 6695963 6537312 6501920 6467411 6355753 6400701 6232080
4200 6232080 6002850 5603357 5377422 5356566 5375280 5389152 5201300 5363470 5193890 5156705
4190 5156705 4962211 4858556 4642513 4335782 4660915 4386715 4559100 4263121 3963188 3735818
4180 3735818 3664632 3878450 3964356 3899011 3748969 3641328 3446381 3457634 3488218 3525655 3323509
4169C323509J39735j84819K30341o9197m23669j32701Q165j14644j64313j66678
4159B445729J44729j6637l1790l26616J71586j51018l08302k2539K59636J36826
4149B301604k49955Q2451J61490o2741J25821j96968o9391j93073m83J81712j18324
4138A962143r4118J95185J02970l50471j58460J06626K06408J03222K34881k8438
4128B279948j60933n7899j09955J20402J49115k38590n8568l021K6779J10505
4118B057783l33182j78058J18863j61627r0490j25390L39525j32991K1696k38289
4108A277840j86040O5840L40314j73466j84745n9531J09323j12343O5976j40899
4098A002269J72670J5771j10793K89423n7249r052J0924l47650K5219R6806k75701
$$ plain form
4169 3323509 3463244 3278425 3508766 3439569 3015900 2883199 2891364 2776720 2612407 2445729
4159 2445729 2590458 2573821 2542031 2215415 2387001 2235983 1927681 1905142 2164778 2301604
4149 2301604 2051649 2134100 2295590 2232849 2358670 2161702 2092311 1899238 1898755 2080467 1962143
4138 1962143 1868025 2063210 2166180 1815709 1657249 1763875 1970283 2073505 2308386 2279948
4128 2279948 2119015 2061116 1951161 2071563 2220678 1982088 1923520 1920499 1947278 2057783
4118 2057783 1724601 1546543 1665406 1503779 1413289 1287899 1627424 1494433 1516129 1277840
4108 1277840 1091800 1157640 1497954 1324488 1139743 1080212 1189535 1077192 1143168 1002269
4098 1002269 1174939 1190710 1079917 1369340 1312091 1303039 1313963 966313 991532 1088338 812637
4087H12637K05999j96208k01576K92961M3209j94628q9355j43503j42279J64140
4077E51397P2980R0540K96673k29137K63028l8952j48405O9854j59483J35240
4067I03735k7157K2758o8512M3020o3444K8311j56596m8428J42262k84273N2600
4056E44276J7563K8081k35071N3696J54861K50184P433j65015K49349k0403l69590
4045E15364p0448K60213j14511k6674J70643K00229J2436j61357j87306Q9659
4035F88248j60826j6171o531J5874J19025l7917K3159k75018J56276Q9360o9461
4024E26018N0333P8039J32128K1244k45183J07704K18272j97437j22951O6693
4014F34860j42861L47726k90120L5743l3865m1556j02758j13264J15928K8845
$$ plain form
4087 812637 1018636 822428 620852 913813 957022 762394 673039 529536 387257 551397
4077 551397 624377 714917 1011590 782453 1045481 1006529 858124 927978 768495 903735
4067 903735 876578 899336 830824 873844 810400 838711 682115 633687 775949 491676 544276
4056 544276 561839 589920 354849 408545 563406 813590 821023 656008 905357 884954 515364
4045 515364 444916 705129 590618 563944 734587 934816 947252 785895 598589 688248
4035 688248 527422 511251 504720 520594 639619 601702 624861 349843 506119 595479 526018
4024 526018 576351 654390 786518 807762 562579 670283 888555 691118 568167 634860
4014 634860 491999 839725 549605 585348 551483 509927 407169 293905 409833 438678
4004D38678R0249N4179k91369K02364L2857j47512p9097j37146L5204j3455K78883
3993D63835j54004K7245j1217J85342j73509j55509K7883P4999k38246Q8887J14361
3982B50067p2566J93933K45138k3371l70964k67612R7909j2919O296J89567l17954
3971h2476J52509P3283J14801l5294q7231J08144P0780j98703j11134L4045p0493
3960c1769J4924J1987N1910J60391J64978o1508p2262J3963k4744J03634j00224
3949B31280j27250J51496K5723K6293m2278j14836k9075J2438M2726J62864l01701
3938C7680M4678L13241l900j14608L7357O2520R7295j71039k7737j66861J20249
3927B28875q1020k7199P5253k54723j5977k265J81134N3945k69081J03878j30756
$$ plain form
4004 438678 528927 583106 291737 494101 526958 379446 300349 163203 198407 184952 463835
3993 463835 309831 337076 325859 511201 337692 182183 210066 285065 46819 135706 250067
3982 250067 177501 371434 616572 593201 222237 -45375 52534 39615 45911 235478 -82476
3971 -82476 70033 143316 258117 222823 135592 243736 314516 115813 4679 38724 -31769
3960 -31769 -16845 -4858 47052 207443 372421 310913 238651 252614 227870 331504 231280
3949 231280 104030 255526 281249 307542 265264 150428 121353 133791 176517 339381 37680
3938 37680 82358 395599 391699 277091 314448 376968 474263 303224 275487 108626 228875
3927 228875 147855 120656 195909 -58814 -74791 -77056 104078 158023 -111058 -7180 -137936
3916a37936R0419j69063M17738K00403l2493j0340l51078j01834K6160K94042
3906B26018P0818j32825k25691M8786r6057K45697j15414k92127L971O8599j45247
3895c43472J65648J92659M5191q4990k7670N4620m7881m9525n5318k16568K73330
3884i3976K51048j03684j2666q1090j15908L81603N8681j56733R8573J3307k84404
3873d5249r6466R488j2150J58822K04513k6046j93996J18382r5758p0590n5756
3862a04806N7923J80351j51790k6855L08426j48428q3131M1122j37362j27944
3852a92494m9310l2837L55567k15889Q9235L03490p2503m1917j1627l7076K56398
3841C51037p746j76449n9774M5807k96863o2538J67967j15672j47785L74120M39301
$$ plain form
3916 -137936 -47517 -216580 201158 401561 369068 358728 7650 -94184 -68024 226018
3906 226018 296836 164011 -61680 -12894 -108951 136746 21332 -270795 -266824 -198225 -343472
3895 -343472 -177824 14835 60026 -24964 -52634 1986 -45895 -95420 -150738 -367306 -93976
3884 -93976 157072 53388 40722 -40368 -156276 225327 284008 127275 225848 239155 -45249
3873 -45249 -141715 -132227 -144377 14445 218958 192912 -1084 117298 21540 -49050 -104806
3862 -104806 -46883 133468 -18322 -45177 263249 114821 31690 72812 -64550 -192494
3852 -192494 -241804 -274641 80926 -134963 -45728 257762 185259 143342 131715 94639 351037
3841 351037 343291 166842 107068 152875 -143988 -206526 -38559 -154231 -302016 72104 511405
3830E11405k91429K9079M8975j40283M4005J64027J31165M8904m82931k91512
3820b28595k37591L86333J92193J00371n2900j57011L5106j58254P2682J82266
3810A34600J43209r5506k21368J34412K37656J01197o7209j48013l30826O8708
3800d3140O52J6076K46963m9488k94849Q5597p5041K0643J386L033l4003M18831
3788B96660M018M2761J15920m83626J37943n030J09061l8699j76469K04101j4215
3777A92425p8851O6175N5651k10940k32857K98611K21533P1520l52311r1393J70355
3766A09918j63927N0685j66817j11910K87502J09731l582K17205k8774j80974
3756A19057m4869l4175J01739j10375k5326J92L57570k22806j03544J37847l9569
$$ plain form
3830 511405 219976 249055 298030 157747 201752 365779 496944 545848 62917 -228595
3820 -228595 -466186 -79853 112340 212711 159811 2800 37906 -120348 -47666 134600
3810 134600 277809 182303 -39065 95347 333003 434200 366991 218978 -111848 -43140
3800 -43140 -42488 -26412 220551 171063 -123786 -38189 -113230 -92587 -91201 -88168 -122171 296660
3788 296660 300678 343439 459359 -24267 113676 108646 217707 179008 2539 206640 192425
3777 192425 113574 179749 235400 24460 -208397 90214 311747 383267 30956 -60437 109918
3766 109918 -54009 -3324 -170141 -282051 5451 115182 111600 328805 300031 119057
3756 119057 74188 40013 141752 31377 6051 6243 363813 141007 37463 175310 135741
3745A35741k86825j05119K52397K13318j63839J080M7437m2513J6155j25188n583
3734f2939J69955O4762k21147j2462K01034k80506P748J51056J61852L1052j9880
3723A90525j70218j38813J19577j56907J30962L9103p667J59184m0379N4926j34800
3712D5493p103p4727p3503k4509m8753J05240K38533R0709l11673j01210K07142
3701D5639n9487k93527l0974O6287K24480q0548r3176K12717N3479o6983Q389
3690a3704m1141M2961K27662j11764j94285L14450L3449M5680l0989P9270L6802
3679C88391k43658k16715m0084J20249r1182o9431P0278k00966K07681R8007p2143
3668d9573J7305q0800Q7342K8514J31885p2968m3245o7791K1169L64877j67555
$$ plain form
3745 135741 -151084 -256203 -3806 209512 45673 46753 94190 51677 67832 -57356 -62939
3734 -62939 107016 171778 -49369 -61831 139203 -141303 -133555 17501 179353 210405 190525
3723 190525 20307 -118506 1071 -155836 -24874 14229 6562 165746 125367 180293 45493
3712 45493 38390 -36337 -109840 -134349 -183102 -77862 160671 251380 -60293 -161503 45639
3701 45639 -13848 -307375 -338349 -272062 -47582 -128130 -221306 -8589 44890 -22093 -13704
3690 -13704 -54845 -11884 215778 104014 -90271 224179 257628 303308 272319 351589 388391
3679 388391 144733 -71982 -112066 8183 -82999 -152430 -82152 -283118 -75437 22570 -49573
3668 -49573 -32268 -113068 -25726 2788 134673 61705 18460 -49331 -28162 336715 169160
3657A69160j0387k6477J45351M6534k49683k15737Q954J94955j858p0458J57676
3646A48030k23630m7412K75137K09935o6170j40082l687l5092n2068J30921n3665
3635A42217M1658J88567K24924j39058p675k39653j03941N1337j59682L20922
3625C19616J33888k18999k35552l0891O3738J38519K3393m2729q0739K9867n8699
3614D1412n9435j60667L64054l7334j69482N8952J75730P6700J70543j20048p1114
3603B69311k4053L7890J8984j02956k5588r2289l1507J94241j8148O9260p154
3592B87991K0762j09636J3859r1504K3901j15251l3126P5405j44169L16176L32185
3581E76593k15891k71385J52672J99477j55327L6714J00191j00974l8278J58558
$$ plain form
3657 169160 158773 132296 277647 324181 74498 -141239 -132285 62670 60812 -9646 148030
3646 148030 -75600 -123012 152125 362060 295890 155808 152121 117029 64961 195882 142217
3635 142217 183875 372442 597366 458308 450633 210980 107039 158376 -1306 319616
3625 319616 453504 234505 -1047 -31938 31800 170319 193712 150983 70244 100111 41412
3614 41412 -18023 -178690 185364 148030 -21452 37500 213230 289930 460473 340425 269311
3603 269311 245258 283148 302132 199176 173588 81299 49792 244033 225885 295145 287991
3592 287991 308753 199117 212976 121472 145373 30122 -3004 72401 -71768 244408 576593
3581 576593 360702 89317 241989 441466 286139 322853 423044 322070 283792 442350
3571D42350N6822J50126L0974J4916p1374j74688k019l0298J11584l5371J32124
3560F25146r9067K73615K8357R9667k54388k79386K09272J55404K5139J67605
3550I51364j1954m138N5967k9995p8908J02686Q8849N7633K7234j00870J12760
3539A170628j83106j32942K11435J54570Q0943m2797K00177P193j67488k45062
3529A053551j64179J79291J55814m3664J6110k7132n53J39827J00651J05261R575
3518A524552j44304J40457J78955J14034n8645m7770J21450K26352Q721R00K70208
3507B334910Q566J863K88709N2674k87857j11875M7355k0713K8667L90854m4224
3496B688929j27443M1231J41171J38154J25024P918J47464k1399K34276O9684
$$ plain form
3571 442350 499172 649298 680272 695188 623814 449126 447107 416809 528393 493022 625146
3560 625146 526079 799694 828051 927718 673330 393944 603216 758620 783759 951364
3550 951364 939410 935272 991239 961244 882336 985022 1073871 1131504 1158738 1057868 1170628
3539 1170628 987522 854580 1066015 1220585 1301528 1258731 1458908 1466101 1298613 1053551
3529 1053551 889372 1068663 1224477 1180813 1196923 1169791 1169238 1309065 1409716 1514977 1524552
3518 1524552 1380248 1520705 1699660 1813694 1755049 1707279 1828729 2055081 2063802 2064702 2334910
3507 2334910 2343476 2345339 2634048 2686722 2398865 2286990 2334345 2313632 2342299 2733153 2688929
3496 2688929 2561486 2602717 2743888 2882042 3007066 3014984 3162448 3141049 3375325 3445009
3486C445009k92692L4729K42994M04820J94696K54830K40248R0347L65562L13861
3476E294404J78861K88543J50360M21292N81696K86420O59015L61721L89514O18444
3466I230270M75688L50662K77449M8632p32450q17106j419654j071297m05071
3457E937123o08251n12993j90517l79427j06330k03444l28707L2491P6700m1646
3447C674999k7492J0695j47369P707o6916n8362L5415J78353L03042L52642N52503
3436D815217O17949N77118P46546R95099J060328J64447l96116j273784j315958
3427E990846r29075o04009n79415m12617l63271k12711j57212l20863J71971k25570
3417B358074j94114R8697p9207q5658p1973J34344r3379J54369M26830k95550
$$ plain form
3486 3445009 3152317 3187046 3430040 3834860 4029556 4284386 4524634 4614981 4980543 5294404
3476 5294404 5473265 5761808 5912168 6333460 6915156 7201576 7860591 8222312 8611826 9230270
3466 9230270 9705958 10056620 10334069 10382701 9650251 8833145 7413491 6342194 5937123
3457 5937123 5328872 4815879 4625362 4245935 4139605 3936161 3607454 3639945 3716645 3674999
3447 3674999 3647507 3658202 3510833 3518540 3451624 3393262 3428677 3607030 3910072 4262714 4815217
3436 4815217 5433166 6010284 6756830 7751929 8812257 8976704 8580588 7306804 5990846
3427 5990846 5061771 4457762 3878347 3465730 3102459 2889748 2732536 2411673 2583644 2358074
3417 2358074 2163960 2262657 2183450 2097792 2025819 2160163 2066784 2221153 2647983 2352433
3407B352433K0640K8978J56464M50844M65749N11119L99708N10468j974o38095
3397D256334o01505n69059l74029n51527r3395r7645j34080k81737j1250M1129
3387A583236k60404j2591N7931k38647j86588l8996J4650p8451j88494n7421R1664
3376F85889O6779j21573k190Q044l0937j04474M9281o36m9728L0192J10242j15753
3364E25136N0776L3001L4780j28864J88716k07046R8043M44903Q4257l13808J28
3353H10022L4394l41763J88388n0827k77757J86747Q7772j04624r5796O004Q0270
3342E22830o3713K1005r687j97890K4717J22565j64752j5590J23830l9313j98497
3331A25505L02405l4485j96050m4037K24944P1629k77350j05434j37307K22030
$$ plain form
3407 2352433 2373073 2402051 2558515 3009359 3475108 3986227 4385935 4896403 4894429 4256334
3397 4256334 3654829 3085770 2711741 2160214 2066819 1969174 1835094 1553357 1542107 1583236
3387 1583236 1322832 1310241 1368172 1129525 942937 903941 918591 840140 651646 594225 685889
3376 685889 752668 631095 628905 636949 606012 501538 550819 550183 500455 530647 640889 525136
3364 525136 575912 608913 643693 514829 703545 496499 594542 1039445 1123702 809894 810022
3353 810022 844416 502653 691041 640214 362457 549204 636976 532352 436556 442560 522830
3342 522830 459117 480122 470435 272545 297262 419827 255075 239485 363315 324002 125505
3331 125505 427910 393425 197375 153338 378282 449911 172561 67127 -70180 151850
3321A51850Q2354M851p2999P7200J26184j41580N9255K0205J94158K4014L3687
3310E59179j21705j56602j0536Q8342l08601j26092K98487M7256P0291N6271r3570
3299C02720q8393r3795j44112p131R4936J72596J9222r2025k55831j68664l8062
3288b98539J73450K51618M8628k1627r1413R0099R7039j38233k6606P1388M718
3277A60522L01589p369m10325J31784R154k09399o5460j0424L77646l76826k93201
3266c92309K23014J06073J20769j3702J78574P7788j4715k38022j82074q0641
3256b15245N8853J86261o7251J07538J0905j26237J62810R3717J0563m5338j82112
3245e536K61742N3336l57542K73987J92659j98004q3256M2308J64953j88807k45115
$$ plain form
3321 151850 234204 239055 166056 243256 369440 227860 287115 307320 501478 525492 559179
3310 559179 437474 280872 270336 358678 50077 -76015 222472 269728 340019 396290 302720
3299 302720 214327 120532 -23580 -30711 64225 236821 256043 164018 -91813 -260477 -298539
3288 -298539 -125089 126529 175157 153530 62117 152216 249255 111022 84416 155804 160522
3277 160522 462111 454742 44417 176201 185355 -24044 -89504 -99928 277718 -99108 -392309
3266 -392309 -169295 -63222 57547 43845 222419 300207 285492 47470 -134604 -215245
3256 -215245 -156392 29869 -37382 70156 81061 -45176 117634 211351 221914 176576 -5536
3245 -5536 256206 309542 -48000 225987 418646 220642 137386 179694 344647 155840 -89275
3234h9275J63016J38066j12238J59390m0057l37222K85137R0150r7040p4773m3619
3223D1535j63415O2915J67905o8738k6844j68407K16138M1256J50291J86353j95722
3212B43267n8791j8N8508J23723K29800k51118k88875j9730k5615L09062q896
3201C11317j02737p2647n7312J83718P3578k47197j99646m4272j1542J75184J9382
3190B7826O5017j09536R4407J71633r7394M7133K77829k7503m49287k7372L42999
3179C15752K6339k2484o251K4874l1681j5355L6229J70639l59138M4631K78250
3168D61805K85491K8602o4649j03538r8156j52042K42635m1031k07461K93928
3158F45584p2632J03798k49984K0253M16362J70549k85627R7331M991n1645p3888
$$ plain form
3234 -89275 73741 211807 99569 258959 218902 -118320 166817 256967 159927 85154 41535
3223 41535 -121880 -58965 108940 40202 13358 -155049 61089 102345 252636 438989 243267
3212 243267 184476 184458 242966 366689 596489 345371 56496 36766 11151 320213 311317
3201 311317 208580 135933 78621 262339 335917 88720 -110926 -155198 -166740 8444 27826
3190 27826 92843 -16693 77714 249347 151953 199086 476915 449412 125 -27247 315752
3179 315752 342091 319607 313356 338230 306549 291194 327423 498062 138924 183555 461805
3168 461805 747296 775898 711249 607711 509555 357513 600148 559117 351656 645584
3158 645584 572952 676750 426766 447019 863381 1033930 748303 845634 850625 798980 725092
3147G25092M4635k61964K3627J67098l8825K31136j12940j38290k00973L01153
3137G39749r0527o8083K18129k0372P8342K11648O2824j3201N0423j69172j9523
3126I80237j03191Q5863k63779j00564j14717k1087P8984J46414K9565p5045M0890
3115F83570q8829m4226l932J03976L8231k21401J09307L04296N1389k30281N9035
3104G61135J63066j8476j71267J25965N4355k55451r1218J02532l19097K2116
3094C73660K05819N1918p9230j20432j4762j86443N2421J84628k4076O6226K27480
3083G37209J39949j18346l29499N497L9060l58255j16956Q5325J12502J97851
3073C94337R103p8986k14275K5058j99997K23446j03528m8372J40149Q1850K13852
$$ plain form
3147 725092 769727 507763 531390 698488 659663 890799 777859 639569 438596 739749
3137 739749 649222 581139 799268 778896 857238 1068886 1131710 1118509 1168932 999760 980237
3126 980237 877046 962909 699130 598566 483849 462762 541746 688160 717725 642680 683570
3115 683570 594741 550515 546583 650559 688790 467389 576696 880992 932381 702100 761135
3104 761135 924201 905725 734458 860423 914778 659327 568109 670641 351544 373660
3094 373660 579479 631397 552167 431735 416973 230530 282951 467579 443503 509729 737209
3083 737209 877158 758812 429313 434810 473870 115615 -1341 83984 196486 394337
3073 394337 403440 324454 110179 135237 -64760 158686 55158 6786 146935 228785 442637
3062D42637k15434j48843p2923j3505p1492o2690q9363J40521K50188p7994N631
3051H6733O2078J36638m3278o8022j17002n844j5283K7003J1446O9168k17117
3040g3480j9032P2170L1283j11298j0211j53599K57015N1092J7536j51047k67728
3029c57299m4445L81611J57841k42463J98446r7202k59766K99378k0239m41132
3019d25270Q865L63304j968j59837K1918k10197K28784M0541M4975J19711j03632
3008g2806j27346J33663R8756k38946K913K01734O7253j88328l33060K75843Q1483
2997i8841M8133o30j74542r346K06670k01626j00216J63195M4887J4060k07506
2986c15762k5631J18943M4975P6056j80529j42498L30505O8824j46665N3769l15598
$$ plain form
3062 442637 227203 78360 5437 -8068 -79560 -142250 -231613 -91092 159096 81102 86733
3051 86733 148811 285449 242171 174149 57147 51303 36020 63023 74469 143637 -73480
3040 -73480 -92512 -20342 10941 -100357 -110568 -264167 -7152 43940 61476 -89571 -357299
3029 -357299 -401744 -20133 137708 -104755 93691 -3511 -263277 36101 15862 -425270
3019 -425270 -416405 -53101 -55069 -214906 -192988 -403185 -174401 -133860 -88885 30826 -72806
3008 -72806 -200152 -66489 32267 -206679 -203766 -2032 65221 -123107 -456167 -180324 -98841
2997 -98841 -50708 -51338 -225880 -235226 -28556 -230182 -330398 -167203 -122316 -108256 -315762
2986 -315762 -341393 -222450 -177475 -101419 -281948 -424446 -93941 -25117 -171782 -118013 -433611
2975d33611P3849K95888o8617j29611p687j25509P2495M3866M977N0640K81344
2964E8024J16446J32359l15487k3024r1734J2618j868k14738L4485K63731J08261
2953G9073j80151j08387j04765K84558m5055k10521O5788Q3233L60890L996j08339
2942A20320k909j16189j40975j39661m1760j7885L400k31066K14802j67648l4613
2931e54184J32541J63988P8341J17956j24774J9074O4284q2563J05955n0538k04407
2920c34327O4517O6120p0522J86754K44314j94375j60950o6637J69902L883k12316
2909c03637O4277K04597Q6950k09535J33820M8494l16965j87055M0963J01235
2899c36856K26134J71179r3241j101k3720j33016k23090O8527J89929l3502N1423
$$ plain form
2975 -433611 -359762 -63874 -132491 -262102 -269789 -395298 -322803 -278937 -273960 -223320 58024
2964 58024 174470 306829 -8658 -31682 -123416 -110798 -112666 -327404 -292919 -29188 79073
2953 79073 -101078 -209465 -314230 -29672 -74727 -285248 -219460 -136227 224663 228659 120320
2942 120320 117411 1222 -139753 -279414 -321174 -339059 -335659 -566725 -351923 -519571 -554184
2931 -554184 -421643 -257655 -179314 -61358 -186132 -167058 -102774 -185337 -79382 -129920 -334327
2920 -334327 -269810 -203690 -274212 -87458 156856 -37519 -198469 -265106 -95204 -91321 -303637
2909 -303637 -239360 -34763 52187 -157348 -23528 24966 -291999 -479054 -438091 -336856
2899 -336856 -110722 60457 -32784 -33885 -57605 -190621 -413711 -345184 -155255 -188757 -137334
2888a37334L4440R3976K19663r7404l59848O3744K65705j23812J69291j77548
2878d9127k31361n9204J17242n2073o5566L7848O8164K47669K8205R3104r2216
2867D2685j03634m3696k7889k55171j22293J06796O2649J58052j19962k8334K81078
2856d9719j73775m5059K67719K0231q8717j58183M7599l5468R4515O8348J35029
2845H2520J8282m06235k18636J91675J16014j16750j4549Q2864K44345m9572n0718
2834a20760k5635J3756k5340J87390l3969l65453L9868P5463L9921J63899l28098
2823c78958M6851J37312k527J36817L4602k432k0642m01994R954J20950J47883
2812a72184k13815j25577K02893p7570N6247J9104Q5556r9582J78735O8784Q6312
$$ plain form
2888 -137334 -102894 -8918 210745 113341 -246507 -182763 82942 -40870 128421 -49127
2878 -49127 -280488 -339692 -222450 -274523 -340089 -302241 -234077 13592 41797 134901 42685
2867 42685 -60949 -104645 -132534 -387705 -509998 -403202 -340553 -182501 -302463 -330797 -49719
2856 -49719 -223494 -268553 -834 19397 -69320 -227503 -179904 -215372 -120857 -52509 82520
2845 82520 100802 -305433 -524069 -332394 -216380 -333130 -347679 -264815 -20470 -70042 -120760
2834 -120760 -146395 -132639 -157979 29411 -4558 -370011 -330143 -254680 -214759 -50860 -378958
2823 -378958 -332107 -194795 -197322 -60505 -25903 -28335 -48977 -450971 -441017 -320067 -172184
2812 -172184 -385999 -511576 -308683 -386253 -330006 -310902 -225346 -324928 -146193 -77409 8903
2801H903J26294m40970j68010K44190M8990j15966j06551L7983K2418j54202J99561
2790b97360K22548m8824j60726Q936j4180L02744l7377k74725j00924J02190K84174
2779a3524j40145l05929J91799j73412N9637K19967k3235r3533j17463J55465
2769b40373M2366P7801l69757J16136M43638j08393r1105N1451j06192K60317
2759G5889k11658Q8238j43345J79028j94223J88925j9935j35390J42421p745j54840
2748a92635j07372k8747Q3280L30963l84735k07616Q8640K51329R2521k6675k57134
2737c58181R3206J78363r193k26384K1060j0696j25731l1177J35546n6657K44760
2726a45084J86010r703j03962N1309q8961k42014L6044J33336J48809j16361p5641
$$ plain form
2801 8903 135197 -305773 -473783 -229593 -180603 -296569 -403120 -365137 -342719 -496921 -297360
2790 -297360 -74812 -123636 -284362 -275426 -289606 13138 -24239 -298964 -399888 -297698 -13524
2779 -13524 -153669 -459598 -267799 -441211 -381574 -161607 -184842 -278375 -395838 -240373
2769 -240373 -198007 -120206 -489963 -373827 69811 -38582 -129687 -78236 -184428 75889
2759 75889 -135769 -47531 -190876 -11848 -206071 -17146 -37081 -172471 -30050 -37795 -192635
2748 -192635 -300007 -328754 -245474 85489 -299246 -506862 -418222 -166893 -74372 -101047 -358181
2737 -358181 -264975 -86612 -95805 -322189 -301129 -311825 -437556 -468733 -333187 -389844 -145084
2726 -145084 40926 31223 -72739 -21430 -110391 -352405 -316361 -183025 -34216 -150577 -226218
2715b26218K34027L7173j10550J67798k22051j93291M6716K29267L5750P308j8194
2704a2265k5035J53610q4436l48107J22040l2580k089K638j49787l2455J67549
2693b40917K82483M7830j3381M7006m03806J37814j08085j19190K3662N748K57777
2682h3059R9918M7858O8390n9185k26729J91266K9096o6277k94169J15798m4183
2671b21276J65306q3570L1836N8000K17251K1107j85068J05465j43302L8141L4648
2660C8538l84723K07312J1349k32917L24670N0873n5979k14869N2360J77997J65063
2649A39674j20054p6937K34175j01255Q2836l58128l2134J09471k09244L15545
2639a6051l8577K5639n4243k1404j54842j72064J70778M7187J3577J00086N1790
$$ plain form
2715 -226218 7809 44982 -65568 102230 -119821 -313112 -266396 -37129 -1379 5929 -12265
2704 -12265 -37300 116310 31874 -316233 -194193 -226773 -228862 -226224 -376011 -408466 -240917
2693 -240917 41566 89396 76015 123021 -280785 -142971 -251056 -370246 -346584 -340836 -83059
2682 -83059 16859 64717 133107 73922 -152807 38459 67555 1278 -292891 -177093 -221276
2671 -221276 -55970 -139540 -107704 -49704 167547 188654 3586 109051 -34251 3890 38538
2660 38538 -346185 -138873 -127524 -360441 -35771 15102 -40877 -255746 -203386 -25389 139674
2649 139674 19620 -57317 176858 75603 158439 -199689 -231823 -122352 -331596 -16051
2639 -16051 -54628 -28989 -83232 -104636 -259478 -431542 -260764 -213577 -200000 -99914 -48124
2628d8124k5606K21780k91612J4494Q4292o6290q4374K06393R5531j02073P3252
2617G7663k09286p9975q0926P6497m1027R5850j11908P920J51180J53746j45453
2606a05719m4717O5463L5195m0988j8129L99980J19818J35713o669l32986j08436
2595I8525M210K62226k48501j94818J06258q1152j68404N732P2030k1463K10779
2584D5422j48406k3491j49689j32840K42632N556J92810p7205N3636k8695m795
2573b5065j7963N6315P3562o7954r9431j73781K70959J35402k19772O7485K30614
2562B30371o7474j93211n2737J09584r7702J41961k13704k34931l4135K65857
2552a46121J6362n2218j67429J31793J17515m9625J4183O8519R2867j24007M6130
$$ plain form
2628 -48124 -73730 148050 -143562 -129068 -44776 -111066 -195440 10953 106484 4411 77663
2617 77663 -131623 -211598 -292524 -216027 -257054 -161204 -273112 -265192 -114012 39734 -105719
2606 -105719 -150436 -84973 -49778 -90766 -108895 291085 410903 546616 539947 206961 98525
2595 98525 102735 364961 116460 -78358 27900 -53252 -221656 -215924 -143894 -165357 45422
2584 45422 -102984 -126475 -276164 -409004 -166372 -160816 31994 -45211 8425 -20270 -25065
2573 -25065 -43028 13287 86849 18895 -80536 -254317 16642 152044 -67728 -243 230371
2562 230371 162897 -30314 -83051 26533 -71169 70792 -142912 -377843 -411978 -146121
2552 -146121 -129759 -181977 -349406 -217613 -100098 -149723 -135540 -67021 25846 -98161 -52031
2541e2031N3705j516N7041j12000j10112J23294M6969M7031K3324k26998P7896
2530g3397Q3385P079R5020j15802p4994n3194L35363n9323K50450j67933l15572
2519h8918k6559O3452Q8884K9986k89148k4865R7988L42137J62696j92330j16511
2508D6812m886k05919m5671J09896P7419r8762q240J72938R848J82378j5499n2974
2496A67340k50640Q8767n0182P9561M6395k01366J00074K36628R7314J39010j04350
2485C48551k29198M1733J14984r7445k56640j8336o6890j9460R3302K3732P2873
2474G206j7057J33519j82638k9422P234J42219K2416R0309J33097L8k45966J28587
2462A89542J17005P234l23346j19806J37343j24549J23058J01749J90770j8486
$$ plain form
2541 -52031 1674 158 57199 -54801 -164913 -41619 5350 52381 75705 -151293 -73397
2530 -73397 9988 17067 112087 -3715 -78709 -131903 203460 144137 394587 226654 -88918
2519 -88918 -115477 -52025 36859 66845 -222303 -247168 -149180 192957 355653 163323 46812
2508 46812 41926 -163993 -209664 -99768 -22349 -121111 -129351 43587 53435 235813 220314 167340
2496 167340 -83300 5467 -44715 34846 81241 -120125 -20051 216577 313891 452901 348551
2485 348551 119353 161086 276070 178625 -78015 -96351 -163241 -182701 -89399 -65667 7206
2474 7206 -9851 123668 -58970 -88392 -81158 61061 83477 173786 306883 306921 60955 189542
2462 189542 306547 313781 -9565 -129371 7972 -116577 6481 108230 299000 280514
2452B80514L2280O1075L58689J2771k79706O3267k85273l8485K5560J84815j87227
2441B28280k35515J54375m444J37152O330J20911M0520j34841J61722P0836N8173
2430F03499J4904j35632j47373k1112P4440L1705K08633q3770K2422L6933Q9008
2419F93657j34530J70016K14036L9912L2407J8896k75254q3960J61086j68735
2409F67531J30666K12942K67647L5905j2660p7899N2973K65132J03144m0536M2741
2398A647586m1533l98267O5510K01704J31875q7516p6671J29307K25746J4177
2388A811918R4771r2835J32497Q9667j66879N2529o781M17825L5608r5159o4721
2377B208440j32845O7442K26896K52384R9176L66687J39568J27969l7385L0659
$$ plain form
2452 280514 312794 373869 732558 745329 465623 528890 243617 205132 230692 415507 228280
2441 228280 -7235 147140 142696 279848 286178 407089 447609 312768 474490 545326 603499
2430 603499 618403 482771 335398 314286 388726 420431 629064 545294 567716 604649 693657
2419 693657 559127 729143 943179 983091 1015498 1034394 759140 675180 836266 667531
2409 667531 798197 1011139 1278786 1314691 1302031 1224132 1277105 1542237 1645381 1604845 1647586
2398 1647586 1606053 1207786 1273296 1475000 1606875 1519359 1442688 1571995 1797741 1811918
2388 1811918 1906689 1813854 1946351 2036018 1869139 1921668 1914887 2332712 2368320 2273161 2208440
2377 2208440 2075595 2143037 2369933 2622317 2721493 3088180 3227748 3355717 3318332 3348991
2367C348991j09943J75025J95466J43257R330J57645M30502K23411R5172J40734
2357D809590M20350Q4060M2127N7227L94648L73443J23005O73779P76926O00572
2347H355727M83693R65661Q15598Q18429P25716L16291M02867P59589R11809J775255
2337A6330635K315871L101553L882922N425685O223117P979045J0186735J1213030
2329F6658593N000988p836503j1136081j1213893q981379o128389m291471l395992
2321A8675873k316619j770814j621080j365652j293365p36472m58429m16229q62656
2312G834557q27431o43837k41959n97809m92590j23355o5097l69930k53055l89942
2302C829552k16809L3477k51454k2317l28203j76895k23989p1124k5547j23785
$$ plain form
2367 3348991 3239048 3414073 3609539 3752796 3762126 3919771 4350273 4573684 4668856 4809590
2357 4809590 5229940 5314000 5356127 5413354 5808002 6181445 6304450 6978229 7755155 8355727
2347 8355727 8839420 9805081 10620679 11439108 12164824 12481115 12883982 13643571 14555380 16330635
2337 16330635 18646506 21748059 25630981 31056666 37279783 45258828 55445563 66658593
2329 66658593 71659581 63823078 52686997 41473104 32491725 26363336 22071865 18675873
2321 18675873 16359254 14588440 12967360 11601708 10308343 9571871 9113442 8697213 7834557
2312 7834557 7007126 6363289 6121330 5523521 5030931 4907576 4842479 4472549 4219494 3829552
2302 3829552 3612743 3646220 3394766 3372449 3044246 2867351 2643362 2572238 2546691 2422906
2292B422906l2999l04159j36521P0549l05379j24599M0001j2575J0911m9864q303
2281A569968L5266Q7621k37607r0569J01697k61524N847j8018l25556j7622j25580
2270G23923N0790J88132j25557P5636M5273J80563k02191j16017P5118N3878l0101
2259I19447j99166j14420J11979k30634K34403j4714m21462J48401N9373j19235
2249C73972j7231p3994q3640l7909N9473M0366q9532M24768q736j45476j38010
2238C04051J28180k32736j3725n783k0109j44018J85438N9378O1910r4561J59927
2227C87952k9630j81520q7837j9969J35164Q4415J05569l30822J8895Q6124N0378
2216B18719J00115j00916p4686K47666L4533k53232m8245J48176J58921j32458
$$ plain form
2292 2422906 2389907 2085748 1949227 2019776 1714397 1589798 1629799 1617224 1628135 1578271 1569968
2281 1569968 1605234 1692855 1455248 1364679 1466376 1204852 1210699 1192681 867125 849503 723923
2270 723923 774713 962845 837288 912924 958197 1138760 936569 820552 895670 949548 919447
2259 919447 720281 605861 717840 487206 721609 706895 285433 433834 493207 373972
2249 373972 356741 282747 199107 161198 220671 261037 171505 596273 587537 442061 304051
2238 304051 432231 199495 185770 179987 159878 15860 201298 260676 322586 228025 387952
2227 387952 358322 176802 88965 68996 204160 288575 394144 63322 82217 168341 218719
2216 218719 318834 217918 143232 390898 425431 172199 123954 272130 431051 298593
2206B98593J52522l65291k17777N8979K44838R2178l26877K4215m0048J12068
2196C3400K03586j08552K3161j5028J56517J34363j84787P9325j74742j55052
2186g809J96154m1228k27317J32740J807j24702J49865J8619K2478m0341j10090
2175b9824J45070m681K5702P8913J44912k11339O1379k8599r3349o4936k08141
2164a84893P9910K20646Q8722j53648j6835j37841M0790k20019N1642K65834K30330
2153B64638j00744l37311L59606o0128j10487k82755P0078L21607j58289l1211
2143f4996K12161J70681k42886L0196Q6684j10575k2177k0036M3958k7054j69246
2132a13290M0434N8119M3154K11466p638l7208k62695P310p2666R057k8333p128
$$ plain form
2206 298593 451115 85824 -131953 -72974 171864 264042 -62835 -38620 -78668 33400
2196 33400 236986 128434 151595 136567 293084 427447 242660 321985 147243 -7809
2186 -7809 188345 147117 -80200 52540 54347 -70355 79510 98129 120607 80266 -29824
2175 -29824 115246 110565 136267 215180 360092 148753 210132 181533 88184 23248 -184893
2164 -184893 -104983 115663 204385 50737 33902 -103939 -63149 -283168 -231526 34308 264638
2153 264638 163894 -173417 186189 126061 15574 -267181 -197103 124504 -33785 -64996
2143 -64996 147165 317846 74960 105156 191840 81265 59088 39052 83010 55956 -113290
2132 -113290 -72856 -14737 28417 239883 232245 195037 -67658 -60348 -133014 -123957 -152290 -159418
2120a59418o5980K5311J11191Q4818R9414q5415L8482J7911l28418N4662J67161
2109d0281j5448M3423K51014l04021n3116L9397O1192J23793j32455n800k18838
2098b51140Q6601L56453K4229J084j40347M4076k1268l9503J05345j02108j79374
2087a15952O2438o5489o2480k5107o7963J08344P7170J81521P4466l6887j33524
2076c463n1304k84666L42932J78328J9114N1002O1864j3181p0903j44228k18612
2065a33117J35737k22201J06551L32716j67841q7537O6521J60570j40852J50345
2055B00892O9490k03332j14955K26414k9308n2845k30666J86690O1061Q2837O1438
2044B57716j27200O6511p77j23436q435K14927K31889k73863l85793n4843q4194
$$ plain form
2120 -159418 -225398 -200087 -88896 -4078 95336 9921 48403 66314 -262104 -207442 -40281
2109 -40281 -55729 -12306 238708 -65313 -118429 -79032 -17840 105953 -26502 -32302 -251140
2098 -251140 -164539 191914 216143 217227 76880 120956 99688 60185 165530 63422 -115952
2087 -115952 -53514 -119003 -181483 -206590 -274553 -166209 -89039 92482 166948 130061 -3463
2076 -3463 -54767 -339433 3499 181827 200941 251943 313807 300626 229723 85495 -133117
2065 -133117 2620 -219581 -113030 219686 51845 -35692 30829 191399 50547 200892
2055 200892 270382 67050 -47905 178509 149201 96356 -134310 52380 113441 196278 257716
2044 257716 130516 197027 196250 72814 64379 279306 511195 237332 -148461 -203304 -287498
2033b87498J90470J42626o3761j26602R577K12357J15312j16467p1670n8214J3511
2022d0359J4260J04772N0567J2864P3565J20915k22742o7162k9645j02178j86591
2011b71734r8022P9672j7922q7974J17977K16907J17863k6788k25018O3067K273
2000a29699J5739k41266J3901J83710K4769K28172J14778j13696j44513l36235
1990c84340N348L02862p4031o6877l3455o2529J25843J84527J75469J1084j66743
1979A7158j58767j1895J70691N7447j640P2997K1202j91280j97382J2768o5482
1968b74183J17196k33560K8581K61461n8195R691Q8274J87265m46497O1540O3446
1957a94981n7093o8669J65939n6703j01715k07K29468N6146k12648m6621j67436
$$ plain form
2033 -287498 -97028 45598 -18163 -144765 -135188 77169 192481 76014 4344 -53870 -40359
2022 -40359 -26099 78673 129240 142104 215669 336584 113842 46680 17035 -85143 -271734
2011 -271734 -369756 -290084 -308006 -395980 -278003 -61096 56767 29979 -195039 -131972 -129699
2000 -129699 -113960 -355226 -341325 -157615 -132846 95326 210104 96408 -48105 -384340
1990 -384340 -378992 -76130 -150161 -217038 -250493 -313022 -187179 -2652 172817 183901 17158
1979 17158 -141609 -153504 17187 74634 72994 145991 167193 -24087 -221469 -208701 -274183
1968 -274183 -156987 -390547 -361966 -100505 -158700 -149009 -60735 126530 -319967 -258427 -194981
1957 -194981 -252074 -320743 -154804 -211507 -313222 -313429 -83961 -27815 -240463 -287084 -454520
1946d54520K65459N12590j69364k26263J47610J03960j25616j30208O6094O2762
1936E2504P4411k17316j42103j218J5635J18383q5366j80845K18542r4565j39378
1925c81316N2055J33720J48197M7828k74347P5122J98742k30442K15184J26012
1915A10755m5147j53435n012J444j19556k9361J04778J0820J0237k66372J33455
1904b47394L65384j74076k31410m9789J40424J3252j96674j18622L26786p4850
1894b46969j41700M47632l5347k32692q0580M9340P5096Q7479k1339J94463k20327
$$ plain form
1946 -454520 -189061 323529 154165 -72098 75512 179472 53856 -76352 -10258 52504
1936 52504 126915 -90401 -232504 -233722 -218087 -99704 -185070 -365915 -147373 -241938 -381316
1925 -381316 -329261 -195541 -47344 484 -273863 -198741 1 -230441 -15257 110755
1915 110755 65608 -87827 -92839 -91395 -210951 -240312 -135534 -124714 -114477 -380849 -247394
1904 -247394 117990 -56086 -287496 -337285 -196861 -183609 -380283 -498905 -172119 -246969
1894 -246969 -388669 58963 23616 -209076 -289656 -240316 -165220 -77741 -99080 95383 -124944
$$ [...]
##END NTUPLES=NMR SPECTRUM
##END=
