##TITLE=1H_EC-3333(III-3)
 CDCl3
 8 sc, 
 8.10.2024
##JCAMPDX= 6.0         $$ Bruker NMR JCAMP-DX V2.0
##DATA TYPE= NMR SPECTRUM
##DATA CLASS= NTUPLES
##ORIGIN= UXNMR, Bruker Analytische Messtechnik GmbH
##OWNER= root
$$ XWIN-NMR		Version 3.5
$$ Tue Oct  8 13:57:44 2024 Russian Standard Time (UT+4h)  she@DPX200
##.OBSERVE FREQUENCY= 200.1318
##.OBSERVE NUCLEUS= ^1H
##.ACQUISITION MODE= SIMULTANEOUS
##.ACQUISITION SCHEME= undefined
##.AVERAGES= 8
##.DIGITISER RES= 18
##SPECTROMETER/DATA SYSTEM= spect
##.PULSE SEQUENCE= zg30
##.SOLVENT NAME= CDCl3
##.SHIFT REFERENCE= (INTERNAL, CDCl3, 0, 23.2788)
##AUDIT TRAIL= $$ (NUMBER, WHEN, WHO, WHERE, WHAT)
$$ ##TITLE= Audit trail, XWIN-NMR		Version 3.5
$$ ##JCAMPDX= 5.01
$$ ##ORIGIN= Bruker BioSpin GmbH
$$ ##OWNER= she
$$ F:/spectra/data/she/nmr/H-F/1/pdata/1/auditp.txt
$$ ##AUDIT TRAIL=  $$ (NUMBER, WHEN, WHO, WHERE, WHAT)
(   1,<2024-10-08 13:56:21.34 +0400>,<she>,<DPX200>,
      <created by zg, POWCHK disabled, PULCHK disabled
       configuration hash MD5:
       00 E9 B6 7A A2 85 ED C7 34 08 36 98 17 FE 4E 26
       data hash MD5: 16K
       C9 6F 20 E6 16 C8 D0 91 06 AA F0 54 D9 B7 C3 EF>)
(   2,<2024-10-08 13:56:30.32 +0400>,<she>,<DPX200>,
      <Start of raw data processing
       efp BC_mod = 2 LB = 0.24 FT_mod = 6 PKNL = 1 PHC0 = -26349.42 PHC1 = 15.78747 SI = 16K 
       data hash MD5: 16K
       A3 F7 65 D4 BC D2 49 08 1C 54 E7 73 D0 AB 15 C6>)
(   3,<2024-10-08 13:56:54.25 +0400>,<she>,<DPX200>,
      <pk PHC0 = 5.455629 PHC1 = -7.4 
       data hash MD5: 16K
       8C 69 D5 3E 20 12 41 7F 41 B4 C2 EE 46 0D BF 8C>)
(   4,<2024-10-08 13:56:57.81 +0400>,<she>,<DPX200>,
      <abs ABSG = 5 
       data hash MD5: 16K
       7B 56 13 8C D4 0D 71 EF B9 3A 21 65 5F 1C 46 DD>)
$$ ##END=
$$ 
$$ hash MD5
$$ 3F 26 35 53 41 FD 71 85 0A 54 69 F8 A5 F9 1D F6
##$RELAX= 
##$RELAX= 
##$RELAX= 
##$RELAX= 
##$RELAX= 
##$RELAX= 
$$ Bruker specific parameters
$$ --------------------------
##$DU= <F:/spectra>
##$EXPNO= 1
##$NAME= <H-F>
##$PROCNO= 1
##$TYPE= <nmr>
##$USER= <she>
##$AMP= (0..31)
100 100 100 100 100 100 100 100 100 100 100 100 100 100 100 100 100 100 
100 100 100 100 100 100 100 100 100 100 100 100 100 100 
##$AQSEQ= 0
##$AQ_mod= 1
##$AUNM= <au_zg>
##$AUTOPOS= <>
##$BF1= 200.13
##$BF2= 200.13
##$BF3= 200.13
##$BF4= 200.13
##$BF5= 200.13
##$BF6= 200.13
##$BF7= 200.13
##$BF8= 200.13
##$BYTORDA= 1
##$CFDGTYP= 0
##$CFRGTYP= 5
##$CHEMSTR= <none>
##$CNST= (0..31)
1 1 145 1 1 1 1 1 1 1 1 1 1 1 1 1 1 1 1 1 1 1 1 1 1 1 1 1 1 1 1 1 
##$CPDPRG= <>
##$CPDPRG1= <>
##$CPDPRG2= <>
##$CPDPRG3= <>
##$CPDPRG4= <mlev>
##$CPDPRG5= <mlev>
##$CPDPRG6= <mlev>
##$CPDPRG7= <mlev>
##$CPDPRG8= <mlev>
##$CPDPRGB= <>
##$CPDPRGT= <>
##$D= (0..31)
0 1.2 0 0 0 0 0 0 0 0.06 0 0.03 0 0 0 0 0.0002 0 0 0 0 0 0 0 0 0 0 0 0 
0 0 0 
##$DATE= 1728381380
##$DBL= (0..7)
120 120 120 120 120 120 120 120 
##$DBP= (0..7)
150 150 150 150 150 150 150 150 
##$DBP07= 0
##$DBPNAM0= <>
##$DBPNAM1= <>
##$DBPNAM2= <>
##$DBPNAM3= <>
##$DBPNAM4= <>
$$ [...]
##$SUBNAM3= <"">
##$SUBNAM4= <"">
##$SUBNAM5= <"">
##$SUBNAM6= <"">
##$SUBNAM7= <"">
##$SUBNAM8= <"">
##$SUBNAM9= <"">
##$SW= 24.0689170037331
##$SWIBOX= (0..15)
0 0 2 0 0 0 0 0 0 0 0 0 0 0 0 0 
##$SW_h= 4816.95568400771
##$TD= 16384
##$TD0= 1
##$TE= 0
##$TE2= 300
##$TE3= 300
##$TEG= 300
##$TL= (0..7)
0 120 120 120 120 120 120 120 
##$TP= (0..7)
150 150 150 150 150 150 150 150 
##$TP07= 0
##$TPNAME0= <>
##$TPNAME1= <>
##$TPNAME2= <>
##$TPNAME3= <>
##$TPNAME4= <>
##$TPNAME5= <>
##$TPNAME6= <>
##$TPNAME7= <>
##$TPOAL= (0..7)
0.5 0.5 0.5 0.5 0.5 0.5 0.5 0.5 
##$TPOFFS= (0..7)
0 0 0 0 0 0 0 0 
##$TUNHIN= 0
##$TUNHOUT= 0
##$TUNXOUT= 0
##$USERA1= <user>
##$USERA2= <user>
##$USERA3= <user>
##$USERA4= <user>
##$USERA5= <user>
##$V9= 5
##$VALIST= <valist>
##$VCLIST= <CCCCCCCCCCCCCCC>
##$VD= 0
##$VDLIST= <DDDDDDDDDDDDDDD>
##$VPLIST= <PPPPPPPPPPPPPPP>
##$VTLIST= <TTTTTTTTTTTTTTT>
##$WBST= 1024
##$WBSW= 4
##$XGAIN= (0..3)
0 0 0 0 
##$XL= 0
##$YL= 0
##$YMAX_a= 900008
##$YMIN_a= -888905
##$ZGOPTNS= <>
##$ZL1= 120
##$ZL2= 120
##$ZL3= 120
##$ZL4= 120
##$ABSF1= 21.01054
##$ABSF2= -3.058594
##$ABSG= 5
##$ABSL= 3
##$ALPHA= 0
##$AQORDER= 0
##$ASSFAC= 0
##$ASSFACI= 0
##$ASSFACX= 0
##$ASSWID= 0
##$AUNMP= <proc_1d>
##$AZFE= 0.1
##$AZFW= 0.1
##$BCFW= 0
##$BC_mod= 2
##$BYTORDP= 0
##$COROFFS= 0
##$CY= -3
##$DATMOD= 1
##$DC= 0
##$DFILT= <>
##$DTYPP= 0
##$F1P= 0
##$F2P= 0
##$FCOR= 1
##$FTSIZE= 16384
##$FT_mod= 6
##$GAMMA= 0
##$GB= 0
##$INTBC= 1
##$INTSCL= 3.70164e-10
##$ISEN= 128
##$LB= 0.24
##$LEV0= 0
##$LPBIN= 0
##$MAXI= 10000
##$MC2= 0
##$MEAN= 0
##$ME_mod= 0
##$MI= 1.114404
##$NCOEF= 0
##$NC_proc= -5
##$NLEV= 6
##$NOISF1= 3.799351
##$NOISF2= 2.8
##$NSP= 0
##$NTH_PI= 0
##$NZP= 0
##$OFFSET= 23.27883
##$PC= 1
##$PHC0= -26343.96
##$PHC1= 8.38747
##$PH_mod= 1
##$PKNL= yes
##$PPARMOD= 0
##$PSCAL= 0
##$PSIGN= 0
##$REVERSE= no
##$SF= 200.129549695455
##$SI= 16384
##$SIGF1= 3
##$SIGF2= 2
##$SINO= 5.538805
##$SIOLD= 16384
##$SREGLST= <1H.CDCl3>
##$SSB= 0
##$STSI= 16384
##$STSR= 0
##$SW_p= 4816.95568400771
##$SYMM= 0
##$S_DEV= 0
##$TDeff= 16384
##$TDoff= 0
##$TI= <>
##$TILT= no
##$TM1= 0
##$TM2= 0
##$TOPLEV= 0
##$USERP1= <user>
##$USERP2= <user>
##$USERP3= <user>
##$USERP4= <user>
##$USERP5= <user>
##$WDW= 1
##$XDIM= 16384
##$YMAX_p= 343238678
##$YMIN_p= -474111
$$ End of Bruker specific parameters
$$ ---------------------------------
##NTUPLES= NMR SPECTRUM
##VAR_NAME=  FREQUENCY,     SPECTRUM/REAL,   SPECTRUM/IMAG
##SYMBOL=    X,             R,               I
##VAR_TYPE=  INDEPENDENT,   DEPENDENT,       DEPENDENT
##VAR_FORM=  AFFN,          ASDF,            ASDF
##VAR_DIM=   16384,         16384,           16384
##UNITS=     HZ,            ARBITRARY UNITS, ARBITRARY UNITS
##FACTOR=    0.29402158847633, 1,            1
##FIRST=     4658.78168019893, 0,            0
##LAST=      -158.174003808782, 0,           0
##MIN=       -158.174003808782, -474111,     0
##MAX=       4658.78168019893, 343238678,    0
$$ Real data points
##PAGE= N=1
##DATA TABLE= (X++(R..R)), XYDATA
$$ [...]
5410D6035893M92945n84810j832356k346478k124114j363361p29499j6841M45630
5401C7977009N18620M36001M25311L14770M30605K29410o65529k010908l071681
5392C4583608l367500l105956k388551j911564j562203j223090j188668j009004
5384A8827072r43017p97776o58743n63657l89485l20733k19679j88082k87674
5375A4458226j38712j37942j88549j73952p0597j10159m2225Q1405j14303J3903
5365A3577095J5968J09096O0233J73944K31020J35638K42833K08460K72788K10533
5355A5237608K56179K55449K32888K54874K30210L27874L90383L86012N74463
5346A8145940P10825P86372P88994Q57331J012999J143405J229445J347618J621430
$$ y = [46035893, 46528838, 45944028, 44111672, 41765194, 39641080, 38277719, 37548220, 37531379, 37977009, 38495629, 38931630, 39356941, 39671711, 40102316, 40331726, 39666197, 37655289, 34583608, 31216108, 28110152, 25721601, 23810037, 22247834, 21024744, 19836076, 18827072, 17884055, 17086279, 16427536, 15863879, 15474394, 15153661, 14933982, 14745900, 14458226, 14319514, 14181572, 13993023, 13819071, 13748474, 13638315, 13596090, 13677495, 13563192, 13577095, 13593063, 13702159, 13762392, 13936336, 14167356, 14302994, 14545827, 14754287, 15027075, 15237608, 15493787, 15749236, 15982124, 16236998, 16467208, 16795082, 17185465, 17571477, 18145940, 18856765, 19643137, 20432131, 21289462, 22302461, 23445866, 24675311, 26022929, 27644359]
5337B7644359J825522K071562J964080J915372J857193J856278K117800K229292
5329D3481458J851521R21360j73095q04797j034589o73825k52621O2199R766r38277
5319D2449100k107080l060052l108920k553825j878227j204245q59414n12106
5311B7165231k71766J3166K10264N19494O96320J050200J353200J539097J654638
5302C3929844J748836J694208J538920J795095K003893J773649J106294J20496
5294D5711235p89203j143469j121662o91602m03855j91689p29348j846224k973483
5285C5820700l425457l236434k689258k084628j680774j329543j098915p70856
5277A9504835o82063n39873n13167l99803l31305l10365k54772j50248q5804n9653
$$ y = [27644359, 29469881, 31541443, 33505523, 35420895, 37278088, 39134366, 41252166, 43481458, 45332979, 46254339, 46081244, 45276447, 44241858, 43568033, 43315412, 43377611, 43387377, 42449100, 40342020, 37281968, 34173048, 31619223, 29740996, 28536751, 27677337, 27165231, 26893465, 26906631, 27116895, 27636389, 28332709, 29382909, 30736109, 32275206, 33929844, 35678680, 37372888, 38911808, 40706903, 42710796, 44484445, 45590739, 45711235, 44922032, 43778563, 42656901, 41965299, 41561444, 41369755, 40640407, 38794183, 35820700, 32395243, 29158809, 26469551, 24384923, 22704149, 21374606, 20275691, 19504835, 18822772, 18282899, 17769732, 17369929, 17038624, 16728259, 16473487, 16323239, 16237435, 16177782]
5267A6177782k4901k1973N2326p4892j09532j7783K3072j4398j7784j26456r9947
5256A5745514Q6345J36382R5603L6363J02217J81179K11864J90771L11572M82050
5246A7579860M64235O69153Q33091J105169J144015J296558J315596J279127J130241
5237B6817045J128619J308794J307219J071800L58463m63104q45928q44491p83518
5228B9054899l58611j89879L3136k75125r48992j408146j398747j116115n41687
5219B2850733l12556j36062J81730L35076N08521P80549J118796J389417J675008
5210B8391212J831137J974106J877570J781852J757386J905437J957960J516090
5202D2992750O30714n97189j348032j388896j039109n95962k47025k40292p91931
$$ y = [16177782, 16152881, 16130908, 16183234, 16108342, 15998810, 15981027, 16004099, 15989701, 15971917, 15845461, 15745514, 15831859, 15968241, 16063844, 16100207, 16202424, 16383603, 16595467, 16786238, 17097810, 17579860, 18044095, 18713248, 19546339, 20651508, 21795523, 23092081, 24407677, 25686804, 26817045, 27945664, 29254458, 30561677, 31633477, 31991940, 31528836, 30682908, 29838417, 29054899, 28696288, 28506409, 28539545, 28264420, 27315428, 25907282, 24508535, 23392420, 22850733, 22538177, 22402115, 22583845, 22918921, 23427442, 24207991, 25326787, 26716204, 28391212, 30222349, 32196455, 34074025, 35855877, 37613263, 39518700, 41476660, 42992750, 43623464, 43026275, 41678243, 40289347, 39250238, 38654276, 38407251, 38166959, 37375028]
5193C7375028j719976k340825k564947k341919j782411j391541r75709o42753
5185B3614947n63448k87189j03576J22391K56734M39533N59431M44680K27917
5176B4711420L60230M45929N64561O37325M97346j12627q55643j023161r39235
5167B4286145n78264m03422k13406j17568m85243j105339j426325j356961j096569
5158A7503048q56889p02145o10907n96233n42690m11249l61868l72462k33291
5149A2815314l57761l13594l60368l09380l89415l82129l02987k75085j42965
5140I981630k58281j38223j14588j66982j87338L84j17894q6568j16662j00582
5130H694896j66065j52509l18470k89249q3198k02417j44402o6551j69427k57997
$$ y = [37375028, 35655052, 33314227, 30749280, 28407361, 26624950, 25233409, 24257700, 23614947, 23051499, 22764310, 22660734, 22783125, 23039859, 23479392, 24038823, 24483503, 24711420, 25071650, 25517579, 26082140, 26719465, 27216811, 27104184, 26248541, 25225380, 24286145, 23707881, 23304459, 23091053, 22973485, 22488242, 21382903, 19956578, 18599617, 17503048, 16646159, 15944014, 15333107, 14736874, 14194184, 13782935, 13421067, 13048605, 12815314, 12457553, 12143959, 11783591, 11474211, 11084796, 10702667, 10399680, 10124595, 9981630, 9723349, 9585126, 9470538, 9303556, 9116218, 9116602, 8998708, 8912140, 8795478, 8694896, 8528831, 8376322, 8057852, 7768603, 7685405, 7482988, 7338586, 7272035, 7102608, 6844611]
5120F844611k03908j49753j64798k67848k10475j87088k14656j93040j76887j66791
5110D909367j35817j04283j13560r4862j51915m8233j37310p0092L0900q5626
5100C998569j45o8702l4809j13749j01235j6053o5972m3002n8324p6870M6250
5089C465958K8276r9977j18146q2563L173j84559j50087p9084l5246p4935n4856
5078B617954o0302r796r0794p5222L1326o4364j4041L0620p7632L9505M325n598
5066B325981j332m3520p9672p710j04587o0840O7910j6554j15278p4574K9693
5055A919517l2127l1330Q1322k5343j28759K9221M1662j6202k9881k4458L310
5044A786932q732r8272q0012l539L7086p0732o3947N7392k0545N4220N9527O543
$$ y = [6844611, 6640703, 6490950, 6326152, 6058304, 5847829, 5660741, 5446085, 5253045, 5076158, 4909367, 4773550, 4669267, 4555707, 4460845, 4308930, 4260697, 4123387, 4053295, 4084195, 3998569, 3998424, 3929722, 3894913, 3781164, 3679929, 3663876, 3597904, 3554902, 3496578, 3419708, 3465958, 3494234, 3394257, 3276111, 3193548, 3196721, 3012162, 2862075, 2782991, 2747745, 2672810, 2617954, 2557652, 2547856, 2457062, 2381840, 2413166, 2348802, 2334761, 2365381, 2287749, 2327254, 2331579, 2325981, 2324649, 2281129, 2201457, 2193747, 2089160, 2028320, 2096230, 2079676, 1964398, 1889824, 1919517, 1887390, 1856060, 1937382, 1912039, 1783280, 1812501, 1854163, 1837961, 1808080, 1783622, 1786932, 1778200, 1679928, 1599916, 1596377, 1633463, 1562731, 1498784, 1556176, 1535631, 1589851, 1649378, 1655921]
5032A655921j0684m8749J13633j651m0841j2532N9221m0902J7231O149p1418r0872
5020A534506j8101L3821J0795j36835J770K5057J2872J8691j7992k5761j26803
5009A312020k679N8070P5309k148j12826n6083m7252O8635n9564J6571N5977j1152
4997A294878O2993m526p5575o3328L2927j0030J4342l3099p917m1530p955j988
4985A159192p038K3704N4343O7839n1217L630R4355p267P5174R3608m2819l5881
4973A427623K760N7270n6548K4894L7177K6370l0343L0665P2073j0865j7376O1748
4961A625448P7448n4244K1738J42314P3870L9500j9285L8937J07692J06307Q8383
4950B248108J6889M5455l2079R820M6754L2331r0967q2794m2470l6146q9013o2749
$$ y = [1655921, 1645237, 1596488, 1710121, 1708470, 1667629, 1655097, 1714318, 1673416, 1690647, 1696796, 1625378, 1534506, 1516405, 1550226, 1561021, 1424186, 1425956, 1451013, 1463885, 1482576, 1464584, 1438823, 1312020, 1309341, 1367411, 1442720, 1440572, 1327746, 1271663, 1224411, 1293046, 1233482, 1250053, 1306030, 1294878, 1357871, 1353345, 1277770, 1214442, 1247369, 1237339, 1251681, 1218582, 1210665, 1169135, 1161180, 1159192, 1152154, 1175858, 1230201, 1298040, 1246823, 1250453, 1344808, 1337541, 1412715, 1506323, 1463504, 1427623, 1430383, 1487653, 1431105, 1455999, 1493176, 1519546, 1489203, 1519868, 1591941, 1581076, 1563700, 1625448, 1702896, 1648652, 1670390, 1812704, 1886574, 1926074, 1906789, 1945726, 2053418, 2159725, 2248108, 2264997, 2310452, 2278373, 2288193, 2334947, 2367278, 2276311, 2193517, 2151047, 2114901, 2025888, 1963139]
4938A963139n200k7052m7326j15538k4786j13843o1247N5190J1214N3487l315
4927A684723p1331l1018M5158p752J02447J08231M1971m5957J49085j3478l2936
4916A929143R8100r278K3970q2794J06226K6146j17184j83398l5958n8823n0614
4905A645536n3274j10903l5380j01434r9335p7479j15909k5856o0264n8177K8549
4894I36074j24574j01644N3672n5486j1387L5984j12793l0190j6026K4025p808
4883E89847q6334l3535L3669J4144n4880M9014m6326L1645K1132p6005q486j21026
4871C12859q000Q0216j3575k8031j7579L4998m1345l2148M6253j1064J93N165
4859C27942l6422j07441O7829q5232k256P4304k6888J6650L3291j5726p1875o021
$$ y = [1963139, 1957939, 1930887, 1883561, 1768023, 1743237, 1629394, 1568147, 1623337, 1634551, 1688038, 1684723, 1613392, 1582374, 1627532, 1619780, 1722227, 1830458, 1872429, 1826472, 1975557, 1962079, 1929143, 2027243, 2017965, 2041935, 1959141, 2065367, 2091513, 1974329, 1790931, 1754973, 1696150, 1645536, 1592262, 1481359, 1445979, 1344545, 1245210, 1167731, 1051822, 1025966, 965702, 907525, 936074, 811500, 709856, 763528, 708042, 696655, 732639, 619846, 589656, 573630, 597655, 589847, 503513, 469978, 503647, 517791, 462911, 511925, 465599, 497244, 518376, 442371, 433885, 312859, 304859, 385075, 371500, 343469, 325890, 360888, 319543, 287395, 333648, 322584, 322777, 327942, 291520, 184079, 251908, 166676, 164420, 238724, 211836, 228486, 261777, 246051, 174176, 168155]
4847A68155J6545p406M3592m6848q0284J4752N6575j26l585N0656p562K2657Q562
4834B35683m7965m7993j3442l4649K4573l4986L0110N5578j35490J5473R047N8837
4822A14776k1554l9020M6305l5865n144r653k144j0449Q373N8730N1178k8726
4810A26807N471N564q5360l3984N3084l0067o79q1477L8335N1161m6622k6694
4798b4461m0116R6063J7718m1378o0794L8865k8610J5786M811m445R8989k7989
4786D4439l1676K2530n7551m31N2940k2918J3768K257l7139k0144K162O6321j6554
4773A8004j4239M662J0349j3912k9250Q5112j0838n4320j31933O1745j7825k2522
4761a14967N4933L6969M3746m422m8648j4147j1628J8973Q8608m4985o3751n207
$$ y = [168155, 184700, 177294, 220886, 174038, 93754, 108506, 165081, 164955, 161370, 212026, 204464, 227121, 235683, 187718, 139725, 126283, 91634, 116207, 81221, 111331, 166909, 31419, 46892, 55939, 114776, 93222, 54202, 100507, 64642, 59498, 49845, 47701, 37252, 45625, 104355, 155533, 126807, 132278, 137842, 52482, 18498, 71582, 41515, 40836, -40641, -2306, 48855, 2233, -24461, -64577, 31486, 49204, 7826, -52968, -14103, -42713, -26927, -22116, -26561, 72428, 44439, 12763, 35293, -22258, -22689, 30251, 7333, 21101, 23358, -13781, -33925, -31763, 34558, 18004, 3765, 8427, 18776, 4864, -24386, 60726, 49888, -4432, -136365, -74620, -92445, -114967, -60034, -23065, 20681, 16259, -32389, -46536, -58164, -39191, 49417, 4432, -59319, -64526]
4749f4526M7833J4102l5375m2712m2415P0545J5221o2263R9694k5705M6866O04
4737B1869O381m2094q4952q5362J05793O5954l7745K5995N659j15206L6422O3511
4725c3775K3930L8080n2227M7812l4802Q6716n2540j2354l1733j04955L5890N2725
4713c7233k6837r173J6425L6859N5634o9552L9036L0386m2233J4331q2864J972
4701g3249P6862j3698l4753j0605n4703J9513N2381n1090P7346k3386R578K8060
4689B256k8138K565n2211L1074m533Q8484j6452k2813l6095L9695K6878p7763
4677d7053l560Q8435O4968j0851J4176l1k1772k5361j8843k5846J0686k6774r848
4664a1674Q068L8408L9875r0216n2691j1626Q8520p2663N4430o145r963N7194
$$ y = [-64526, -16693, -2591, -37966, -80678, -123093, -52548, -37327, -99590, 104, -25601, 21265, 21869, 28250, -13844, -98796, -184158, -78365, -12411, -50156, -24161, -18502, -133708, -97286, -33775, -9845, 28235, -23992, 23820, -10982, 75734, 23194, 10840, -20893, -125848, -89958, -37233, -64070, -73243, -56818, -19959, 35675, -33877, 5159, 35545, -6688, 7643, -75221, -73249, 3613, -10085, -44838, -55443, -110146, -90633, -38252, -89342, -11996, -35382, -25804, 2256, -25882, -23317, -75528, -44454, -48987, 39497, 23045, 232, -35863, 3832, 30710, -47053, -50613, 37822, 102790, 91939, 106115, 106084, 84312, 58951, 40108, 14262, 24948, -1826, -11674, -3606, 34802, 74677, -15539, -68230, -79856, 8664, -63999, -9569, -15714, -25677, 31517]
4652C1517l0643m7670P2747o074K7759l1895l7576J5115m5969L1769R8561p3887
4640C754m4025J4385J4528k3720O6978K5174q8704J93j0899L9385m5445Q730p385
4627d7051l2553J9742L9919o9791n78J09934q4137j5896O8185J0320J7142j10415
4615i5179K2797J1152n7738O491J7315m2460J30840n6575J1475n2746l5525Q936
4603a31217J1365M8183j5164M279q1464J3643KL594L1485r394J6057j5536K1941
4590a02226M4861N61k358J198K234K1091j16491J11672J818n2243M8815L809m6056
4577h3315l0180J7887k4727P2927m6857L0101M1698o110O9143n3750o0478j1194
4565h4855m592L6789R5033m2744j0306j8768j2602L8620J4638l8416l8992m0094
$$ y = [31517, 874, -46796, 25951, 19877, 47636, 15741, -21835, -6720, -52689, -20920, 77641, 3754, -40271, -25886, -11358, -35078, 31900, 57074, -31630, -31437, -42336, -2951, -48396, -39666, -47051, -79604, -59862, -19943, -89734, -90312, 19622, -64515, -80411, -12226, -1906, 15236, -95179, -72382, -61230, -118968, -112477, -95162, -137622, -6782, -63357, -51882, -104628, -140153, -131217, -119852, -71669, -86833, -82554, -164018, -150375, -150373, -146779, -115294, -124688, -108631, -124167, -102226, -57365, -56804, -59162, -57964, -55730, -34639, -151130, -39458, -37640, -89883, -41068, -37259, -83315, -113495, -95608, -120335, -47408, -94265, -64164, -22466, -28576, 40567, -13183, -73661, -84855, -89447, -52658, 42375, -369, -10675, -29443, -42045, -3425, 11213, -27203, -66195, -106289]
4553a06289l655N584k0844L2303J9436O663m9573m0770O4290N3472j0756J0300
4541c9839m0565K4549M8442k2825l806o5376k4443N3732k98j15183R8446J43884
4529E6718P425n3170o2259N8585m662p3740P8235k2503N5321l3505j9836L8023
4517B4632r1509M5842j8739l1258K2930J7500M2720M8795o2626P405q367J7581
4505A4906K9992m3624M8489n562j34052N5027N9243J842J902l3641l7211K4178
4493a8511n6480L7819J6577k0340J8142j6259l6994R4859L6868o4619o8077P1705
4481e310O4924r2092m4182J17049l5604L6221K3774r478Q62q833j05615N4791
4469c493M5615j9284Q2039j3317J7299k5398M1382L6475J029j04098P9444N1713
$$ y = [-106289, -109944, -104360, -125204, -92901, -73465, -66802, -116375, -157145, -92855, -39383, -50139, -39839, -80404, -55855, -7413, -30238, -34044, -99420, -123863, -70131, -70429, -185612, -87166, 56718, 64143, 10973, -51286, 7299, 2637, -71103, 7132, -15371, 39950, 6445, -13391, 24632, -66877, -21035, -39774, -71032, -48102, -30602, 12118, 60913, -1713, 5692, -2675, 14906, 44898, 1274, 49763, 44201, -89851, -34824, 24419, 26261, 28163, -5478, -42689, -18511, -74991, -37172, -20595, -40935, -22793, -39052, -76046, 18813, 55681, -8938, -77015, -5310, 59614, -32478, -76660, 40389, 4785, 41006, 64780, 55302, 56164, 47331, -58284, -3493, 42122, 22838, 104877, 91560, 108859, 83461, 124843, 161318, 162347, 58249, 137693, 189406]
4457A89406J6171k1458R370j4223m2456J9137P5070M4559p5863K2407K9130K1312
4445B72562O334O876L7179j1823J4745R5010L4297O1705N2446P9842O3326J03653
4433H16152J00508N0098R2063J01258O4854K0895J6645R260k8170n4534j60101
4422A028928m4863l1741k23108j4297k6777q4465P396L7767k9114m848j98l30
4410F14350j9465m7177M4164J9849L5677J2596l2517k4412P2395K2549r424P1294
4398G59879O3932K5060Q7665N0978O1635J41518Q3853O7170K3481J48001J0593
4387A523765o403K6329k669q1521l8141j6286n1001j10197k3169k4793J3903Q8021
4375A297838K87L8097j0703Q2553j7669M3903L2035J9081R728j39194r5000R326
$$ y = [189406, 205577, 184119, 193489, 179266, 136810, 155947, 231017, 275576, 199713, 222120, 251250, 272562, 278896, 285772, 322951, 311128, 325873, 420883, 455180, 516885, 569331, 649173, 712499, 816152, 916660, 966758, 1058821, 1160079, 1224933, 1245828, 1262473, 1271733, 1243563, 1189029, 1028928, 984065, 952324, 729216, 714919, 688142, 603677, 611073, 648840, 619726, 614878, 614680, 614350, 594885, 547708, 591872, 611721, 647398, 659994, 627477, 603065, 675460, 698009, 688585, 759879, 823811, 848871, 936536, 987514, 1049149, 1190667, 1274520, 1341690, 1365171, 1513172, 1523765, 1517362, 1543691, 1541022, 1459501, 1421360, 1405074, 1354073, 1243876, 1220707, 1195914, 1209817, 1297838, 1298125, 1336222, 1325519, 1408072, 1390403, 1434306, 1466341, 1485422, 1495150, 1355956, 1260956, 1270282]
4363A270282k980J515p8829j03747j04662K9659k9601j3486o3718q4544K3990
4352H43879N9642m7308n9962M1256k8609m4992n8416Q3166M2814R136k9921K3848
4340H34533k8325k2338L3690M7940J15751Q781K0002j204Q8822J20657o1300L4756
4328A191765R1091k8761k1177L4991k3525m1886O8438O9330o9927k1095R7936
4317A347180R8696Q2630P8702J0278L4434P6374J1601m5278q5926l8199R7941
4306A668433p9637j86605j27859o3438k8132m5981j78315L0993r92j13120J0457
4295H85804l4642k7067K9079o9403k8503M4371n5043j9279M5924k234n3948m7683
4283F67376M9066M3039O342J9642K537j8076j7633L3179N7140j2317k7449K2137
$$ y = [1270282, 1267302, 1268817, 1189988, 1086241, 981579, 1011238, 981637, 968151, 904433, 819889, 843879, 903521, 856213, 796251, 837507, 808898, 763906, 705490, 788656, 831470, 840606, 810685, 834533, 806208, 783870, 817560, 865500, 981251, 990032, 1010034, 1008830, 1097652, 1218309, 1157009, 1191765, 1282856, 1254095, 1232918, 1267909, 1244384, 1202498, 1270936, 1340266, 1270339, 1249244, 1347180, 1445876, 1528506, 1607208, 1617486, 1651920, 1728294, 1739895, 1694617, 1608691, 1570492, 1668433, 1588796, 1402191, 1274332, 1210894, 1182762, 1136781, 958466, 989459, 988467, 875347, 885804, 851162, 824095, 853174, 783771, 755268, 799639, 744596, 725317, 771241, 769007, 715059, 667376, 716442, 759481, 765823, 785465, 788002, 769926, 752293, 785472, 842612, 830295, 802846, 824983]
4271H24983J1189j0151J6742N1342J1915L569K1549L1848Q9730l2960P6618n172
4259A091202J50071J49775J7904P9907M8700R3650R1848M9763J53723N4197l5166
4248A945574o5745j3336J1069m7132p8343j34347p5758m7897r3838j57831l0187
4237A212229r4844j06665n961J7561q1411J5487K520l8983Q299k9763o7206J8600
4225H49863M8733O4605K1350o901p9092N3243J9208Q506P8611N7564k429L4161
4213A147422j1377j7186n987J16611J16980l4555O966J1587O8760J14145l6899
4202A476467M9066J11132O8351K6254J6083J27566J02423j2022R2236O0711Q6720
4191B204987O4786R573R6572J44961P7737J08615J07479J27115K1570J7806J06185
$$ y = [824983, 836172, 826021, 842763, 894105, 906020, 909589, 931138, 962986, 1052716, 1019756, 1096374, 1091202, 1241273, 1391048, 1408952, 1488859, 1537559, 1631209, 1723057, 1772820, 1926543, 1980740, 1945574, 1879829, 1866493, 1877562, 1830430, 1752087, 1617740, 1541982, 1494085, 1400247, 1242416, 1212229, 1117385, 1010720, 1004759, 1022320, 940909, 956396, 958916, 919933, 928232, 898469, 831263, 849863, 898596, 963201, 984551, 977650, 898558, 951801, 971009, 979515, 1058126, 1115690, 1113261, 1147422, 1136045, 1118859, 1112872, 1229483, 1346463, 1311908, 1318874, 1330461, 1399221, 1513366, 1476467, 1525533, 1636665, 1705016, 1731270, 1747353, 1874919, 1977342, 1965320, 2057556, 2118267, 2204987, 2269773, 2279346, 2375918, 2520879, 2598616, 2707231, 2814710, 2941825, 2963395, 2981201, 3087386]
4180C087386J1538Q8728P8036J41447Q5119K08361K73882J14569K14470K42661
4170D546197J93520Q4166P8291m2952p8332j13042k67222k45651k84881k59678
4160C610416j82811j82993r6096L086k6859r5930K5860J18254M6533Q2240R3131
4149C394831K7725Q0584O4223r5969O8274p1501j24025k57211j97765k28673k81669
4138B378824j48042k13485j31288j57441j45045j13255o1984o7221p0717j23288
4128A147058K5781j11378L02j58767k4179R7161r6492q1685l4475Q882k3335n8159
4116F90714m3065J14354q2623r4490N2742k1470m1820K3083p7325K7642R358J2971
4104E70071L0788O775l7638k8209j5560l8467k3486J9626n5599k0456o2061k0382
$$ y = [3087386, 3098924, 3187652, 3265688, 3407135, 3492254, 3700615, 3974497, 4089066, 4303536, 4546197, 4739717, 4823883, 4902174, 4859222, 4780890, 4667848, 4400626, 4154975, 3870094, 3610416, 3427605, 3244612, 3148516, 3151602, 3124743, 3028813, 3054673, 3172927, 3219460, 3301700, 3394831, 3422556, 3503140, 3567363, 3471394, 3539668, 3468167, 3344142, 3086931, 2889166, 2660493, 2378824, 2230782, 2017297, 1886009, 1728568, 1583523, 1470268, 1408284, 1341063, 1270346, 1147058, 1172839, 1061461, 1061763, 902996, 878817, 975978, 879486, 797801, 763326, 772208, 748873, 690714, 647649, 762003, 679380, 584890, 637632, 616162, 574342, 597425, 520100, 547742, 557100, 570071, 600859, 607634, 569996, 541787, 526227, 487760, 464274, 483900, 428301, 407845, 345784, 325402]
4092C25402N1296j14151K3663J52676q4882l4107q1955O8651J7672q6608l3253
4081B04404L0620L753l0676j5994J458p1539n2677J6952n2187K6116q309Q885
4069F0806K4634l8295J8520k0685J7464m7200j1129o361k7475M846J10158K3051
4057A08334p7979p5491K4568O3628m0636K4726k8181o610k0933P9147k1974K4416
4045E3015m320j20988m530P9592L1956j1136j6263J0748M5166P643O9101M0522
4033A80506k1308m1110j1205k3511O0542j6981o1172l6402j7934j0340j6451L2478
4021A7112K2361j1814o2949J7736l0531J5651M0129j0877Q441p3440j1663J11917
4009C2073j7099l7131j5419j5920k1970j9887M2828j7955M2621N455K9085K9018
$$ y = [325402, 376698, 262547, 286210, 438886, 354004, 319897, 237942, 306593, 324265, 237657, 204404, 235024, 238777, 208101, 192107, 193565, 122026, 69349, 86301, 34114, 60230, 51921, 60806, 85440, 47145, 65665, 44980, 62444, 15244, 4115, -2246, -29721, -24875, 85283, 108334, 30355, -45136, -20568, 43060, 2424, 27150, -1031, -7641, -28574, 50573, 28599, 53015, 48695, -72293, -76823, 2769, 34725, 23589, 7326, 18074, 63240, 70883, 139984, 180506, 159198, 118088, 106883, 83372, 143914, 126933, 65761, 29359, 11425, 1085, -15366, 17112, 39473, 27659, -35290, -17554, -48085, -32434, 7695, -3182, 5259, -68181, -79844, 32073, 14974, -22157, -37576, -53496, -75466, -95353, -52525, -70480, -27859, -22404, 6681, 35699]
3997C5699k8235Q15q8732L8121j1813M3665n2023K5093o0660o168N1214O763j1005
3984e7266J4140l6934M2987N127J8644m1394M0801m0123j06649J00047m930r7124
3972a62674j1176O3732K4137J7217l7979N2847k1947l9384L0118j1994J01771
3961D668k3566r0705N9876m4949L0169L7587L1992m6759J0810J039n217n8461
3949i3516L7964j992M8451K2730p1988M1251K415k719L1876q670o66n7615K5400
3936b7079r26K0493k2389n7826K3106j2409J2595J6516j3634J9239k2075M3920
3924b0469M6553q4320k6610L5640O5583N9677m4634J1911k9545m0195K223N4815
3912C0629n1418Q446N7876j7791n7778o1362J06839L20j9005K6717P6164J9279
$$ y = [35699, 7464, 8279, -80453, -42332, -54145, -10480, -62503, -37410, -98070, -104238, -53024, -46261, -57266, -43126, -80060, -37073, -31946, -13302, -54696, -13895, -54018, -160667, -60620, -65550, -162674, -173850, -110118, -85981, -68764, -106743, -53896, -75843, -115227, -85109, -97103, 4668, -18898, -109603, -49727, -94676, -64507, -26920, 5072, -41687, -30877, -29838, -35055, -93516, -55552, -57544, -9093, 13637, -58351, -17100, -14685, -17404, 14472, 5802, 5136, -52479, -27079, -28005, -7512, -29901, -87727, -64621, -77030, -64435, -47919, -61553, -42314, -64389, -20469, 26084, -58236, -84846, -49206, 16377, 76054, 31420, 43331, 13786, -26409, -24186, 30629, -20789, -12343, 45533, 27742, -30036, -91398, 15441, 15761, -3244, 23473, 99637, 118916]
3900A18916o8294O137L991L112K0939l1401L9465m4479J9245M4251L6208n4546
3888I3544n1711j510N454n8161k330J1455k0761m2799J19568P6692J140p6807
3876E3774k4380k1047M2538L5923k4490J3896q546j1031n6287L2628M2951r850
3864F6079k9425J8303o158L1283n3677m360k4707m3717r869K7981l6530k6280
3852i1077M3751O685O5536n99o9183K2067N7369P211j7192P5997N42r5506N0286
3839E5887l646J3769M91L6307O4361j4070p4687O2066q195m5212O6641Q6330r6673
3826A43369k2092P1192o0716p7874O3626M8070k8003m580k5501l0326k9086L5304
3814H3383K2606J4604K2611n2855j8771O4114J6776o4433m8650j7185J5164M0863
$$ y = [118916, 50622, 56759, 60750, 63862, 84801, 53400, 92865, 48386, 67631, 111882, 148090, 93544, 41833, 40323, 45777, -12384, -14714, -3259, -24020, -66819, 52749, 129441, 130581, 53774, 29394, 8347, 50885, 86808, 62318, 76214, 67668, 56637, 350, 32978, 75929, 66079, 36654, 54957, 48799, 80082, 26405, 22045, -2662, -46379, -56248, -28267, -64797, -91077, -47326, -40641, 24895, 24296, -44887, -22820, 34549, 41760, 24568, 100565, 101107, 5601, 55887, 52241, 66010, 66501, 102808, 167169, 153099, 78412, 140478, 132283, 87071, 153712, 240042, 143369, 121277, 192469, 131753, 53879, 117505, 165575, 137572, 132992, 107491, 77165, 48079, 83383, 105989, 120593, 143204, 90349, 71578, 135692, 152468, 88035, 39385, 22200, 37364, 78227]
3802G8227L0094K4231l7431L9599Q14j7237p1247K8067L1364L6275p678o4802
3790G0276j9191N9990M9074o841p344J2259L0130m4250j8497Q0280l965K0090
3778B22011k4210m406j7043Q5093K8208j12416j0209P0264J2805j4699n4399m210
3766A76789J4696M7840p1533k5932m8771K1286K7964m9991J5279R571O3901j6272
3754A64827J0989M6079j21563J1905J13196K8268o8637N5040Q0688j23318L5162
3743B32636j9647J0563J048K6233J2814n5586K2252l2333N5529P864m648m3392
3731B13333K2044N3107l5067j5649P6876N1145P697l6172r8748K5162K9097K0810
3719C13635M289j0044L7621R486L1169l9068K9153N1256j1126j1158J3513J8532
$$ y = [78227, 108321, 132552, 95121, 134720, 135534, 118297, 47050, 75117, 106481, 142756, 135078, 70276, 51085, 111075, 160149, 153308, 145964, 158223, 188353, 144103, 125606, 205886, 201921, 222011, 197801, 193395, 176352, 261445, 289653, 177237, 167028, 237292, 250097, 235398, 180999, 176789, 191485, 239325, 167792, 141860, 93089, 114375, 142339, 92348, 107627, 117198, 181099, 164827, 175816, 221895, 100332, 112237, 225433, 253701, 185064, 240104, 320792, 197474, 232636, 212989, 223552, 224600, 250833, 263647, 208061, 230313, 197980, 253509, 261373, 256725, 213333, 235377, 288484, 253417, 237768, 314644, 365789, 373486, 337314, 238566, 263728, 292825, 313635, 317924, 307880, 345501, 354987, 386156, 347088, 376241, 427497, 416371, 405213, 418726, 437258]
3707D37258k0877m1409N0815P5277K1267p559m7144J950M8517M6076J4129M0581
3695F18881M4522K1873K7322j4528M0145K3177O581J9376N1166M1555p8324N1901
3683H53647m7773j7683j9856R9182P420L2178n5065m093Q6123L2412K2646O7430
3671A056568r706K7384M2464K7957J5186L5189R795n539q768j0318J0274N0901
3659A241387l6933N7370Q7513r0643N1421Q975J2477o3049n155J2875M3121P0544
3647A389903L3248m008R6596L8366J1540L109j0928Q5257K7823l2869k3978Q3018
3635A697077k6701J52380L7864m4872N7584P4389N0532J51867n3696m1211J798
3624B057011L6019L3082M7888P1679M4292J2091J6954O20Q8999j2331m2596j1657
$$ y = [437258, 416381, 374972, 425787, 501064, 522331, 514772, 467628, 469578, 518095, 564171, 578300, 618881, 663403, 685276, 712598, 698070, 738215, 761392, 767973, 787349, 838515, 880070, 801746, 853647, 805874, 788191, 768335, 867517, 874937, 907115, 852050, 847957, 934080, 966492, 989138, 1056568, 1046862, 1074246, 1116710, 1144667, 1159853, 1195042, 1204837, 1199298, 1190530, 1180212, 1190486, 1241387, 1204454, 1261824, 1349337, 1258694, 1310115, 1319090, 1331567, 1268518, 1263363, 1276238, 1319359, 1389903, 1423151, 1419143, 1515739, 1554105, 1565645, 1568754, 1557826, 1643083, 1670906, 1638037, 1614059, 1697077, 1670376, 1822756, 1860620, 1815748, 1873332, 1947721, 1998253, 2150120, 2096424, 2055213, 2057011, 2093030, 2126112, 2174000, 2245679, 2289971, 2302062, 2319016, 2319636, 2408635, 2396304, 2353708, 2342051]
3612B342051p8643k80L3173o446P216P3252l4308o7706r9619L253K6053o535n0991
3599B140470J2007J3140r896m512r8377k0524N5191M5427J4774l7571O0405K4876
3587B195410n7490P0505m598J19071N314m3312J00336O3797K3012K0647P1474
3576B564166Q5880J58226L2522K3478J9263Q3681J55022j0211J9127Q6655M111
3565C221920J4852J6522M3583q3648n8651m5399j3352o0295m7997p7440o8395
3554B841700m0191M1743n0913k1892q5405P6591M1068j05508m1390O9863l5932
3543B689734N6983n1778N5881J8384O6871J432j1588N9897N563M8177M9144K5867
3531C014567N0631k0725N9039O6592P6317J15903m1426O7981J36336M4897L6016
$$ y = [2342051, 2263408, 2263128, 2296301, 2289855, 2297071, 2370323, 2336015, 2268309, 2168690, 2171943, 2197996, 2191461, 2140470, 2152477, 2165617, 2155721, 2151209, 2052832, 2032308, 2087499, 2132926, 2147700, 2110129, 2170534, 2195410, 2137920, 2208425, 2203827, 2322898, 2328212, 2284900, 2385236, 2449033, 2472045, 2492692, 2564166, 2650046, 2808272, 2840794, 2864272, 2883535, 2967216, 3122238, 3112027, 3131154, 3217809, 3221920, 3236772, 3253294, 3296877, 3213229, 3154578, 3109179, 3095827, 3035532, 2987535, 2910095, 2841700, 2801509, 2843252, 2792339, 2770447, 2685042, 2761633, 2802701, 2697193, 2655803, 2725666, 2689734, 2746717, 2694939, 2750820, 2769204, 2836075, 2837507, 2825919, 2885816, 2891379, 2939556, 2988700, 3014567, 3065198, 3044473, 3103512, 3170104, 3246421, 3362324, 3320898, 3388879, 3525215, 3570112, 3606128]
3520C606128R7679J32783J21775J15548R7398Q7832l372J24728J02072J28911
3510D611482J35893P4889J40989J49280K17014J26829J49440J99155J55260K20094
3500F180325J76069J93759K68226K08532K26669K28813K95291K78113J25174K86921
3490H467892L27522K86656K31973Q5361J62036K21839J86852K70302K68410K91943
3480A0800786K94966K28832J39101J75072K57185J76956J71659J22858N7356K8357
3470A2453128J97694J08824K55696J56976J59960Q6031K00194K22722K66795J38993
3460A4247013L29890K23736K48872R2580J67575J03705o0529Q7487Q1817K27753
3450A5749899M8034J21790K70151K40875J78282L38527K89510L17764M35199L33094
$$ y = [3606128, 3703807, 3836590, 3958365, 4073913, 4171311, 4259143, 4255771, 4380499, 4482571, 4611482, 4747375, 4822264, 4963253, 5112533, 5329547, 5456376, 5605816, 5804971, 5960231, 6180325, 6356394, 6550153, 6818379, 7026911, 7253580, 7482393, 7777684, 8055797, 8180971, 8467892, 8795414, 9082070, 9314043, 9399404, 9561440, 9783279, 9970131, 10240433, 10508843, 10800786, 11095752, 11324584, 11463685, 11638757, 11895942, 12072898, 12244557, 12367415, 12424771, 12453128, 12650822, 12759646, 13015342, 13172318, 13332278, 13418309, 13618503, 13841225, 14108020, 14247013, 14576903, 14800639, 15049511, 15142091, 15309666, 15413371, 15352842, 15440329, 15522146, 15749899, 15797933, 15919723, 16189874, 16430749, 16609031, 16947558, 17237068, 17554832, 17990031, 18323125]
3440A8323125M93019M26322M84475L87298M81343O40845M99872O06957N50326
3431B2893582O05823P33112P62614R01561R37121J043686R90764J025950J229610
3422C1123823J305718J482136J576611J607433J870354K130639K296397K601540
3414D5994651L021601L369097L814780M406451M846643M958055M838446M712569
3406G9962293M808620N032298N035708M258609K744094J641331J080542J555026
3398A06118521K645029L683355M935456N956058N729078M584362L480766K919933
3390A40052558L343266L574610K456733K43204j777540k965806k626650j631018
3382A40669357o20262k45940p1633N7285Q43483J824195K836388L625730L632458
$$ y = [18323125, 18816144, 19242466, 19726941, 20114239, 20595582, 21236427, 21736299, 22343256, 22893582, 23499405, 24232517, 24995131, 25896692, 26833813, 27877499, 28868263, 29894213, 31123823, 32429541, 33911677, 35488288, 37095721, 38966075, 41096714, 43393111, 45994651, 49016252, 52385349, 56200129, 60606580, 65453223, 70411278, 75249724, 79962293, 84770913, 89803211, 94838919, 99097528, 101841622, 103482953, 104563495, 106118521, 108763550, 112446905, 117382361, 123338419, 129067497, 133651859, 137132625, 140052558, 143395824, 146970434, 149427167, 149670371, 147892831, 144927025, 142300375, 140669357, 140049095, 139803155, 139731522, 139788807, 140632290, 142456485, 145292873, 148918603, 152551061]
3373A52551061K289887l08901k395884l739333m317843n284702o729834q233736
3365A23830715q938220q456143p250189n813638m527616l433599k275193j447301
3357H1688816p06231k13852j38860k37772j71581n34285q95075j613683k675349
3348G4502128l990883m843790n137065m858069m420262l864325l427426k954793
3340D1005515k572114k210089j999618j804364j552380j531474j385786j302204
3332B6647486j108958j040469j006054q64125r13220q56477o72867q80068n78672
3323A8726576n76169n57362n62084o07112m78961n25592m33372m33622l76408
3314A4175894m32712l31613l55996l30381l09615k20956k56842l96264k35667
$$ y = [152551061, 154840948, 154532047, 152136163, 148396830, 144078987, 138794285, 132064451, 123830715, 114892495, 106436352, 99186163, 93372525, 88844909, 85411310, 83136117, 81688816, 80982585, 80768733, 80629873, 80392101, 80220520, 79686235, 78791160, 77177477, 74502128, 70511245, 65667455, 60530390, 55672321, 51252059, 47387734, 43960308, 41005515, 38433401, 36223312, 34223694, 32419330, 30866950, 29335476, 27949690, 26647486, 25538528, 24498059, 23492005, 22627880, 21714660, 20858183, 20185316, 19305248, 18726576, 18150407, 17593045, 17030961, 16423849, 15944888, 15419296, 14985924, 14552302, 14175894, 13743182, 13411569, 13055573, 12725192, 12415577, 12194621, 11937779, 11541515, 11305848]
3305A1305848k13838k07617j70485j70973j90736r4160o4389j62777q4333n2685
3295I893855j02601j65322q2993q7885j19127p9975k6213j55028k26519j04450
3285H743742p7261j05254j8715r7446j590M988M3174O1701j4067M4067r029O211
3273H580521Q882j45332o9546r0745j53898j86472k41660k01346j95737j02626
3263G202041j08624r0791r2156l3339j8099q3845m7653m9157J8519m4993r1256
3252F560647p6791l1691j58260j19714m7907k07480j26815n6979r1866j27980
3242E515164q2907m6107k2123m4411k1574p5617o9245n4921L0017M2635q032r8303
3230E064576P7915J0446p848J263J07361j3884M4217m0066N1061N6704o5908J9349
$$ y = [11305848, 11092010, 10884393, 10713908, 10542935, 10352199, 10258039, 10193650, 10030873, 9946540, 9893855, 9791254, 9625932, 9542939, 9455054, 9335927, 9255952, 9229739, 9074711, 8848192, 8743742, 8666481, 8561227, 8542512, 8445066, 8443476, 8448464, 8491638, 8553339, 8539272, 8583339, 8574310, 8580521, 8589403, 8444071, 8374525, 8283780, 8129882, 7943410, 7701750, 7500404, 7304667, 7202041, 7093417, 7002626, 6910470, 6877131, 6859032, 6775187, 6727534, 6678377, 6696896, 6651903, 6560647, 6483856, 6452165, 6293905, 6174191, 6126284, 5918804, 5791989, 5735010, 5643144, 5515164, 5432257, 5386150, 5364027, 5319616, 5298042, 5222425, 5153180, 5098259, 5128276, 5170911, 5162879, 5064576, 5142491, 5152937, 5145089, 5146352, 5253713, 5239829, 5284046, 5243980, 5295041, 5351745, 5285837, 5305186]
3218E305186J02000R5011R802Q290Q2714L5671Q7435k2087N941J47616Q7306J15580
3206F060465K5541J42955Q3792L9572J44110J10085L7351K1163J18387J04467
3196F887888k0927L7746J2476J05636P4255m4012K1715J16001l014K5613J04236
3185G317613J01849J16842j7801J01104J74129L7891M4557J36666J12570J99187
3175H324607J38622L3545J11640Q4898R1614J99724J87790J99176J86809P8350
3165I636775J10387K12763K29630J79427J94418J75595K54738K00100J85734K82697
3155A1662264K08525J50582L19453K09692J76048K65721K55354K30479J78079
3146A3656197K67398K19576K37567J63936K50814K83428K63848L05319J43452
$$ y = [5305186, 5407186, 5502197, 5511999, 5520289, 5603003, 5638674, 5726109, 5704022, 5709963, 5857579, 5944885, 6060465, 6086006, 6228961, 6312753, 6352325, 6496435, 6606520, 6643871, 6665034, 6783421, 6887888, 6866961, 6904707, 6917183, 7022819, 7097074, 7053062, 7074777, 7190778, 7187764, 7213377, 7317613, 7419462, 7536304, 7518503, 7619607, 7793736, 7831627, 7876184, 8012850, 8125420, 8324607, 8463229, 8496774, 8608414, 8693312, 8784926, 8984650, 9172440, 9371616, 9558425, 9636775, 9747162, 9959925, 10189555, 10368982, 10563400, 10738995, 10993733, 11193833, 11379567, 11662264, 11870789, 12021371, 12340824, 12550516, 12726564, 12992285, 13247639, 13478118, 13656197, 13923595, 14143171, 14380738, 14544674, 14795488, 15078916, 15342764, 15648083, 15791535]
3137A5791535L32235K78754K83677L17201L05463L21884L04645J57626K63815
3128A8356835K53588J88782K40524J23857K72214L09131K53213J67294K83393
3119B0448831K88079L40026L35802L22178L90477M92717M30490M93639N30636
3110B4072875O18006N56555N56198N78253O57540N98326O74326O87153N90677
3101B9589909Q37646P44862Q58762R81852J053276J168524J250119J322742J393849
3092C9201541J539600J657988J626769J892070J855081K090646K320959K533793
3084E4718447K772046L304276L543632L705051L733533L621123L494605L137444
3076H2030157K961896K510094J642399L38103r61248j836643j732000j194394
$$ y = [15791535, 16123770, 16402524, 16686201, 17003402, 17308865, 17630749, 17935394, 18093020, 18356835, 18610423, 18799205, 19039729, 19163586, 19435800, 19744931, 19998144, 20165438, 20448831, 20736910, 21076936, 21412738, 21734916, 22125393, 22618110, 23048600, 23542239, 24072875, 24690881, 25247436, 25803634, 26381887, 27039427, 27637753, 28312079, 28999232, 29589909, 30427555, 31172417, 32031179, 33013031, 34066307, 35234831, 36484950, 37807692, 39201541, 40741141, 42399129, 44025898, 45917968, 47773049, 49863695, 52184654, 54718447, 57490493, 60794769, 64338401, 68043452, 71776985, 75398108, 78892713, 82030157, 84992053, 87502147, 89144546, 89482649, 88521401, 86684758, 84952758, 83758364]
3068H3758364m31148N07158J367811K238113L205807M002931M345637M278398
3060A03273071L994149L447061L130290K622967J240995j335778m271048o344081
3052A05757626p021273o613595n571393m371631l269235k356669j421509o09309
3044G4523012j21793J77098L33291K70720K03587J964l88256j020028k023111
3035G1956484l064061l832624m006756l658472l220445k631736k288840j981912
3027D7271638j591669j328943j051982q88558p69472o07765m37139k13315j94777
3018D0188018k40772o5315N7898K16743K67795K62830L25884L82217L87351M55914
3008D2238563N54299O34343O88286Q47835R24712R75285J032381J273012J343376
$$ y = [83758364, 83327216, 83834374, 85202185, 87440298, 90646105, 94649036, 98994673, 103273071, 107267220, 110714281, 113844571, 116467538, 117708533, 116372755, 112101707, 105757626, 98736353, 92122758, 86551365, 82179734, 78910499, 76553830, 75132321, 74523012, 74401219, 74578317, 74911608, 75182328, 75385915, 75387879, 74999623, 73979595, 71956484, 68892423, 65059799, 61053043, 57394571, 54174126, 51542390, 49253550, 47271638, 45679969, 44351026, 43299044, 42410486, 41641014, 41033249, 40596110, 40382795, 40188018, 39947246, 39881931, 39939829, 40156572, 40424367, 40687197, 41013081, 41395298, 41782649, 42238563, 42792862, 43427205, 44115491, 44963326, 45888038, 46863323, 47895704, 49168716, 50512092]
2999E0512092J476541J686134J844477J873638K265995K328314K456796K768365
2991F7212352K955070L198917L338280L893055M260064M602585N211283N712428
2983A00384034O334875P087877P635857Q264806Q678560Q855546Q538490P707442
2975A63487487O626020N073344L924470K253378O2210k272369m169169n357744
2967A69627627n363162m979530m544630m108263l859957l500378k857017k017913
2959A38396777j248780j142563k206348l426983m148920l688568k446486j051922
2951A19036207K26499J348931J156183J05823n63176q22648k56874N46484J92155
2942A20969584j145583k754082l774111l743810k942876k316803k646021k809732
$$ y = [50512092, 51988633, 53674767, 55519244, 57392882, 59658877, 61987191, 64443987, 67212352, 70167422, 73366339, 76704619, 80597674, 84857738, 89460323, 94671606, 100384034, 106718909, 113806786, 121442643, 129707449, 138386009, 147241555, 155780045, 163487487, 170113507, 175186851, 179111321, 181364699, 181426909, 179154540, 174985371, 169627627, 164264465, 159284935, 154740305, 150632042, 146772085, 143271707, 140414690, 138396777, 137147997, 136005434, 133799086, 130372103, 126223183, 122534615, 120088129, 119036207, 119262706, 120611637, 121767820, 121873643, 121310467, 120487819, 120230945, 120777429, 120969584, 119824001, 117069919, 113295808, 109551998, 106609122, 104292319, 101646298, 98836566]
2934I8836566l028720k869476k400607k019639j622519j381709j966920l470981
2926H0075995n098987n984899n730403n038511m233226l582985l083710k664139
2918D4659135k373918k098732j845423j769857j578159j554741j322520j260728
2910C0855057j251969j005187j114406j065382r40539q10258q69344q64709o81303
2901B2251960o32844o81475o80335n87200o96805n11240n07248m69870m69927
2892A7015016n97530m99716l33602m57209l60940m76142l10654l30125m18128
2883A3230970l29891k33039j87372k80795k05766k42414j79721k25107l19189
2874A1027676k36237k76528k54786j67294p7795k92550r3498r4748j93357j20215
$$ y = [98836566, 95807846, 92938370, 90537763, 88518124, 86895605, 85513896, 83546976, 80075995, 74977008, 68992109, 63261706, 58223195, 53989969, 50406984, 47323274, 44659135, 42285217, 40186485, 38341062, 36571205, 34993046, 33438305, 32115785, 30855057, 29603088, 28597901, 27483495, 26418113, 25477574, 24667316, 23797972, 22933263, 22251960, 21619116, 20937641, 20257306, 19670106, 18973301, 18462061, 17954813, 17484943, 17015016, 16417486, 15917770, 15584168, 15126959, 14766019, 14289877, 13979223, 13649098, 13230970, 12901079, 12668040, 12480668, 12199873, 11994107, 11751693, 11571972, 11346865, 11027676, 10791439, 10514911, 10260125, 10092831, 10015036, 9722486, 9628988, 9534240, 9340883, 9220668]
2864I220668j62508j13578j68599j24585q5401k15392q6362j34324j11612p7036
2854G941271o2393j47108j44592o5505j00361r5627j21840r9301k9435q8231m2120
2843F944758p1395q0029q2272p8332m1156j5900P4763j19169r2608j0936k1649
2832F406075M296m8397n9194q7573k3478o3060p1096m3742M2593K2361r4750j3787
2820E970248n1613J352N0228m4839l4747M8298o0258r493p3471k5758o589j07243
2808E656115j03116j1567q303o082j1112J3316J4429N1848J32689J58449J17671
2797F004337J47597L08246K76766J47123K05962R4250J64126K21819p8532k31393
2787G260301k06646l37393n10732m74490l86476l14898j03800k48649j15810j50896
$$ y = [9220668, 9058160, 8944582, 8775983, 8651398, 8565997, 8350605, 8264243, 8129919, 8018307, 7941271, 7878878, 7731770, 7587178, 7521673, 7421312, 7325685, 7203845, 7104544, 7075109, 6986878, 6944758, 6873363, 6793334, 6711062, 6632730, 6591574, 6575674, 6650437, 6531268, 6438660, 6427724, 6406075, 6410371, 6361974, 6302780, 6215207, 6191729, 6128669, 6057573, 6013831, 6056424, 6078785, 5984035, 5970248, 5918635, 5919987, 5970215, 5925376, 5890629, 5938927, 5878669, 5869176, 5795705, 5769947, 5763358, 5656115, 5552999, 5541432, 5533129, 5527047, 5515935, 5529251, 5543680, 5595528, 5728217, 5886666, 6004337, 6151934, 6460180, 6736946, 6884069, 7090031, 7184281, 7348407, 7570226, 7491694, 7260301, 7053655, 6716262, 6205530, 5731040, 5344564, 5029666, 4925866, 4677217, 4561407, 4410511]
2777D410511j28282k088k1787o1011P647p9962M0336l0739o2457M0908p325j9607
2765D086144o0988m6121J3118k1773n2442j2371M0821q0087R397j5076j6782o3799
2753C780041N311N0447K8704l2227O4704k3553L7711O2613R767K4432O6786n9906
2741D014830o6552J6731J1343n3162o6692m7175l4406P730m0961K5406n1510m3504
2729C672078l2027l0476l1138N6778k3064P1357L3212N6460j1552Q4136O7648
2718C913412J1348k4395P0686R1308n4498J03367K4228j594Q0309K0299R9387
2707D333857P5518k2094N4653n2692J60801n7690J19680M365L4861N2602r6202
2696D607659O1833J8882P9486N2385J22287J40031J14394P5812J77778N3738J47796
$$ y = [4410511, 4282229, 4280141, 4258354, 4197343, 4204990, 4125028, 4165364, 4134625, 4072168, 4113076, 4105751, 4086144, 4025156, 3979035, 3992153, 3970380, 3917938, 3905567, 3946388, 3866301, 3875698, 3860622, 3843840, 3780041, 3785352, 3835799, 3864503, 3832276, 3896980, 3873427, 3911138, 3973751, 3983518, 4007950, 4074736, 4014830, 3948278, 3965009, 3976352, 3923190, 3856498, 3809323, 3774917, 3782647, 3741686, 3767092, 3715582, 3672078, 3640051, 3609575, 3578437, 3635215, 3612151, 3683508, 3716720, 3773180, 3761628, 3845764, 3913412, 3924760, 3900365, 3971051, 4062359, 4007861, 4111228, 4135456, 4133862, 4214171, 4234470, 4333857, 4409375, 4387281, 4441934, 4389242, 4550043, 4492353, 4612033, 4616398, 4651259, 4703861, 4607659, 4669492, 4688374, 4767860, 4820245, 4942532, 5082563, 5196957, 5272769, 5450547, 5504285, 5652081]
2685E652081K27944J43458M9173J28583P5393M7499Q8840J20109K9222j01220
2675F461082j42652k22084j81141k02781n3240N0790n1673M1097m8462P2525R0924
2664E814385J30171P3988N7655l423P3919P135Q7571M8376N3778r222Q470Q4799
2652F427602K6793N2134N05J1952O4099n9898N331J9087Q4110R796K6584m1794
2640F626301Q6267Q095J03085Q9106Q5041J30629J31330J17663L8984L0022J63863
2629G610386J69958P6460N6549J65039J13789Q6789J08315K52589P3592J70689
2619H884155K54944R2215K08794J76445K98518J61518K07287K11600L13132L39257
2609A1147865K79897L59055M11923N47801N56753N73629N96008N53248N17054
$$ y = [5652081, 5880025, 6023483, 6072656, 6201239, 6276632, 6324131, 6412971, 6533080, 6562302, 6461082, 6318430, 6096346, 5915205, 5712424, 5659184, 5709974, 5658301, 5699398, 5650936, 5723461, 5814385, 5944556, 6018544, 6076199, 6072776, 6146695, 6153830, 6241401, 6289777, 6343555, 6334333, 6342803, 6427602, 6454395, 6506529, 6507034, 6518986, 6583085, 6523187, 6528518, 6547605, 6631715, 6641511, 6668095, 6626301, 6712568, 6720663, 6823748, 6912854, 6997895, 7128524, 7259854, 7377517, 7416501, 7446523, 7610386, 7780344, 7856804, 7913353, 8078392, 8192181, 8278970, 8387285, 8639874, 8713466, 8884155, 9139099, 9231314, 9440108, 9616553, 9915071, 10076589, 10283876, 10495476, 10808608, 11147865, 11427762, 11786817, 12198740, 12746541, 13303294, 13876923, 14472931, 15026179, 15543233]
2600A5543233N63205O53118P13889P33203N91751K78789m3516j79364m1216J71878
2590A8984970J29887J74895k7270j2084j96677k76732l45728k81414k92306m33636
2580A7423905l33800m83243k67989r8380l4665q2206k7813L2783K9634P9092N2878
2569A6290196M7965J23388J92959J54640L02029K93583K42699L45331K32314J89449
2559A8414553L01422M25101M70626O75978Q74385R48515Q14948O30544M96401
2550B4052473N53883N36444N09235o6185p24862j022775q38919l55295j52700
2541B2491299j23802j46368M7477J09187J99125K67852K42161L71129L81453N49429
2531B4388942P09734P17408P54920P99886Q71100Q67650J082014R52264J100226
$$ y = [15543233, 16106438, 16759556, 17473445, 18206648, 18798399, 19077188, 19033672, 18854308, 18813092, 18984970, 19114857, 19289752, 19262482, 19250398, 19053721, 18776989, 18431261, 18149847, 17857541, 17423905, 17090105, 16606862, 16338873, 16240493, 16205828, 16123622, 16095809, 16128592, 16158226, 16237318, 16290196, 16338161, 16461549, 16654508, 16809148, 17111177, 17404760, 17647459, 17992790, 18225104, 18414553, 18715975, 19141076, 19611702, 20287680, 21162065, 22110580, 22925528, 23556072, 24052473, 24606356, 25142800, 25652035, 25585850, 24860988, 23838213, 22999294, 22643999, 22491299, 22367497, 22221129, 22268606, 22377793, 22576918, 22844770, 23086931, 23458060, 23839513, 24388942, 25098676, 25816084, 26571004, 27370890, 28241990, 29109640, 30191654, 31143918, 32244144]
2522C2244144J159861J461243J296103J352861J338940J248175J277703J249754
2514D2628784J319447J494585J509942J777174J762855J886183J763926J928402
2506E6071298J880212J941298K117462K213222K335648K499721K547838K886604
2498G4493303L225519L538017L727116M103454M244326M619113M763746N013236
2490A07727830M854942M870638M764708M785210M836414M796127M479135M403417
2482A45518421M402457M595732M804956N101547N134745N338375N203309N098537
2474A85198079M561580M278807L517698K877470K106042J502181N68071j35136
2466B04474792r98561j739847k628219k978669l257027k411493j488712n8029
$$ y = [32244144, 33404005, 34865248, 36161351, 37514212, 38853152, 40101327, 41379030, 42628784, 43948231, 45442816, 46952758, 48729932, 50492787, 52378970, 54142896, 56071298, 57951510, 59892808, 62010270, 64223492, 66559140, 69058861, 71606699, 74493303, 77718822, 81256839, 84983955, 89087409, 93331735, 97950848, 102714594, 107727830, 112582772, 117453410, 122218118, 127003328, 131839742, 136635869, 141115004, 145518421, 149920878, 154516610, 159321566, 164423113, 169557858, 174896233, 180099542, 185198079, 189759659, 194038466, 197556164, 200433634, 202539676, 204041857, 204609928, 204474792, 203476231, 201736384, 199108165, 196129496, 192872469, 190460976, 188972264, 188914235]
2458A88914235J125601K546301L746372N221888N907833O734211P246567Q966818
2450B30409826J0870922J5433855J7148153J3910944J0599177P712407J0281870
2443C16367154J3095371J3776153o781825k7779688m2886497l9528807k8447498
2436A97814363k2577205j8646933j5529044j2891116j0811355q928693q013739
2429A00416278o996573o027246n032037m402841l859747l449745l068580l037651
2421F4541858k859068k732018k340487k123704j809681j676179j402646j251272
2413D8346803j108771r96465q56942q49117o44546o81391n23090n42007n02744
2404D1641730n67515m36331m70855l39757m69987m29133m83628l67281n02881
$$ y = [188914235, 190039836, 192586137, 196332509, 201554397, 207462230, 214196441, 221443008, 230409826, 241280748, 256714603, 273862756, 287773700, 298372877, 306085284, 316367154, 329462525, 343238678, 336456853, 308677165, 265790668, 226261861, 197814363, 175237158, 156590225, 141061181, 128170065, 117358710, 108430017, 100416278, 93419705, 87392459, 82360422, 77957581, 74097834, 70648089, 67579509, 64541858, 61682790, 58950772, 56610285, 54486581, 52676900, 51000721, 49598075, 48346803, 47238032, 46241567, 45384625, 44535508, 43890962, 43209571, 42686481, 42144474, 41641730, 41074215, 40637884, 40167029, 39827272, 39357285, 38928152, 38444524, 38077243, 37574362]
2395C7574362n20681n91473m76319o04019n56997o71124m83937n18195l04470
2386C2847147k70425m9692Q8313L36263O59728O96307Q60873J226044J018183
2377C7412741Q01162L97766M74420L55525M40540l61900j836278k988769k866600
2368C1828607k517887k052592j793737j284888j048965o56217n85623n48040n70210
2359B0770448n23349o31550o42029n74430n10695m01844k95403k06388k01939
2350A6782821k40005j91597k54139k13445k36212j91679k97649l66430k32248
2341A4559417n6047j8469N8450O7437P9130Q6617j23210k24560j98114j61476
2331A4069175O4196J47446J88718K41726K09144J89047K53868J62526J89134K79824
$$ y = [37574362, 37053681, 36462208, 35985889, 35381870, 34824873, 34153749, 33669812, 33151617, 32847147, 32576722, 32527030, 32615343, 32951606, 33611334, 34307641, 35168514, 36394558, 37412741, 38213903, 38611669, 39086089, 39441614, 39882154, 39520254, 37683976, 34695207, 31828607, 29310720, 27258128, 25464391, 24179503, 23130538, 22474321, 21888698, 21340658, 20770448, 20247099, 19615549, 18973520, 18399090, 17888395, 17486551, 17191148, 16984760, 16782821, 16542816, 16351219, 16097080, 15883635, 15647423, 15455744, 15158095, 14791665, 14559417, 14503370, 14484901, 14543351, 14610788, 14689918, 14776535, 14653325, 14428765, 14230651, 14069175, 14133371, 14280817, 14469535, 14711261, 14920405, 15109452, 15363320, 15525846, 15714980, 15994804]
2321A5994804L33391L64408M13710M33699M89480M92571M73281N00934M41890
2312A9938168M30701M78153M63145N81946O20563N53235O73844Q16799P28537
2303B5285091O45169Q33348R15683R76603R17825J100018J208755J150321J205674
2294C4238487J302770J310641J412159J472370J519243J691508J828800J834016
2286D6609994J809516J840892K203730K320519K665981L144450L566434L977766
2278F8139282M584086N186683N988046O734867P924845R061679J0596356J2330744
2270A30546588J4057264J6007152J7494747J7404468J5390247J2843729J1132154
2263B34876349J0069410Q204435K408082q731148k0055339k5233166k3774660
$$ y = [15994804, 16328195, 16692603, 17106313, 17540012, 18029492, 18522063, 18995344, 19496278, 19938168, 20368869, 20847022, 21310167, 21892113, 22512676, 23065911, 23739755, 24556554, 25285091, 25930260, 26763608, 27679291, 28655894, 29573719, 30673737, 31882492, 33032813, 34238487, 35541257, 36851898, 38264057, 39736427, 41255670, 42947178, 44775978, 46609994, 48419510, 50260402, 52464132, 54784651, 57450632, 60595082, 64161516, 68139282, 72723368, 77910051, 83898097, 90632964, 98557809, 107619488, 118215844, 130546588, 144603852, 160611004, 178105751, 195510219, 210900466, 223744195, 234876349, 244945759, 253150194, 255558276, 246827128, 226771789, 201538623, 177763963]
2256A77763963k0002179j6483612j3565182j1001277r077369p657453o403894
2249I3572997n436890m788902m131878l498969l139000k860414k822533k779123
2241F4115288k769418k873524k915589k807293k576450k415647k295601k045360
2233D3416406k039733j868002j738954j559014j438290j255284j292616j184725
2225C1039788r87008j028523j010508j069282j018790r25198r01458p65013o93575
2216B2640433p05077n49513n18082n11714m37489m38049l38883l57157k75883
2207A8508586m18191m08632k62675k90197m30053m26084n50511l67284l61618
2198A4993341l09765k31101j97478j71714j37712q5422o2636j03679j61872q0762
$$ y = [177763963, 157761784, 141278172, 127712990, 116711713, 107634344, 99976891, 93572997, 88136107, 83347205, 79215327, 75716358, 72577358, 69716944, 66894411, 64115288, 61345870, 58472346, 55556757, 52749464, 50173014, 47757367, 45461766, 43416406, 41376673, 39508671, 37769717, 36210703, 34772413, 33517129, 32224513, 31039788, 30052780, 29024257, 28013749, 26944467, 25925677, 25000479, 24099021, 23334008, 22640433, 21935356, 21385843, 20867761, 20356047, 19918558, 19480509, 19141626, 18784469, 18508586, 18090395, 17681763, 17419088, 17128891, 16698838, 16272754, 15722243, 15354959, 14993341, 14683576, 14452475, 14254997, 14083283, 13945571, 13860149, 13797513, 13693834, 13531962, 13451200]
2188A3451200j85708l37355l75135k30464j37503j32645r8892p0045p7571p2468
2178A1733414n2691k5931P0587k2200o0163N9016Q6440k2306N7347J08888L1469
2167A1963870o8535j6720O8116J38810L3465L7877p3587J26425R8849M2355J55189
2156A2506114n23j50679l93396l64448m28578l02671r8168j41385l7965K19817
2146A0808118J09247L73381L00994M30871L83755M63653N24430L15688K68071
2137A3978208L60088J14189k899n62567r12044r42668p87679o57767o25395l75805
2127I585661l67659l50420m07281j81806k92250l00752k33577k56212k07528j96183
2117F791993j77704k38319j75409j33712j76248j06321l9742j40842j13367j53008
$$ y = [13451200, 13265492, 12928137, 12553002, 12322538, 12185035, 12052390, 11953498, 11883453, 11805882, 11733414, 11680723, 11654792, 11725379, 11703179, 11643016, 11702032, 11788472, 11766166, 11823513, 11932401, 11963870, 11895335, 11878615, 11946731, 12085541, 12119006, 12156883, 12083296, 12209721, 12308570, 12350925, 12506114, 12505591, 12354912, 11961516, 11597068, 11168490, 10865819, 10767651, 10626266, 10588301, 10808118, 10917365, 11290746, 11591740, 12022611, 12406366, 12870019, 13394449, 13710137, 13978208, 14338296, 14452485, 14449586, 13887019, 12974975, 12032307, 11244628, 10586861, 9961466, 9585661, 9218002, 8867582, 8460301, 8278495, 7986245, 7685493, 7451916, 7195704, 6988176, 6791993, 6614289, 6375970, 6200561, 6066849, 5890601, 5784280, 5744538, 5603696, 5490329, 5337321]
2107E337321J17K4146j543q4123k1609L2159R0406J36329N5546P3366K34833J84679
2095F061627J90232K45490K42573K02714K23017J21003N1481K13194m3995l37783
2085G169553n02079n09954n28469l55626k97312l29020j83864j02110o0034j96727
2075D104358r7528q5400j4878r5994n7920J1686j05519K1083M7802P2239l0689
2064C769240N6335n2661o4736M3632l6621m2524k1599q2833l8722k2101j5655
2053C491755m3946n2998l2692O6651P5522M7670N1198o0831p7375J26799J03062
2042C694815M4054N9274J24623J13062O9684J14940M7983L9534L2804J4356q6098
2031D269031j05328j03707j04831m1879p8187l4885j1281m2868O2953j3511j0771
$$ y = [5337321, 5337438, 5361584, 5360041, 5275918, 5254309, 5286468, 5376874, 5513203, 5568749, 5642115, 5876948, 6061627, 6251859, 6497349, 6739922, 6942636, 7165653, 7286656, 7338137, 7551331, 7507336, 7169553, 6667474, 6157520, 5629051, 5273425, 4976113, 4647093, 4463229, 4361119, 4301085, 4104358, 4006830, 3921430, 3906552, 3810558, 3752638, 3764324, 3658805, 3679888, 3727690, 3799929, 3769240, 3825575, 3772914, 3708178, 3751810, 3715189, 3672665, 3651066, 3568233, 3529511, 3507410, 3491755, 3447809, 3394811, 3362119, 3428770, 3504292, 3551962, 3603160, 3542329, 3464954, 3591753, 3694815, 3738869, 3798143, 3922766, 4035828, 4105512, 4220452, 4268435, 4307969, 4340773, 4355129, 4269031, 4163703, 4059996, 3955165, 3913286, 3835099, 3800214, 3788933, 3746065, 3809018, 3795507, 3784736]
2020C784736N2485M7207Q8798J23791P6018J12054J12568P1209k1420L2638M2845
2009D522929L7943Q3421J0073j09373k4977O4421k3590o0202l5445n9079K6996
1998D433117p9991l8798j41076L4245j7352j04104N1611J466N52j08311k8567
1987D002792j4086J2834k8245j22239n9392r5640j97884j10340m1063k2861j43710
1976C180166j25475L8609j01556m9085j3978K5467K966j312n2714J6041m0561
1965B878568j25570k641j5542Q9236j30041m9076r4069k4306p1645j8253k1117
1954B415544m4118m9686l8124j32055j7943N1264n6124o5116L061N03L0202N6272
1942B153680o3017p2579m656M3661N132k5567j6877n4981k485J7972l9380p0842
$$ y = [3784736, 3837221, 3884428, 3973226, 4097017, 4173035, 4285089, 4397657, 4468866, 4447446, 4480084, 4522929, 4560872, 4644293, 4654366, 4544993, 4520016, 4584437, 4560847, 4500645, 4465200, 4406121, 4433117, 4353126, 4314328, 4173252, 4207497, 4190145, 4086041, 4137652, 4139118, 4139670, 4031359, 4002792, 3988706, 4001540, 3973295, 3851056, 3791664, 3696024, 3498140, 3387800, 3346737, 3323876, 3180166, 3054691, 3093300, 2991744, 2942659, 2928681, 2954148, 2957114, 2955802, 2903088, 2919129, 2878568, 2752998, 2750357, 2734815, 2824051, 2694010, 2644934, 2550865, 2526559, 2454914, 2436661, 2415544, 2371426, 2321740, 2283616, 2151561, 2133618, 2184882, 2128758, 2063642, 2066703, 2067206, 2097408, 2153680, 2090663, 2018084, 2013428, 2057089, 2062221, 2036654, 2019777, 1964796, 1962311, 1980283, 1940903, 1870061]
1930A870061N3304l6009q7762J9750K4108R343q06o7694M2679K2116n4221n0577
1918A744292k379k5245j0553J4681l7107l4804j7949L2539J5935q0814r222r0178
1906A499196L9651O9446m0723k6938K5333m1396K0673j5931K4287O9519p4764
1895A548353j3170n1300K1975r090n039n7882P481l9492m4163N8315Q3751J5549
1883A515288p203l2483r106N0220m9564j00091n2182N5709p5399Q761j8306j6378
1871A269266Q717j2307o2235L0197K3761j10953N8344K072l2321j02571L386o1227
1859A014129k4692k498K91k8473K1369m7546J5742n6268m3923J5769K2408r9475
1847G86833r433L523l9341K2182n7761o2136k2444N9346o8505k9679J2773P5908
$$ y = [1870061, 1923365, 1887356, 1799594, 1819344, 1843452, 1852795, 1851989, 1784295, 1826974, 1849090, 1794869, 1744292, 1741913, 1716668, 1706115, 1720796, 1683689, 1648885, 1630936, 1663475, 1679410, 1598596, 1589374, 1499196, 1538847, 1608293, 1567570, 1540632, 1565965, 1524569, 1545242, 1529311, 1553598, 1623117, 1548353, 1535183, 1483883, 1505858, 1496768, 1491729, 1433847, 1441328, 1401836, 1357673, 1415988, 1499739, 1515288, 1508085, 1475602, 1466496, 1516716, 1467152, 1367061, 1314879, 1370588, 1295189, 1303950, 1285644, 1269266, 1277983, 1265676, 1203441, 1233638, 1257399, 1146446, 1204790, 1206862, 1174541, 1071970, 1075356, 1014129, 989437, 986939, 987230, 958757, 980126, 932580, 948322, 892054, 848131, 863900, 886308, 786833, 777400, 780923, 741582, 763764, 706003, 643867, 621423, 680769, 612264, 582585, 595358, 671266]
1835F71266j07988o1056M2102m6313N0668q59j07396l6325L5665r301Q3350q5413
1823D28400q6361l7591P0845Q0556j12318m5150K5974L5368n5379K5105o4344
1812B65105O783j9921m7640R4666J0458N3275m5523k1866o1681k4425M2944m31
1800B51744o375p252L7721l7714P441p159K5615L3862j36935K2485M831L4423
1788B22687j5604k7725r1468P8760k1602L5838m0804m2529M0622J3855l3102j9691
1776I9237o4764L9892O1351N717N6396j0544n5898j16761j9759K3277j5833j0974
1764h663M5526N1668o5438j6382K2751j2430L6741n891l7708J7837r6076L2515
1752c5550l5198p609P6668q096M1784j35491M7984j0177n4988K8677Q8738j3465
$$ y = [671266, 563278, 502222, 544324, 498011, 548679, 547820, 440424, 404099, 439764, 430463, 513813, 428400, 342039, 304448, 375293, 455849, 343531, 298381, 324355, 359723, 304344, 329449, 265105, 271888, 251967, 204327, 298993, 309451, 362726, 317203, 295337, 233656, 209231, 252175, 251744, 245369, 238117, 275838, 238124, 245565, 238406, 264021, 297883, 160948, 183433, 188264, 222687, 207083, 179358, 87890, 166650, 145048, 180886, 140082, 97553, 138175, 152030, 118928, 99237, 34473, 74365, 135716, 141433, 197829, 187285, 131387, 14626, -5133, 18144, 2311, -8663, 36863, 88531, 23093, 6711, 29462, 17032, 53773, 47882, 10174, 28011, -68065, -35550, -70748, -78357, -1689, -9785, 31999, -103492, -55508, -65685, -120673, -91996, -3258, -16723]
1740a6723j6869j10812n903O7347q168N0411o068r1431K520L6239O7386l6589
1728f8660l0135K0563Q2274j08960m9034j6597N9094J0335p400q3737J15725L7442
1716c9090N636o5591r2762Q4739l6395J22012j8599p2954J7464j15599P8933j5841
1704a48047L050K4223m6328N7377J3732n077l9103l6144P4221Q9421o1022J5584
1692e8113J7183o0760R49N9599O993n745o2263o2223K4214P502R491K9289J053
1679i2831m9999J0532L8779K6027k7521M4896j4508j2245k2327m5366Q7583j0982
1667f7962j1292O1174l830Q991j4892j3006N1039L033r9956Q6708k3173m1299
1655f4465M6460L5309N688j7085L3067k7763L4009K3305m46j9954l6417L948R871
$$ y = [-16723, -33592, -144404, -150307, -82960, -91128, -40717, -46785, -138216, -135696, -99457, -32071, -68660, -98795, -78232, 4042, -104918, -153952, -170549, -111455, -101120, -108520, -192257, -76532, -39090, -33454, -99045, -191807, -107068, -143463, -21451, -40050, -113004, -95540, -211139, -132206, -148047, -144997, -120774, -167102, -109725, -95993, -101070, -140173, -176317, -102096, -12675, -73697, -58113, -40930, -101690, -100741, -41142, -34149, -39894, -102157, -164380, -140166, -132664, -123173, -93884, -92831, -142830, -132298, -93519, -67492, -95013, -50117, -64625, -76870, -99197, -144563, -56980, -67962, -79254, -18080, -21910, -12919, -27811, -40817, 10222, 13255, -86701, 7, -23166, -64465, -18005, 17304, 22992, 5907, 38974, 11211, 45220, 68525, 68079, 48125, 11708, 15656, 25527]
1642B5527N603O5140L9063L6539q801l5051K592L1987L1889L2805R280r80K2065
1629B57658j3743N0931L85L0736R1405j0020M0736o8649O933N2425L6050K1812
1617D96659M3386j5124J472P207L9603m6057K5525K5884l7122j2821M8850J1017
1605E88479j1659L9421M8107l2704M2475J5547L725r844J6028j6564J1319m0822
1593F53508O1533J75m2240N2891K466O956M033p814m0656J6447K7342o0685j1952
1580F62004r324L0072q2749K376j3830o3411J07684K3808n9292p2244O1728q0693
1568E06129K8733N7977o0115J6233k5276J6353M6584j0312k9533j0478o8130o4929
1556D03236k3108J00476q797j0532o997l7501r848o6745j5537l1822j5524n2850
$$ y = [25527, 31130, 96270, 135333, 171872, 163071, 128020, 130612, 162599, 194488, 227293, 236573, 235593, 257658, 243915, 294846, 295231, 325967, 417372, 407352, 448088, 379439, 386372, 438797, 474847, 496659, 540045, 524921, 526393, 533600, 573203, 527146, 552671, 578555, 541433, 528612, 577462, 588479, 576820, 616241, 664348, 631644, 674119, 689666, 693391, 683547, 699575, 683011, 694330, 653508, 715041, 715216, 672976, 725867, 728333, 735289, 739322, 731508, 690852, 707299, 734641, 673956, 662004, 652680, 682752, 600003, 602379, 588549, 525138, 632822, 656630, 597338, 525094, 586822, 506129, 534862, 592839, 532724, 548957, 523681, 540034, 586618, 576306, 546773, 536295, 468165, 403236, 380128, 480604, 471807, 461275, 454278, 416777, 406929, 340184, 324647, 292825, 277301, 224451]
1544B24451L3827P978K7735n6768j13L3200L3382j0803L663r111k0585N481p5549
1531A96788m8175N758l4091K4562N1251o0452J1341L466k2880M349k3477L0523
1519A38963L0033j8214o9551M5601K9852j7965m5664j970J9468k1042J3937K878
1507A06326R2559k8882o6420N1483l181K5977J1753n9330O340Q0179R8412m3241
1495B71975J8778k1559J3460N0369l8568J084O329L4075j2299J44688p2138m8995
1483C47199j3361R3968L7846k3316N4262N7377L181k3467L8420O7437l3985p1736
1471E33825O6361Q7339P8117k0006p1338P5506P8146q678Q3075l744Q2092M3351
1459A024046O8260Q2756N0655m8103K7910R3804L2962K296J07629P6811O1131
$$ y = [224451, 258278, 266256, 293991, 237223, 237110, 270310, 303692, 292889, 296552, 287441, 266856, 272337, 196788, 148613, 154371, 120280, 144842, 196093, 135641, 146982, 150448, 127568, 131917, 108440, 138963, 168996, 150782, 81231, 126832, 156684, 138719, 93055, 91085, 110553, 89511, 103448, 106326, 198885, 170003, 103583, 155066, 151885, 177862, 189615, 130285, 136625, 216804, 315216, 271975, 290753, 269194, 282654, 333023, 294455, 295539, 301868, 335943, 323644, 468332, 396194, 347199, 333838, 427806, 465652, 442336, 496598, 553975, 557156, 533689, 572109, 639546, 605561, 533825, 600186, 687525, 765642, 745636, 674298, 749804, 827950, 819272, 902347, 898603, 980695, 1024046, 1092306, 1175062, 1225717, 1177614, 1205524, 1299328, 1332290, 1334586, 1442215, 1519026, 1580157]
1448A580157R8537n8392R0461J34049J1245M2145P5193N1462Q3118Q8166L7890
1437B234031O7047J65616J73372J13885J16480J44762J28721Q1600K0138J04038
1427C349690J67396P9281R2400J22217J18924J92813K27673J43248J07552K02047
1417D803241K37697J57167K31719K19127K60884K15691K43710L02620L32363L24168
1407G328387K64569M28116M59129M20806M32749N82985N68998O09033O91042O92492
1397A2478306O06543O13227O31131O87536N35408M93282L13512J65532J55979
1388A6680456J16682r9998k06812k03747k42746k94406k83148l78430m67427n32774
1378A4087650n09950o89921p37372p55259q96435p84393p82619o78562p02662
$$ y = [1580157, 1678694, 1620302, 1710763, 1844812, 1856057, 1898202, 1973395, 2024857, 2107975, 2196141, 2234031, 2301078, 2466694, 2640066, 2753951, 2870431, 3015193, 3143914, 3225514, 3245652, 3349690, 3517086, 3596367, 3688767, 3810984, 3929908, 4122721, 4350394, 4493642, 4601194, 4803241, 5040938, 5198105, 5429824, 5648951, 5909835, 6125526, 6369236, 6671856, 7004219, 7328387, 7592956, 8021072, 8480201, 8901007, 9333756, 9916741, 10485739, 11094772, 11785814, 12478306, 13084849, 13698076, 14329207, 15016743, 15552151, 16045433, 16358945, 16524477, 16680456, 16797138, 16697140, 16490328, 16286581, 16043835, 15749429, 15466281, 15087851, 14620424, 14087650, 13577700, 12887779, 12150407, 11395148, 10498713, 9714320, 8931701, 8253139, 7550477]
1369G550477n88114m72137n11717m13793l45140l95678k88243j73844k22986k69032
1359C869793j54304j39817k11693j14034j08667q8887k3261o1745r7356j11670
1349B758359J04721j1944M1197L4616J61847J11567J15010J5878K7027R7556J44785
1338C600619q506j43821k52051k23735j94589k24951p6491j11438j926j09992
1328B253119N6395L6297j0897P9871J90290J37070K47043L13688J47538K35488
1318C685902J84313J84816J81447K68688q4652l09279l83623n80984m97617l41761
1308B307250k28744j51440j36947j23173k476j19302p3985N0660k3993P7668J36243
1297A711761J06321J41284Q5139J1055R1350N7719N1016k6268k08333k41825l23775
$$ y = [7550477, 6962363, 6490226, 5978509, 5564716, 5219576, 4823898, 4535655, 4361811, 4138825, 3869793, 3715489, 3575672, 3363979, 3249945, 3141278, 3052391, 3029130, 2967385, 2870029, 2758359, 2863080, 2851136, 2892333, 2926949, 3088796, 3200363, 3315373, 3331251, 3358278, 3455834, 3600619, 3592113, 3448292, 3196241, 2972506, 2777917, 2552966, 2476475, 2365037, 2363111, 2253119, 2309514, 2345811, 2334914, 2414785, 2605075, 2742145, 2989188, 3302876, 3450414, 3685902, 3870215, 4055031, 4236478, 4505166, 4420514, 4111235, 3727612, 3146628, 2649011, 2307250, 2078506, 1927066, 1790119, 1666946, 1664470, 1545168, 1471183, 1521843, 1497850, 1575518, 1711761, 1818082, 1959366, 2044505, 2055560, 2146910, 2204629, 2255645, 2229377, 2021044, 1779219, 1455444]
1286A455444k61263j30382q8360j21594n7041j7129j45810o8816o5137p2592m54
1275D26866n5274k4220n1570m8069j4234K1158L5683J2392n7751m8801l1570O884
1263A71494P5221j17270k5767O7769L2648l947r8724K0676j5615j292J0590k466
1251A13317k8224p656m9599m233J8631J5184K2399N251O925j00157m7970N0470
1239e662j2748q536K9665j7639N8147p0235m2502N6210n6170L1050n151K2417
1227b1154J4405Q0038l9830k1699l248R388q1716P2279O238q2263J7585J3099
1215c6878Q017Q5193K6636q4015J3588L5015N837o0163j3441l9356J8102K7164
1203a4301Q5678j05761l3159Q4065J1998L43Q2946q3586J7809L0413q127J5092
$$ y = [1455444, 1194181, 1063799, 975439, 853845, 796804, 779675, 633865, 565049, 499912, 427320, 426866, 371592, 347372, 295802, 247733, 233499, 254657, 290340, 302732, 244981, 196180, 164610, 171494, 246715, 129445, 103678, 171447, 204095, 200148, 101424, 122100, 106485, 105193, 115783, 113317, 85093, 77437, 27838, 23605, 42236, 57420, 79819, 85070, 91995, -8162, -56132, -5662, -18410, -26946, 2719, -14920, 43227, -27008, -69510, -13300, -69470, -38420, -43571, -21154, -6749, 73289, 33459, 11760, 8512, 17900, -63816, 8463, 14701, -67562, -49977, -36878, -28861, 56332, 82968, -1047, 12541, 47556, 53393, -6770, -20211, -59567, -41465, -14301, 71377, -34384, -67543, 16522, 28520, 28863, 111809, 28223, 46032, 76445, 68318, 83410]
1191H3410K5856N6442k2619j2290l6977J4777Q5949m354k8108M429J5414K0929
1179B02858K3073j578O4146K7219l2194N0754M3943Q508N4793L8768N5040N3003
1167E88333q487P2598J04162N825O2351Q9655J7910Q4182k7901j1381O1919M5858
1155A085024J8926O4968J3370O2997p186M5377k1307l027M3046K300J06126O4532
1143A475146J31723M5682R9536K8603O9775K5420R3491M3464m7336N6989q7871
1132A934622j35974j44165j59589j32821p961l3805r4419J3146J4361n3987K55
1121A199663l3242n6393n915K1437k0722n9168p425K1363p4416P4819P012j10466
1109I56547p8152j18669k892r4348m6864n5216r2370L1353j2631j831q4629m7428
$$ y = [83410, 109266, 165708, 143089, 130799, 93822, 108599, 194548, 190194, 162086, 166515, 181929, 202858, 225931, 224353, 288499, 315718, 283524, 334278, 378221, 386729, 441522, 480290, 535330, 588333, 579846, 652444, 756606, 762431, 824782, 914437, 932347, 1016529, 988628, 977247, 1039166, 1085024, 1103950, 1168918, 1182288, 1245285, 1238099, 1283476, 1262169, 1259142, 1302188, 1304488, 1410614, 1475146, 1606869, 1652551, 1752087, 1780690, 1850465, 1875885, 1969376, 2012840, 1965504, 2022493, 1934622, 1798648, 1654483, 1494894, 1362073, 1354112, 1320307, 1225888, 1239034, 1253395, 1199408, 1199663, 1166421, 1110028, 1104113, 1125550, 1104828, 1045660, 1038235, 1059598, 985182, 1060001, 1067013, 956547, 878395, 759726, 756834, 662486, 615622, 560406, 468036, 499389, 486758, 484927, 400298, 352870]
1097C52870q2769k1372j7027N9831n0588j40602j7781J06086l9344m1600k4498
1086H3206l5684M808k6899r3266n789J2926j9573N5791o1842m3878P932J9253
1074a03015l3401J3815M1322n2273m6242j2877L558o514J879L2759M9195n3164
1062a64958o6789K772k6173M268o4672L6974j2706N1930P469j5024n628r2578
1050c45115M2187K7199p8734N4028P4184o6455j2456P82K4176R902k9387K4745
1038b74944p1486j1361K9969K8386N3832l4616l1566j1297q390O5948n4806P049
1026c13282k0872L5702j5884n1691M2749q429L0227J983l4592l961j7053M7385
1014c07718j1347m7651M58K7902j0532m4172j7374N367J2907J3819J2859L6477
$$ y = [352870, 270101, 248729, 231702, 291533, 240945, 100343, 82562, 188648, 149304, 107704, 83206, 47522, 52330, 25431, -67835, -73624, -60698, -80271, -24480, -86322, -130200, -122268, -103015, -136416, -122601, -81279, -133552, -179794, -192671, -189113, -195627, -193748, -160989, -111794, -164958, -231747, -228975, -255148, -250880, -315552, -278578, -291284, -239354, -231885, -246909, -252537, -345115, -302928, -275729, -354463, -300435, -226251, -292706, -305162, -304380, -280204, -270302, -299689, -274944, -346430, -357791, -327822, -299436, -245604, -280220, -311786, -323083, -331473, -265525, -320331, -313282, -334154, -298452, -314336, -366027, -323278, -331707, -301480, -299497, -334089, -338050, -355103, -307718, -319065, -366716, -366258, -338356, -348888, -393060, -410434, -405067, -392160, -378341, -365482, -329005]
1002c29005j7863J4457L7445J217n9289j108P3757J8420j8792q874l4871o117
990c30623q320p2335j3167L4834M1979k7087j332K6035K079L2238M2175k8144
978c01668m5541L799j1142k1656N7976q1959J8102L6436r1137K5403j9897M8994
966c82290k2386j3486K7607k7687M4995J3599o1241N4954l3136M4839n437j8526
954c78195l5115j1569k7567N2257Q1908L299J3835l5828K5805n9599K8220j2863
942c55412J8534m9128O790L9827m8393l7048P860L4933n5590l6484M7329p780
930d34562O1032l6078j4307M0570L7292o3576J5623n1476K6390j8899K9956P0373
918c37662J4567k2266l5968p5326N4708M9211J4861l6867m335J6506k7904l4611
$$ y = [-329005, -346868, -332411, -294966, -293749, -353038, -354146, -280389, -261969, -280761, -289635, -324506, -330623, -338943, -411278, -424445, -389611, -347632, -374719, -376051, -350016, -347937, -315699, -273524, -301668, -347209, -343410, -354552, -376208, -318232, -400191, -382089, -345653, -436790, -411387, -431284, -382290, -404676, -418162, -390555, -418242, -373247, -359648, -420889, -365935, -399071, -354232, -359669, -378195, -413310, -424879, -452446, -400189, -318281, -314982, -301147, -336975, -311170, -370769, -342549, -355412, -336878, -386006, -379216, -339389, -387782, -424830, -416970, -382037, -437627, -474111, -426782, -434562, -373530, -409608, -423915, -383345, -346053, -409629, -394006, -445482, -419092, -437991, -408035, -337662, -323095, -345361, -381329, -456655, -401947, -352736, -337875, -374742, -379077, -362571, -390475, -425086]
906d25086N6506K6858r1924M586J1935N4666M5070m1705O1571l318j9797K9588
894b91050l5830J4361o8061k5064M1097M3437n8427J1320o344k4310N6081K7407
882c15383q846m2280j0188k6089P355L1411m276o8653O914P0308k8316q1822K9091
869d40774P3234k1373R7095o1503j4230n0193K7697J17515m2880q7196l6266M1349
857c97525K0437L8552j358q964j1268l4155n0807K4659Q3080k4564K8726L84j28095
844d60898M9880Q5384k940p7634r07L3133K041m5192l243K7330k7981M524P3825
831c42678J1524j0480j1998k7300j0823K771M6528n5275m296o9586Q8725M6529
819c36359p6972k0287J0477M1453O069m2558P1556R06L7027k5958M766P922k9727
$$ y = [-425086, -368580, -341722, -433646, -429060, -417125, -362459, -317389, -359094, -297523, -300841, -320638, -291050, -326880, -312519, -380580, -405644, -364547, -321110, -379537, -368217, -374561, -398871, -342790, -315383, -324229, -366509, -376697, -402786, -395431, -364020, -368296, -436949, -430035, -359727, -388043, -469865, -440774, -367540, -388913, -291818, -353321, -367551, -417744, -390047, -272532, -315412, -402608, -438874, -397525, -377088, -338536, -339894, -348858, -360126, -394281, -445088, -420429, -337349, -361913, -333187, -332803, -460898, -411018, -325634, -328574, -406208, -407115, -373982, -371941, -417133, -420376, -393046, -421027, -416503, -342678, -331154, -341634, -353632, -380932, -391755, -388984, -342456, -397731, -402027, -471613, -382888, -336359, -413331, -433618, -423141, -381688, -375619, -418177, -346621, -345715, -308688, -334646, -329880, -321958, -351685]
806c51685l8570K3486K8126j802p5306N9849j3733R529N2899m6657L5372k2952
794c41444q0721N894K227M7977J15232l9572k5237J51q6881o0183Q4061N0575
782c27921j2331J598j905m5941j5004J3429J6884Q968j5063M338m638m1755J1732
769d07609L8323R113J5446L6313l9423k7190n8560R804Q0249N0190J6567n4665
757c31442j1118k7796J4258L6728J8197M0201l0997N1101j8685l0472K9491j6787
745b77321l3729K6280K3924K0505j35842O7279K7998n5603L2277p2774P7386N8233
733b41387n4662j5159m2001k0164l676K4040J7794m6455k1979K5008J21613r7716
721c54744L9870m9764j69P0942O757l5974q603K7516J9581Q836j9621j0108p3212
$$ y = [-351685, -390255, -366769, -338643, -340445, -415751, -355902, -369635, -360106, -307207, -353864, -318492, -341444, -422165, -416271, -414044, -366067, -250835, -290407, -315644, -315493, -402374, -462557, -378496, -327921, -340252, -338654, -340559, -386500, -401504, -388075, -371191, -362223, -377286, -372948, -377586, -419341, -407609, -369286, -360173, -344727, -308414, -347837, -375027, -433587, -423783, -343534, -293344, -276777, -331442, -342560, -370356, -356098, -319370, -301173, -260972, -291969, -240868, -259553, -290025, -260534, -277321, -311050, -284770, -260846, -240341, -376183, -308904, -280906, -336509, -304232, -377006, -299620, -241387, -296049, -311208, -353209, -373373, -377049, -353009, -335215, -381670, -403649, -378641, -257028, -354744, -314874, -364638, -364807, -293865, -287108, -323082, -331685, -304169, -284588, -275752, -295373, -305481, -378693]
708c78693Q8336k0793K6515r483m8370M7214r489j7217P056J5521j7089k4146
696c40638M2761m5102j6576l5624R6390j9246j9538m4518N5116j4583p608k6113
684c75279L3584M0595n7324r4781O8992K1892j3957K7493J7309K7466J6880K3483
672b63647m9768M1690o5837m826N4477L5575l5851l6934K6893j5938l013L4381
660b82798k5255n1605P3948o3874k0680P3841J197L3626j2761J6466O0363q0338
648b77870j9742N9114J3659K0924p6724R497K6355O2325o4359j5556L896P6527
636a81954n4169o9227O9397r300o4863M3215L7045R4464p8438k8205K7663j6496
624b30868k6174j6175O7711l8578J8853M5579L9929m60o5138N9702l519J4113
$$ y = [-378693, -290357, -311150, -284635, -294118, -342488, -295274, -304763, -321980, -314924, -299403, -316492, -340638, -297877, -342979, -359555, -395179, -298789, -318035, -337573, -382091, -326975, -341558, -349166, -375279, -341695, -301100, -358424, -453205, -384213, -362321, -376278, -348785, -331476, -304010, -287130, -263647, -313415, -271725, -337562, -342388, -287911, -252336, -288187, -325121, -298228, -314166, -317179, -282798, -308053, -359658, -285710, -349584, -370264, -296423, -295226, -261600, -274361, -257895, -197532, -277870, -297612, -238498, -224839, -203915, -280639, -271142, -244787, -182462, -246821, -262377, -258481, -181954, -236123, -305350, -235953, -245253, -310116, -266901, -229856, -135392, -213830, -242035, -214372, -230868, -257042, -273217, -205506, -244084, -225231, -179652, -139723, -140183, -205321, -145619, -149138, -135025]
612a35025N3161J2602p7674L2886j6928N5156N033o3784K2932J970L8269o915
600g8317J0557J1199L5781K290M8478l5956l317J16750O0027j05705L4078L9815
588A35680K6990M4705L547j0374K6730L8458L45O3855M613O8688J5748K8682J16144
575E63811Q520o6488Q8941P3267M2280J7861L8627J00119P6324k9212M1142O6582
563A021774Q0114J16924M4936J89215R3648R5768K43245J44962J65082K37377
553B433045K45561K29211L73389L59867L96253N29878N92264P39424R77376P21035
543G597303N20946M93419M99492N94212O36221J20937j626047j844316j320536
534E671631r69443p64000n63329m30746l10115k48805j73491j60028j92726k12354
$$ y = [-135025, -81864, -69262, -146936, -114050, -130978, -75822, -70789, -134573, -111641, -109671, -71402, -78317, -67760, -56561, -20780, -18490, 29988, -5968, -9285, 107465, 167492, 61787, 95865, 135680, 162670, 207375, 210922, 200548, 227278, 265736, 266081, 329936, 334549, 403237, 418985, 447667, 563811, 572331, 505843, 594784, 668051, 710331, 728192, 766819, 866938, 943262, 914050, 955192, 1021774, 1101888, 1218812, 1263748, 1452963, 1546611, 1642379, 1885624, 2030586, 2195668, 2433045, 2678606, 2907817, 3281206, 3641073, 4037326, 4567204, 5159468, 5898892, 6876268, 7597303, 8118249, 8611668, 9111160, 9705372, 10341593, 10462530, 8836483, 6992167, 5671631, 4702188, 3938188, 3374859, 2944113, 2633998, 2385193, 2211702, 2051674, 1858948, 1646594]
524A646594k50685k05673n5775j03790n1672q8284r4781j8516j44168J6267p7418
513E72099m6967j10584J7104L720j57298N2925k5218o3598k9098p3954K2147O2591
501B23869j5602n5780l4139k624k3737O2464p1785m6723L4948O1769n8723j00233
489b6296k3393o00M6210L3562j6638m2203K8217j9819p6002O5569M072L3415p845
476a751j13263Q050J3050N8397j8699K6971p1746J137K4942J7494m2074k2513
464a20005M5638m6504j2602l3563l3856K288R5398J762r3869L1757m3088L8509
452a68135k0273n775K491p760L4843j00841m215M9918N1564l7753l7472K942J0451
439b30015m4858J8322M9440J1220k430o3622Q7758R271K5060J5264o1570n4014
$$ y = [1646594, 1395909, 1190236, 1134461, 1030671, 978999, 890715, 795934, 777418, 633250, 649517, 572099, 525132, 414548, 431652, 435372, 278074, 330999, 305781, 242183, 213085, 139131, 161278, 223869, 208267, 152487, 118348, 115724, 91987, 154451, 82666, 35943, 70891, 132660, 73937, -26296, -49689, -50289, -4079, 29483, 12845, -29358, -1141, -20960, -96962, -31393, -27321, 6094, -1751, -115014, -106964, -93914, -35517, -54216, -27245, -98991, -97854, -72912, -55418, -97492, -120005, -74367, -120871, -133473, -167036, -200892, -198604, -103206, -101444, -195313, -163556, -206644, -168135, -188408, -194183, -191692, -199452, -164609, -265450, -269665, -219747, -168183, -205936, -243408, -240466, -230015, -274873, -256551, -207111, -195891, -198321, -261943, -174185, -164914, -139854, -124590, -186160, -240174]
427b40174R542J5856p266n7056L5187P361k3169k7122M7342q50N854K3241M7465
414a63789k2306N8615k9453n0203j24909j4204l281J8173J00408n500J4387J7040
402b05022k3642J6538J2931k5654J8291K8970N4874q0743Q0864M767K464o9829
390a85191O6649m2823P228j2040m0731l4378j4099N5972J4018m2641R474M832
378b13730J3615L8416l8209K6158m7282M3047M1991o4742p268K9163K2508J4163
366a42170M2697m6855J5382k8834p7282K8088L0738M853m8663J1703m1523N2655
354a99211J1126j2142M6221j14228O9466P9396M7883n5348o9662L2888L7246L3835
342i2530l9375Q7045o0067j5696l6466j0167K0507l385N7878k4546l5095m6697
$$ y = [-240174, -230632, -214776, -222042, -279098, -243911, -236550, -259719, -286841, -239499, -240349, -234495, -211254, -163789, -186095, -127480, -156933, -207136, -332045, -346249, -349530, -331357, -230949, -236449, -222062, -205022, -228664, -212126, -199195, -224849, -206558, -177588, -122714, -203457, -122593, -117826, -115362, -185191, -118542, -161365, -154137, -166177, -206908, -241286, -255385, -199413, -185395, -228036, -218562, -213730, -200115, -161699, -199908, -173750, -221032, -177985, -135994, -200736, -208004, -178841, -156333, -142170, -99473, -146328, -130946, -159780, -237062, -208974, -178236, -173383, -222046, -210343, -251866, -199211, -188085, -200227, -154006, -268234, -198768, -119372, -71489, -126837, -196499, -163611, -126365, -92530, -131905, -44860, -104927, -120623, -157089, -167256, -146749, -150134, -92256, -116802, -151897, -198594]
330a98594P8738J7008j09058n371O5372J7093n3985J0633l296R860J4974K7625
318a29001j57m6117K1283K6343J4051p3232P6556p1902O0953m2430K5883P300
306a30470N0428L7411p3182J7349n1874P0306k2071m0456j2819j6239K2797J0858
294a37962k2416N9256l796k5064n1049Q065N8860m571J8507N8793p6040K6661
282i0756n8470O181O3782q463o1999L7186n322N9969j5915j23078J10264Q7761
270A140m2677l7302M6526M973j5279n7941m9337L3223L1502J745M1216j486r2523
257a36220o1648P9591J04928m5124n2145P540J8527J7490L587l557n0079M4340
245g2770q674J2934J5856n3011R913N6586o8415K0159J4717K3905L2958l7586
$$ y = [-198594, -119856, -102848, -211906, -217277, -151905, -134812, -188797, -178164, -181460, -171600, -156626, -129001, -129158, -175275, -153992, -127649, -113598, -186830, -110274, -182176, -121223, -163653, -137770, -130470, -80042, -42631, -115813, -98464, -150338, -80032, -102103, -142559, -155378, -171617, -148820, -137962, -160378, -101122, -104918, -129982, -181031, -172966, -114106, -118677, -100170, -41377, -117417, -90756, -149226, -143045, -79263, -87726, -149725, -112539, -117861, -57892, -73807, -196885, -86621, 1140, -41537, -78839, -32313, -27340, -42619, -100560, -149897, -116674, -85172, -83427, -42211, -43697, -136220, -197868, -118277, -13349, -58473, -110618, -103078, -84551, -67061, -63474, -67031, -117110, -72770, -81444, -68510, -52654, -105665, -95752, -39166, -107581, -87422, -72705, -48800, -15842, -53428]
233e3428k6592k0661M35P5506k8960n8295Q075m415L2047R8497j02451o1964J10910
220c1296K3526n8877j7444J192j0196J3588Q8171l0541n408M956p4757K1633k0239
207i5692K8870j5933P114j6920J02623j3543K5869O147k1376J0988J6481m1097
195f469m3573N8382Q709p9763L9728m7552L5747k7546J2886N1509J8497j6403
183D152l7293K1839o2185K107O6766J8894K1070l391n2614J5120n4249P887L3187
170a8710L920O1886m8505m3494N1616j3613L7996m0091l7583L5531j1256M2174
158A9871O5781J579m0862j2148j327J4779l6950k8342k7917L2929K7686n5501
146d0422M8219m2729o2383N9914P2421r956k0041M7381J5167l0957l5381J1332
$$ y = [-53428, -80020, -100681, -100246, -24740, -53700, -111995, -103920, -108335, -76288, 22209, -80242, -142206, -31296, -7770, -66647, -84091, -82899, -93095, -79507, 8664, -21877, -27285, -22329, -97086, -75453, -95692, -66822, -82755, -75641, -92561, 10062, -3481, 22388, 28535, 7159, 18147, 34628, -6469, -50042, 8340, 17049, -62714, -22986, -70538, -34791, -62337, -49451, 2058, 20555, 4152, -33141, -11302, -73487, -71380, -4614, 14280, 35350, 31959, -20655, -5535, -59784, -51897, -18710, -14790, 47096, -1409, -44903, 6713, -6900, 31096, -8995, -46578, -11047, -22303, 19871, 85652, 87231, 46369, 34221, 32894, 47673, 10723, -17619, -45536, -12607, 15079, -40422, 7797, -34932, -97315, -37401, 35020, 25064, 5023, 52404, 67571, 36614, 1233, 12565]
134A2565q632j9712J4469l7300M0144k1467J8988L5109l2343J6938k1367J7706
122A5098N0098k4427l4780o588P3995n3907J1030l783j440L6913n3055J6152M3738
109F9044m7828m8668L8833L0485L5787K573q443n6265j8028J11833K679n619L4483
96A40866k6884k5705O113j8203K309q952p7098K1186M500P753N3581j7637K7539
83H9368r632K4889K0069J0379n2412k3787R752J8564J0131J4205l2855m4689J6229
70E0211k7094j1849K9012J270L4071K4939k5212J7240J9551j5242m6234j906J143
57D9900R902j6521N9243L4280j7910j6638J9501L6382m6921K0728k8651l6710
45F6585O9274k0352l6417L442L0065n2583l3183M7760k9603j7M8730K9420n9147
$$ y = [12565, 3933, -15779, -1310, -38610, 1534, -19933, -945, 34164, 1821, 18759, -2608, 15098, 65196, 40769, 5989, -599, 73396, 19489, 30519, 26736, 25296, 62209, 9154, 25306, 69044, 21216, -27452, 11381, 41866, 77653, 80226, 71783, 15518, -2510, 109323, 112002, 106383, 140866, 113982, 88277, 94390, 76187, 78496, 69544, -7554, 13632, 18132, 25885, 79466, 61829, 89368, 79736, 104625, 124694, 135073, 82661, 58874, 68626, 87190, 97321, 111526, 78671, 33982, 50211, 23117, 11268, 40280, 41550, 75621, 100560, 75348, 92588, 112139, 96897, 50663, 48757, 49900, 59802, 43281, 102524, 136804, 118894, 102256, 121757, 158139, 111218, 131946, 103295, 66585, 135859, 115507, 79090, 82532, 112597, 60014, 26831, 74591, 44988, 44971, 93701, 123121, 63974]
32F3974J6587j102j2331L4410q105L3003r7j0368K0173k4639L3551m2252m282
19I8522M974j6592K4164j1415L9902J3115n3054o837L9537L9908k131k5646k0885
6A23562l3347N7616L253j0541K9248O537
0A76328
$$ y = [63974, 80561, 79459, 67128, 101538, 93433, 126436, 126339, 115971, 136144, 111505, 145056, 102804, 98522, 103496, 86904, 111068, 99653, 139555, 152670, 99616, 92779, 132316, 172224, 170093, 144447, 123562, 90215, 147831, 151084, 140543, 169791, 176328]
$$ Imaginary data points
##PAGE= N=2
##DATA TABLE= (X++(I..I)), XYDATA
16383c205204Q3654L8189j7995j9955K9218P7952l4152P8670N9430L0661j3830
16372b893362M2790N3205M879K5653q248P4639K2748J8366O7483M8111M2034K1531
16360b480171N552L5737L9535L3929L312O8563K2029j2856M9927M6322o240J1133
16348b183228J4115L1105M6439M2280R6902M1655q709j6146m677j5066N1639M1340
16336a862351L0220O8802K3899K5649q507P797M8466P5828j2785k6854R2273L2677
16324a504886l525M3528M0608J00131J9035m5556n8795M7434O2848M1231K4659
16313a233288J8176P4783k1306J1476K3709o028K7461J5433Q9666K7648P9722
16302h92548j3745R664J0072J3297Q628J0071P1920M6755L2828o404L027m1038
$$ y = [-3205204, -3121550, -3083361, -3101356, -3121311, -3092093, -3014141, -3048293, -2969623, -2910193, -2879532, -2893362, -2850572, -2797367, -2792488, -2766835, -2775083, -2700444, -2677696, -2659330, -2591847, -2543736, -2501702, -2480171, -2474619, -2438882, -2399347, -2365418, -2362106, -2293543, -2271514, -2284370, -2234443, -2188121, -2194361, -2183228, -2169113, -2138008, -2091569, -2049289, -1952387, -1910732, -1919441, -1935587, -1940264, -1955330, -1903691, -1862351, -1832131, -1763329, -1739430, -1713781, -1722288, -1714491, -1666025, -1590197, -1602982, -1629836, -1537563, -1504886, -1508411, -1464883, -1424275, -1324144, -1305109, -1350665, -1409460, -1362026, -1299178, -1257947, -1233288, -1215112, -1140329, -1161635, -1150159, -1126450, -1132478, -1105017, -1089584, -999918, -972270, -892548, -906293, -896629, -886557, -873260, -864632, -854561, -782641, -735886, -703058, -709462, -706435, -747473]
16290g47473L8149Q2381K6736K1855J542J1289N9333k032L7217N6433n3732L1706
16278d36596J06953O522o1169L1908Q5565M0258k865M8294n1380k234L4719L1154
16266a68871L2938M0454J6217m438L8812L7784j7590K4482P3960l9286k4390Q6135
16254I6207M0726L3264n2037q197M1958P0232N967O422j0438q469j7629Q6016
16242B84022j7842N4032K1173j0408K518m449M8962L051j3751L0127L5590J1924
16230D44949J3847o9054J49911j9529m2657P1127l0451L2007R3656l8135O666
16219F12337O786L1401N61m1166M3386M4690p9113O2807J2965L8094K2627M8500
16207H03875l9249o0612N6193M8625M9750O7125r7773l4604Q923R7297n3489K0429
$$ y = [-747473, -709324, -626943, -600207, -578352, -576810, -565521, -506188, -508220, -471003, -414570, -468302, -436596, -329643, -323121, -384290, -352382, -266817, -226559, -229424, -181130, -232510, -234744, -200025, -168871, -135933, -95479, -79262, -83700, -44888, -7104, -24694, -212, 73748, 34462, 10072, 96207, 136933, 170197, 118160, 109963, 151921, 222153, 228120, 234542, 224104, 215635, 198006, 284022, 266180, 320212, 341385, 330977, 333495, 329046, 378008, 381059, 367308, 397435, 433025, 444949, 458796, 389742, 539653, 520124, 477467, 548594, 518143, 550150, 643806, 605671, 612337, 619123, 650524, 651085, 609919, 653305, 697995, 618882, 681689, 694654, 732748, 755375, 803875, 764626, 704014, 760207, 808832, 858582, 925707, 827934, 793330, 802253, 899550, 846061, 866490]
16195H66490O3767o3661m375K5889L1992k9240P5300P7099n617k2620j9859R001
16183A004166O8378k9147m4126L296J4862P0060p8710M1242K3253P974q078K5693
16171A098863Q6752J1890k3319K3070j4238R406n2291O3218M9955o5373k3496
16160A164437J1759O1002N6359o783q9516L4359N3311l7835n3851P2050l4147
16149A231145J9414l9233L8864n0735J01353P4768n5223L0487K6071p670K411
16138A371652j2421j4136N4429l2395L7888k9103Q478m5130P292m425M3098k3068
16126A362159J680M8231j3337M8736m406j5354L1532M4239r6790j7359L3412M1857
16114A464600p6296Q7826n3440L2416j6195M2610M5307n1878j6093k4616P3992
$$ y = [866490, 930257, 866596, 862221, 888110, 920102, 890862, 966162, 1043261, 1037644, 1015024, 995165, 1004166, 1072544, 1043397, 999271, 1002567, 1017429, 1087489, 1008779, 1050021, 1073274, 1081248, 1073170, 1098863, 1185615, 1197505, 1174186, 1197256, 1183018, 1192424, 1140133, 1203351, 1253306, 1187933, 1164437, 1176196, 1237198, 1293557, 1286774, 1197258, 1231617, 1284928, 1247093, 1193242, 1265292, 1231145, 1250559, 1211326, 1250190, 1199455, 1300808, 1375576, 1320353, 1350840, 1376911, 1369241, 1371652, 1359231, 1345095, 1399524, 1367129, 1405017, 1375914, 1384392, 1339262, 1346554, 1342129, 1385227, 1362159, 1363839, 1412070, 1398733, 1447469, 1443063, 1427709, 1459241, 1503480, 1406690, 1389331, 1422743, 1464600, 1388304, 1476130, 1422690, 1455106, 1438911, 1481521, 1526828, 1474950, 1458857, 1434241, 1508233]
16103A508233k7848j6401K1821j5861j3151j1526R3966j5094n0916j4841O6669
16092A525051L8327k6681q1231N0430M5972M7490o2358J6608M9977k1613k6935
16081A555037n1551L758K8521l7892l7566M7216M6795m3143q6892N6656R785K8919
16069A519643M7145N2237l2990Q3078r2761k8109l0815L1583m614P143J8009k1130
16057A548419j341K0341m745L9207R192o3325j164R5217j7119o5885J4588N9119
16045A632504L0176n3347o2553J5651l2234N0399K8631N3091m1444M532p0555
16034A554851l6831P8242o3783K9106m9703L2466M5187L3319N1637k4387j05806
16023A544298J6924r806L6978k5592J0213k5927j002N8148L0514m7962J5304N7982
$$ y = [1508233, 1480385, 1463984, 1485805, 1469944, 1456793, 1445267, 1539233, 1524139, 1473223, 1458382, 1525051, 1563378, 1536697, 1455466, 1505896, 1551868, 1599358, 1537000, 1553608, 1603585, 1581972, 1555037, 1503486, 1507244, 1535765, 1497873, 1460307, 1507523, 1554318, 1511175, 1424283, 1480939, 1490724, 1519643, 1566788, 1619025, 1586035, 1669113, 1576352, 1548243, 1517428, 1549011, 1544397, 1551540, 1569549, 1548419, 1547078, 1567419, 1562674, 1601881, 1611073, 1547748, 1546584, 1641801, 1624682, 1558797, 1573385, 1632504, 1662680, 1609333, 1546780, 1562431, 1530197, 1580596, 1609227, 1662318, 1620874, 1625406, 1554851, 1518020, 1596262, 1532479, 1561585, 1511882, 1544348, 1589535, 1622854, 1674491, 1650104, 1544298, 1561222, 1551416, 1588394, 1562802, 1573015, 1547088, 1546086, 1604234, 1634748, 1586786, 1602090, 1660072]
16011A660072k9996l7403J8409j4209N536L4852k3264k8147j9432J0169J5148
16000A591735M392j3150K7510Q8944p8801l4957m3901J0128J06444K6087p1814
15989A612617N8178K7843j18633j1328O0347L2881L2988m7259M2499k9686n3611
15978A606836N8452j09180K1431j5715P129l4487R380R5569M9627j08206N5847
15967A636683K9837j1940n1156n3658r065K476O9915j2129j0523k9150Q1757L3478
15955A676525n2053P4152q0445l8243L4709J6756J5784j9380n1534K8902M2123
15944A647296L2226l2647o1030K1451J8143m9871k6140J26171m0049l3212L3712
15933A636050k437n1990n3945J1866M7708L5628m0872L5852L9218M6183j05266
$$ y = [1660072, 1630076, 1592673, 1611082, 1596873, 1602409, 1637261, 1613997, 1585850, 1566418, 1576587, 1591735, 1596127, 1582977, 1610487, 1699431, 1620630, 1585673, 1541772, 1551900, 1658344, 1684431, 1612617, 1670795, 1698638, 1580005, 1568677, 1629024, 1661905, 1694893, 1647634, 1690133, 1660447, 1606836, 1665288, 1556108, 1577539, 1561824, 1568953, 1534466, 1543846, 1639415, 1689042, 1580836, 1636683, 1666520, 1654580, 1603424, 1549766, 1540701, 1543177, 1613092, 1600963, 1590440, 1561290, 1643047, 1676525, 1624472, 1698624, 1618179, 1579936, 1614645, 1631401, 1647185, 1627805, 1576271, 1605173, 1647296, 1679522, 1646875, 1585845, 1607296, 1625439, 1575568, 1549428, 1675599, 1635550, 1602338, 1636050, 1633613, 1581623, 1527678, 1539544, 1587252, 1622880, 1582008, 1617860, 1657078, 1703261, 1597995]
15922A597995N6916J1982n0024K4535K1150r3239m6481M6688K4503N868O1777
15911A661670O7760p3916p452j886J6935p4309L7520r545o3307Q973N181K9797
15899A597421K6965P620l0784q3356P0927J1709k2662L4171M157l7900K4288k1202
15887A581354O1331l7301L2375k7879q2874P1364M3495n5076q896m0769N3467
15876A590591j278O232J9944J4442M4278K5910j1026j52409O3683O5411r2455
15865A573323J1968m73L4926k8629m6197N3760L6219n2204q551R5807o648j95
15853A663106N3976n5982j6456J01772p8708O1096m4578K4329k0727j3983l5334
15842A638511N9416n0756L1894q5790n7282N9425M2961M8293k0325J23736n1172
$$ y = [1597995, 1654911, 1666893, 1616869, 1641404, 1662554, 1569315, 1522834, 1569522, 1594025, 1599893, 1661670, 1729430, 1655514, 1648062, 1646176, 1663111, 1588802, 1626322, 1616777, 1553470, 1562443, 1567624, 1597421, 1624386, 1632006, 1601222, 1517866, 1588793, 1600502, 1577840, 1612011, 1616168, 1578268, 1602556, 1581354, 1642685, 1605384, 1637759, 1609880, 1527006, 1598370, 1641865, 1586789, 1577893, 1537124, 1590591, 1589313, 1595545, 1615489, 1629931, 1674209, 1700119, 1689093, 1536684, 1600367, 1665778, 1573323, 1585291, 1584818, 1619744, 1591115, 1544918, 1598678, 1634897, 1582693, 1574142, 1669949, 1663301, 1663106, 1717082, 1661100, 1644644, 1746416, 1667708, 1728804, 1684226, 1708555, 1687828, 1673845, 1638511, 1697927, 1647171, 1679065, 1593275, 1535993, 1595418, 1638379, 1686672, 1666347, 1790083, 1738911]
15831A738911j6784m1658k4936J1147m6686k458l2511K5855M1376p7377P8265
15820A653144L2815j5995K7682l4563L0087m4194j05383Q5919n5251J00909n441
15809A669729L155l2238k6910K4742k1860M1619k1879L2420N7821l9340m0018
15798A647241l3744J8947n6588N8616p961j1015M6328l3920j5529M2488N1717
15787A706580J6152l7652j01938O4630m6654J8544j6534l211m0165N4057O759
15776A620568N256j1057r708q43m8238N6147N8178j516K0097l1243p03M0903j7936
15763A679905k2075K9078j8977k8438j3216L5681l7187j5686J7367N8192k98K961
15751A687307m7555M4448O6860k1690l9239J2301l225k2941m8823N154k3350L7134
$$ y = [1738911, 1722127, 1680469, 1655533, 1666680, 1619994, 1617536, 1585025, 1610880, 1652256, 1574879, 1653144, 1685959, 1669964, 1697646, 1663083, 1693170, 1648976, 1543593, 1629512, 1574261, 1675170, 1669729, 1672884, 1640646, 1613736, 1638478, 1616618, 1658237, 1636358, 1668778, 1726599, 1687259, 1647241, 1613497, 1632444, 1575856, 1634472, 1626511, 1615496, 1661824, 1627904, 1612375, 1654863, 1706580, 1722732, 1685080, 1583142, 1647772, 1601118, 1619662, 1603128, 1599917, 1559752, 1613809, 1620568, 1625824, 1614767, 1605059, 1604216, 1555978, 1612125, 1670303, 1668787, 1688884, 1657641, 1656938, 1697841, 1679905, 1657830, 1686908, 1667931, 1639493, 1626277, 1661958, 1624771, 1609085, 1626452, 1684644, 1684346, 1687307, 1639752, 1684200, 1751060, 1729370, 1690131, 1702432, 1699207, 1676266, 1627443, 1632597, 1609247, 1646381]
15739A646381K7049l000m015l5851O2405n679p315l8733L8796L6920J1832q9673
15727A639117J7065N9537p2373L191j739l5957K8140L0145n001M7653k0098n4546
15715A635134N3381k6098j8613m8420M7476r940M7158j02692M1383Q2177J1897
15704A712843L4750j06666m2544k5828K3054J5386J1950N0217m7205R654K0739
15693A656350k470O163N908L5910q445r7639q0391J15870P63o105M5398l1501
15681A639811O8230q6217N7198O1098K8575o6834l4813r222j7235r495p1809M2164
$$ y = [1646381, 1673430, 1670430, 1666415, 1630564, 1692969, 1687290, 1679975, 1641242, 1680038, 1716958, 1728790, 1639117, 1656182, 1715719, 1643346, 1646537, 1644798, 1608841, 1636981, 1667126, 1662125, 1709778, 1689680, 1635134, 1688515, 1662417, 1643804, 1595384, 1642860, 1632920, 1680078, 1577386, 1618769, 1700946, 1712843, 1747593, 1640927, 1598383, 1572555, 1595609, 1610995, 1622945, 1673162, 1625957, 1635611, 1656350, 1653880, 1660043, 1665951, 1701861, 1693416, 1595777, 1515386, 1631256, 1632019, 1625914, 1671312, 1639811, 1708041, 1621824, 1679022, 1740120, 1768695, 1701861, 1667048, 1657826, 1640591, 1631096, 1559287, 1601451]
$$ [...]
##END NTUPLES=NMR SPECTRUM
##END=
