##TITLE=1H_EC-3333(III-2)
 CDCl3
 8 sc, 
 8.10.2024
##JCAMPDX= 6.0         $$ Bruker NMR JCAMP-DX V2.0
##DATA TYPE= NMR SPECTRUM
##DATA CLASS= NTUPLES
##ORIGIN= UXNMR, Bruker Analytische Messtechnik GmbH
##OWNER= root
$$ XWIN-NMR		Version 3.5
$$ Tue Oct  8 13:50:54 2024 Russian Standard Time (UT+4h)  she@DPX200
##.OBSERVE FREQUENCY= 200.1318
##.OBSERVE NUCLEUS= ^1H
##.ACQUISITION MODE= SIMULTANEOUS
##.ACQUISITION SCHEME= undefined
##.AVERAGES= 8
##.DIGITISER RES= 18
##SPECTROMETER/DATA SYSTEM= spect
##.PULSE SEQUENCE= zg30
##.SOLVENT NAME= CDCl3
##.SHIFT REFERENCE= (INTERNAL, CDCl3, 0, 21.0105)
##AUDIT TRAIL= $$ (NUMBER, WHEN, WHO, WHERE, WHAT)
$$ ##TITLE= Audit trail, XWIN-NMR		Version 3.5
$$ ##JCAMPDX= 5.01
$$ ##ORIGIN= Bruker BioSpin GmbH
$$ ##OWNER= she
$$ F:/spectra/data/she/nmr/H-F/1/pdata/1/auditp.txt
$$ ##AUDIT TRAIL=  $$ (NUMBER, WHEN, WHO, WHERE, WHAT)
(   1,<2024-10-08 13:49:31.76 +0400>,<she>,<DPX200>,
      <created by zg, POWCHK disabled, PULCHK disabled
       configuration hash MD5:
       00 E9 B6 7A A2 85 ED C7 34 08 36 98 17 FE 4E 26
       data hash MD5: 16K
       F0 FA 0F DF 66 0C A1 43 B5 6E 14 23 68 78 29 1F>)
(   2,<2024-10-08 13:49:34.06 +0400>,<she>,<DPX200>,
      <Start of raw data processing
       efp BC_mod = 2 LB = 0.24 FT_mod = 6 PKNL = 1 PHC0 = -26347.94 PHC1 = 15.78747 SI = 16K 
       data hash MD5: 16K
       FB 52 8F 5C 56 44 24 70 D1 8F CA 6D BA A4 AC C7>)
(   3,<2024-10-08 13:49:54.32 +0400>,<she>,<DPX200>,
      <pk PHC0 = -1.48136 PHC1 = 0 
       data hash MD5: 16K
       B2 B5 5E 6D 03 18 95 94 52 22 1F BA F9 ED 7F 51>)
(   4,<2024-10-08 13:49:57.70 +0400>,<she>,<DPX200>,
      <abs ABSG = 5 
       data hash MD5: 16K
       BA 80 B5 A3 68 1F 29 F4 A1 89 7C 7D D6 6B E5 A2>)
$$ ##END=
$$ 
$$ hash MD5
$$ AB 98 D6 DF C3 E6 89 4F D5 3E A6 E8 EB 8F 67 42
##$RELAX= 
##$RELAX= 
##$RELAX= 
##$RELAX= 
##$RELAX= 
##$RELAX= 
$$ Bruker specific parameters
$$ --------------------------
##$DU= <F:/spectra>
##$EXPNO= 1
##$NAME= <H-F>
##$PROCNO= 1
##$TYPE= <nmr>
##$USER= <she>
##$AMP= (0..31)
100 100 100 100 100 100 100 100 100 100 100 100 100 100 100 100 100 100 
100 100 100 100 100 100 100 100 100 100 100 100 100 100 
##$AQSEQ= 0
##$AQ_mod= 1
##$AUNM= <au_zg>
##$AUTOPOS= <>
##$BF1= 200.13
##$BF2= 200.13
##$BF3= 200.13
##$BF4= 200.13
##$BF5= 200.13
##$BF6= 200.13
##$BF7= 200.13
##$BF8= 200.13
##$BYTORDA= 1
##$CFDGTYP= 0
##$CFRGTYP= 5
##$CHEMSTR= <none>
##$CNST= (0..31)
1 1 145 1 1 1 1 1 1 1 1 1 1 1 1 1 1 1 1 1 1 1 1 1 1 1 1 1 1 1 1 1 
##$CPDPRG= <>
##$CPDPRG1= <>
##$CPDPRG2= <>
##$CPDPRG3= <>
##$CPDPRG4= <mlev>
##$CPDPRG5= <mlev>
##$CPDPRG6= <mlev>
##$CPDPRG7= <mlev>
##$CPDPRG8= <mlev>
##$CPDPRGB= <>
##$CPDPRGT= <>
##$D= (0..31)
0 1.2 0 0 0 0 0 0 0 0.06 0 0.03 0 0 0 0 0.0002 0 0 0 0 0 0 0 0 0 0 0 0 
0 0 0 
##$DATE= 1728380971
##$DBL= (0..7)
120 120 120 120 120 120 120 120 
##$DBP= (0..7)
150 150 150 150 150 150 150 150 
##$DBP07= 0
##$DBPNAM0= <>
##$DBPNAM1= <>
##$DBPNAM2= <>
##$DBPNAM3= <>
##$DBPNAM4= <>
$$ [...]
##$SUBNAM3= <"">
##$SUBNAM4= <"">
##$SUBNAM5= <"">
##$SUBNAM6= <"">
##$SUBNAM7= <"">
##$SUBNAM8= <"">
##$SUBNAM9= <"">
##$SW= 24.0689170037331
##$SWIBOX= (0..15)
0 0 2 0 0 0 0 0 0 0 0 0 0 0 0 0 
##$SW_h= 4816.95568400771
##$TD= 16384
##$TD0= 1
##$TE= 0
##$TE2= 300
##$TE3= 300
##$TEG= 300
##$TL= (0..7)
0 120 120 120 120 120 120 120 
##$TP= (0..7)
150 150 150 150 150 150 150 150 
##$TP07= 0
##$TPNAME0= <>
##$TPNAME1= <>
##$TPNAME2= <>
##$TPNAME3= <>
##$TPNAME4= <>
##$TPNAME5= <>
##$TPNAME6= <>
##$TPNAME7= <>
##$TPOAL= (0..7)
0.5 0.5 0.5 0.5 0.5 0.5 0.5 0.5 
##$TPOFFS= (0..7)
0 0 0 0 0 0 0 0 
##$TUNHIN= 0
##$TUNHOUT= 0
##$TUNXOUT= 0
##$USERA1= <user>
##$USERA2= <user>
##$USERA3= <user>
##$USERA4= <user>
##$USERA5= <user>
##$V9= 5
##$VALIST= <valist>
##$VCLIST= <CCCCCCCCCCCCCCC>
##$VD= 0
##$VDLIST= <DDDDDDDDDDDDDDD>
##$VPLIST= <PPPPPPPPPPPPPPP>
##$VTLIST= <TTTTTTTTTTTTTTT>
##$WBST= 1024
##$WBSW= 4
##$XGAIN= (0..3)
0 0 0 0 
##$XL= 0
##$YL= 0
##$YMAX_a= 530689
##$YMIN_a= -311329
##$ZGOPTNS= <>
##$ZL1= 120
##$ZL2= 120
##$ZL3= 120
##$ZL4= 120
##$ABSF1= 20.92093
##$ABSF2= -3.148199
##$ABSG= 5
##$ABSL= 3
##$ALPHA= 0
##$AQORDER= 0
##$ASSFAC= 0
##$ASSFACI= 0
##$ASSFACX= 0
##$ASSWID= 0
##$AUNMP= <proc_1d>
##$AZFE= 0.1
##$AZFW= 0.1
##$BCFW= 0
##$BC_mod= 2
##$BYTORDP= 0
##$COROFFS= 0
##$CY= -3
##$DATMOD= 1
##$DC= 0
##$DFILT= <>
##$DTYPP= 0
##$F1P= 0
##$F2P= 0
##$FCOR= 1
##$FTSIZE= 16384
##$FT_mod= 6
##$GAMMA= 0
##$GB= 0
##$INTBC= 1
##$INTSCL= 3.70164e-10
##$ISEN= 128
##$LB= 0.24
##$LEV0= 0
##$LPBIN= 0
##$MAXI= 10000
##$MC2= 0
##$MEAN= 0
##$ME_mod= 0
##$MI= 1.114404
##$NCOEF= 0
##$NC_proc= -6
##$NLEV= 6
##$NOISF1= 3.799351
##$NOISF2= 2.8
##$NSP= 0
##$NTH_PI= 0
##$NZP= 0
##$OFFSET= 21.01054
##$PC= 1
##$PHC0= -26349.42
##$PHC1= 15.78747
##$PH_mod= 1
##$PKNL= yes
##$PPARMOD= 0
##$PSCAL= 0
##$PSIGN= 0
##$REVERSE= no
##$SF= 200.130003637731
##$SI= 16384
##$SIGF1= 3
##$SIGF2= 2
##$SINO= 5.538805
##$SIOLD= 16384
##$SREGLST= <1H.CDCl3>
##$SSB= 0
##$STSI= 16384
##$STSR= 0
##$SW_p= 4816.95568400771
##$SYMM= 0
##$S_DEV= 0
##$TDeff= 16384
##$TDoff= 0
##$TI= <>
##$TILT= no
##$TM1= 0
##$TM2= 0
##$TOPLEV= 0
##$USERP1= <user>
##$USERP2= <user>
##$USERP3= <user>
##$USERP4= <user>
##$USERP5= <user>
##$WDW= 1
##$XDIM= 16384
##$YMAX_p= 390798937
##$YMIN_p= -1334715
$$ End of Bruker specific parameters
$$ ---------------------------------
##NTUPLES= NMR SPECTRUM
##VAR_NAME=  FREQUENCY,     SPECTRUM/REAL,   SPECTRUM/IMAG
##SYMBOL=    X,             R,               I
##VAR_TYPE=  INDEPENDENT,   DEPENDENT,       DEPENDENT
##VAR_FORM=  AFFN,          ASDF,            ASDF
##VAR_DIM=   16384,         16384,           16384
##UNITS=     HZ,            ARBITRARY UNITS, ARBITRARY UNITS
##FACTOR=    0.29402158847633, 1,            1
##FIRST=     4204.83944834079, 0,            0
##LAST=      -612.116235666923, 0,           0
##MIN=       -612.116235666923, -1334715,    0
##MAX=       4204.83944834079, 390798937,    0
$$ Real data points
##PAGE= N=1
##DATA TABLE= (X++(R..R)), XYDATA
$$ [...]
7031C0967388k058643j221870j188236q95900p18798m88488o90434l16458j17666
7022B3270895J72569L55360M00643L50772L99129R4209P870p7488M14873K85562
7012B5674394O65898P30696J007555N44872M72461L97130O19853P51003J291496
7003C2155358J712328J882017K062711K323662K044811J716445J860002J701884
6995D7459218J738932J184277j25898j020282k060511k051039j871329j240129
6987D2013239q94223m10439J82728L47338K05925K00798L831k46979M569K34681
6977D1641468R855p5780o37140o74405o31020J35225P21682J565117K095923J959787
6967D6110712J110679K96527j160982k613531k953111l059289k944329k309408
$$ plain form
7031 30967388 28908745 27686875 26498639 25602739 24883941 24395453 23705019 23388561 23270895
7022 23270895 23443464 23798824 24199467 24550239 24949368 25043577 25051447 24973959 25388832 25674394
7012 25674394 26340292 27070988 28078543 28623415 29095876 29493006 30112859 30863862 32155358
7003 32155358 33867686 35749703 37812414 40136076 42180887 43897332 45757334 47459218
6995 47459218 49198150 50382427 50256529 49236247 47175736 45124697 43253368 42013239
6987 42013239 41119016 40708577 40891305 41238643 41444568 41645366 41649197 41402218 41406787 41641468
6977 41641468 41651323 41575543 40938403 40263998 39632978 39768203 40489885 42055002 44150925 46110712
6967 46110712 47221391 47517918 46356936 43743405 40790294 37731005 34786676 32477268
6959C2477268j651550q18501n09255j32668N54561J90759j47283n35255j141633
6950B8286443j370321j508480j418542j045883o69270l59423o81J1382K07309
6941B2132534k8084k61577l68218n93342p83860r49628n66676k94089m61896N8340
6931A7883504j01516J84636J12193J79946L15930M14630P2430k4440l19733m64722
6921A8252858l74463k64654j52891j3167L14237K97414K60102J59562M16324N41229
6911A9436551O13514L89083M33622k45100k76386l19103k12020k44296J37676
6902A9713541M21192M32357M36725P21153M94484J045851J026908J206096R30659
6893B6428966O31601K61062P3465j16335j10097L9843K74178O60017O89473Q35836
$$ plain form
6959 32477268 30825718 30007217 29497962 29365294 29919855 30110614 29963331 29428076 28286443
6950 28286443 26916122 25407642 23989100 22943217 22273947 21914524 21913843 21925225 22132534
6941 22132534 22104450 21842873 21474655 20881313 20097453 19147825 18581149 18287060 17825164 17883504
6931 17883504 17781988 17966624 18078817 18258763 18574693 18989323 19061753 19037313 18717580 18252858
6921 18252858 17878395 17613741 17460850 17447683 17761920 18059334 18319436 18478998 18895322 19436551
6911 19436551 20050065 20439148 20872770 20627670 20351284 20032181 19820161 19575865 19713541
6902 19713541 20134733 20567090 21003815 21724968 22219452 23265303 24292211 25498307 26428966
6893 26428966 27060567 27321629 27395094 27278759 27168662 27208505 27482683 28142700 28832173 29668009
6883B9668009N81917K75377j32442q58936j282802j474748r51344n62303l2699
6874B5230029N0646j45730l43148r23873j127642j122065r75364o46921l94516
6865A9601416O8196J28281L01540O52909O65044P02873Q57653L78481M2032K8021
6855B3426446K45832M37446P85766R72161R63325P86410N5472n38500j083636
6846B6050722j357613j291512r00017n79688L5020r5436n52820p15862j171004
6837A9421790j316877j313851j046956q88435n83852k96828m24359j41698l11988
6828A3096946j19509j32583j93956K5888l5120K2811j52219n2846M2491k37877
6818A2264026k09997j73196r1116p5266m8069k14775Q1941j40436l21868J49872
$$ plain form
6883 29668009 30249926 30525303 30392861 29533925 28251123 26776375 25825031 25262728 25230029
6874 25230029 25280675 25134945 24791797 23867924 22740282 21618217 20642853 19995932 19601416
6865 19601416 19669612 19797893 20099433 20752342 21417386 22120259 22977912 23356393 23398425 23426446
6855 23426446 23672278 24109724 24895490 25867651 26830976 27617386 27672858 27134358 26050722
6846 26050722 24693109 23401597 22501580 21921892 21956912 21861476 21308656 20592794 19421790
6837 19421790 18104913 16791062 15744106 14855671 14271819 13974991 13550632 13408934 13096946
6828 13096946 12977437 12844854 12650898 12676786 12641666 12664477 12512258 12459412 12501903 12264026
6818 12264026 12054029 11880833 11789717 11714451 11666382 11451607 11533548 11393112 11071244 11221116
6808A1221116j02547k7394J61055r122J43500K40409J85223J05816K57739K88646
6798A2464441L75130N35828M24544P20353N94618O41256Q37967R52327J233543
6789A8780007J332935J074505J095099N96171N01504L16000K0942Q4857J76833
6780B3978853J11237m7069j12634l45716o77341m25220n94790m51195k10856m46231
6770B0779038l6661J76157K19770L9366Q1826J37071K20054K57122Q07700Q87788
6760B3569231J079802J423533J647030J288030J247016Q00062M79906O37602R20411
6751C3092623J422268K034508J967977J761683J229763M39323n61354j160228
6743D0226563j508901j557275r22701l14638N0041L88246M08354P3695k59811
$$ plain form
6808 11221116 11118569 11091175 11252230 11243108 11386608 11627017 11812240 11918056 12175795 12464441
6798 12464441 12839571 13375399 13799943 14520296 15114914 15756170 16594137 17546464 18780007
6789 18780007 20112942 21187447 22282546 22878717 23380221 23696221 23717163 23802020 23978853
6780 23978853 24090090 24043021 23930387 23584671 22907330 22482110 21887320 21436125 21225269 20779038
6770 20779038 20742377 20918534 21138304 21177670 21259496 21396567 21616621 21873743 22681443 23569231
6760 23569231 24649033 26072566 27719596 29007626 30254642 31054704 31534610 32172212 33092623
6751 33092623 34514891 36549399 38517376 40279059 41508822 41948145 41386791 40226563
6743 40226563 38717662 37160387 36237686 35923048 35973089 36361335 36769689 36843384 36583573
6734C6583573r57276j515086j434172j298369o37289r528L20098P31790O87623
6725C2471364O32423J93967m43400p77910q56420p35836n03525j76303j65894
6716B9638466J45326p1176l80981l78841p82942j089437r60281k89683k22776
6707B5607675j16264J04123M36904J35515j84866l61277o87673r66982r11136
6698B3056019q68646q17114o68608q91977q20540r97048r94744o98978l55010
6689A5943354k73166r5111J66269P5408J44173j62756k61262n92828o39438q80292
6679A3424351p06048l32412k56868j96068j03278p5328m05909l39342l58749l47293
6669A0303056n70525j64328r5879j40241k39592j37483l90639m40748m11713m71967
$$ plain form
6734 36583573 35626297 34111211 32677039 31378670 30741381 30731853 31051951 31783741 32471364
6725 32471364 33103787 33297754 32854354 32076444 31220024 30484188 29980663 29804360 29638466
6716 29638466 29783792 29712616 29331635 28952794 28169852 27080415 26120134 25830451 25607675
6707 25607675 25491411 25595534 26032438 26167953 25983087 25621810 24934137 23967155 23056019
6698 23056019 22187373 21370259 20701651 19809674 18989134 17992086 16997342 16298364 15943354
6689 15943354 15670188 15575077 15741346 15816754 15960927 15798171 15536909 14944081 14304643 13424351
6679 13424351 12718303 12385891 12129023 11932955 11829677 11754349 11348440 11009098 10650349 10303056
6669 10303056 9732531 9568203 9472324 9332083 9092491 8955008 8564369 8123621 7711908 7239941
6659G239941j79574k80757l80855k61298j65325j23064k03914l38004j82931n5970
6649E068249k9327j22170k52429j40875l0090q9793j79390j17751M6844j03038
6639D050230P7193j88211k27485j06550n5098j33535j67014m4823j0474j78412
6629C015821j10917J19833r3418o4253J47836j68313j16639J9401K5199o0119
6619B714431K8190j26230j10565M4805j87808k0264j07907M8893O295r3379P8200
6608B274661j25156L2692j13578r6950P087j6201j70312O8417k2280j34467j05949
6597A597964J34170k5310j31386M7278L7590O7084j53070J7156j16342p4722L8230
6586A438642n0307Q5016p0j51545K55518L7198k07523o4788Q8878J38008P0622
$$ plain form
6659 7239941 7060367 6779610 6398755 6137457 5972132 5849068 5645154 5307150 5124219 5068249
6649 5068249 5038922 4916752 4664323 4523448 4493358 4403565 4224175 4106424 4153268 4050230
6639 4050230 4127423 3939212 3711727 3605177 3550079 3416544 3249530 3204707 3194233 3015821
6629 3015821 2904904 3024737 2931319 2867066 3014902 2846589 2729950 2749351 2774550 2714431
6619 2714431 2742621 2616391 2505826 2550631 2362823 2342559 2234652 2283545 2289840 2196461 2274661
6608 2274661 2149505 2182197 2068619 1971669 1978756 1962555 1792243 1860660 1838380 1703913 1597964
6597 1597964 1732134 1706824 1575438 1622716 1660306 1727390 1574320 1591476 1475134 1400412 1438642
6586 1438642 1388335 1473351 1473281 1321736 1577254 1614452 1406929 1342141 1431019 1569027 1639649
6575A639649k43214j5238K0237L6465o3780K0592J11327l8018k34147O8352N005
6564A307230n6128P6841o7226k6190j2313N9309L0277J3279N9685l3566j6143
6553A335055l3742L5164J25233J5917j3891j10127J57082j33679n3859K3285R7844
6542A444282J35913m8473j15280J49364j8118N4128J69122P596M8934N4304P1860
6531A953632N2991J4198J32543K51650L9527r6089N8998K15497J64386L9948N8988
6520B886269L4016P1940L1161J86357J21496n4733J09928K77725J43811K04253
6510D012223O0581L14130K22487J67799K37799L11098M36912M74221N33079P52142
6500G522471P75384N62364M08762J44365o6367j47080j21520q3839M6753L28952
$$ plain form
6575 1639649 1396435 1381197 1401434 1437899 1374119 1394711 1506038 1468020 1233873 1302225 1307230
6564 1307230 1251102 1327943 1260717 1234527 1222214 1281523 1311800 1325079 1384764 1351198 1335055
6553 1335055 1301313 1336477 1461710 1477627 1463736 1353609 1510691 1377012 1323153 1346438 1444282
6542 1444282 1580195 1531722 1416442 1565806 1547688 1601816 1770938 1778534 1827468 1881772 1953632
6531 1953632 2006623 2020821 2153364 2405014 2444541 2348452 2407450 2622947 2787333 2827281 2886269
6520 2886269 2920285 2992225 3023386 3209743 3331239 3276506 3386434 3664159 3807970 4012223
6510 4012223 4072804 4386934 4609421 4777220 5015019 5326117 5763029 6237250 6770329 7522471
6500 7522471 8297855 8860219 9268981 9413346 9346979 9199899 9078379 8994540 9041293 9370245
6490I370245j50774l07662k95561o49763o33232p86400m32252l93950j04729j71719
6480E444203l57182k7209P9312k61987N0982K66790k2227J91332J09140K29370
6470E702524N09389M32319N27626P28888O64691M71180J17378j31171l28145l78757
6460H315922j58920J72203P9202J07744q3389o11370p79465p35949n11175q74622
6450D920181l71113n06214m05643k17419j37552k29643j95131j36178j24458j83775
6440B413055j60996j37791k1833K3475q1297j95104M8730r1569m4082m0919J02416
6429A814085N6500k31734O0384M5362q9718r7902P2530R7116l2448R9255k09202
6418A584228n7710j05304l6308r8558r661Q1585k2239J3721j41864j05837j3717
$$ plain form
6490 9370245 9219471 8911809 8616248 7966485 7333253 6546853 6114601 5720651 5615922 5444203
6480 5444203 5087021 5059812 5139124 4877137 4928119 5194909 5172682 5364014 5473154 5702524
6470 5702524 6211913 6644232 7171858 7900746 8565437 9036617 9153995 9022824 8694679 8315922
6460 8315922 8157002 8329205 8408407 8516151 8432762 7821392 7041927 6305978 5794803 4920181
6450 4920181 4549068 4042854 3637211 3419792 3282240 3052597 2857466 2721288 2596830 2413055
6440 2413055 2252059 2114268 2092435 2115910 2034613 1839509 1888239 1796670 1752588 1711669 1814085
6429 1814085 1870585 1638851 1699235 1744597 1654879 1556977 1629507 1726623 1694175 1793430 1584228
6418 1584228 1526518 1421214 1384906 1286348 1276687 1358272 1336033 1349754 1207890 1102053 1088336
6407A088336J5460j52281M9903P0049O6201j05485m9164j19001l1363J44863Q3388
6396A060906q485M132k0285j07750J29910j43865J31214m7276k2619O0485j35305
6385I01062j45733M2219j60128l2384K7603M534k3424L299J85021p1859j9366
6374G10844j23762L1910q1931n5376J77434l5538j44872M5750n7259R1441q1858
6363D76783O9325q011r0649n4670J70504k906j5596j85154n7988J80276J07900
6352E89814k39059O0683K30041k05305J9624o4067K9149L3208j97287K297j0165
6341B48933J78288L5556j2215j67112M0260n2899P7940J31620J02132n5240J00256
6330F27519k10337k0695J01770j37591L7839N7024l1828l5800L1957J9065o7368
$$ plain form
6407 1088336 1103796 951515 1001418 1071467 1137668 1032183 983019 864018 832655 977518 1060906
6396 1060906 1052421 1056553 1036268 928518 1058428 914563 1045777 998501 975882 1036367 901062
6385 901062 755329 797548 637420 605036 632639 637173 613749 617048 802069 730210 710844
6374 710844 587082 618992 537061 481685 659119 623581 478709 524459 467200 558641 476783
6363 476783 546108 538097 447448 392778 563282 560376 544780 359626 301638 481914 589814
6352 589814 350755 411438 641479 436174 455798 391731 420880 454088 256801 259098 248933
6341 248933 427221 462777 450562 283450 323710 270811 348751 480371 582503 527263 627519
6330 627519 417182 396487 498257 360666 398505 455529 423701 387901 419858 438923 371555
6319C71555N4520j03005M2714r08J29520m8549J890K2201j12056J44893R9807
6308F02582m4746N0029L1711O0395J19q5344j81315m422J05030K41501M5757j52412
6296F68885o279q7099J82712n1469r2690k2523K7629O1894j01259j6262L9220
6285F02759R7248R3460p6550n8860j79006M1985J12994L3198l8215M2072n9394
6274F11691P9947J04046M568j53901N7614k8672Q0493K13812j15141q5357n9353
6263G09747O9227M9757J08123j06778p2299N7366k0207o614j04821K62944k87578
6252F58867P2698j29031K8738J02992r9551j3460J72345j95339j7503M1173j17818
6241E04111R745J6347N0895l7315r0895j4710O1882P7223q9918Q784J44961N6041
$$ plain form
6319 371555 426075 323070 365784 364876 494396 445847 447737 469938 357882 502775 602582
6308 602582 557836 607865 639576 699971 700090 614746 433431 429009 534039 775540 821297 668885
6296 668885 662606 575507 758219 706750 614060 591537 619166 681060 579801 563539 602759
6285 602759 700007 793467 716917 658057 479051 521036 634030 667228 629013 671085 611691
6274 611691 691638 795684 800252 646351 703965 675293 755786 969598 854457 769100 709747
6263 709747 778974 828731 936854 830076 757777 815143 794936 788322 683501 946445 658867
6252 658867 731565 602534 631272 734264 634713 621253 793598 598259 580756 621929 504111
6241 504111 513856 530203 581098 543783 452888 438178 500060 577283 487365 496149 641110 697151
6229F97151R923R9622k52408K8109J44990j70172l9881n239J8772q107J4028J21158
6217F57946n8929L7889r1497J9235M4351o8042j8723J7163N9794K4731j16724
6206E07194J7366j70073j6563j08353K6652O0923k57599K08399k9980O9311M2766
6195C50043j13962l3175P4745q378J29080M2109O0660j45031j2360q3074o3912
6184A96745J18394K9155n0070p9150L8259J20416j19454K15500O354j35558j254
6173C39337L1525K694o5466M4193o5180l7019R7715j26522k7566m0993Q1184j1131
6161B22771O2741Q0783q363o4109P0504k3875o83O9864j04963J9816l6866R295
6149B96915q7934K16167K722j43790J03484q8746P6721p7380j06412J17770J22871
$$ plain form
6229 697151 707074 806696 554288 582397 727387 557215 517334 512095 530867 522760 536788 657946
6217 657946 599017 636906 545409 564644 608995 540953 522230 539393 599187 623918 507194
6206 507194 524560 354487 337924 229571 256223 317146 59547 267946 237966 307277 350043
6195 350043 236081 202906 277651 269273 398353 440462 501122 356091 343731 260657 196745
6184 196745 315139 344294 294224 215074 253333 373749 254295 469795 476149 340591 339337
6173 339337 370862 373556 308090 352283 287103 250084 347799 221277 193711 152718 233902 222771
6161 222771 285512 366295 357932 293823 364327 340452 339769 409633 304670 324486 287620 296915
6149 296915 208981 425148 427870 284080 387564 298818 375539 298159 191747 309517 432388
6138D32388N054J4768j4515l7431n0126O213P4237J04186J21065j45991q918r4891
6126D06039K5009J25216j12220p2099P7274O7111n4929j5417N7086N0024j0642
6115E42452m5598P003K0832n2851Q7919O2735j14359J8979j0118j643n7631j9482
6103D38238O7412j35039m3373P8354o759M1875J48257o3676k98M8254j01133m0406
6091D31706N1206N1258r1033J38826N3236j11308j62979o5878K6533O6618N1870
6080D40055M1135n0792l2571J40637K0286m3758K2719p2640L4991J85473M3615
6069G29150m0423j24134R6830M8688K7480n0805l837j9890k798M5698J3655P6577
6057G96191N3395J45227k825J09581q3766j76255M4032m6694J58520j00677J3027
$$ plain form
6138 432388 437442 452210 437695 400264 350138 356351 430588 534774 655839 509848 500930 406039
6126 406039 431048 556264 444044 371945 449219 516330 461401 445984 503070 553094 542452
6115 542452 496854 503857 524689 471838 559757 622492 508133 527112 516994 515351 457720 438238
6103 438238 505650 370611 327238 405592 398833 440708 588965 525289 524991 573245 472112 431706
6091 431706 482912 534170 443137 581963 635199 523891 360912 295034 321567 388185 440055
6080 440055 481190 430398 397827 538464 558750 514992 537711 465071 500062 685535 729150
6069 729150 688727 564593 661423 710111 737591 686786 682949 663059 660261 705959 719614 796191
6057 796191 849586 994813 991988 1101569 1017803 841548 885580 838886 997406 896729 909756
6046I09756J41886n72J63034l5090j79160J56087J41726m5814j9496J87616k7941
6035A392032K17499j3991l911k5464k1140J66132Q4809J30073j44061J3228L6131
6024A831337Q7083K6817l6603j23221J12615J98776J07647L7443k8373P1921J08924
6013B394366j69188l6636O1130J74741l2178p9113J20927P6523k0412O5964J94202
6002B750326O1891K9081M8640J39513J41251J23074J77915K46961J53388L65507
5992D237547K29188L14591N08603K72734M06549M51717O00171N89402P18321J184538
5982I513361R58135O43523N86528l7334j41953k11403m08815o77810j075645j001211
5972H147376p70425p75652o72673l71274l06077l73387j79502q0570r0584j60473
$$ plain form
6046 909756 1051642 1051070 1214104 1179014 999854 1155941 1297667 1251853 1232357 1419973 1392032
6035 1392032 1609531 1595540 1591629 1566165 1545025 1711157 1795966 1926039 1781978 1795206 1831337
6024 1831337 1918420 1945237 1908634 1785413 1898028 2096804 2204451 2241894 2213521 2285442 2394366
6013 2394366 2225178 2188542 2249672 2424413 2392235 2313122 2434049 2510572 2490160 2556124 2750326
6002 2750326 2812217 2841298 2889938 3029451 3170702 3293776 3471691 3718652 3872040 4237547
5992 4237547 4466735 4781326 5289929 5562663 5969212 6420929 7021100 7610502 8328823 9513361
5982 9513361 10471496 11115019 11701547 11664213 11522260 11310857 10902042 10224232 9148587 8147376
5972 8147376 7376951 6601299 5928626 5557352 5251275 4877888 4698386 4617816 4527232 4366759
5962D366759n0436l1228j18413N0170M0978p630M2309J44794J71532L5635K35013
5951D879483J80124J73665L16556L30618M22139P02254P96986O82315R34196P49856
5941A0168192K78757J90026m5955P929l43639o31543o29491j133929r41420q46206
5931F072721n35117m04304k77118l84424j91824j91767r5328k33839j20740K1363
5921C659623j41666J0590j61O5715j99689J9431o9963K1397O1134M9227P490P763
5909C490891m0323L0427p668J32726J03675r5690j09172J7329p1699k3910O6535
5898C493121n2097O7038J0891J00366j9229N7079O0861q646K03835P3744k5596
5887C961367O4824m0767J60612K78987M9060J01345J84942N6841J09442J82663
$$ plain form
5962 4366759 4316323 4285095 4166682 4216852 4257830 4250200 4292509 4437303 4608835 4644470 4879483
5951 4879483 5059607 5233272 5549828 5880446 6302585 7004839 7801825 8484140 9418336 10168192
5941 10168192 10446949 10636975 10591020 10598949 10255310 9623767 8994276 7860347 6918927 6072721
5931 6072721 5537604 5133300 4856182 4471758 4279934 4088167 3992839 3759000 3638260 3659623
5921 3659623 3517957 3528547 3528386 3594101 3394412 3413843 3343880 3365277 3426411 3475638 3483128 3490891
5909 3490891 3450568 3480995 3473327 3606053 3709728 3614038 3504866 3522195 3450496 3426586 3493121
5898 3493121 3441024 3508062 3518953 3619319 3600090 3657169 3718030 3709384 3913219 3986963 3961367
5887 3961367 4026191 3985424 4146036 4425023 4474083 4575428 4760370 4817211 4926653 5109316
5877E109316J08647K95435J03074K16043L43712K88924M30498K44402N29240P74470
5867H443761J061322J197829O35938M69059J76789n5253J96205m78134m97661
5858A1149855q55310j022399q17077o85899m94239l85875m23234k30737q0776
5849F154309k57912N3384l77645N9686j19537j36569p0176q6280q76n3991P0711
5838E235104Q5132j94999l3520P8033j39904o1515J8624j85260q2781J01203j81603
5827D638514R9712P2008j12477M9173J32559q0362K33774J08052R8045J54333
5817E393331N1430K36671J49782J33316L13909J90829K34357N69938M08413N39547
5807H221523Q18292Q54483Q00499L94778K57068j9118K6458r7103k91076n62121
$$ plain form
5877 5109316 5217963 5513398 5616472 5832515 6176227 6465151 6895649 7140051 7669291 8443761
5867 8443761 9505083 10702912 11338850 11807909 11984698 11929445 12125650 11647516 11149855
5858 11149855 10294545 9272146 8455069 7769170 7274931 6889056 6465822 6235085 6154309
5849 6154309 5896397 5949781 5572136 5631822 5512285 5375716 5305540 5219260 5218384 5164393 5235104
5838 5235104 5320236 5125237 5091717 5169750 5029846 4968331 4986955 4801695 4718914 4820117 4638514
5827 4638514 4738226 4810234 4697757 4746930 4879489 4799127 5032901 5140953 5238998 5393331
5817 5393331 5444761 5681432 5831214 5964530 6278439 6469268 6703625 7273563 7681976 8221523
5807 8221523 9039815 9894298 10694797 11089575 11346643 11327525 11353983 11256880 10965804 10403683
5797A0403683q39789q60442n90295l15314l47789k81788j00058j28864L56j7581
5787F922119k46533r1047N8758k33608l28738k5599Q9872j84596k16150m5978
5777E698500j17772K744M3315q7025J32695J07114R6955K7258K50438L38188R9176
5766F591586J55742K44261J95237J95077P1986Q7390R5546N3549K6956J87832
5756G905162K72395K3617O0630J02561K55388L42326L31903J88729K93398L90730
5746A0166839N70806N73294P18073P61452J072216J217504J354182J711584J716598
5737A9862548K018650K451694L063089L310908L055565K582026J476871j44430
5729C7676921j873880l162699l410210l577528k959913k539717k179887j759011
$$ plain form
5797 10403683 9563894 8703452 8113157 7797843 7450054 7168266 7068208 6939344 6939700 6922119
5787 6922119 6675586 6584539 6643297 6409689 6080951 6055352 6145224 5960628 5744478 5698500
5777 5698500 5580728 5583472 5626787 5539762 5672457 5779571 5876526 5903784 6154222 6492410 6591586
5766 6591586 6747328 6991589 7186826 7381903 7453889 7541279 7636825 7690374 7717330 7905162
5756 7905162 8177557 8201174 8261804 8364365 8619753 8962079 9293982 9482711 9776109 10166839
5746 10166839 10737645 11310939 12029012 12790464 13862680 15080184 16434366 18145950 19862548
5737 19862548 21881198 24332892 27395981 30706889 33762454 36344480 37821351 37676921
5729 37676921 35803041 32640342 29230132 25652604 22692691 20152974 17973087 16214076
5721A6214076j480144j438927j035494p33003p63834r06767n33353m63336l66494
5712H492724l38936k60278j36859m48772n08566l91953j67738l13174k88471l78274
5702E259703k84571j28631l17521l23701r7953k74215n4349j43579j03147K7676
5692C559712j10787j11852j2326m9756j91727q5720M6240j88975K7104k33088
5682B648825Q3341j21184J9476K7257l74860o2541L1515L832j3288m1594n2036
5671B148743N3993r7055p1067q2774j38594j8235j2278p2126o4325J4521j49484
5660A511319J4484l032m8816m2062j7900j6607q3285j06929o0582M5727J37209
5649A329526o6520j09983J47319j55403j24522K10816k14121J55967p5947n0485
$$ plain form
5721 16214076 14733932 13295005 12259511 11526508 10762674 9855907 9322554 8859218 8492724
5712 8492724 8153788 7893510 7756651 7307879 6799313 6407360 6239622 5926448 5637977 5259703
5702 5259703 4975132 4846501 4528980 4205279 4107326 3833111 3778762 3635183 3532036 3559712
5692 3559712 3448925 3337073 3324747 3274991 3083264 2997544 3043784 2854809 2881913 2648825
5682 2648825 2732166 2610982 2630458 2657715 2282855 2220314 2251829 2255661 2242373 2200779 2148743
5671 2148743 2202736 2105681 2034614 1951840 1813246 1795011 1782733 1710607 1646282 1660803 1511319
5660 1511319 1525803 1522771 1473955 1431893 1413993 1397386 1314101 1207172 1146590 1192317 1329526
5649 1329526 1263006 1153023 1300342 1144939 1020417 1231233 1017112 1173079 1097132 1046647
5639A046647O1329L3442l4000O5747p1364o8475j38928j50326Q4732P8521R4470
5628A001795j78144M2873Q2472n3972n963q0317j0437L9660K1267R801j34204
5617G34831L0698J39350O3329P1091K5462j46427k1918J8415j47361m3753K6604
5606G50321Q3877j5213j31103Q9760J40573K8395k47653L6244J76312K09767L0285
5595A151565j00072j2829K6683o8351j55903j69854J2919O2420Q8804k0686N9431
5584H74127o9729r1994M6635J18360k00332q7533Q9963R0474M8010o3714J25148
5573H79415r4085l7194r7987j44458J63464J4787K6561j61040M4603L0480J60865
5562G85411m6035o8400K799O1426J8047j51289j4415R3348P1535j04731l2698
$$ plain form
5639 1046647 1107976 1141418 1107418 1173165 1101801 1033326 894398 744072 828804 907325 1001795
5628 1001795 823651 866524 948996 895024 889061 808744 798307 837967 859234 869035 734831
5617 734831 765529 904879 968208 1039299 1064761 918334 896416 914831 767470 723717 750321
5606 750321 834198 818985 687882 777642 918215 946610 698957 735201 911513 1121280 1151565
5595 1151565 1051493 1038664 1065347 996996 841093 671239 684158 746578 835382 814696 874127
5584 874127 804398 712404 759039 877399 677067 589534 679497 769971 817981 754267 879415
5573 879415 785330 748136 650149 505691 669155 683942 710503 549463 594066 624546 785411
5562 785411 739376 670976 673775 735201 753248 601959 587544 680892 752427 647696 614998
5551F14998k0153P4984O9126l2677j7622L5760k3892J01957n9627n4607p48k7730
5539F59769p1389p4019P4708n4403M7081n0199M3314R3564J04403q4755K9260
5528G17334p5959j02837N0546J92425p5160K3897L7410m8355N8161m8573J4283
5517G43172Q4482j57154J14970M3436j62124J02238R6506k0214m3877J73253r162
5506I65526j47489M8286J72289N4971j09269p3536l3826J78436J64414l809j81152
5495A034841M0922J20200O965o3181l5168p1689J08525j03017o3501Q6068r0416
5484I70549M7106j61413R2338j6302N3487J30973O1412j40722O8868q518J35040
5473A232818N748M8030J51989Q5148k5281j17569L9403J50600j06166J16878R0643
$$ plain form
5551 614998 594845 669829 738955 706278 688656 724416 700524 802481 742854 688247 687499 659769
5539 659769 588380 514361 589069 534666 581747 531548 574862 668426 772829 688074 717334
5528 717334 641375 538538 589084 781509 706349 730246 767656 719301 777462 728889 743172
5517 743172 827654 670500 785470 828906 666782 769020 865526 845312 801435 974688 965526
5506 965526 818037 866323 1038612 1093583 984314 910778 876952 1055388 1219802 1215993 1034841
5495 1034841 1075763 1195963 1202928 1139747 1104579 1032890 1141415 1038398 974897 1060965 970549
5484 970549 1017655 856242 948580 932278 985765 1116738 1178150 1037428 1106296 1097778 1232818
5473 1232818 1238566 1286596 1438585 1523733 1498452 1380883 1420286 1570886 1464720 1581598 1672241
5462A672241j75356J8892r7794o5220J02751N506M0719J9793q1876O6386O0602
5451A566644j50803J23345j79943J194R5810L5234J19632R5948J38659J05065
5441A950785j55697P8380l8962M4644O438N534n7951n8807K6913m8121m7114j54421
5429A551621J12713k2415q7154n2369Q6144m9545K32849Q8998K1390Q4428O311
5418A972971M9320m1218m2018J37530J47706m880Q66j85412j02719j496P4643
5407B005293l8437L9558j0693j27399j23841J97854L1430j00582j25756O7251
5397A814678k2021M5530k2338J1769j09913P226J01521J5557N5450o3001j62742
5386A671716K8703J44142l30729j33031K03995j44380J28306j1199j86612N6159
$$ plain form
5462 1672241 1496885 1515777 1417983 1352763 1455514 1461020 1501739 1521532 1439656 1506042 1566644
5451 1566644 1415841 1539186 1359243 1360437 1456247 1491481 1611113 1707061 1845720 1950785
5441 1950785 1795088 1873468 1834506 1879150 1885588 1891122 1833171 1774364 1801277 1753156 1706042 1551621
5429 1551621 1664334 1641919 1554765 1502396 1588540 1538995 1771844 1860842 1882232 1966660 1972971
5418 1972971 2022291 1981073 1939055 2076585 2224291 2219411 2220277 2034865 1932146 1930650 2005293
5407 2005293 1966856 2006414 1995721 1868322 1744481 1942335 1973765 1873183 1747427 1814678
5397 1814678 1792657 1838187 1815849 1827618 1717705 1724931 1826452 1842009 1897459 1834458 1671716
5386 1671716 1700419 1844561 1513832 1380801 1584796 1440416 1568722 1557523 1370911 1427070
5376A427070j23428k9955n6904L4200O7588J14635M6933N1281j80268J89341m943
5365A535550j36Q419k5269n2371O0349P2117L8543q8569N4998o8072Q0731J2024
5353A628314q7117J39328K1820j18835k5520J32395J30084q2749q0220O0741J20142
5342A838383J19191p3584L2987J55167q5262J12682J32335j29864R301L5297P2181
5331B218814m9218J49890L7596j4232J21422n3494J45356K28765K41053N25012
5321C550964J80384J03477K83730K05813J41334k07165j31832j90651k52588j00074
5311C583392j30091m57880l6560N2487q6691l0662N3603o0062q9417p2006N5804
5300B781917n4579q2002j439N2923j45196K12606M7188o1038J85918J71512p8856
$$ plain form
5376 1427070 1303642 1273687 1216783 1250983 1318571 1433206 1480139 1531420 1351152 1540493 1535550
5365 1535550 1535414 1543833 1518564 1466193 1526542 1598659 1637202 1548633 1603631 1535559 1616290 1628314
5353 1628314 1541197 1680525 1702345 1583510 1557990 1690385 1820469 1737720 1657500 1718241 1838383
5342 1838383 1957574 1883990 1916977 2072144 1986882 2099564 2231899 2102035 2111336 2146633 2218814
5331 2218814 2169596 2319486 2357082 2342850 2464272 2410778 2556134 2784899 3025952 3550964
5321 3550964 3731348 3834825 4118555 4324368 4465702 4258537 4126705 3936054 3683466 3583392
5311 3583392 3453301 2995421 2958861 3011348 2924657 2893995 2947598 2887536 2798119 2726113 2781917
5300 2781917 2727338 2645336 2643897 2696820 2551624 2764230 2811418 2750380 2936298 3107810 3028954
5289C028954j96162Q973L0282P3063m5487l4546K2522Q0269q9433K04094P1492
5278C154021k8890q8149K34420O3811N318K17197J86084M6378J33515J79069J26999
5267D229773J22846K60401M5263J61991L48219K95385M34610L79003L21812M92093
5257G091396O91075O16199Q86850J055315J148332J510439J464776J357363P46538
5248A6568283j54616q16223j342028j469457j511636j227303r80800q59947o97174
5239G509099m66204m58815l09434m01972l26833l5163m397j78871j60644J6623
5229E183389j38034j88265p2017r7812j85338j05356j83834J112j01129J8112
5219D130828j1950P6054o7507j36003K67848p2196K7690k1326J25251q850j04017
$$ plain form
5289 3028954 2832792 2841765 2872047 2945110 2899623 2865077 2887599 2967868 2878435 3082529 3154021
5278 3154021 3125131 3036982 3271402 3335213 3340531 3557728 3743812 3790190 3923705 4102774 4229773
5267 4229773 4352619 4613020 4658283 4820274 5168493 5463878 5898488 6277491 6599303 7091396
5257 7091396 7782471 8398670 9285520 10340835 11489167 12999606 14464382 15821745 16568283
5248 16568283 16413667 15597444 14255416 12785959 11274323 10047020 9066220 8206273 7509099
5239 7509099 7042895 6584080 6274646 5872674 5545841 5510678 5506281 5327410 5166766 5183389
5229 5183389 5045355 4857090 4785073 4687261 4501923 4396567 4212733 4213845 4112716 4130828
5219 4130828 4118878 4194932 4127425 3991422 4259270 4187074 4214764 4193438 4318689 4309839 4205822
5208D205822j57235J62217q9226k1248L3614l761P6418J5229J779j28467m1084
5197D054058j18433M1261J745O0310O2527m1026l2886j8954j18612L0749J78121
5186D098860q1414k21894J13832l3102O2151N9742J09153J1290l0423m9148q2148
5175C956899n4355J10543N956R1575R1441J37614O1283J70067J9325k860P4357
5164D661845n6990P2129j0473J26179q5375J19139N2346j45898K232Q7060J28743
5153D950937j64121j40146o1725K28968N311l7728l1418J38376J20659J8581q6035
5142D941659R8419K57881N5732n7042p4838K78598J97611L3526J15539J27520
5132E974605K55955N0078J43127O7670M6504J96886J54308Q6171M7830K02283
$$ plain form
5208 4205822 4048587 4210804 4121578 4100330 4133944 4130183 4206601 4221830 4223609 4095142 4054058
5197 4054058 3935625 3976886 3978631 4038941 4101468 4060442 4027556 4008602 3889990 3920739 4098860
5186 4098860 4017446 3795552 3909384 3876282 3938433 3998175 4107328 4118618 4088195 4039047 3956899
5175 3956899 3902544 4013087 4019043 4110618 4202059 4339673 4400956 4571023 4590348 4587488 4661845
5164 4661845 4604855 4676984 4666511 4792690 4707315 4826454 4878800 4732902 4735134 4822194 4950937
5153 4950937 4786816 4646670 4584945 4813913 4819224 4781496 4750078 4888454 5009113 5027694 4941659
5142 4941659 5040078 5297959 5353691 5296649 5221811 5500409 5698020 5731546 5847085 5974605
5132 5974605 6230560 6280638 6423765 6491435 6537939 6734825 6889133 6975304 7023134 7225417
5122G225417K66111J54358K74308K79403J93284K86126K82742K35007J19608L30047
5112I646411L79820K74372L57174M07201K96384L48292M92225L38736M91868L94990
5102A3427473N08042O44068N39212O71796O09810O34637O44662O77431P29123
5093A9086254J039160P05436R17260R54040J032811J042638J210761J215343J268724
5084B8472427J363399J633249J743930J565649J959263K366354K564472K761551
5076D4430294L136935L602205M297980M905454O244310P769214R116918R714110
5068I3217420N667455K446832p74870l548213k847489m08776K259860M372468
5060A00384687N737098L984381M124675L778010M044182N942075N745740K685991
$$ plain form
5122 7225417 7491528 7645886 7920194 8199597 8392881 8679007 8961749 9196756 9316364 9646411
5112 9646411 10026231 10300603 10657777 11064978 11361362 11709654 12201879 12540615 13032483 13427473
5102 13427473 13935515 14579583 15118795 15790591 16400401 17035038 17679700 18357131 19086254
5093 19086254 20125414 20830850 21748110 22702150 23734961 24777599 25988360 27203703 28472427
5084 28472427 29835826 31469075 33213005 34778654 36737917 39104271 41668743 44430294
5076 44430294 47567229 51169434 55467414 60372868 66617178 74386392 83503310 93217420
5068 93217420 98884875 101331707 100556837 97008624 94161135 93752359 96012219 100384687
5060 100384687 106121785 110106166 114230841 118008851 122053033 127995108 133740848 136426839
5052A36426839o78775l825160n131599l592393l5247Q06468k86190m3823j605253
5043A22034867j155008J057758L348011N974777O263852O81495l747791q083547
5035A26374414j1700781j0901182q090913o221664n159023m401673l823942k948239
5027G3126997j969271j129294m05917K63817J50425m78006j106094j980028k776102
5018F3696527k879377l257314l284171k922602k653948k198989j709573j591373
5010D3199180j480138j458708j401384j331219j004703m76129k13272k16156r5137
5001C5522334j33605k38454o02219q32876p45678j156779r43603n11799p57366
4992B9599955k99205k68736k76589K0969p5216J01198J74028M74192M04145M87140
$$ plain form
5052 136426839 135748064 131922904 126791305 123198912 123163665 123970133 123683943 123640120 122034867
5043 122034867 120879859 121937617 125285628 131260405 137524257 138205752 134457961 126374414
5035 126374414 114673633 103772451 95681538 89459874 84300851 79899178 76075236 73126997
5027 73126997 71157726 70028432 69622515 69886332 70036757 69558751 68452657 66472629 63696527
5018 63696527 60817150 57559836 54275665 51353063 48699115 46500126 44790553 43199180
5010 43199180 41719042 40260334 38858950 37527731 36523028 36046899 35833627 35617471 35522334
5001 35522334 35388729 35150275 34548056 33715180 32969502 31812723 30869120 30357321 29599955
4992 29599955 29300750 29032014 28755425 28776394 28701178 28802376 28976404 29450596 29854741 30341881
4982C0341881P74995P95469R43663J012084J280566J402042J902986K151413K690173
4973D3295272K795950K500475J977436J432054J093078Q27922J199577J365000
4965E6486764J445941J477271J265139J037809J144950J625771J698170K377048
4957F8558863K577311J742702J066595M25745j58615l32662j98588r75524j816708
4948G0889119j838967j847049j201731j90250N38037Q52226Q06450L32331n2559
4939F8287607j00046M1956L65436M53133o13397j949149l631562m645551m955215
4930E3253212m532885l824954l159781k473284k091349j561262j287030q47643
4922C3475024n37717j53642J97277M73810L37666J97403l66251p56492j709276
$$ plain form
4982 30341881 31116876 31912345 32856008 33868092 35148658 36550700 38453686 40605099 43295272
4973 43295272 46091222 48591697 50569133 52001187 53094265 53922187 55121764 56486764
4965 56486764 57932705 59409976 60675115 61712924 62857874 64483645 66181815 68558863
4957 68558863 71136174 72878876 73945471 74371216 74212601 73879939 73681351 72705827 70889119
4948 70889119 69050152 67203103 66001372 65811122 66349159 67201385 68007835 68340166 68287607
4939 68287607 68187561 68229517 68594953 69048086 68434689 66485540 62853978 58208427 53253212
4930 53253212 48720327 44895373 41735592 39262308 37170959 35609697 34322667 33475024
4922 33475024 32937307 32783665 32980942 33454752 33792418 33989821 33623570 32867078 31157802
4913C1157802k095664k094621j941807j669994j428140j127018j108751q16527
4905A8875280r74285p37226p48244n44725l19892n27993m26939l02398m57768
4896A3835810k79038l21843k96765j97067j78212l36674l67935j90979k46162
4887A1421135k51207k09139j22525j09279k52475j47996o7892j21539n9512j16091
4877I963480k5622q9843j82835q8030j47195j52379P8576Q5573j53219j50579
4867I137927j19839k8438l0223J5945J23737n7994o4385M5361R185J71991m7880
4856I155387L9290K7094r0652J22511J02976k9257Q8253N4291j27340k6920p967
4845I307666o128r0652K5834j799j3751j54910N7091Q4714j49716k9514P7461
$$ plain form
4913 31157802 29062138 26967517 25025710 23355716 21927576 20800558 19691807 18875280
4905 18875280 17900995 17163769 16415525 15870800 15550908 15022915 14595976 14293578 13835810
4896 13835810 13556772 13234929 12938164 12741097 12562885 12226211 11858276 11667297 11421135
4887 11421135 11169928 10960789 10838264 10728985 10476510 10328514 10260622 10139083 10079571 9963480
4877 9963480 9937858 9848015 9665180 9577150 9429955 9277576 9356152 9441725 9288506 9137927
4867 9137927 9018088 8989650 8959427 8975372 9099109 9041115 8976730 9022091 9031276 9203267 9155387
4856 9155387 9194677 9221771 9131119 9253630 9356606 9327349 9415602 9469893 9342553 9315633 9307666
4845 9307666 9301538 9210886 9236720 9234921 9221170 9066260 9123351 9208065 9058349 9028835 9106296
4834I106296O272p6276M8057J56294l12448j25889O2219j971l0932j9541j286
4823H810795q768j17005j45682N4312j8517j44268J9030J08803J63902M4841r8064
4812H669379J19628r2701K0308q1571k5149Q085L6459J06032r3732o7955O1618
4801H660401J27207J22136M654R5140j17737j15341j05367M4485J03641j28939
4791H690280r3711J08102J31539J21302j02522J03607J36178J94264j4350L3597
4781I308286J88253J5232J00325k6861J12864l2117M9506p1503R6409q530n8631
4770I673233L7189J29751l440J83181J15930k6158m5784P476J36372J61963p2193
4759A0297520o3201N4372J02317J26441K64490L1852J48931J37212K63199J61076
$$ plain form
4834 9106296 9112568 9036292 9084349 9240643 8928195 8802306 8864525 8862554 8831622 8812081 8810795
4823 8810795 8802027 8685022 8539340 8593652 8575135 8430867 8449897 8558700 8722602 8767443 8669379
4812 8669379 8789007 8696306 8716614 8635043 8609894 8617979 8654438 8760470 8666738 8598783 8660401
4801 8660401 8787608 8909744 8914398 9009538 8891801 8776460 8671093 8715578 8819219 8690280
4791 8690280 8596569 8704671 8836210 8957512 8854990 8958597 9094775 9289039 9274689 9308286
4781 9308286 9496539 9511771 9612096 9585235 9698099 9665982 9715488 9643985 9740394 9731864 9673233
4770 9673233 9710422 9840173 9836733 10019914 10135844 10109686 10063902 10071378 10207750 10369713 10297520
4759 10297520 10234319 10288691 10391008 10517449 10781939 10813791 10962722 11099934 11363133 11524209
4749A1524209K99730L35855J72482K88124J09959J52791K66764K79932L48923
4740A3778769M47599M02283L47913L54194K43118P1855j9780J71137L50759K06766
4730A6354613J69841J7611M7554k798k4467J32423L11532L06280L56139M37721
4720A8106449N95110O15543O11858M09480J59836L13827K45482K06333L75110
4711B1639028O73157N74961N30777O19457N18764K94173Q1688L82552K09446K77258
4701B5801261M85905N96695O75553P73116Q30154R27362R92719J197585J076635
4692C3356985J316518J393568J475382J839406J749159K135498J864483J643516
4684D6774515J844246J661514J679598J961601K399549K632725L087180L281959
$$ plain form
4749 11524209 11823939 12159794 12332276 12620400 12730359 12883150 13149914 13429846 13778769
4740 13778769 14226368 14628651 14976564 15330758 15573876 15645731 15625951 15797088 16147847 16354613
4730 16354613 16524454 16542065 16589619 16586821 16562354 16694777 17006309 17312589 17668728 18106449
4720 18106449 18701559 19317102 19928960 20338440 20498276 20812103 21057585 21263918 21639028
4711 21639028 22312185 22887146 23417923 24037380 24556144 24850317 24932005 25314557 25524003 25801261
4701 25801261 26287166 26883861 27559414 28332530 29162684 30090046 31082765 32280350 33356985
4692 33356985 34673503 36067071 37542453 39381859 41131018 43266516 45130999 46774515
4684 46774515 48618761 50280275 51959873 53921474 56321023 58953748 62040928 65322887
4676F5322887L484687L609152M355557M734695N589156O830731Q334743R766906
4668A12028514J0903186Q500386K988547j43084l923797n055366k877419K80101
4660A22701068L063990M550976L075295K654944K196073K211663M874548P496599
4652A52825156P390016L891426J071274j606497k870349q35051j01586j793189
4644A57971200k301518m110435l833768j594882J164140L249769M795212K823744
4636A58163462j565181m419654p550439q135030o099160l839732k458369k124953
4628A21970944k228944k535139k591566k177646j664754j154936j399858j877666
4620A06340435k698363l234807l140839k519693j694114j305063j123882r68372
$$ plain form
4676 65322887 68807574 72416726 76772283 81506978 87096134 93926865 102261608 112028514
4668 112028514 122931700 131432086 134420633 134277549 130353752 125298386 122420967 122701068
4660 122701068 125765058 130316034 133391329 136046273 138242346 140454009 145328557 152825156
4652 152825156 160215172 164106598 165177872 163571375 160701026 159865975 159764389 157971200
4644 157971200 155669682 151559247 147725479 146130597 147294737 150544506 155339718 158163462
4636 158163462 156598281 152178627 144628188 136493158 130393998 126554266 124095897 121970944
4628 121970944 119742000 117206861 114615295 112437649 110772895 109617959 108218101 106340435
4620 106340435 103642072 100407265 97266426 94746733 93052619 91747556 90623674 89655302
4612H9655302j200488j572510j927930k273140k220156j794266r53101m64739
4604G7248972R9652L63891q0375j75717K3937J4180n9600J54450j73978q91431
4594G6523981j522250k143427k635053k751500k655776k682887k572143k296884
4586E7264061k193744j949328j487404j548259j630231j312850j066959o82071
4578D5393215l79783r2371k2288q1051m7150o4034n5382j06912J57361L58035
4568D5059640P65008Q04494J027978J210134J428809J418790J262905R32274P25761
4559E4635793O68992N68122Q20937J009855J096314J608154J698306J984263K379514
4550F6470250K778536K789596L162741L439838L286812L370384L155770K160665
$$ plain form
4612 89655302 88454814 86882304 84954374 82681234 80461078 78666812 77713711 77248972
4604 77248972 77348624 77712515 77632140 77456423 77480360 77494540 77434940 77589390 77415412 76523981
4594 76523981 75001731 72858304 70223251 67471751 64815975 62133088 59560945 57264061
4586 57264061 55070317 53120989 51633585 50085326 48455095 47142245 46075286 45393215
4578 45393215 45013432 44921061 44898773 44817722 44770572 44706538 44651156 44544244 44701605 45059640
4568 45059640 45824648 46629142 47657120 48867254 50296063 51714853 52977758 53910032 54635793
4559 54635793 55304785 55872907 56693844 57703699 58800013 60408167 62106473 64090736 66470250
4550 66470250 69248786 72038382 75201123 78640961 81927773 85298157 88453927 90614592
4542I0614592J401789N15682j02488m44627m18825q4815r4655M49093J153018
4533I2988764J462099J935850K924933L420466M172490L866308K333814Q50533
4525A13955257j269290k808171l366757l448441l451336l479911l586739l879093
4517H8665519l721608l367362k408830j394714p69434j504787k239507k971316
4509G0287961l279842l001138k643253k322501k272853k438720k201103j957844
4501E0170707j153475n70765p4778n5898q07322j327363k316760k445596k335761
4492C9082989k047966k059519j759583j384027j499257j094997r86837o84155
4484B7566648o29784o71622n12461q44092q11499q29824q18396n89705p57590
$$ plain form
4542 90614592 92016381 92532063 92429575 91984948 91566123 91481308 91386653 91835746 92988764
4533 92988764 94450863 96386713 99311646 102732112 106904602 110770910 113104724 113955257
4525 113955257 112685967 109877796 106511039 103062598 99611262 96131351 92544612 88665519
4517 88665519 84943911 81576549 79167719 77773005 77003571 75498784 73259277 70287961
4509 70287961 67008119 64006981 61363728 59041227 56768374 54329654 52128551 50170707
4501 50170707 49017232 48446467 48371689 48315791 47508469 46181106 43864346 41418750 39082989
4492 39082989 37035023 34975504 33215921 31831894 30332637 29237640 28250803 27566648
4484 27566648 26936864 26265242 25752781 24908689 24097190 23267366 22448970 21859265 21101675
4475B1101675n65079m07841m89940l35170k03053m36298l43232m34344m57594
4466A7429124p15284l67399m18061n42861l84168l67633l42894m25907l65198
4457A3499719l60758k40136K4554k16997k5703m22055j71078k10408k00561k92587
4447A1383990o9551j43719r0522j40981l05198j24785j20954j36630j05353q3619
4437A0062678n7070k40407n0904k70625k3765N1496k39094o7086j07969r1567
4427H965687j7178L4080l0664j4770l11104O183l6892j9476k65432r5419r8548
4416H116467L6835N580o5870R9748J3326p4780K39779J30868J31350J50847M0220
4405H824370J36227J72697K36717K75210K56466M07694J06769k7174j95484j78836
$$ plain form
4475 21101675 20536596 20128755 19638815 19303645 19100592 18664294 18321062 17886718 17429124
4466 17429124 16713840 16346441 15928380 15385519 15001351 14633718 14290824 13864917 13499719
4457 13499719 13138961 12898825 12923379 12706382 12680679 12258624 12087546 11877138 11676577 11383990
4447 11383990 11314439 11170720 11080198 10939217 10634019 10509234 10388280 10251650 10146297 10062678
4437 10062678 10005608 9765201 9714297 9443672 9419907 9471403 9232309 9165223 9057254 8965687
4427 8965687 8948509 8982589 8951925 8937155 8626051 8632234 8595342 8575866 8310434 8215015 8116467
4416 8116467 8153302 8158882 8093012 8192760 8206086 8131306 8371085 8501953 8633303 8784150 8824370
4405 8824370 8960597 9133294 9370011 9645221 9901687 10309381 10416150 10388976 10193492 10014656
4395A0014656k36033k62506J0421o7922K6758o5937M9632N0505J21688J04521
4385I745783O1941K16722M19104J66333K45861K60564l3737Q9687k86235j77286
4375A0708737k59913m43767l52395k51710k35305k06360j50103k11401p4707k64924
4365H258152J9506m4186R028l6949k46938O7637j5725N5627m8350j9576m4263
4354G953963j86029n0668J07931O2734J20157p3157L44345J3499n9686J64649
4344H397738n4653k90276O096q7771K6825k23007j9510j05937k4137p6476m7842
4333G501050m8226M42P139J09395j00083R9631o8045J95761J45584O0192N9862
4322G962702m5814N0720j6425N6976J12202j7386M9150Q9871m1700r6237J54448
$$ plain form
4395 10014656 9778623 9516117 9526538 9458616 9485374 9419437 9469069 9519574 9641262 9745783
4385 9745783 9807724 10024446 10443550 10609883 10855744 11116308 11082571 11172258 10886023 10708737
4375 10708737 10448824 10005057 9652662 9400952 9165647 8959287 8809184 8597783 8523076 8258152
4365 8258152 8277658 8233472 8242500 8205551 7958613 8026250 8010525 8066152 8017802 7998226 7953963
4354 7953963 7767934 7717266 7825197 7887931 8008088 7934931 8279276 8292775 8233089 8397738
4344 8397738 8343085 8052809 8058905 7971134 7997959 7774952 7755442 7649505 7625368 7548892 7501050
4333 7501050 7452824 7453266 7460405 7569800 7469717 7569348 7501303 7697064 7842648 7902840 7962702
4322 7962702 7916888 7967608 7951183 8008159 8120361 8102975 8152125 8241996 8200296 8104059 8258507
4311H258507J20455J56237m7840J31508N7611P5572n8716n8849j76811q1887M1640
4300H417427r2846n2525m2033J036o6821K2130l15101j26649k11273k41900m8200
4289G243245n3289K2398j07693p0208j84413L2957o818R2271q225J04826r2069
4278F972982J48847Q494O101L87160N5601J84801k2969L7946J08117l039m7478
4267G836563J87476M7334J41142O4574Q5021Q341K30631o4110J88456R8245L712
4256H827385M3193K1642R0056K25480P5474O9919J89064L13549J35930M24387
4246A0416079J62241L15399K79504O41436N05211N16892M22608M35127M00099
4237A4094596N02473J92690J77610L7600J29360L4026J84997K42776K62871K12337
$$ plain form
4311 8258507 8378962 8535199 8487359 8618867 8676478 8752050 8693334 8634485 8457674 8375787 8417427
4300 8417427 8324581 8272056 8230023 8231059 8164238 8186368 7871267 7744618 7533345 7291445 7243245
4289 7243245 7189956 7212354 7104661 7034453 6850040 6882997 6876179 6968450 6960225 7065051 6972982
4278 6972982 7121829 7130323 7136424 7523584 7579185 7763986 7741017 7778963 7887080 7884041 7836563
4267 7836563 8024039 8071373 8212515 8277089 8362110 8370451 8601082 8536972 8725428 8823673 8827385
4256 8827385 8870578 8892220 8982276 9207756 9283230 9353149 9542213 9855762 9991692 10416079
4246 10416079 10578320 10893719 11173223 11814659 12319870 12836762 13259370 13694497 14094596
4237 14094596 14597069 14789759 14967369 15004969 15134329 15168355 15353352 15596128 15858999 16071336
4227A6071336L02300L01512N04687M9353L82636J86597M25263K83853N81629N13039
4217A9602205Q76185R56125J097657J231756J404679J184185Q15920O59999Q60549
4208B8689260O46178R15141N54532P89151P84759R43381R25527R61738O40042
4199C5849709Q68651Q73386R84713P91521J345243J094526J399598J165251J650055
4190D6022653J531881K064501K169639K322334K352583K749997K549245L228054
4182F4990887L227164L517058L751507M365636M372591N107651N630843P133140
4174A02096477P829721R760509J1017425J3093407J4644088J8587003K3156767
4167B00185397L3783335M2089453N9028732N2776236K935784j0279815m6451210
$$ plain form
4227 16071336 16373636 16675148 17179835 17229188 17611824 17798421 18223684 18507537 19089166 19602205
4217 19602205 20478390 21434515 22532172 23763928 25168607 26352792 27168712 27828711 28689260
4208 28689260 29335438 30250579 30805111 31594262 32379021 33322402 34247929 35209667 35849709
4199 35849709 36718360 37591746 38576459 39367980 40713223 41807749 43207347 44372598 46022653
4190 46022653 47554534 49619035 51788674 54111008 56463591 59213588 61762833 64990887
4182 64990887 68218051 71735109 75486616 79852252 84224843 89332494 94963337 102096477
4174 102096477 109926198 119686707 130704132 143797539 158441627 177028630 200185397
4167 200185397 233968732 276058185 335086917 387863153 390798937 380519122 334067912
4160C34067912o2336403m8869061l4765950k5252498k0030121j4942321j2008924
4153A15862634r573270r193155p310529o644732n515737m962439l883476l383975
4145F5395321k925604k932166k120751j922306j271290j301728p50949o62522
4137E1508005l20775l28574J44523m8239J68827j36289j0406o5002J44820p3262
4127E0983628M72859M81279O50638O59206J654621J787492K712940K575942L924596
4118F5903201M065052N432130O503639R234056J0773912J5427472J0421659n32925
4110A27228196m548682j3880008j5194275j2113941q747600o839304n268370l789274
4102E6846742l009276k204171j688326j150624r81248q98277j087174r97954r70213
$$ plain form
4160 334067912 271731509 222862448 188096498 162844000 142813879 127871558 115862634
4153 115862634 106289364 97096209 89785680 83140948 77625211 72662772 68779296 65395321
4145 65395321 62469717 59537551 57416800 55494494 54223204 52921476 52170527 51508005
4137 51508005 51187230 50858656 51003179 50954940 51123767 50987478 50977072 50912070 51056890 50983628
4127 50983628 51456487 51937766 52588404 53247610 54902231 56689723 59402663 61978605 65903201
4118 65903201 69968253 75400383 81904022 91138078 101911990 117339462 127761121 127228196
4110 127228196 122679514 108799506 93605231 81491290 72743690 65904386 60636016 56846742
4102 56846742 53837466 51633295 49944969 48794345 47813097 46914820 45827646 44829692 43859479
4093D3859479j097387r37522n97257n61027l23088l25240k09549P9430K87556
4084D0175395M13442J063049J281346J717654K053561K647734L283637M063968
4076E6699786M697332M528535J407772j55085k414632l947730l358526k097008
4068E5360444j720989j772185j246466j359215j141922r83402p06886l20108J22159
4059D6231430O3436L90889P46731O57146P46067R69313J404534J476677K023083
4050E4709306K254357K477805K720070K820514L206451L376425L402559L123983
4042G8091470K192159J431204Q52991p4375k61316J17477R8828N96803J078467
4033H4123708J256450P16149N92143J06991l70894j5848J04782O13850O53316
$$ plain form
4093 43859479 42762092 41824570 41227313 40666286 40343198 40017958 39808409 39887839 40175395
4084 40175395 40588837 41651886 42933232 44650886 46704447 49352181 52635818 56699786
4076 56699786 61397118 65925653 67333425 67178340 64763708 60815978 57457452 55360444
4068 55360444 53639455 51867270 50620804 49261589 48119667 47136265 46429379 46109271 46231430
4059 46231430 46294866 46685755 47432486 48089632 48835699 49805012 51209546 52686223 54709306
4050 54709306 56963663 59441468 62161538 64982052 68188503 71564928 74967487 78091470
4042 78091470 80283629 81714833 82567824 82493449 82232133 82349610 82448438 83045241 84123708
4033 84123708 85380158 86096307 86688450 86795441 86424547 86408699 86513481 87127331 87780647
4024H7780647R96296R43960J159032Q90057O12319N33821K14579J58991N17300
4015I3807002J015581J936412L301129N135674P276861J0487220J2798904J7073628
4007A52832411J4933658K701572o65470q159352j0557464m740564k67034n726469
3999A40351288q327390j1842560j5327949j2535849r874113p128437n845609m326492
3991F5142889l711822k898145k570035k501214k452385j721319j751986j226143
3983D6309840j220981p90985o25910n16361m85264j71711l72731m79226o79900
3974D0966771p50660p11622l89930l13755k39541L4277L70603M96556N46894O92966
3964D0702559O98561J77607J16062l23537l86115n64304l55131j91405L76681
$$ plain form
4024 87780647 88776943 89720903 90879935 91769992 92382311 92916132 93130711 93289702 93807002
4015 93807002 94822583 96758995 100060124 105195798 112472659 122959879 135758783 152832411
4007 152832411 167766069 170467641 169802171 161642819 151085355 146344791 146077757 140351288
3999 140351288 132023898 120181338 104853389 92317540 82443427 75314990 69469381 65142889
3991 65142889 61431067 58532922 55962887 53461673 51009288 49287969 47535983 46309840
3983 46309840 45088859 44297874 43671964 43155603 42670339 42498628 42125897 41646671 40966771
3974 40966771 40216111 39504489 39114559 38800804 38561263 38595540 38966143 39462699 40009593 40702559
3964 40702559 41401120 41578727 41694789 41371252 40985137 40420833 40065702 39874297 40250978
3955D0250978L26770O66303P65186P55336J005348P45971K30367K02230l34184
3946D4614305l79465l97647m76959n29613k61574L5120J15396J24496O95387O62353
3936D4201799P14757P53712J119374R41769J178855J782360K086225K875978K825169
3927E8479998M93963q06522k637757l936589m158030l535849k753666k309490
3919C8836058j953904j978519j786571j402508j380817j389808j221158j236492
3911B6486281j000927r78299r13753o96002p81253n53916p62853o70129n18502
3902A9610647m63441m56362m54306m37602o95099m05585j63578m24858m65541
3893A5644275l58514l39498l12024l63231m8966j31039l14858k00090k23473k67314
$$ plain form
3955 40250978 40577748 41244051 42009237 42764573 43769921 44515892 44746259 44948489 44614305
3946 44614305 44234840 43837193 43360234 42830621 42569047 42604167 42719563 42844059 43539446 44201799
3936 44201799 44916556 45670268 46789642 47731411 48910266 50692626 52778851 55654829 58479998
3927 58479998 58973961 58167439 55529682 51593093 47435063 43899214 41145548 38836058
3919 38836058 36882154 34903635 33117064 31714556 30333739 28943931 27722773 26486281
3911 26486281 25485354 24507055 23593302 22897300 22116047 21562131 20799278 20129149 19610647
3902 19610647 19147206 18690844 18236538 17798936 17103837 16698252 16534674 16109816 15644275
3893 15644275 15285761 14946263 14634239 14271008 14222042 14091003 13776145 13576055 13352582 13085268
3883A3085268j25878N0656j67740j25143j07455J79536m9122J20664J71515J03288
3873A3135589j1500N6644J69314n735Q6174K06589K614K30607K39837L10568L43206
3862A4763907J68961Q9342L29130M31429L99774L91275M30258L69898N03368N18076
3852A8395418L53463N52062M82501Q69918N81625O50968P82652R31048R08329
3843B4507984J001310R00214J087973J067566J450827J546177J795030J832891
3835C5189972K041345J687480J877464K145997K475946L088608L806938M298489
3827E6612239L973785K706931J761023R90142J060858K168266L078810M403826
3819G6755880N449149O422300P684605Q266543Q215718M479748m53254m876304
$$ plain form
3883 13085268 12959390 13010046 12842306 12717163 12609708 12789244 12740122 12860786 13032301 13135589
3873 13135589 13124089 13180733 13350047 13344312 13430486 13637075 13639689 13870296 14110133 14420701 14763907
3862 14763907 14932868 15022210 15351340 15782769 16182543 16573818 17004076 17373974 17877342 18395418
3852 18395418 18748881 19300943 19783444 20653362 21234987 21885955 22668607 23599655 24507984
3843 24507984 25509294 26409508 27497481 28565047 30015874 31562051 33357081 35189972
3835 35189972 37231317 38918797 40796261 42942258 45418204 48506812 52313750 56612239
3827 56612239 60586024 63292955 65053978 66044120 67104978 69273244 72352054 76755880
3819 76755880 82205029 88627329 96311934 104578477 112794195 117273943 116820689 111944385
3811A11944385q505247r517020q228956o485670m693517l549700k188932j391398
3803F7383945o73920L4558P19732J903984K712924L479400M394007M209328K354630
3794H6518588j32994k900317n009192n909484n878997n287184m313460l822233
3786E3264727l096967k228141j914734j144016r85599k88882K92142J93797j52366
3777D3939961p95318j644664k258804k210206j929802j677612j394550r24333
3769C1104672j010768q41771p33643r31400o56568o57838n86608m27715k84825
3760B4973536k91597l73946l59265k04500k8489j11176K94311J66187J25753L35534
3750B4526348O61237R62802J325224J437823J667298J524129J350605N82762j30939
$$ plain form
3811 111944385 103439138 93922118 85693162 79207492 74513975 70964275 68775343 67383945
3803 67383945 66710025 66744583 67464315 69368299 72081223 75560623 79954630 84163958 86518588
3794 86518588 86385594 83485277 78476085 72566601 66687604 61400420 57086960 53264727
3786 53264727 50167760 47939619 46024885 44880869 43895270 43606388 43898530 44092327 43939961
3777 43939961 43144643 41499979 39241175 37030969 35101167 33423555 32029005 31104672
3769 31104672 30093904 29252133 28518490 27587090 26930522 26272684 25686076 25258361 24973536
3760 24973536 24681939 24307993 23948728 23744228 23715739 23604563 23898874 24065061 24190814 24526348
3750 24526348 25187585 26150387 27475611 28913434 30580732 32104861 33455466 34038228 33907289
3741C3907289o27208p17956q34036q81027o99082r76148p54793r33160p35175
3732B6748704o54444o35950k98019j10939l971N1507l9021J36441Q7141J78263
3722B5459712K47740K59642N72063N52561N93850P01380P99335J009634J128808
3713C1324725J089121J324244J264911J010953J005184Q48765O82489N80795O06570
3704C9737757L95475N73174Q95594J071409J512494J954635K343658K728126L379732
3695E4592054L748129M553602N500882O923027Q463022R522888Q883896M609973
3687A06797473q21243n673708r253148r685364q074123o343126m939783m241005
3679E7765973l682795l442295l465010l303582k982119k561778k457704k096610
$$ plain form
3741 33907289 33280081 32562125 31728089 30847062 30147980 29171832 28417039 27483879 26748704
3732 26748704 26094260 25458310 25160291 25049352 25045381 25096888 25057867 25194308 25281449 25459712
3722 25459712 25707452 25967094 26539157 27091718 27685568 28386948 29186283 30195917 31324725
3713 31324725 32413846 33738090 35003001 36013954 37019138 37867903 38550392 39131187 39737757
3704 39737757 40133232 40706406 41602000 42673409 44185903 46140538 48484196 51212322 54592054
3695 54592054 58340183 62893785 68394667 75317694 83780716 93303604 102187500 106797473
3687 106797473 105976230 100302522 91049374 81364010 73289887 66946761 62006978 57765973
3679 57765973 54083178 50640883 47175873 43872291 40890172 38328394 35870690 33774080
3671C3774080j962369j598738j745285j454523j192622j244770j113314r10190
3663B2552269j021334p94945p90178q71807r27187p97625o50332l68031n57770
3654A5773060m99281m42533m39700k10187l02825m63828j48292l0448j69078l57880
3644A2709008j35657m1567j32168p5084j97405l12752k27009m76650m20963k96459
3634A0393294l80929l19177m41162q8946o7239m34805n1834j9635j38573j33478
3624H317516j26485K1693k49147r905K9484O685j4600K5289R7751Q1520M6186
3613H225987K20137J53740J92113j9961k66353j74503k45260J87117J86651P3476
3603H533144K83921r22j28987j00849k50895j72599k26096K1113j02818j0436
$$ plain form
3671 33774080 31811711 30212973 28467688 27013165 25820543 24575773 23462459 22552269
3663 22552269 21530935 20735990 19945812 19074005 18146818 17349193 16698861 16330830 15773060
3654 15773060 15273779 14831246 14391546 14181359 13878534 13414706 13266414 13235966 13066888 12709008
3644 12709008 12573351 12531784 12399616 12324532 12127127 11814375 11587366 11110716 10689753 10393294
3634 10393294 10012365 9693188 9252026 9163080 9095841 8661036 8609202 8589567 8450994 8317516
3624 8317516 8191031 8212724 7963577 7953672 7983156 7989841 7975241 8000530 8098281 8179801 8225987
3613 8225987 8446124 8599864 8791977 8772016 8505663 8331160 8085900 8273017 8459668 8533144
3603 8533144 8817065 8816143 8687156 8586307 8335412 8162813 7936717 7957830 7855012 7844576
3593G844576q1882M5521J80553K22565J43684J583K40386J56354K92812L8743
3583I084895q5504k3824P9970P1295J19557K02079M44358L09141L46792K11333
3573A0760092L98161L64014K66612O04398P02134P71646P55848M30357J79328
3564A5232590k23130k91070k04121j64216J01516J83105M16781L50344K20417
3555A5622216j73478m74581l29692m44420l99396l3979M5883K47545L87074M83616
3545A4930788N98753P09541N37702M35895K67067p227j53280p56585q70443o58569
3535A5033642o82788n80181k99883k52026P4866L6428q6087k13128j33273m92197
3525A2405373l33214k23512k01940j38964K56227J89400N00661M77679K02166
$$ plain form
3593 7844576 7762694 7808215 7988768 8211333 8355017 8356600 8596986 8753340 9046152 9084895
3583 9084895 8999391 8975567 9055537 9126832 9246389 9448468 9892826 10201967 10548759 10760092
3573 10760092 11158253 11522267 11788879 12393277 13095411 13867057 14622905 15053262 15232590
3564 15232590 15009460 14718390 14514269 14350053 14451569 14634674 15051455 15401799 15622216
3555 15622216 15448738 14974157 14644465 14200045 13800649 13766670 13812553 14060098 14447172 14930788
3545 14930788 15529541 16239082 16776784 17212679 17479746 17472519 17319239 16562654 15692211 15033642
3535 15033642 14350854 13770673 13470790 13218764 13293630 13330058 13243971 13030843 12897570 12405373
3525 12405373 12072159 11848647 11646707 11507743 11763970 11953370 12454031 12931710 13133876
3516A3133876L43918j41452k93319j62804k75979k39639j19570k77820o11769
3507A1355442n22198o69503p15357n03130m20125k03230j03307k36021j16764
3498G865807J6117L7659q4308r6528o4793k69770l8434Q4840k4774P7665O4161
3487G567642J13740J94635K86737J71961l1166l10826l50502m78654l87242l08802
3477F467523r7237k22360l12003N8227J32593K1058J4729N9475k6048j73052l6741
3466E886164k32502K1298r8681l21896k45600k49968j88038j53344p4790j81507
3456D161136q8076k30179k66516j03176r5495p6731o4854j63879R0941q8149J49309
3445C224331j16277o499K13591J38391k7699J61203j53484J77306j27326j29897
$$ plain form
3516 13133876 13477794 13336342 13043023 12880219 12604240 12364601 12245031 11967211 11355442
3507 11355442 10833244 10163741 9448384 8945254 8525129 8321899 8218592 7982571 7865807
3498 7865807 7881924 7919583 7835275 7738747 7673954 7404184 7365750 7450590 7425816 7503481 7567642
3487 7567642 7681382 7876017 8162754 8334715 8303549 7992723 7642221 7163567 6776325 6467523
3477 6467523 6370286 6147926 5835923 5894150 6026743 6047801 6062530 6122005 6095957 5922905 5886164
3466 5886164 5653662 5674960 5576279 5254383 5008783 4758815 4570777 4417433 4342643 4161136
3456 4161136 4073060 3842881 3576365 3473189 3377694 3300963 3236109 3072230 3163171 3075022 3224331
3445 3224331 3108054 3101555 3315146 3453537 3425838 3587041 3433557 3610863 3483537 3353640
3435C353640j05340j89701k72082J19517k17988q7254J7938j71653Q2354j8982
3425B510449j08221j93607n1149j50118j5968M1915O223R563k6465o5192m9976
3414A907454j27731P5957P4070l6215o2136n2866n7876q5679j54541O3082M3873
3403A587392Q0508j66762j716N4354l5353M456L1359Q8961k01594M0934n8257
3392A424282l7793J03416j43814r3921J12005m4576j41631M011K78847j37713
3382A323113m3318m0N112o1753R092N345l6820k342j72587K3400Q5853j01813
3370A033242p1344K443O0001j378R1093J9616J24552j6473k1723j42397l6149
3359A041483J19222k7968P0230o2902q7528j5649Q7267M337j86812P2795J92223
$$ plain form
3435 3353640 3248300 3058599 2786517 2906034 2688046 2600792 2618730 2447077 2529431 2510449
3425 2510449 2402228 2208621 2157472 2007354 1991386 2033301 2039524 2049087 2022622 1957430 1907454
3414 1907454 1779723 1855680 1929750 1893535 1831399 1778533 1720657 1634978 1480437 1543519 1587392
3403 1587392 1667900 1501138 1499422 1553776 1518423 1522879 1554238 1643199 1441605 1482539 1424282
3392 1424282 1386489 1489905 1346091 1252170 1364175 1319599 1177968 1181979 1460826 1323113
3382 1323113 1279795 1279755 1284867 1223114 1232206 1237551 1200731 1198389 1025802 1049202 1135055 1033242
3370 1033242 961898 964341 1024342 1022964 1114057 1133673 1258225 1241752 1220029 1077632 1041483
3359 1041483 1160705 1132737 1202967 1140065 1052537 1036888 1124155 1128492 941680 1014475 1206698
3348A206698p6096j93219k8312J50723J35672p309j78142J24712j8529k5333k55515
3337H35350R7487O0466m1112o461p2615l8708Q4343R2827R1823j71032m4128r856
3325H78384N1120r5374j452O859j10191L7057N4586N2146L5048L1209n9731l9543
3313H40118J5739q3882n8677q4527n479P1740r2393K7962m461J40337p4748j21728
3301E70001j570p0222m5067K9302L3393Q5308q4601K975N4877J38636j01492r8131
3289E13409O5019O590n734O3068P3400j03473N7229j38252Q7916K2841k7739o027
3277F08247l3135o685j1755n1364J48522l1861J7232p5640j22400R3969O2366
3266E97496R3962j46275K3021J09711k5693n9477q2492Q5604j19210J60539K3842
$$ plain form
3348 1206698 1130602 937383 909071 1059794 1195466 1188157 1010015 1134727 1116198 1090865 835350
3337 835350 932837 993303 952191 945730 873115 834407 918750 1011577 1103400 932368 888240 878384
3325 878384 929504 834130 832678 839537 729346 766403 820989 873135 908183 939392 879661 840118
3313 840118 855857 771975 713298 628771 623292 695032 602639 630601 626140 766477 691729 570001
3301 570001 568431 498209 453142 482444 515837 601145 516544 519519 574396 713032 611540 513409
3289 513409 578428 585018 579284 642352 715752 612279 669508 531256 619172 642013 614274 608247
3277 608247 575112 568427 556672 505308 653830 621969 639201 563561 441161 535130 597496
3266 597496 691458 545183 568204 677915 652222 592745 510253 595857 476647 637186 661028
3255F61028m9845l4703j5259Q9727p3170p7636J09160j12633o2534J52837R6595
3244F83567j9137j39764J40980M9464k60510K9616Q1241Q2604R4013j37313J15534
3233G20295j9910o9014j03798M4126J13739l1992r8994J17824m6910M8344j05006
3222E68704N9134P98O381L4934L7664p9153k7466j9100J27899O5049L4001l0946
3210G77899p714j01630n5180L0440L0824n4619n0535N5590k8577K54476j26452
3199G24522M2355j19449m945Q3147R070p9445n613o6000N4355J36368N6322j23481
3187G07206j15843N3672J04219j24447N9608j53539J20474K13770j03661q8849
3177F72610K5187O9898P5130j44072j16764K1747K12337o757j98422n0404J02838
$$ plain form
3255 661028 611183 576480 561221 650948 577778 500142 609302 496669 434135 586972 683567
3244 683567 664430 524666 665646 715110 454600 484216 565457 648061 742074 604761 720295
3233 720295 700385 631371 527573 571699 685438 653446 554452 672276 625366 673710 568704
3222 568704 627838 628636 635017 669951 707615 628462 600996 581896 709795 774844 808845 777899
3210 777899 770185 668555 613375 643815 674639 620020 569485 625075 596498 850974 724522
3199 724522 766877 647428 642483 725630 734700 655255 649642 583642 637997 774365 830687 707206
3187 707206 591363 645035 749254 624807 684415 530876 651350 865120 761459 672610
3177 672610 697797 767695 842825 698753 581989 603736 816073 809316 610894 560490 663328
3166F63328J21241K963q9139J0899L8970O6120j43924j40560O9786L514J19209
3155G22407m9350k1781L9759J6675p0061K16249j70657p5562J26949J1055J30963
3144H76646j7847k23743L8429j2051K5697R2385P7581k06051J18628l6293m9908
3133F83473n9368K4136L8053j8719n6894j3470M7287K15421j66673P914J19499
3122H20659P600M4299p2115r6108L942q1080k3913J59098j13628p867Q3232J37053
3110H61172j88445n1939L8025J64024j13779q9961R5204k865J09611M8190n3386
3099H15851o2516n0502J2226p8912M9907J28596K335l9509r8741j32915O4257
3088F10077M6771j39477J85049M1217j5189Q9332n7893j34386L8794O8920j31746
$$ plain form
3166 663328 784569 787532 698393 709292 748262 814382 670458 529898 599684 603198 722407
3155 722407 673057 651276 691035 707710 637649 853898 683241 607679 734628 745683 876646
3144 876646 858799 635056 673485 661434 687131 779516 857097 651046 769674 733381 683473
3133 683473 624105 648241 686294 667575 610681 597211 644498 859919 693246 701160 820659
3122 820659 828259 872558 800443 704335 708277 627197 603284 762382 648754 640887 724119 861172
3110 861172 672727 620788 658813 822837 709058 619097 714301 711436 821047 869237 815851
3099 815851 753335 702833 715059 636147 686054 814650 816985 777476 678735 545820 610077
3088 610077 656848 517371 702420 743637 728448 817780 759887 625501 664295 733215 601469
3077F01469P8536J56118j32029P7108P0984j03129m2946p9944J13670J44984j21537
3066G63284P8047j33947P0097m8523R9528J16056m9386n5826j9480q43m9277J22709
3054H92439n4992k2445Q1665p0434m1218q0621K0414J73779R1957o8915l6603
3043H85026o2570J52058P500J362R8328m7963Q9381J34359j39043p0787L9762
3032A087413J8995L1085m8657p6288l6391J44055Q7340n4894j09274L6732O0529
3021A140645K53846q9335q3878q5426K00149k0044N8948J3076J96972j27717j4984
3010A442252n3993p5197J80309J55899k5992J42584j6458n6081J07367J30870
3000A931560o3367r8551K8016J71645J82964R9264k10128N8398J98381j22621
$$ plain form
3077 601469 680005 836123 704094 781202 852186 749057 706111 626167 739837 884821 763284
3066 763284 841331 707384 777481 728958 828486 944542 895156 839330 819850 819007 769730 892439
3054 892439 837447 815002 896667 826233 785015 704394 724808 898587 990544 921629 885026
3043 885026 822456 974514 982014 983376 1081704 1033741 1123122 1257481 1118438 1047651 1087413
3032 1087413 1106408 1137493 1088836 1012548 976157 1120212 1207552 1152658 1043384 1080116 1140645
3021 1140645 1394491 1305156 1221278 1135852 1336001 1315957 1374905 1387981 1584953 1457236 1442252
3010 1442252 1388259 1313062 1493371 1649270 1623278 1765862 1749404 1693323 1800690 1931560
3000 1931560 1868193 1769642 1797658 1969303 2152267 2251531 2041403 2099801 2298182 2175561
2990B175561J07338K10941J01463n0369j22515K11962K4002J43976l038n8351
2980B740970J27060M8530L5323J10409K00848J28962O6089J0300K40496R35M8847
2969C758769J21182K6639K13013J72515K56362P1149J03466N3671O2322K0730
2959D859818l0404K39641J4272L39611K38848J29496M5570L34071K71194M78953
2949F921070L27858J65302L71039M82446M81738M30792N01818N30469N30959K61592
2939A1005083L60621K55758o311j12413k81958m91665n10383n79968m17581k51167
2929H970016k69545k07697m08402k38403k74334j90509j14814j90071k83781j64712
2919F627748k91808k07459k70681j87240j3071r8150k88984n044K3261j91918
$$ plain form
2990 2175561 2282899 2493840 2595303 2544934 2422419 2634381 2658383 2802359 2799321 2740970
2980 2740970 2868030 2916560 2951883 3062292 3263140 3392102 3458191 3468491 3708987 3709922 3758769
2969 3758769 3879951 3906590 4119603 4292118 4548480 4619629 4723095 4776766 4839088 4859818
2959 4859818 4829414 5069055 5083327 5422938 5661786 5791282 5836852 6170923 6442117 6921070
2949 6921070 7248928 7414230 7785269 8267715 8749453 9180245 9682063 10212532 10743491 11005083
2939 11005083 11365704 11621462 11615151 11502738 11220780 10729115 10218732 9638764 9221183 8970016
2929 8970016 8700471 8492774 8084372 7845969 7571635 7381126 7266312 7076241 6792460 6627748
2919 6627748 6335940 6128481 5857800 5670560 5657489 5559339 5270355 5265311 5288572 5096654
2909E096654k4538j11927l3352J07657J32697j11999l2053J41493O5654R57r436
2898E221807j5398j89599j48976k63250m39250k29241j34470j83763j52564n6029
2888C409267R304p5921k13182R816p4028q7254Q3265o3101K2078j4335o7785O4425
2876C002549K7441j19040L3496K7512q4244k30223n5762j5904k49707l6383k9987
2865B269748j94058J1148j38873K7078P6873j9427j31604j7381m9475q6212K8488
2854A776305J04330q9805N9073j82140O46K2180j69684Q3734M380r8999j3189
2843A496831O6746R7807q5265J5530r1996o3653J42744p7813r7536m5112L7762
2832A396045j10657K02852j49205m6769j263J10904j21318n2355Q8337O5623j03131
$$ plain form
2909 5096654 5072116 4960189 4926837 5034494 5167191 5055192 5023139 5164632 5230286 5231243 5221807
2898 5221807 5206409 5016810 4867834 4604584 4165334 3936093 3801623 3617860 3465296 3409267
2888 3409267 3418571 3342650 3129468 3139284 3065256 2978002 3061267 2998166 3020244 3005909 2938124 3002549
2876 3002549 3029990 2910950 2944446 2971958 2887714 2657491 2601729 2585825 2336118 2299735 2269748
2865 2269748 2075690 2086838 1947965 1975043 2051916 2032489 1900885 1883504 1834029 1747817 1776305
2854 1776305 1880635 1790830 1849903 1667763 1668409 1690589 1520905 1604639 1609019 1510020 1496831
2843 1496831 1563577 1661384 1576119 1591649 1499653 1436000 1578744 1500931 1403395 1358283 1396045
2832 1396045 1285388 1488240 1339035 1292266 1291003 1401907 1280589 1228234 1316571 1382194 1279063
2821A279063n860r8282M9583Q7440j18173K6534r9304r1635r377P4033L8080p6714
2809A055388m2595L6757j17274O5614l804m9071J18136j70120N6105m921r7970
2798H46245J89810r4094j14128M9857J8504K9400j22381n41M6073r0663L6041
2787G94123N14l3296L5997R5479j6080m0281n6529M2046P2868O3166p9813l9608
2775H38586n9538k3393q4558l4191N0513J62018j30427P5609M4199j13716J83566
2764I08668j03341p8824j09250J01989R0668Q7528J739K8237q7877j06064M094
2753G37567m7034P8005n1024n0554J1634K02068q2892o320J18184K4028j7486
2742I16176j10467N7630R7118O336J10725J04566j40703n1684N1693J52576p4037
$$ plain form
2821 1279063 1273203 1174921 1224504 1311944 1193771 1220305 1121001 1029366 1019989 1094022 1132102 1055388
2809 1055388 1012793 1049550 932276 997890 994086 945015 1063151 893031 949136 944215 846245
2798 846245 1036055 941961 827833 877690 896194 925594 803213 802672 848745 758082 794123
2787 794123 794637 761341 797338 892817 876737 836456 779927 821973 894841 958007 878194 838586
2775 838586 779048 755655 671097 636906 687419 849437 719010 794619 838818 725102 908668
2764 908668 805327 726503 617253 719242 809910 897438 899177 927414 839537 733473 737567
2753 737567 690533 768538 717514 666960 678594 880662 797770 791450 909634 933662 916176
2742 916176 805709 863339 960457 966793 1077518 1182084 1041381 989697 1041390 1193966 1119929
2731A119929n0660J91712q6644n8776K02202j00377N2551J03017j10917J73870
2721A435907m254j24812N6506J48077J82583j40556o9414L143J9214J52497P3237
2710A732128l5636Q4653J27465N9921j12584J43784k1019Q0911J10255J48127
2700B318005j35818N4779P3164L0422P4639n4505l4520J5162J95872J40914l9265
2689B638849R8607J00785O3178L44018J80111l5488R8495K3691l6920j06032j7492
2678C351802q305l1515r7719j54112l4490j403j7670k0145R1289O8663J58419
2667C304814N0169L9876J28655k4804l166K3491K0837j23735j36087j56231j2364
2656C111455p6121j41411k14410J9829m5654p4529k0275q9923m9195q9039J11553
$$ plain form
2731 1119929 1069269 1260981 1174337 1115561 1317763 1217386 1269937 1372954 1262037 1435907
2721 1435907 1431653 1306841 1363347 1511424 1694007 1553451 1484037 1487180 1506394 1658891 1732128
2710 1732128 1696492 1781145 1908610 1968531 1855947 1999731 1978712 2059623 2169878 2318005
2700 2318005 2182187 2236966 2310130 2340552 2415191 2360686 2326166 2341328 2537200 2678114 2638849
2689 2638849 2737456 2838241 2901419 3245437 3425548 3390060 3488555 3512246 3475326 3369294 3351802
2678 3351802 3343497 3311982 3214263 3060151 3025661 3024258 3006588 2986443 3077732 3146395 3304814
2667 3304814 3354983 3394859 3523514 3498710 3495544 3519035 3539872 3416137 3280050 3123819 3111455
2656 3111455 3035334 2893923 2679513 2699342 2653688 2579159 2558884 2468961 2419766 2330727 2442280
2645B442280n8885O7839j01620R1598k13078o630j55550r6413k46226l3386j96602
2634A493327n0897m2794l6551K2074j32809o2957J16091j04712L3461R766j53156
2623A090843N071j78762j71544N7131K4615k6001l8685k5321K2419J7292N2589
2612H29647j48662N6241n1285M2960M0358p4543l3933Q842p9610r34M2311K1031
2600F52423j43674j13846J46082l2178m110j02080j02600R8493Q4217o5349l4072
2589C83306O8947O4580p998M0457o9824r1276M5077J5989m7475P0249k55438o7930
2577A48664J54122Q6549K9244p9304o5285j41225N1422J86211J7213j16758n717
2566B65136k6045j78171J30562J80758k234N4255j57532j30361k3393J50730r8318
$$ plain form
2645 2442280 2383395 2451234 2349614 2441212 2228134 2221504 2065954 1969541 1723315 1689929 1493327
2634 1493327 1442430 1399636 1363085 1385159 1252350 1189393 1305484 1200772 1234233 1243999 1090843
2623 1090843 1095914 917152 745608 802739 827354 801353 762668 737347 759766 777058 829647
2612 829647 680985 737226 685941 728901 769259 694716 660783 669625 590015 589081 631392 652423
2600 652423 508749 394903 540985 508807 504697 402617 300017 398510 482727 417378 383306
2589 383306 452253 516833 508835 549292 479468 388192 433269 449258 401783 472032 216594 148664
2577 148664 302786 389335 418579 339275 273990 132765 184187 370398 387611 270853 265136
2566 265136 239091 60920 191482 372240 370006 424261 266729 136368 112975 263705 165387
2555A65387q3125R7394Q8883o0585j05618P9072l5193j07349O9615p4419L7565
2544G1627Q268l943k371L4805J6885L0691J36796j96425j9793R223k3878J50129
2532B12014j33901L9494l8818j4175O7090Q364q5773K2779J12515j14284o7437
2521G868J15934j12838k0593J16826j1195o9843K5903L2533j15575P9691J79444
2510B28155j44459R367l8755n2913J2249M2626Q5438R8491j90031o1276J02054
2499I0946l7397l0265K0101P8254O586K6523j18453n1652j01642K5587n3154J20730
2487b3836M1999N9841j9859K3394j0979n6376J27317k7806j6947k13023J19491
2476C216L16778l3731o0301k12844J2744O4001j02915K9515j99706J20777O3782
$$ plain form
2555 165387 82262 179656 268539 207954 102336 181408 146215 38866 108481 34062 71627
2544 71627 79895 75952 73581 108386 125271 155962 292758 96333 76540 85763 61885 212014
2532 212014 78113 117607 78789 64614 131704 140068 54295 77074 189589 75305 7868
2521 7868 123802 10964 -9629 107197 96002 26159 52062 84595 -30980 48711 228155
2510 228155 83696 93063 54308 1395 13644 56270 141708 240199 50168 -11108 90946
2499 90946 53549 23284 43385 121639 128225 154748 36295 -15357 -116999 -91412 -144566 -23836
2487 -23836 18163 78004 58145 81539 70560 14184 141501 113695 96748 -116275 3216
2476 3216 319994 286263 225962 13118 25862 89863 -13052 16463 -183243 -62466 1316
2465A316m1313J743J08852j86337O3348J52410n6471n6487M8018L07241q2341
2454B59979n3055o5278m2575P102j25214M5318R2295R1631o6416o3672K01697
2443B81812j58406n4426m1376n0456o8076P2212p8574J17816J9753J9013M300
2432F3592j17828M785p2869M574j7586J81739O064n4925k8487L1019J1095O3899
2420G5072j29763l1970L6598k6970P2469J67789M0077o8513n0575j26748P1506
2409B8972P4429j50249p7033K00003K9691n1229O695O3992M6121j56592n6920
2398d2120J40988j81753m4120K9496J82631N0500j87486l7348J63385o0098j19990
2387a05915J06749K857K2003j16349Q3767O2446j60465R4141R3593j73560J21849
$$ plain form
2465 1316 -39997 -38254 70598 -115739 -52391 100019 43548 -12939 35079 342320 259979
2454 259979 206924 141646 99071 106173 -19041 26277 118572 210203 143787 80115 281812
2443 281812 123406 68980 27604 -22852 -90928 -18716 -97290 20526 40279 59292 63592
2432 63592 -54236 -49451 -122320 -117746 -135332 46407 52471 -2454 -30941 78 11173 75072
2420 75072 -54691 -86661 -50063 -77033 -4564 163225 203302 134789 84214 -42534 28972
2409 28972 103401 -46848 -123881 76122 105813 54584 61279 125271 171392 14800 -42120
2398 -42120 98868 -82885 -127005 -97509 85122 135622 -51864 -89212 74173 14075 -105915
2387 -105915 834 3691 25694 -90655 -6888 55558 -104907 -10766 82827 -90733 31116
2376C1116K5863l4848m8092n2254j98179L8926L5942J57624k5523L6624J50034
2365A17233j24491O5284j871j76770Q7461M9997K4307J7089q6669J5898n7929
2354g0461J3840Q0043Q884j05954K3478L4094k0966O1867p2004M0854N393J6634
2342A5702m5436P807N1601j51404J56426N6703r2458q732j2842N2527j27450R574
2330h7982J69223m6602L4639j37652k8712P2488K32955j23546m9135O5168K9801
2319A30645j15665Q7084j7911K157K8785l7127m0179j5685o0861l2100J56614
2308H5757P0032j70486p5783J15852l9190q5743K05561n7287r3474J35614j02598
2297a1745P5361Q104k3330j0541o4778r674N5798Q397J31002n548n1969N1466
$$ plain form
2376 31116 56979 22131 -25961 -78215 -276394 -237468 -201526 -43902 -69425 -32801 117233
2365 117233 -7258 58026 56155 -120615 -33154 16843 41150 58239 -28430 -12532 -70461
2354 -70461 -56621 23422 32306 -73648 -50170 -16076 -37042 24825 -47179 -6325 -932 15702
2342 15702 -29734 -21927 29674 -121730 34696 91399 -1059 -9791 -22633 29894 -97556 -87982
2330 -87982 81241 34639 69278 -68374 -97086 -24598 208357 84811 35676 100844 130645
2319 130645 14980 102064 84153 86310 115095 77968 37789 22104 -38757 -70857 85757
2308 85757 155789 -14697 -90480 25372 -13818 -99561 106000 48713 -44761 90853 -11745
2297 -11745 63616 71720 48390 37849 -26929 -36603 19195 27592 158594 153046 101077 152543
2285A52543K6098N6219L611K3716l9029n1131k677K8002j06413o4571j41166O7270
2273d7528o0140N1313n6602J03791K0337J3344R4414p9189n7159j18139n4901
2262a90459M5537J31201R5579J55063k40015R516n4976J42115J34105j37242j07234
2251a6810M1906J21189q3768q6970P2492j1481K7401l5864q2330K08948N3376
2240B08089j66223l0022N7710o0925N1793q3631L4875j4731J11658N568j33438
2229a9277K0429R3586P0803j60225N034j12558K67745p2472k04459m6695J67744
2218I655K18489k464j24669M6319Q8316k42356p5500J98919J43900r8467M755
2207A66897r479j37846l8578J485J24326k8746P9718j6181M3752Q9249l30677
$$ plain form
2285 152543 178641 234860 238471 262187 223158 172027 169350 197352 90939 26368 -114798 -47528
2273 -47528 -107668 -56355 -112957 -9166 11171 24515 118929 39740 -17419 -135558 -190459
2262 -190459 -144922 -13721 81858 236921 -3094 6422 -48554 93561 227666 90424 -16810
2251 -16810 25096 146285 62517 -24453 48039 36558 63959 28095 -54235 154713 208089
2240 208089 41866 11844 69554 8629 60422 -23209 11666 -3065 108593 114161 -19277
2229 -19277 1152 94738 165541 5316 10350 -102208 165537 93065 -111394 -158089 9655
2218 9655 228144 225680 101011 147330 235646 -6710 -82210 116709 260609 162142 166897
2207 166897 157418 19572 -19006 -17521 106805 78059 157777 141596 185348 274597 -56080
2196e6080o9379Q6020O9825O6045K5504J01472m675O0906j13466M5833o6704q4132
2184F1169K09078n4845q2984M2830j50935L2675j13032n827J20782n5740q354
2173e183N6843k7924J96932j46104n0433M5565j58329J32982J7659Q9904m840
2162A47072M7158N7008M307o5928R1524J25213j76614J1462l8900J55398n4392
2151C03308n5598Q6538j6843m2679L3087Q059J13996Q7385p8003N8529j2177P901
2139D93503R6709m3086J8126J00244J42385Q763l5101J25300n6212J8335M4331
2128I13297M8600N0233J52349J90079k6746P5694n2637J48224J63010j46411n691
2117A510001J94075J89849J80239O8624R7115l6782J8863K89791R3406J43185
$$ plain form
2196 -56080 -125459 -39439 30386 96431 121935 223407 218732 279638 166172 212005 145301 61169
2184 61169 270247 215402 132418 175248 24313 56988 -56044 -61871 58911 3171 -5183
2173 -5183 51660 23736 220668 74564 24131 69696 -88633 44349 62008 151912 147072
2162 147072 194230 251238 255545 189617 281141 406354 229740 241202 202302 357700 303308
2151 303308 247710 334248 317405 274726 307813 315872 429868 517253 439250 497779 485602 493503
2139 493503 590212 547126 565252 665496 807881 816644 781543 906843 850631 868966 913297
2128 913297 961897 1012130 1164479 1354558 1327812 1403506 1350869 1499093 1662103 1515692 1510001
2117 1510001 1704076 1893925 2074164 2142788 2239903 2203121 2221984 2511775 2605181 2748366
2107B748366J77494K08397K06536J9466K60394K77771K17122K49449K70782K02129
2097D837906L98021O76731N85732P30459Q14022Q61962P10263J136604J361500
2088A2113200J738029K525254L402673M295636N592928R65043o37808l159839
2080B6835116n519812m368342k951523j943594j657777j226825j182643n50923
2072G433677p95471p38695m32573n48875n08144m99597l22638J2218m65585l45364
2062B788953k59619o7137j71043j73630k0552j36666r3679n1803j77931o6462
2052A570431j5912j46994j28730j4172j28301J2521r2052q45n1512n7293q2077
2041H65064L462j555j2265p846r5851k09843J79602J1593m626j23505m8866J23800
$$ plain form
2107 2748366 2925860 3134257 3340793 3360259 3620653 3898424 4115546 4364995 4635777 4837906
2097 4837906 5235927 5912658 6498390 7228849 8042871 8904833 9615096 10751700 12113200
2088 12113200 13851229 16376483 19779156 24074792 29667720 30632763 29994955 26835116
2080 26835116 21315304 16946962 13995439 12051845 10394068 9167243 7984600 7433677
2072 7433677 6638206 5899511 5466938 4918063 4409919 3910322 3587684 3599902 3134317 2788953
2062 2788953 2529334 2462197 2291154 2117524 2096972 1960306 1866627 1814824 1636893 1570431
2052 1570431 1554519 1407525 1278795 1264623 1136322 1148843 1056791 1055946 1004434 947141 865064
2041 865064 868526 866971 854706 846860 751009 541166 720768 732361 727735 604230 555364 679164
2029F79164j10875r9360J34017p1915k01081R8052L9874J04651p0507Q9334j11272
2018D80082r8527k2125l5175J6574n677j50535k9012J44284n347J67028j25186
2007C36384j29811J0188J25468J3593j29168K8143J35894j01540j69301O5669
1997A85519L6581o2170J37155m5796l9178j46814R7877M3153o6669k7114j4071
1986I8473m6857P2872j11801J14128p4496m8175O4156J9822O9835j899j11249
1975D4809m1993J44757j26302J33115n7270m1998j8126o9173N5670N4639j3118
1964F5010J41046P4245j69774O9006m26j06487o4890O8717m666K3680P966N4017
1952A57444j4382l5462r4442L525M4737l6271M3124K3187Q8824j26612N8449n5939
$$ plain form
2029 679164 568289 468929 602946 531031 329950 428002 467876 572527 502020 591354 480082
2018 480082 381555 359430 324255 340829 335152 184617 155605 299889 294542 461570 336384
2007 336384 206573 216761 342229 355822 226654 254797 390691 289151 119850 185519
1997 185519 222100 159930 297085 251289 212111 65297 163174 206327 139658 112544 98473
1986 98473 51616 124488 12687 126815 52319 4144 68300 88122 157957 156058 44809
1975 44809 2816 147573 21271 154386 97116 55118 36992 -32181 23489 78128 65010
1964 65010 206056 280301 110527 179533 179107 72620 7730 76447 71781 95461 103427 157444
1952 157444 143062 107600 13158 16683 61420 25149 68273 91460 180284 53672 112121 56182
1940E6182j0343J06325J17402j24831j77490J0347Q7013P0628m9381m9404o8928
1929c2480R3442K7642k6685J066l0028o7089R925q2893J15524m6289R8084j33741
1917g3522J01766O591m3502J1351l4771j3583J37476j6020j47177R6288O2260
1906H7157j52240l3499K52858l2890J26o3989j9583m0984p1969N4474J11432j44502
1894e3609m8386K4922J14314n2368R6333n9145J97436p0676j47589J15994k1247
1883I5979N8220J09032l1532P429l96j8998j04407j58708R8926k7284M8437Q90
1871G7588j18349q7488O5830R3946N068J6816j7274o0832j40594n6585N4417J62577
1859d880J78O7067j2951L0823j78335O2748M5440J8748j79303P7334N7600j0017
$$ plain form
1940 56182 45839 152164 269566 144735 -32755 -22408 64605 135233 85852 36448 -32480
1929 -32480 60962 88604 61919 62985 32957 -34132 -24207 -107100 8424 -37865 60219 -73522
1917 -73522 28244 34835 -8667 2684 -32087 -45670 91806 75786 -71391 24897 87157
1906 87157 -65083 -98582 154276 121386 121512 57523 37940 -3044 -75013 -20539 90893 -53609
1894 -53609 -101995 -77073 37241 -15127 81206 22061 219497 148821 1232 117226 95979
1883 95979 154199 263231 231699 239128 238732 219734 115327 -43381 55545 28261 76698 77588
1871 77588 -40761 -128249 -62419 31527 36595 53411 36137 -24695 -165289 -221874 -167457 -4880
1859 -4880 -4702 62365 49414 80237 -98098 -35350 10090 28838 -150465 -73131 -15531 -25548
1847b5548l255P1327O4277L3122r0060p1733J56816r3421J7731R3857j91160l4809
1835g2856M1607j8368N9824n6832O3611r2355p4439J86647O1567r2895n3784r3084
1823a41357q122J7533o843J5914N4869n6780N9019J73642k16516J09562J12682
1812A13603j28310j8039N3795O5384j21254o8987P9587N1720l2088m7665P836
1801d4418l6955l4876J94875j8092R9557j87610j21891l5475l721J22151o9837
1790a36292J74071J10784j03006l1325j08654P3483m1541j48604n2371J76689
1780h6766N9951J5193p4966J2739J47257M7374j99957R3012K1314j31323p6025
1769a72197m1332N3651N4344K32066n7582j78538J7087J06183J09879k53283p4916
$$ plain form
1847 -25548 -28803 42524 106801 139923 49863 -21870 134946 41525 59256 153113 -38047 -72856
1835 -72856 -31249 -49617 10207 -46625 16986 -75369 -149808 36839 98406 5511 -48273 -141357
1823 -141357 -149479 -131946 -138789 -122875 -68006 -124786 -65767 107875 -108641 921 113603
1812 113603 -14707 -32746 21049 86433 -34821 -103808 -24221 27499 -4589 -52254 -44418
1801 -44418 -81373 -116249 78626 60534 160091 -27519 -149410 -184885 -188606 -66455 -136292
1790 -136292 37779 148563 45557 14232 -94422 -20939 -62480 -211084 -263455 -86766
1780 -86766 -26815 -11622 -86588 -73849 73408 120782 -79175 13837 35151 -96172 -172197
1769 -172197 -213529 -159878 -105534 126532 68950 -109588 -92501 13682 123561 -129722 -204638
1758b04638R9751j507j4371J8544J09251J35488j27757j24516M1301M3398M8799
1747B3743j9176m5618m0031R9967j86271N6790k6523J70881J0747n5959N7609
1736D6159m2655K4212q3663J01357k3089L8264j53004M9705N3459n9278L543k2979
1724f7969n218J51441K2854k02138M4193j1486L6983J034m6090j26259J7218J52037
1712c3400p4935Q5099l9080J4289N4778L6988q844M771P1296j15669j28749J9457
1700a13999k8616k591K26775j93160r1455J26463j22376P4306Q2870n138j16811
1689a63732L9155J16628o4030J68539j26256j60933J55348J24699j98897P528
1679a01951n0043Q5970R8215J726K2900j41668L2781k5031L5670J37503r0579
$$ plain form
1758 -204638 -104887 -106394 -120765 -102221 7030 142518 14761 -109755 -68454 -25056 23743
1747 23743 4567 -41051 -81082 18885 -167386 -110596 -137119 33762 44509 -11450 46159
1736 46159 3504 27716 -55947 45410 22321 60585 -92419 -42714 10745 -48533 -44990 -67969
1724 -67969 -73187 78254 101108 -101030 -56837 -68323 -31340 -30306 -76396 -202655 -185437 -33400
1712 -33400 -108335 -23236 -62316 -48027 6751 43739 34895 39666 110962 -4707 -133456 -113999
1700 -113999 -142615 -145206 81569 -111591 -203046 -76583 -198959 -124653 -41783 -46921 -163732
1689 -163732 -124577 -7949 -71979 96560 -29696 -190629 -35281 89418 -109479 -101951
1679 -101951 -151994 -66024 32191 33917 56817 -84851 -52070 -77101 -41431 96072 5493
1668E493k46706R6309P7041l7807J9309o2684L2728J1643J3883J23685k90l7020
1656d416j18855O3805J20761L9869O600j6077o6493J23762j48920l6141P332j18998
1644a47771R3467J79169j60582J33429O7766j42407J47327k28531N4821q4034
1634h7346O8020o76R3543l4810r9431N0352j56574J11649q89o0968J01007K6383
1622A0260q9256J31210p7587O8298n7789P494O8184k9833L7627j34679n4432L5798
1610h4705P1969j17285R0828O6983j72100K5892J79419J05175j54873p4286k6050
1599h9033o0172K8333Q0064M3952O7707K9912k45568J61485l9438O4360J3604
1588E5206j92875M2229J4431J78138j27721o9436R8709p2725J10603p1653L6057
$$ plain form
1668 5493 -241213 -144904 -67863 -105670 -86361 -149045 -116317 -104674 -90791 32894 32604 -4416
1656 -4416 -123271 -59466 61295 101164 107764 91687 25194 148956 36 -36105 -28773 -147771
1644 -147771 -54304 124865 -35717 97712 165478 23071 170398 -58133 -3312 -87346
1634 -87346 -19326 -20002 73541 38731 -60700 -10348 -166922 -55273 -56162 -117130 -16123 10260
1622 10260 -78996 52214 -25373 42925 -14864 -7370 60814 30981 68608 -66071 -120503 -84705
1610 -84705 -12736 -130021 -39193 27790 -144310 -118418 61001 166176 11303 -62983 -89033
1599 -89033 -149205 -120872 -40808 3144 70851 100763 -144805 16680 -22758 41602 55206
1588 55206 -137669 -95440 -81009 97129 -30592 -100028 -1319 -74044 36559 -35094 963
1577I63r6599n0513M710M8739j46055K75547K5938j90981j1903J13530O5875P3991
1565A13242j03624p398N7196p1895J6826j02723J40416l7390n2309q1397J52697
1554B3641P1051j04970k3706O1471M7973J0490k5033Q5415j34062j2790j9991
1543b0511J02949j65599j19488N7693L8202Q3726j66252K06830L4452m6870L0266
1532C5398m2367K6278j24735j035Q50j13Q7742K4724k1719q8807j65185M8769
1520b20200J57814q2654l8013J885K889n5306J02097k0667L2979L2778R6617j01027
1508i0808J6546J6648j36443O4269k115J46697M640q8121k7137J5206J19915Q7672
1496A26969n0567n2559J12300J45974k51593q3861J02924J8363P197n5946n1013
$$ plain form
1577 963 -95636 -146149 -141439 -92700 -238755 36792 62730 -128251 -140154 -26624 39251 113242
1565 113242 9618 2220 59416 -12479 4347 -98376 42040 4650 -47659 -129056 23641
1554 23641 94692 -10278 -33984 27487 75460 85950 60917 146332 12270 -520 -20511
1543 -20511 82438 -83161 -202649 -144956 -106754 -23028 -189280 17550 52002 5132 35398
1532 35398 -6969 19309 -105426 -106461 -105611 -105724 -17982 6742 -14977 -103784 -268969 -220200
1520 -220200 -62386 -145040 -183053 -181168 -178279 -233585 -131488 -152155 -119176 -86398 10219 -90808
1508 -90808 -74262 -57614 -194057 -129788 -131903 14794 19434 -68687 -95824 -80618 39297 126969
1496 126969 76402 23843 136143 282117 30524 -53337 49587 67950 75147 19201 -31812
1485c1812r1194k5095R8380J592J1488l7490J67O6642L9279q8812K32915q0595
1473I5465Q5787j4486K324j51216L6854J39499j46064N4029j26820k9178L8807
1462a4999L5549q8621P0297J9002j27387O0773M7155l0592O2497k7561q5522J86486
1450A07077j58765J08116J19089k61028r2402J40427j742j24468K02270R0413
1440A28987m3797j09735M8736j75186j0213J10883R6577l0629K3082n6689m4477
1429f2461J47898p5081j17045J4924J19468M9463R0946j41959j68830P4780J02768
1418C4871k809r1898p8270J44933k2300M1129q6848N4103O6215j48174j56900
1407b45948j9207J22714J05812J35994k40719J02499L6462O813o4099M55R4177
$$ plain form
1485 -31812 -123006 -148101 -49721 -48129 -36641 -74131 -73964 -7322 31957 -56855 176060 95465
1473 95465 181252 166766 169090 17874 54728 194227 48163 102192 -24628 -53806 -14999
1462 -14999 20550 -68071 2226 21228 -106159 -45386 1769 -28823 33674 6113 -79409 107077
1450 107077 -51688 56428 175517 -85511 -177913 -37486 -39228 -163696 38574 128987
1440 128987 85190 -24545 24191 -150995 -161208 -50325 46252 15623 38705 -17984 -62461
1429 -62461 85437 10356 -106689 -91765 27703 77166 168112 26153 -142677 -67897 34871
1418 34871 32062 -59836 -138106 6827 -15473 25656 -61192 -7089 59126 -89048 -245948
1407 -245948 -265155 -142441 -36629 99365 -141354 -38855 -2393 4420 -59679 -59224 34953
1396C4953l2685r134j35835m5398J47359J7293M4394J15700J7143r5359J7307
1385G5738m2051j46234q3308J40415k5830p9213J87046m76J42778q3093j30912
1374d5140M7662N8621j1227k464o4467N362p694M6981J06475n3458o9834j5066
1362d249J02602j46436K8759M4246j7439n9808m2738R0945J29355j11309j6870
1351b942r8989k5288J1604n1515J68005K6257N3412p8494N698J68748j21420j23504
1339f8428L9136L8728j28594Q6009L2335k4405K14108r4018r1364M6522j36042
1328h6013N8365L0554N3438m0217J02060R688n8466P0412j70457o426N4489J45207
1316A62634k7j02826q9835N0602K9977N7700J4183r6403j03974j28519J05025
$$ plain form
1396 34953 2268 -6866 -142701 -188099 -40740 -23447 20947 136647 153790 58431 75738
1385 75738 33687 -112547 -195855 -55440 -81270 -160483 26563 26087 168865 85772 -45140
1374 -45140 2522 61143 49916 47452 -17015 -11653 -19347 27634 134109 80651 10817 -4249
1362 -4249 98353 -48083 -19324 24922 7483 -52325 -95063 -4118 125237 13928 -2942
1351 -2942 -101931 -127219 -115615 -167130 875 27132 80544 2050 7748 176496 55076 -68428
1339 -68428 -29292 9436 -119158 -33149 -814 -25219 188889 94871 3507 50029 -86013
1328 -86013 -27648 2906 56344 16127 118187 127875 69409 139821 -30636 -37062 17427 162634
1316 162634 162607 59781 -30054 20548 50525 108225 122408 26005 -77969 -206488 -101463
1305a01463J05180j9989J37277k04498p2409J14278n7843M4566J02729m3610j66202
1294a61984R6489j2082K2146R4033M0966l4811p7381o7421m3038J72422L9741
1283F9080L0581j28651l4417J79462j0677j50793o1568J08982j232k1342j11910
1272a32485J5737l2090Q9397J16937n7911j38276Q355J38795k0984m440J0296
1261f669k0196r2980Q9863q848r8066J83174n6675j13103j8729r5032N0239K64671
1249G7649M842j02630P68K8286m0656L9503R9540j60595k0870J5815L4744m1371
1237f4975J30082M2379m7997j851n2894P5371j19771o4961N8771o042J02278k09466
1225a59076L2196l9485J6590j2790n0155N4881L6617J1518L178N2472J75282r2849
$$ plain form
1305 -101463 3717 -16272 121005 -83493 -155902 -41624 -99467 -54901 47828 4218 -161984
1294 -161984 -65495 -77577 -55431 38602 79568 44757 -32624 -100045 -143083 29339 69080
1283 69080 99661 -28990 -63407 116055 105378 -45415 -106983 1999 767 -20575 -132485
1272 -132485 -116748 -148838 -59441 57496 -415 -138691 -130336 8459 -12525 -16965 -6669
1261 -6669 -26865 -119845 -29982 -38830 -136896 46278 -10397 -123500 -142229 -237261 -187022 77649
1249 77649 82491 -20139 -19371 8915 -31741 7762 107302 -53293 -74163 -58348 -23604 -64975
1237 -64975 65107 107486 59489 57638 4744 80115 -39656 -104617 -45846 -51888 50390 -159076
1225 -159076 -126880 -166365 -149775 -162565 -212720 -157839 -121222 -109704 -106526 -54054 121228 28379
1213B8379p906j35987Q3786P0062j13654O963k3010J0878q1169M7602J38161R8577
1201A22682n0829j6600K3994j52244l0785R9956J13469j99401J9025J65070n0434
1190D3903P2733P672p4590l3614J6045j07088J3068j08295J14489N8685m8122
1179d5114p2028p4355R2041N3100o0619J21121m2408O5653q8481p3135J8174J5468
1167i0583J26389M8430q8194j07848J12940P177o5384N837l653J40222j3338O9296
1155A41291j46526o4600j18720O6337R596J982J45623J25855j15465j52101J86416
1144G9688M0768r153j21978M972l6173O8379J76862j11753k9522j58696K5845
1133g0761k2647l6718J55489k5848q8980m8199J10443m3805L3095j7294p3175
$$ plain form
1213 28379 20473 -115514 -31728 38334 -75320 -68357 -91367 -80489 -161658 -114056 24105 122682
1201 122682 71853 55253 79247 -72997 -103782 -3826 109643 -89758 -70733 94337 43903
1190 43903 116636 124308 49718 16104 32149 -74939 -61871 -170166 -55677 3008 -45114
1179 -45114 -117142 -191497 -99456 -46356 -106975 14146 -28262 37391 -51090 -124225 -106051 -90583
1167 -90583 35806 84236 -3958 -111806 1134 8311 -57073 -51236 -54889 85333 71995 141291
1155 141291 -5235 -69835 -188555 -122218 -112622 -110640 34983 160838 45373 -106728 79688
1144 79688 120456 111303 -10675 -5703 -41876 26503 203365 91612 62090 -96606 -70761
1133 -70761 -93408 -130126 25363 -485 -89465 -137664 -27221 -71026 -37931 -55225 -128400
1122a28400k816J58870L470K2504r396O7673j61870j74555J73396J36701j45214
$$ plain form
1122 -128400 -131216 27654 31124 53628 44232 111905 -49965 -224520 -51124 85577 -59637
$$ [...]
##END NTUPLES=NMR SPECTRUM
##END=
