##TITLE=1H_EC-3333(II-4)
 CDCl3
 8 sc, 
 4.10.2024
##JCAMPDX= 6.0         $$ Bruker NMR JCAMP-DX V2.0
##DATA TYPE= NMR SPECTRUM
##DATA CLASS= NTUPLES
##ORIGIN= UXNMR, Bruker Analytische Messtechnik GmbH
##OWNER= root
$$ XWIN-NMR		Version 3.5
$$ Fri Oct  4 14:01:15 2024 Russian Standard Time (UT+4h)  she@DPX200
##.OBSERVE FREQUENCY= 200.1318
##.OBSERVE NUCLEUS= ^1H
##.ACQUISITION MODE= SIMULTANEOUS
##.ACQUISITION SCHEME= undefined
##.AVERAGES= 8
##.DIGITISER RES= 18
##SPECTROMETER/DATA SYSTEM= spect
##.PULSE SEQUENCE= zg30
##.SOLVENT NAME= CDCl3
##.SHIFT REFERENCE= (INTERNAL, CDCl3, 0, 21.0355)
##AUDIT TRAIL= $$ (NUMBER, WHEN, WHO, WHERE, WHAT)
$$ ##TITLE= Audit trail, XWIN-NMR		Version 3.5
$$ ##JCAMPDX= 5.01
$$ ##ORIGIN= Bruker BioSpin GmbH
$$ ##OWNER= she
$$ F:/spectra/data/she/nmr/H-F/1/pdata/1/auditp.txt
$$ ##AUDIT TRAIL=  $$ (NUMBER, WHEN, WHO, WHERE, WHAT)
(   1,<2024-10-04 14:00:04.26 +0400>,<she>,<DPX200>,
      <created by zg, POWCHK disabled, PULCHK disabled
       configuration hash MD5:
       00 E9 B6 7A A2 85 ED C7 34 08 36 98 17 FE 4E 26
       data hash MD5: 16K
       B2 84 0E BD BF 46 5F 07 BE 97 2C 39 F9 A9 FF 95>)
(   2,<2024-10-04 14:00:06.81 +0400>,<she>,<DPX200>,
      <Start of raw data processing
       efp BC_mod = 2 LB = 0.24 FT_mod = 6 PKNL = 1 PHC0 = -26434.32 PHC1 = 9.38747 SI = 16K 
       data hash MD5: 16K
       B2 62 19 69 DF EC E6 21 EA D4 74 2F 2F 93 44 CC>)
(   3,<2024-10-04 14:00:21.51 +0400>,<she>,<DPX200>,
      <pk PHC0 = 92.11436 PHC1 = 0 
       data hash MD5: 16K
       4E B0 DB FC 7C AF 5A 51 EE 8D BB EF F5 67 B4 01>)
(   4,<2024-10-04 14:00:24.90 +0400>,<she>,<DPX200>,
      <abs ABSG = 5 
       data hash MD5: 16K
       04 E1 B1 85 20 34 8E 6B 24 42 EB 49 1A 52 7E 55>)
$$ ##END=
$$ 
$$ hash MD5
$$ 80 FA 00 E9 9B 26 06 64 DE E8 42 3E 69 61 97 69
##$RELAX= 
##$RELAX= 
##$RELAX= 
##$RELAX= 
##$RELAX= 
##$RELAX= 
$$ Bruker specific parameters
$$ --------------------------
##$DU= <F:/spectra>
##$EXPNO= 1
##$NAME= <H-F>
##$PROCNO= 1
##$TYPE= <nmr>
##$USER= <she>
##$AMP= (0..31)
100 100 100 100 100 100 100 100 100 100 100 100 100 100 100 100 100 100 
100 100 100 100 100 100 100 100 100 100 100 100 100 100 
##$AQSEQ= 0
##$AQ_mod= 1
##$AUNM= <au_zg>
##$AUTOPOS= <>
##$BF1= 200.13
##$BF2= 200.13
##$BF3= 200.13
##$BF4= 200.13
##$BF5= 200.13
##$BF6= 200.13
##$BF7= 200.13
##$BF8= 200.13
##$BYTORDA= 1
##$CFDGTYP= 0
##$CFRGTYP= 5
##$CHEMSTR= <none>
##$CNST= (0..31)
1 1 145 1 1 1 1 1 1 1 1 1 1 1 1 1 1 1 1 1 1 1 1 1 1 1 1 1 1 1 1 1 
##$CPDPRG= <>
##$CPDPRG1= <>
##$CPDPRG2= <>
##$CPDPRG3= <>
##$CPDPRG4= <mlev>
##$CPDPRG5= <mlev>
##$CPDPRG6= <mlev>
##$CPDPRG7= <mlev>
##$CPDPRG8= <mlev>
##$CPDPRGB= <>
##$CPDPRGT= <>
##$D= (0..31)
0 1.2 0 0 0 0 0 0 0 0.06 0 0.03 0 0 0 0 0.0002 0 0 0 0 0 0 0 0 0 0 0 0 
0 0 0 
##$DATE= 1728036003
##$DBL= (0..7)
120 120 120 120 120 120 120 120 
##$DBP= (0..7)
150 150 150 150 150 150 150 150 
##$DBP07= 0
##$DBPNAM0= <>
##$DBPNAM1= <>
##$DBPNAM2= <>
##$DBPNAM3= <>
##$DBPNAM4= <>
$$ [...]
##$SUBNAM3= <"">
##$SUBNAM4= <"">
##$SUBNAM5= <"">
##$SUBNAM6= <"">
##$SUBNAM7= <"">
##$SUBNAM8= <"">
##$SUBNAM9= <"">
##$SW= 24.0689170037331
##$SWIBOX= (0..15)
0 0 2 0 0 0 0 0 0 0 0 0 0 0 0 0 
##$SW_h= 4816.95568400771
##$TD= 16384
##$TD0= 1
##$TE= 0
##$TE2= 300
##$TE3= 300
##$TEG= 300
##$TL= (0..7)
0 120 120 120 120 120 120 120 
##$TP= (0..7)
150 150 150 150 150 150 150 150 
##$TP07= 0
##$TPNAME0= <>
##$TPNAME1= <>
##$TPNAME2= <>
##$TPNAME3= <>
##$TPNAME4= <>
##$TPNAME5= <>
##$TPNAME6= <>
##$TPNAME7= <>
##$TPOAL= (0..7)
0.5 0.5 0.5 0.5 0.5 0.5 0.5 0.5 
##$TPOFFS= (0..7)
0 0 0 0 0 0 0 0 
##$TUNHIN= 0
##$TUNHOUT= 0
##$TUNXOUT= 0
##$USERA1= <user>
##$USERA2= <user>
##$USERA3= <user>
##$USERA4= <user>
##$USERA5= <user>
##$V9= 5
##$VALIST= <valist>
##$VCLIST= <CCCCCCCCCCCCCCC>
##$VD= 0
##$VDLIST= <DDDDDDDDDDDDDDD>
##$VPLIST= <PPPPPPPPPPPPPPP>
##$VTLIST= <TTTTTTTTTTTTTTT>
##$WBST= 1024
##$WBSW= 4
##$XGAIN= (0..3)
0 0 0 0 
##$XL= 0
##$YL= 0
##$YMAX_a= 715806
##$YMIN_a= -430181
##$ZGOPTNS= <>
##$ZL1= 120
##$ZL2= 120
##$ZL3= 120
##$ZL4= 120
##$ABSF1= 20.9415
##$ABSF2= -3.127632
##$ABSG= 5
##$ABSL= 3
##$ALPHA= 0
##$AQORDER= 0
##$ASSFAC= 0
##$ASSFACI= 0
##$ASSFACX= 0
##$ASSWID= 0
##$AUNMP= <proc_1d>
##$AZFE= 0.1
##$AZFW= 0.1
##$BCFW= 0
##$BC_mod= 2
##$BYTORDP= 0
##$COROFFS= 0
##$CY= -3
##$DATMOD= 1
##$DC= 0
##$DFILT= <>
##$DTYPP= 0
##$F1P= 0
##$F2P= 0
##$FCOR= 1
##$FTSIZE= 16384
##$FT_mod= 6
##$GAMMA= 0
##$GB= 0
##$INTBC= 1
##$INTSCL= 3.70164e-10
##$ISEN= 128
##$LB= 0.24
##$LEV0= 0
##$LPBIN= 0
##$MAXI= 10000
##$MC2= 0
##$MEAN= 0
##$ME_mod= 0
##$MI= 1.114404
##$NCOEF= 0
##$NC_proc= -5
##$NLEV= 6
##$NOISF1= 3.799351
##$NOISF2= 2.8
##$NSP= 0
##$NTH_PI= 0
##$NZP= 0
##$OFFSET= 21.03552
##$PC= 1
##$PHC0= -26342.21
##$PHC1= 9.38747
##$PH_mod= 1
##$PKNL= yes
##$PPARMOD= 0
##$PSCAL= 0
##$PSIGN= 0
##$REVERSE= no
##$SF= 200.129998640255
##$SI= 16384
##$SIGF1= 3
##$SIGF2= 2
##$SINO= 5.538805
##$SIOLD= 16384
##$SREGLST= <1H.CDCl3>
##$SSB= 0
##$STSI= 16384
##$STSR= 0
##$SW_p= 4816.95568400771
##$SYMM= 0
##$S_DEV= 0
##$TDeff= 16384
##$TDoff= 0
##$TI= <>
##$TILT= no
##$TM1= 0
##$TM2= 0
##$TOPLEV= 0
##$USERP1= <user>
##$USERP2= <user>
##$USERP3= <user>
##$USERP4= <user>
##$USERP5= <user>
##$WDW= 1
##$XDIM= 16384
##$YMAX_p= 422865298
##$YMIN_p= -538555
$$ End of Bruker specific parameters
$$ ---------------------------------
##NTUPLES= NMR SPECTRUM
##VAR_NAME=  FREQUENCY,     SPECTRUM/REAL,   SPECTRUM/IMAG
##SYMBOL=    X,             R,               I
##VAR_TYPE=  INDEPENDENT,   DEPENDENT,       DEPENDENT
##VAR_FORM=  AFFN,          ASDF,            ASDF
##VAR_DIM=   16384,         16384,           16384
##UNITS=     HZ,            ARBITRARY UNITS, ARBITRARY UNITS
##FACTOR=    0.29402158847633, 1,            1
##FIRST=     4209.8386997868, 0,             0
##LAST=      -607.116984220915, 0,           0
##MIN=       -607.116984220915, -538555,     0
##MAX=       4209.8386997868, 422865298,     0
$$ Real data points
##PAGE= N=1
##DATA TABLE= (X++(R..R)), XYDATA
$$ [...]
9671 70091 675 -31761 13047 89587 72404 64650 9424 1447 35389 59483 47984 -50819
9659 -50819 -9876 90385 76552 43324 63176 55759 -20188 27251 57314 -2722 10697 15270
9647 15270 -16361 -27183 -81106 -14674 34020 52098 59122 9087 78198 33455 13965 21313
9635 21313 -25392 -120173 -79607 -50601 -16555 -20959 15744 48078 11632 31836 -30 -14198
9623 -14198 -60136 -22893 53686 77885 12787 43638 -49438 -83082 -6256 78153 49542 -55007
9611 -55007 -17180 510 40123 -10655 -20121 -19665 -11845 -10707 21967 -15052 -48573 -33542 -32956
9598 -32956 -5648 6158 -53627 -36236 -32647 56557 4975 -9829 -3932 25117 66787 51199
9586 51199 37232 76410 -54781 55762 22303 -1974 31811 44199 65416 31355 85984
9575 85984 -6665 358 -20864 34060 -4890 -73448 -38402 -10981 -22891 3997 56291 15144
9563 15144 25610 76843 65682 13993 -4422 3544 -5406 -29296 -62732 -102207 -68085 -6296
9551 -6296 45757 82054 49156 79196 5724 69369 67868 12472 -16704 24069 -6355 46874
9539 46874 41273 1786 -30113 -2568 71165 -27546 -5995 -8651 -34743 1956 -32376 24647
9527 24647 -15335 -37307 -81637 44223 11245 -56544 -76247 -33384 -51714 -39926 -8356 -36117
9515 -36117 -4778 -39437 -46329 -26014 -25102 -58420 -4715 -78870 -121306 -46998 -18469 34272
9503 34272 -3941 -52900 -79556 -85313 -21039 16666 25794 -9287 17710 -13989 -36275 -69208
9491 -69208 -12969 5952 -65365 -75399 -38565 -29966 -8754 -62904 -49499 -65485 -56992 -36231
9479 -36231 -23500 -51836 26749 -57786 -76520 -61680 -69295 -20863 -52556 -59597 -42519 -61060
9467 -61060 -16870 8770 13393 32882 12077 55840 63426 -36622 -25595 7569 11954 -47117
9455 -47117 2896 -46697 -60560 -58600 -67615 -25543 -25282 31043 13885 8679 -7385 31438 -14356
9442 -14356 -24237 7184 57620 13121 8078 -53846 41460 52223 5478 -4591 39983 9555
9430 9555 -23462 -20503 -8047 -17798 -14519 -8199 24159 -26984 -25946 -54927 -52637 -1439 -37518
9417 -37518 -13732 16696 -42668 -24642 99506 81556 -23661 40147 54517 9760 -52238
9406 -52238 -56615 -13616 -49147 -56527 9368 12064 -34717 -12414 -12471 -23637 -27684 -83535 -54863
9393 -54863 -94986 -68978 -46143 -75469 -96409 -42164 -85756 -29183 54122 14164 -3775 -19458
9381 -19458 -11611 -51660 -12013 -7428 -53573 -93338 -90286 2551 -16893 13704 76068 32728
9369 32728 32816 -24782 48786 19999 -75780 -69908 -10143 7980 28420 3072 -30903 -11675 -59849
9356 -59849 -89044 -7715 -37166 -25517 444 64099 25629 -33762 -44887 -6194 -5639 37912
9344 37912 43362 59352 -35175 19330 -39268 -35819 -18124 -10801 -47892 -28340 59489 -10123
9332 -10123 -1191 11723 38063 9604 -24918 -80100 -68671 -42365 -91693 -25874 -27943 -68756
9320 -68756 -68515 -69452 -42184 -1974 -12574 -88544 -86038 -16723 -27311 -27023 -54427 -7455 -1329
9307 -1329 -11288 51532 -33405 -44554 -24383 -32890 -29764 -26790 -39534 -19381 -3279 -3494 -611
9294 -611 -1783 72942 13719 22395 -65671 -44429 -23215 -44486 -58638 25157 -55771 -18406 25921
9281 25921 34798 -23768 2025 22438 -14105 68961 -11352 -29273 45918 128879 46371 13562
9269 13562 12258 -2021 -8116 9758 -16446 29088 24422 24235 -3864 14336 8792 -7613 -72732
9256 -72732 1772 34683 -3334 44257 64025 967 -39205 -91923 -84034 -39050 -48433 -25316
9244 -25316 12280 29263 27363 -61462 2678 -13577 -20367 -11516 -19635 -57853 14026 12082 -8089
9231 -8089 55505 41427 -4739 48234 42801 -12144 -51342 19769 54594 76089 31780 -25660
9219 -25660 -95639 -93111 -104029 -66258 -52382 -8561 -24931 -19960 -48936 -22853 12903 33602
9207 33602 -6903 -7175 8592 873 51167 -50921 -63379 33845 4555 26639 -15321 -48580
9195 -48580 -50492 -88148 -50212 -41812 -30014 -42942 -23924 -40114 -39928 -26332 54763 60884 1436
9182 1436 -523 17143 -78706 -84608 -58490 -76988 -34349 -25644 7483 9816 -45797 38854 -21513
9169 -21513 692 33925 10855 7139 -103273 -93051 40322 -53529 -70592 -34477 -39535 -38899
9157 -38899 -107819 -66462 -60089 -70369 -114555 -72697 -57236 -52374 -27453 16382 -22192 2204
9145 2204 9071 -3712 -61512 -137609 -8125 -27881 32389 5505 -2500 -25588 -22721 5759
9133 5759 -12235 -87978 -59873 -36282 -5589 -47728 -74238 -31209 16522 46708 14664 -48004
9121 -48004 -6687 -8022 5179 12483 -40153 -33896 -13196 -29072 -90540 -57858 -23944 -84774
9109 -84774 -8689 -31452 -57030 -22845 -59118 -45751 -70394 -100283 -45125 -12243 -62305 -94052
9097 -94052 -77786 -35905 -34766 -21044 -23039 3979 -42886 -72569 -86634 -27488 -19361 3886
9085 3886 -42935 -63602 -27900 -54456 -46264 -20775 -72559 -13729 32099 39397 57340 31265
9073 31265 54616 5173 39166 53118 78198 -36679 -19012 70799 82891 6305 -26036 -34247
9061 -34247 31539 9866 -27954 -71599 -26991 -62463 -39898 -32844 -2746 5646 -40675 -32267
9049 -32267 -130736 -110144 -88036 -84976 -27677 -76435 16002 17091 33239 34409 42370 30709 25194
9036 25194 -12729 -62477 -3976 -85107 -81528 -127370 -16732 -57602 -55006 -43442 10103 -19499
9024 -19499 -93258 -3592 -61218 -11021 -25826 -28053 -65285 -27010 -14778 -63323 -34958 -47164
9012 -47164 -115089 -156676 -63927 -62067 -83586 -8186 23237 -54186 -23237 -48252 5918 19297
9000 19297 -4815 -43528 36606 -34935 -95746 7914 51830 -62891 -30460 -43208 -32282
8989 -32282 -83825 -37240 -42956 -12896 -12227 -31502 -19634 11801 30327 16407 15087 -47069 -10874
8976 -10874 -119441 -129140 -25678 39104 20802 -36986 -6492 -29294 -79067 -36902 26907 -19950
8964 -19950 10132 10867 -45663 27660 20742 4968 30590 25483 -39130 2259 -28152 -19711 -1205
8951 -1205 27322 5491 -16082 -21036 -84750 -67365 -106279 -85841 -3122 4350 -53954 -45475 -56624
8938 -56624 -44780 -2298 -19351 -37763 -41889 -8982 1791 -103786 -4463 31835 25412 26995
8926 26995 7959 -47704 35184 -17680 53248 61316 -61724 -111248 -73327 -26392 -58032 -25309
8914 -25309 36214 20503 7918 -12664 -28834 -20524 -1064 -34145 20085 -55195 -43480 32546
8902 32546 -74801 14569 18857 -4908 -15925 30453 -22296 30992 -3230 -24187 -52730 46018
8890 46018 70581 -31967 -66555 -11756 28348 40664 75367 65379 -29860 -2732 32493 -5438
8878 -5438 -36935 7928 21514 37385 5114 -19232 -44256 -38356 -36403 -23692 -34107 -16812
8866 -16812 -16734 42294 43088 44775 28008 -35564 -62926 -68247 -4542 -25307 -126043 -65348 -9809
8853 -9809 -12397 -31049 -50357 1533 -26135 -24409 -36412 -9844 5650 -5002 30866 21125 -31307
8840 -31307 -111361 -27651 -47384 -6179 -4818 18377 -1866 -70607 -55939 -104816 -63039 -46339
8828 -46339 -20340 -38667 -41587 -46357 -60267 -41262 -36142 -80101 -52195 -13108 -51284 -71261
8816 -71261 -33589 -84668 -98189 -99254 -4642 6901 -11062 17616 -8542 -60462 -94052 -60114
8804 -60114 -105000 -116487 -37685 -32495 -84389 -42477 -58420 -77199 -108299 -42362 -48246 -60646
8792 -60646 -16034 61402 71574 19869 -2297 -14454 -42964 -12496 18472 -25572 -6021 -11193
8780 -11193 3547 -9169 -30679 -65241 -80133 -45240 -11860 -42610 -46270 -1935 -16337 -57981
8768 -57981 -71734 -73074 -18180 -30776 -36218 -20821 -72360 -29152 -63223 -20774 -22191 -53756
8756 -53756 -78760 -30265 -10914 -11373 38487 37565 -42327 -5706 31498 10451 -67178 -50812 -24017
8743 -24017 -68728 -48843 40504 53277 -27089 -14994 2015 -83575 -71737 -75959 -89591 -3652
8731 -3652 -45287 -41433 -25322 -8345 -10622 -7401 -8025 78 29105 17976 -99338 -71544 -22159
8718 -22159 64620 -19369 13066 -31669 -47343 -47820 -262 -53324 -126184 -72717 -39252 -35049
8706 -35049 -27320 -56191 -53380 -122862 -44415 -73763 -24441 -73136 4656 -13819 -32336 -52362
8694 -52362 -102427 -72268 -83647 -55856 21135 12370 47982 7616 60345 54978 26881 80861
8682 80861 39684 -1193 -68788 -24236 -34117 -16600 20162 -9792 -5384 8703 -11149 -42563
8670 -42563 -110952 -92767 -96106 -41029 -19257 -5617 -36091 -65877 -71570 -48946 -55509 -70146
8658 -70146 -86483 -90810 -78958 946 26430 19830 -30138 -44387 -1315 -6253 -40893 6156
8646 6156 9900 -44291 -27092 -71316 -135928 -31284 -40859 -66631 -79818 -26823 -13603 -63101
8634 -63101 -81318 19343 29490 -33411 -23632 -22429 -73694 -8825 -158643 -98019 19032 14574
8622 14574 -32710 -55606 -73740 -29425 25449 -15553 34924 49514 69594 -44386 -53858 -31079
8610 -31079 -7390 -8990 126 -31303 -144437 -113566 -80927 -38224 -83111 -44675 -55066 -44622
8598 -44622 -53206 -26942 -11650 -31292 -990 7748 40954 73967 12422 28468 21172 -7807
8586 -7807 -80079 -76421 -90040 -42095 -49294 -70444 -20891 18855 11792 -52684 -46890 -65725 -25929
8573 -25929 -37783 -18126 -29812 -77904 -113018 -1563 -30493 17245 -71296 -46202 36818 71855
8561 71855 53231 -54273 -32550 -64701 -22499 13804 72908 -37771 -20025 -14026 -25976 -34065
8549 -34065 43055 26509 70091 5659 33564 20165 -51484 9524 -2285 -30412 -17099 58724
8537 58724 86939 -53178 -61724 -1137 43720 74729 -24314 6192 -22928 53697 37979 37079
8525 37079 3387 2349 37367 34077 -28624 -7516 2179 -54434 -28875 -19323 27502 51866 -25592
8512 -25592 27659 90215 79771 -34521 4850 -8890 -39891 -43226 -23133 5636 27111 -11286
8500 -11286 18635 54782 -7754 15744 -7099 -93835 -20154 10341 -27878 6399 26743 9868
8488 9868 27042 22215 72162 168356 48064 -92274 -81885 -89346 -102142 -55005 47238 7032
8476 7032 -21132 5304 77284 32678 3759 -104767 -61443 -45 -106830 -15905 -11379 18321
8464 18321 17878 55202 -8863 -8921 65123 -39311 -27253 45852 5921 3445 32852 -3656 -41382
8451 -41382 5666 -41851 -96597 -42434 -53074 -40622 -29056 -43241 -22472 -24807 -45461 -47691
8439 -47691 -81788 -64624 -42705 -26657 -57251 -38284 -41493 -91640 -68116 -43808 -36621 -103325
8427 -103325 -43803 -8374 -99355 27693 -52917 -106174 -48847 -29824 -68150 -40171 -90746
8416 -90746 -66725 -45431 -69566 -38040 12227 40303 -7743 -72776 -23204 -31472 -72741 -63471
8404 -63471 -140833 -75859 -26435 -66267 -52285 -91381 -82956 -11039 55122 53395 -29552 -17633
8392 -17633 -82385 -82189 -87375 -44032 -58758 13456 6510 17253 -38553 -79849 -51070 -47943 -77445
8379 -77445 -48602 -44775 -60311 -70776 -82500 -128522 -137744 -113860 -31596 12589 -1912 16089
8367 16089 -84170 -84396 -44482 -116194 -18767 -83823 -120609 -99417 -65565 -401 -39607 -21958
8355 -21958 -25428 -97473 -11209 -534 -57671 -63458 -66459 -8934 -43449 -27749 -24537 42703 -24830
8342 -24830 -91688 -36028 -19423 -62304 -108044 -110051 -103603 -33679 -103325 -29939 9513 1513
8330 1513 -3746 -101267 -100535 -63468 -72122 -70958 -42694 -97290 -88354 -72913 -69031 -10035 -54594
8317 -54594 -63135 -21975 -85127 -73978 -75868 -54608 -84461 -84548 -31703 -89615 15958 -22200 -525
8304 -525 -25803 -35005 3 34253 -55851 -141589 1864 -44190 -83057 -74851 -29483 -80351
8292 -80351 -63837 30384 -5970 -24746 -38815 -42791 13517 -28927 -52632 -14638 -50609 -84373
8280 -84373 5050 -20950 -38950 -28732 -42994 -21831 -58102 7880 -102628 -55824 -100287 -45143
8268 -45143 12372 -8771 -7404 -4902 80312 6342 -40298 7522 -49995 -30855 63959 -57084
8256 -57084 -73921 -28027 -30698 -93039 -58973 -50387 -87669 -11021 -28891 -3701 -2127 -56057
8244 -56057 20372 -8629 3485 -49879 -1415 -15569 -15082 -8099 -4912 -48038 -739 -19478 -11619
8231 -11619 8601 -20035 -120369 -24239 42818 20248 -1531 -60666 -77450 -115718 -69119 -20614
8219 -20614 -80298 -67098 -71614 -28208 -48325 -32644 -80736 -88179 -79995 -16737 -6900 -8174 -50210
8206 -50210 -63666 -78278 -73375 -5103 -22844 -12458 -95661 -80974 -69176 -85164 -53381 -52129
8194 -52129 -62730 -142141 -397772 -82360 -72529 -74711 -92779 -100328 -84588 -125290 -95041 -89323
8182 -89323 -47877 -48069 -101280 -98160 -63733 -4465 -53125 -70802 -107046 -22187 22501 -63791
8170 -63791 -43378 35534 -41043 -121837 -128981 -152819 -17145 -124611 -154452 -152696 -114993 -66007
8158 -66007 -98738 -161115 -82484 -94102 -109730 -75503 -128191 -86757 -53282 -144490 -140378 -61773
8146 -61773 -4830 2712 -54421 -120078 -91791 -66870 1470 -59218 -98894 -88405 -116312 -144295
8134 -144295 -96521 29716 -61190 -20160 -75313 -102778 -99617 -186132 -180821 -149073 -93703 -80429
8122 -80429 -14104 -43171 -25607 -127399 -109134 -44043 -73433 -137560 -109914 -87816 -89952 -90719
8110 -90719 -84897 -82015 -160905 -85979 -112843 -83549 -73705 -146115 -104992 -52111 -48258 -137908 -161325
8097 -161325 -159948 -95667 -95621 -99622 -60849 -95939 -134917 -216318 -80412 -41176 -58935 -67322 -125673
8084 -125673 -69759 -40368 -136713 -172769 -146929 -146144 -225486 -155951 -108997 -165632 -146500 -158681
8072 -158681 -180178 -87098 -123287 -129304 -93050 -113603 -77067 -74622 -77041 -64144 -40144 -114730
8060 -114730 -145939 -29026 -35206 -161865 -56012 -34491 -100098 -12890 -54882 -71720 -76935
8049 -76935 -46467 -42052 -75985 -93732 -45939 -30350 -5469 -85294 -121159 -15891 -82086 -84515
8037 -84515 -103161 -135749 -49215 -24551 1965 -34375 -29154 -88818 -98309 -46186 -36517 -57669
8025 -57669 -62026 -88939 -93036 -20314 -68169 -8125 -11209 -58702 -43749 -39504 -38683 -64770 -52783
8012 -52783 -115839 -127183 -39224 -72394 -70174 -69543 -130317 -85730 -85601 -98135 -107621 -122276 -33725
7999 -33725 -39848 4450 15449 -60391 -5651 3210 -16937 -53123 -66274 -87114 -15528 3440
7987 3440 -53863 -109152 -64664 -13388 -37863 -39650 -33667 -90199 7373 58498 24970 69040
7975 69040 -20019 -28679 4323 -88488 -116781 -34438 -24086 -43852 -1136 23430 -5492 -7477
7963 -7477 -4844 -51055 -28725 -81556 -88410 5636 685 46646 9334 -31222 -46386 3832 13130
7950 13130 -14017 -11773 -65425 -48820 -27835 -43337 -21536 -64167 -30888 -134148 -40718 -90634
7938 -90634 -126185 2611 -18437 -30147 -18764 -38126 -107490 -81053 9567 48565 38087 -66958
7926 -66958 6613 -20242 -104366 -20733 -94147 -46971 -74554 -92938 -66052 -30304 -38123 4300
7914 4300 -9729 -50617 -50375 -52553 -37740 -102733 -40779 -26715 -4204 31002 2664 -117956
7902 -117956 -52125 -22561 216571 -9714 -107266 -40037 -70876 -47608 -14183 87767 44666
7891 44666 4184 -27737 26514 27748 12508 52234 54616 -6457 -64272 -137427 -105122 -72
7879 -72 38601 17038 -1611 15361 -60885 -98033 -77605 -65886 -46619 -50797 -10850 21280 -13299
7866 -13299 -60554 26223 -4632 15020 -19688 -66250 9439 10727 -32867 -97848 -34440 16923
7854 16923 -7573 -53516 -98244 -37928 -121803 -77369 11967 52737 -37953 -34772 -40819 31169
7842 31169 47853 29673 36287 -22448 -52296 -8779 52190 16988 -4152 4687 53735 5595
7830 5595 11719 -19289 -16666 17394 23018 31290 21766 118509 59948 132288 157865 183055 205870
7817 205870 186283 113049 62752 76617 112717 85208 66710 48324 115163 89126 -72715
7806 -72715 -32657 -93130 -98572 -58623 -19313 -10124 -46999 -34005 -10807 -6853 338 64501 19825
7793 19825 -5553 28968 -3523 -32613 34762 47021 40791 -10259 -51483 4920 -65997 -5356
7781 -5356 1072 50349 10014 -8964 22457 15158 47993 40533 43361 -9924 2648 33862 109901
7768 109901 58593 57913 66283 54228 54251 24221 -11196 -37839 18318 21555 51740 112401 75316
7755 75316 38367 73557 7467 -8772 -3739 24903 39281 16562 -2629 -17339 45044 42385
7743 42385 21473 -31089 25814 34054 54639 93744 151508 153503 136640 90162 65314 43558
7731 43558 87577 101763 122970 129140 71677 108090 32262 48853 111624 41667 6152 4971
7719 4971 40641 64466 104144 70216 70621 18364 108097 175722 188337 193431 120120 180640 148667
7706 148667 201022 247549 198788 178205 149900 116549 159907 154876 141877 185718 184275 163489
7694 163489 197312 228096 308384 234369 256704 296511 292774 308173 301063 301864 299331 306786 415004
7681 415004 436416 455733 469007 451801 405075 419206 415779 400783 368146 368876 475241 526751
7669 526751 479035 459898 493967 410151 424430 430278 439021 444458 404371 488259 536171 528880
7657 528880 463900 405716 426782 435122 401435 384117 345918 426421 334597 342476 389209 366728
7645 366728 265729 265240 249160 270881 251528 365257 371692 280108 281849 340839 300781 317250
7633 317250 279518 309639 309854 348540 205049 176047 315426 203619 293167 341780 345689 278749
7621 278749 322870 254843 193940 196843 148482 171091 182763 166906 192082 188615 237437 236586
7609 236586 266734 174440 188749 260271 268075 234009 201004 259700 179213 198723 234274 232596
7597 232596 233479 227723 234792 187721 314541 216953 257321 290258 216543 232356 265256 273752
7585 273752 224839 250305 209254 195452 314660 305942 279944 247526 256596 276183 290417 273137
7573 273137 318493 238260 221284 322952 327627 314138 341596 352628 340023 359093 391935 423324
7561 423324 499644 541907 548739 556619 553805 500928 489892 384028 386073 437701 464805 365900
7549 365900 409772 384142 401087 446854 380728 439907 479211 480003 423878 395957 420590 411287
7537 411287 425003 464841 463888 486584 528301 552657 486291 466665 511570 547669 463887 442624
7525 442624 521912 433814 486161 491982 521310 518726 481831 480555 326131 389986 370869 333856
7513 333856 299519 243955 161394 213121 260276 160537 205623 258376 174096 193682 125273 105353
7501 105353 190747 196614 203858 195230 171401 158404 121579 118253 133199 196661 188868 201360 183520
7488 183520 148123 153413 134154 134469 171927 217848 208930 140553 157081 151740 200762 226093 234785
7475 234785 207927 184560 187889 221331 196637 202797 220254 161242 166075 158042 228586 300611
7463 300611 252242 261798 245983 223760 264359 211260 196349 231331 266657 246011 249663 184129
7451 184129 198628 218998 208146 237190 254638 212408 197050 256714 214123 171527 235906 158315
7439 158315 183956 204820 199433 211273 181731 205230 305608 286387 234926 265139 262578 252757
7427 252757 324106 279922 231314 246160 249107 352409 397143 299018 256126 315681 296478 268579
7415 268579 275863 318735 311725 330943 351120 336636 391874 411834 359749 299817 307233 342455
7403 342455 306370 420392 499578 511258 485435 516298 526001 530974 530882 545542 472644 402406
7391 402406 351242 392897 358247 268136 326523 326877 378990 368349 303018 350562 315986 328862
7379 328862 355419 329181 323292 319582 305990 229677 208496 229783 303597 412105 298317 194524
7367 194524 210810 237096 257869 220579 186003 222332 279857 272963 281835 277799 289395 263017
7355 263017 295072 248526 220688 334540 312749 252527 214234 187811 194846 218343 224306 238223
7343 238223 229384 149268 151353 220957 235845 224900 241126 186011 270490 326459 294119 288562
7331 288562 224510 336069 343412 297349 243235 280902 324453 319388 230455 269836 228464 307752
7319 307752 362164 294459 240208 245704 268427 298092 336086 323759 276690 213260 199293 246189
7307 246189 252630 295018 280584 195334 221631 328574 281057 229250 240757 332879 302086 278546
7295 278546 336528 278870 231885 269224 318321 323484 240098 256609 304364 361258 357635 303684
7283 303684 357468 298045 361203 370867 389203 346959 334492 290224 349331 351877 383586 344886
7271 344886 446499 402900 398395 354839 376897 432727 434536 374426 448450 448044 469358 459491
7259 459491 407371 451584 502963 496160 474041 454926 514859 561232 514050 480441 510226 491224
7247 491224 466077 484293 514733 521564 492947 447629 513005 498135 542514 573750 571828 498754
7235 498754 530587 498483 506487 434797 456116 553006 560987 533742 577972 581590 531462 545205
7223 545205 545730 520118 483631 536545 516226 452430 388106 429450 410575 527405 514438 486779
7211 486779 483497 452854 455314 531894 495318 548772 588695 512302 428824 507499 565833 475835
7199 475835 500067 518751 502884 459069 512717 493714 470926 511001 524846 509390 537884 557810
7187 557810 504808 543348 557691 575771 637641 638013 590142 619460 579686 564920 559255 621246
7175 621246 592370 655302 653735 670900 571757 637534 624461 620164 688542 694533 735320 790245
7163 790245 767497 833414 825159 822865 772877 801837 811170 814374 925304 881858 886842 869927
7151 869927 861720 878107 893247 877956 929991 916589 1006848 1049193 1072161 1145110 1135606 1194657
7139 1194657 1167907 1180976 1163004 1214082 1262126 1253889 1254915 1297682 1384306 1400822 1367805 1344376
7127 1344376 1358386 1443607 1458316 1526666 1604582 1485563 1512947 1539394 1582494 1630751 1658579
7116 1658579 1728605 1748227 1760615 1758407 1791989 1828084 1877032 1895996 1944616 2025016 2098832 2153652
7104 2153652 2204322 2241356 2263390 2363412 2473716 2483171 2602903 2746116 2889554 2993876
7094 2993876 3097632 3130032 3244523 3274272 3321664 3389355 3497484 3528325 3655815 3796349
7084 3796349 3904751 3933753 4140195 4366016 4490750 4652324 4805033 4968006 5214285 5437759
7074 5437759 5580503 5801707 6123071 6326395 6557487 6728092 7006317 7285584 7549050 7854560
7064 7854560 8175493 8403852 8914189 9299194 9791286 10308750 10830210 11439516 12115530 12787385
7054 12787385 13674490 14828528 16113883 17680509 19475759 21267671 23433066 25888847
7046 25888847 29332820 33640258 39917724 47607618 58207942 68014315 65660392 59021645
7038 59021645 49491532 39765148 32831326 27950316 24474899 21474821 19234863 17651475
7030 17651475 16388891 15330986 14606323 13909873 13436744 13097411 12805164 12694948 12650916
7021 12650916 12581622 12566652 12635049 12771437 12913854 13239524 13474951 13654575 13851026 14135362
7011 14135362 14383688 14798690 15253143 15887718 16608564 17359238 18132713 18817662 19554683
7002 19554683 20427844 21372326 22763084 24312317 26173980 27982572 29045963 29402755 29462878
6993 29462878 29170868 28801585 28608110 28566095 28465011 28333381 28029018 27756254 27426345 27292397
6983 27292397 27604956 28116536 28859427 30020347 31588874 33276800 34490809 35641997 36474053
6974 36474053 36996971 37276174 37565534 38117963 38713417 38834808 38266226 37225900 36021389
6965 36021389 34502245 32910960 31677269 31016465 30471720 30052764 29516310 28965782 28144823
6956 28144823 27106286 26098945 25308934 24918130 24867643 25187872 25259586 25046210 24835582
6947 24835582 24402995 23903884 23357853 22870412 22394914 21870741 21064327 20008635 18995090
6938 18995090 18001141 16971533 16025399 15196724 14692303 14484424 14241643 13886927 13356979
6929 13356979 12915435 12254985 11554372 10980917 10409129 9977693 9584402 9302380 9080368
6920 9080368 8796007 8607160 8373225 8337078 8242982 8126452 7983998 7820855 7666908 7485329
6910 7485329 7386884 7274909 7219493 7168821 7160213 7102675 7076405 7059319 7007228 6908515 6889412
6899 6889412 6833022 6758285 6700088 6638994 6572253 6477123 6397854 6396950 6388884 6355259 6365974 6399968
6887 6399968 6413806 6537119 6551229 6579648 6611549 6652604 6605201 6657083 6732610 6754288 6913440
6876 6913440 7063994 7191049 7404766 7486244 7740487 7965033 8202812 8539911 8973797 9461449
6866 9461449 10062018 10601457 10984187 11264139 11317525 11210048 10957869 10895574 10908275 11124359
6856 11124359 11283188 11266926 11083599 10767361 10190791 9635901 9059168 8754846 8409052 8213848
6846 8213848 8171801 8124541 8038265 8073282 8186694 8217756 8330089 8472629 8720098 8938543
6836 8938543 9202799 9638978 10171563 10718318 10987311 11257201 11304253 11152536 10981775 10749073
6826 10749073 10675364 10836054 11002562 11043584 10895454 10481326 10021136 9446654 8845573 8304310
6816 8304310 7828171 7493300 7264750 7117298 6944984 6791948 6649151 6630761 6626349 6566352
6806 6566352 6485593 6421833 6365302 6320623 6314757 6294766 6214496 6147752 6108580 6079571 6069304 5971343
6794 5971343 5883809 5914667 5936478 5901014 6049160 6142683 6109477 6173591 6334529 6401085 6395662
6783 6395662 6513378 6584969 6740544 6914020 7116436 7288275 7634893 8027151 8381330 8716109
6773 8716109 9099432 9468892 9599205 9700271 9679427 9552702 9376833 9366431 9405072 9484395
6763 9484395 9630624 9562985 9418605 9275989 9028588 8773076 8736393 8642609 8526546 8595759
6753 8595759 8579001 8694241 8851759 9062990 9360357 9680463 10096307 10502648 11143032 11809484
6743 11809484 12579133 13448525 14297939 15007665 15562296 15923906 16025662 16032534 16061153 16149348
6733 16149348 16320959 16425625 16314319 16012785 15733718 15438073 15109968 14971815 14807738
6724 14807738 14590681 14437284 14367954 14290275 14431147 14747739 15058092 15580423 16100225 16602921
6714 16602921 17158391 17529320 17793801 17986976 18171765 18203353 18225474 18293880 18233264 18107462
6704 18107462 17994125 17940575 18041927 18252972 18295520 18065118 17662822 17158659 16579985 15911693
6694 15911693 15425388 14954805 14545693 14009638 13744045 13498673 13183958 12869095 12609079
6685 12609079 12384337 12186433 12228462 12358503 12332397 12167070 11966447 11583758 11161394 10771670
6675 10771670 10535214 10425950 10360004 10277403 10144470 9950389 9750732 9555167 9100226 8586035
6665 8586035 8031190 7503928 7040646 6589711 6237462 5925326 5540286 5216892 4989142 4730078
6655 4730078 4531713 4315741 4146623 4062942 3982431 3862677 3641586 3507054 3455025 3323297
6645 3323297 3182655 3080906 3000435 2860162 2839530 2749699 2716151 2637549 2558574 2474327 2463132
6634 2463132 2466951 2356032 2250250 2189771 2216581 2095796 2054271 2003899 1959216 2036531 1970108
6623 1970108 1888421 1881984 1798859 1761806 1699698 1668575 1648191 1634092 1539044 1577671 1536207 1513111
6611 1513111 1510288 1462978 1450387 1444719 1412076 1436051 1395137 1337077 1328199 1267866 1228076 1192359
6599 1192359 1210717 1240983 1182948 1149419 1114725 1106997 1135046 1098923 1142464 1066685 1040212 949580
6587 949580 946535 1020452 1049067 988505 1005150 963793 1033490 914593 920936 966737 898572 894292
6575 894292 878457 797806 795122 824453 849870 884672 831084 814443 779975 797076 824192 849779
6563 849779 794855 845607 833182 733813 795565 819761 775377 778327 783459 781893 756324 758335
6551 758335 794067 832800 832633 800900 777361 744370 779179 688409 633130 726470 734526 668504
6539 668504 698349 691251 726345 749278 700814 688504 676006 653894 689519 661386 651201 632475
6527 632475 715083 695904 705413 748196 769966 793253 756319 783688 754182 853960 816507 875771
6515 875771 917323 934851 870496 838262 900001 903724 942867 1039754 1087352 1082111 1143887 1139192
6503 1139192 1127481 1076947 1048994 1067948 981019 901450 872965 894091 882487 913337 940285
6492 940285 925336 978728 1026509 994807 1000041 1131553 1149856 1180971 1182442 1245821 1252893 1183830
6480 1183830 1213783 1191693 1204870 1222171 1380932 1451097 1485840 1448785 1434857 1401770 1381189
6469 1381189 1302788 1289252 1294932 1272261 1243408 1191036 1159590 1122834 1079847 992697 903821 912861
6457 912861 841785 790229 833936 885471 825048 807324 866121 852340 846999 787557 851292 893442
6445 893442 900910 951206 1044675 1015905 1011573 1080564 1183931 1176315 1155432 1070519 1064498 1030688
6433 1030688 1014690 1086937 1011732 950739 987627 873531 819165 762181 729124 630580 629156
6422 629156 700732 590319 534981 556397 526457 520424 479193 442873 554392 469297 520091
6411 520091 492577 514861 457993 449313 476340 458273 440507 440009 508909 482129 456790 472532
6399 472532 338873 374291 414365 427205 359664 302581 376444 366083 414373 369042 425477
6388 425477 376417 376659 338023 363261 302705 345705 363865 326535 301712 301601 396443 334407
6376 334407 302310 349346 330148 306795 295722 402987 382209 312923 304075 293548 354253 348154
6364 348154 268842 278878 260186 253213 227191 171758 237888 183517 205562 168585 129845 119390
6352 119390 160158 245948 183462 102254 161240 221957 198523 165707 220888 168084 118615 163674
6340 163674 297743 236388 185851 208956 235303 199693 167721 145256 104677 96120 90697 119205
6328 119205 155882 160763 142299 182183 187304 141362 106911 114426 104884 75192 53615 141935
6316 141935 135498 128483 179526 127944 111248 123875 160255 191920 191269 194077 154621 171352 174256
6303 174256 197994 160534 188029 214542 182349 155088 213760 153737 193158 231032 203298 207000
6291 207000 103131 155361 166847 185026 177876 146916 201968 214618 189733 227249 202717 178381
6279 178381 189250 163828 197818 192641 101514 171376 112172 139751 156203 119366 110880 186078
6267 186078 168445 149274 166718 227714 246379 195533 163586 175082 164069 131892 187403 218452
6255 218452 223256 197789 272355 169531 139394 234879 190978 146214 142743 172804 149665 112633
6243 112633 92066 117753 181868 167741 139121 228052 204952 93099 87991 89077 105181 113630
6231 113630 150331 39982 85584 56009 108398 144143 98974 99995 63759 99777 93726 114846
6219 114846 123083 97878 96601 96305 225006 227242 171277 200722 163769 160804 227045 176788 186243
6206 186243 159851 143329 227261 200894 204194 161635 129476 171938 156000 226657 237775 266980
6194 266980 191997 223438 260333 189218 241143 227538 240518 357973 305956 202085 178603
6183 178603 125295 135679 167687 122385 136208 209680 247152 156766 89825 162584 115289 146162
6171 146162 166160 160314 101477 144756 168230 213359 187402 132283 210246 107959 73989 88402
6159 88402 84865 111694 115443 182447 127775 94626 128299 143917 166017 232916 158271 167515
6147 167515 150735 120457 187278 249662 200698 144099 159755 72549 103056 170291 182641 171053
6135 171053 138742 81695 189673 161307 202428 156297 156824 196839 68817 140908 118144 120247
6123 120247 119807 117603 133189 98360 183533 141751 192696 243110 275463 209185 242461 260074
6111 260074 150339 125876 113386 163370 224619 220777 247027 203220 216367 300507 222100 264755
6099 264755 268652 245455 233300 170959 150417 238743 206475 168863 212067 280367 323590 333054
6087 333054 308914 268909 287254 366018 347607 330607 323864 355900 291049 308511 261807 390649
6075 390649 386863 349576 326901 311494 269602 275438 306608 267379 308538 329020 296563 322100
6063 322100 278134 270974 261009 255856 272906 241974 312534 317698 330642 357661 337543 333114 361614
6050 361614 376602 305403 295153 281048 259970 267069 316090 284561 270021 264260 279139 372486
6038 372486 297303 311327 330655 326791 326959 311636 347790 353222 310848 404169 377565 411278
6026 411278 381672 315260 320573 347335 301284 346271 429851 429201 424467 474593 489107 519047
6014 519047 589846 621269 592942 560534 595920 611619 573921 625767 606566 610820 645303 649545
6002 649545 575450 633123 688812 684114 667434 582034 640565 704264 668675 680452 699815 717705
5990 717705 739578 767250 790135 788819 830682 951421 900994 865183 971186 1011457 1075533
5979 1075533 1140216 1153750 1202174 1245037 1427500 1481168 1631546 1749695 1778610 1959268 2049067
5968 2049067 2050186 2119560 2068159 2056122 2050413 1985658 1892244 1773762 1800473 1797441 1744979 1767242
5956 1767242 1837848 1807537 1820475 1846871 1891631 1859463 1914733 1924852 2054390 2128220 2110947
5945 2110947 2132862 2227979 2392338 2440585 2523134 2650420 2671442 2772871 2890711 3006675
5935 3006675 3166775 3315553 3489189 3662241 3809670 3984792 4188922 4328411 4493641 4564941
5925 4564941 4674088 4776973 4829042 5004148 5115855 5372732 5603984 5807183 6129117 6410161
5915 6410161 6723645 7021395 7400078 7815323 8206919 8617422 9015619 9461094 9865936 10318596
5905 10318596 10720222 10983923 11203596 11328416 11352090 11277875 11170946 10917921 10465965 9988024
5895 9988024 9559344 9101111 8637703 8167948 7696676 7298923 6897340 6543350 6123854 5822060
5885 5822060 5448955 5198292 4984544 4732044 4531452 4397691 4175742 3984435 3834602 3663894
5875 3663894 3575110 3573699 3470374 3440577 3454039 3338960 3323538 3314086 3218598 3103668 3014527
5864 3014527 2822644 2789757 2771189 2637345 2461522 2411860 2424777 2423812 2509704 2591811 2561478
5853 2561478 2523750 2458929 2428819 2427274 2342804 2266516 2147278 2037289 2010802 1914057 1842097
5842 1842097 1727235 1749550 1738533 1721267 1649271 1642188 1645592 1650147 1637410 1633530 1558973 1507126
5830 1507126 1556355 1556284 1563902 1511567 1479306 1444005 1364207 1391462 1316186 1243455 1356842 1338440
5818 1338440 1271038 1229009 1209758 1197053 1233572 1210402 1181019 1136581 1150964 1068889 1031341
5807 1031341 1072922 1091582 1059638 1088734 1120301 1073025 1137051 1153169 1272551 1267807 1369273
5796 1369273 1430460 1397385 1484518 1514310 1512377 1524188 1581141 1512085 1510577 1442814 1378821 1330489
5784 1330489 1241268 1207447 1279213 1194838 1159027 1230562 1152439 1120447 1212853 1241089 1136834
5773 1136834 1254183 1263070 1197761 1278381 1258608 1264944 1331740 1306240 1208315 1204963 1183579 1181252
5761 1181252 1122945 1093119 1120049 1141908 1150046 1129984 1220017 1255244 1218248 1207233 1220954 1271382
5749 1271382 1243409 1226673 1245409 1225614 1199519 1240363 1307012 1323637 1315356 1342873 1466947
5738 1466947 1428856 1438998 1518494 1556343 1632355 1730557 1781802 1850060 2012298 2139471 2230795
5727 2230795 2382445 2567966 2815824 3093829 3433820 3588188 3800941 3937401 3877508 3711894
5717 3711894 3408105 3165467 2809917 2555728 2317726 2152206 2016420 1783150 1656781 1512177
5707 1512177 1429280 1399008 1317336 1292000 1316898 1293399 1220385 1226599 1164633 1156697 1144298 1141218
5695 1141218 1061731 972286 960414 943767 875651 873168 841052 823256 828377 825319 788748 750885
5683 750885 753177 716337 664069 619301 606967 585809 607426 566809 595364 604347 473890 491396
5671 491396 472510 359337 402927 421428 478120 427232 409210 410534 354713 322665 334424 388832
5659 388832 366597 388646 369230 397164 347589 337564 411920 331999 332864 330386 324934 331636 256653
5646 256653 318078 363762 263137 286761 308182 264748 298209 250469 295040 319579 344370
5635 344370 299937 265612 266572 280278 358372 318869 232434 183931 218076 211869 143392 167896
5623 167896 220272 208369 230565 237550 194750 187515 118045 141295 247997 198065 184100 128742
5611 128742 179237 276716 249958 194515 218487 187821 211715 226022 177860 195019 223027 201642
5599 201642 148185 144552 214017 178297 240727 230601 281556 254926 285492 327656 372028 412934
5587 412934 327914 305081 331023 362978 366676 343638 216382 226269 236942 116089 111843 231822
5575 231822 230941 190020 217630 193036 237704 220231 268406 277848 281809 246809 235085 229195 208560
5562 208560 252033 199817 207382 200956 217266 258832 234536 223505 173032 119359 137158 270972
5550 270972 309229 212668 125402 158315 173037 188160 309205 286232 370629 364498 385372 307264
5538 307264 260836 286682 327612 340027 284727 308262 293679 248037 201555 210578 250083 278168
5526 278168 280815 307995 266609 265265 208920 204682 250210 315475 367444 315576 238976 239302 334856
5513 334856 296443 298385 332784 422459 313772 312677 316985 338264 358149 328336 331917 346435
5501 346435 388405 496197 475569 430538 482600 398151 417112 465111 454756 396170 383485
5490 383485 315827 335175 449715 370542 403925 342155 381980 467895 566460 505430 537171
5479 537171 536329 542240 518065 528896 518871 558457 524544 535197 528313 594817 641331 645597 659682
5466 659682 641923 627689 604395 636548 645576 674697 716033 742556 745889 743206 830928 888858
5454 888858 790244 801410 804831 726185 770230 757210 732652 767135 690164 733523 693585 681475
5442 681475 669425 642688 627308 670746 696058 736549 764664 761654 742322 752415 739690 748555
5430 748555 778983 816296 799597 824925 900977 962946 874571 928596 931692 926286 882152 864454
5418 864454 919850 940867 908592 909876 882876 912225 864803 858713 789751 789485 820851 894800
5406 894800 864207 863802 831268 901251 928114 871566 885574 967230 968477 957894 891703 924334
5394 924334 957519 943182 959420 936925 938888 879113 878238 817817 811341 789903 794589 804780 839088
5381 839088 779311 756205 771349 785125 816949 862651 891792 895198 839231 810017 761428 779260
5369 779260 821122 732328 625972 595209 672422 701008 669649 741656 690964 664810 696672
5358 696672 712731 702086 640279 696881 676782 675705 696440 729865 734764 674606 675677 760954
5346 760954 667740 624841 665105 671245 717755 768911 763283 729966 723803 710525 730987 744647
5334 744647 747388 872642 850817 858100 902866 928967 953289 937896 960335 956200 970701 982111
5322 982111 1102131 1162785 1143125 1211430 1223093 1211605 1245690 1347031 1452887 1538893 1632981
5311 1632981 1727897 1648420 1542553 1543825 1553719 1544455 1470856 1496139 1364384 1486240 1426165
5300 1426165 1444407 1461793 1466854 1440479 1415936 1461988 1482327 1404913 1415444 1398978 1423459 1397354
5288 1397354 1303209 1358662 1422261 1370667 1357277 1330566 1308802 1450764 1465814 1423070 1400359
5277 1400359 1314173 1301101 1234545 1219982 1144784 1136123 1144942 1091662 1119806 1154463 1231756 1211928
5265 1211928 1158423 1184723 1154365 1172337 1210408 1187596 1114780 1111540 1110217 1164606 1180311 1169490
5253 1169490 1192899 1149139 1139780 1225516 1324559 1280099 1209940 1206830 1335881 1332444 1457702 1479376
5241 1479376 1545683 1663559 1628996 1674767 1744803 1865981 1949906 1866818 1861969 1880960 1819638
5230 1819638 1752785 1701321 1707708 1711417 1770656 1783695 1751662 1815769 1856506 1914471 1898209 1905548
5218 1905548 1939306 1887927 1941695 2019537 1951062 1974399 1905492 1939848 1951755 1919875 1981336
5207 1981336 1970957 1978344 1942858 1933014 1957514 1991441 1971163 1960395 1925687 1983809 2029425 2051760
5195 2051760 2131897 2125163 2174599 2151457 2117172 2125378 2244431 2308417 2247103 2316152 2292629 2287291
5183 2287291 2371755 2368445 2438902 2380530 2478546 2499023 2515806 2511602 2534424 2518795 2483286 2581849
5171 2581849 2582831 2594461 2613988 2644874 2661959 2661933 2644096 2749871 2747556 2767213 2816375 2784779
5159 2784779 2805304 2876761 2831542 2830094 2855228 2900712 2904573 2849771 2924942 2957187 2961484 3045880
5147 3045880 3041578 3066128 3115736 3160005 3157282 3309958 3293866 3364955 3319067 3344825 3449162
5136 3449162 3551980 3606203 3642560 3670654 3690057 3782345 3884897 3960155 3951405 4083896 4142562
5125 4142562 4262817 4350451 4444419 4584837 4657034 4714422 4882460 4972920 5046518 5255909 5366716
5114 5366716 5465955 5678921 5812125 6076866 6333714 6574528 6741381 6943421 7060613 7312829
5104 7312829 7597840 7968251 8186801 8465056 8777344 9206603 9604571 9935698 10297133 10723405
5094 10723405 11158741 11680040 12165916 12654669 13262081 13863699 14455105 15038522 15658364
5085 15658364 16327546 17001260 17751769 18574042 19490802 20398243 21397703 22410428 23467732
5076 23467732 24606411 25792838 27129202 28467623 29883257 31477741 33279624 35323375
5068 35323375 37622386 40341210 43302104 46595568 50371259 54809279 60160171 66850980
5060 66850980 75109447 84806772 94376991 99566764 101401626 101343455 99295403 96329549
5052 96329549 94786322 95883159 99690534 104427504 107349179 110162584 113633660 117663573
5044 117663573 122051449 125791132 126970054 125824759 123075442 119301535 115538256 113939982
5036 113939982 112706286 109929100 107345574 105094912 102983697 102328891 104260482 108898144
5028 108898144 113362740 112786293 108560592 101731195 92195681 81266567 71410239 63595497
5020 63595497 57587710 52519099 48258490 44734788 41726626 39255442 37390575 36043492
5012 36043492 35072410 34277794 33387644 32073586 30671008 29074009 27317031 25675513 24231558
5003 24231558 22960783 21917454 20995615 20174558 19488360 18778183 18222033 17768248 17382971
4994 17382971 17032374 16753028 16458100 16154405 15925989 15702240 15507689 15338581 15185176
4985 15185176 14977654 14904898 14746829 14676376 14676079 14595447 14580114 14586008 14705741 14780773 14841648
4974 14841648 15055613 15312356 15577184 15788337 16127562 16585717 17007479 17440464 18012611
4965 18012611 18645125 19380119 20369513 21485775 22648947 23983237 25287108 26186403 26681693
4956 26681693 26890042 27030408 26994550 27150470 27609298 28384123 29232681 29999350 30972625 31942975
4946 31942975 32971859 34111776 35055282 35590458 35742572 35488452 34920429 34248519 33601980
4937 33601980 32936624 32281508 31675793 31244033 31009635 31064505 31552763 32368585 33466597
4928 33466597 34187229 34745399 35112403 35079493 34469128 33267063 31650078 29713908 27502868
4919 27502868 25351162 23488078 21883772 20592091 19631325 18826480 18389978 17978581 17765262
4910 17765262 17854333 17975253 18213390 18554242 18732770 18553073 18218413 17598188 16645518 15665059
4900 15665059 14794442 13802443 12982198 12279720 11595471 11056610 10585733 10162263 9813281
4891 9813281 9554915 9333388 9083428 8889314 8736357 8589706 8484072 8453715 8336579 8162355
4881 8162355 8116206 8014011 7989424 7793370 7638485 7547715 7525652 7403668 7357082 7337590 7324995
4870 7324995 7235157 7266687 7253682 7204992 7186371 7147577 7131120 7051735 6924314 6997204 7094479
4859 7094479 7103716 7081418 7076790 7095483 7161482 7191040 7229958 7198387 7225590 7269132 7193586 7281519
4847 7281519 7294574 7369758 7478957 7450093 7409146 7372365 7439972 7515876 7517636 7557013 7544791
4836 7544791 7572315 7669436 7663664 7593180 7604093 7678154 7713500 7740621 7668465 7661063 7710442 7717448
4824 7717448 7724766 7732158 7721494 7799048 7884508 7820221 7842507 7816222 7889101 7933926 7983190 8048170
4812 8048170 8044320 8116379 8138621 8182921 8234849 8306277 8309234 8404537 8471679 8621118 8761459
4801 8761459 8838272 8911621 8909152 8936564 8943334 9031243 8941973 9044517 9106451 9169383 9256749 9291499
4789 9291499 9329633 9394806 9400476 9502812 9533047 9472206 9513021 9454599 9478161 9582632 9580289
4778 9580289 9634237 9632541 9721175 9680201 9735273 9792148 9782164 9742990 9816092 9841516 9808757 9726860
4766 9726860 9742210 9737018 9743072 9711687 9638093 9641298 9681206 9669575 9720798 9795239 9853152 9817096
4754 9817096 9748146 9804562 9863354 9967169 9941894 9903040 9943990 9926126 10037268 10066774 10181427
4743 10181427 10216422 10244035 10343607 10444665 10489348 10515684 10663308 10674768 10867365 10999473
4733 10999473 11103268 11225698 11355529 11477876 11535198 11613534 11776490 12039098 12279276 12512604
4723 12512604 12703418 12830182 12998476 13100745 13156348 13262415 13240533 13257096 13334158 13487930
4713 13487930 13613050 13760154 13978309 14207831 14539799 14838249 15132755 15470639 15811072
4704 15811072 16127585 16473339 16766761 17023936 17254470 17687253 18077965 18544186 19064442
4695 19064442 19537335 20092308 20591758 21055797 21613215 22099954 22609364 23106322 23678428
4686 23678428 24178502 24809467 25634696 26364158 27278026 28323636 29379772 30592092 31676743
4677 31676743 33064461 34520190 36067257 37787049 39716405 41642539 43648331 45842350
4669 45842350 48261357 50998581 54131880 57557765 61434379 65938193 71053298 77177487
4661 77177487 84852725 94211374 105161420 115118422 119960929 121086601 120005183 116722142
4653 116722142 112657467 110613916 111555131 114823461 116901079 117791234 119010783 120680281
4645 120680281 123103990 127126192 131840393 134407262 134403631 132992512 130599623 128209840
4637 128209840 126450986 123657649 120860548 118419628 115719897 113268518 112904598 115054925
4629 115054925 119282467 122620951 121646402 117758291 111873259 103628023 94466804 86371851
4621 86371851 80299232 75938679 72842134 70558924 68848901 67513651 66544742 65734591
4613 65734591 65076956 64551683 64060004 63229880 61901457 60166015 58175747 56205006 54362755
4604 54362755 52716923 51419481 50210336 49113631 48074926 47191196 46159968 45088644
4596 45088644 44012099 42972960 42075403 41480485 41144885 40830162 40528307 40169820 39777358
4587 39777358 39407624 39127200 38843022 38498834 38203035 37791617 36989611 35751483 34372235
4578 34372235 32873469 31214851 29425517 27780155 26347964 25005047 23835384 22860964
4570 22860964 22102850 21472488 20991897 20605647 20261332 20004403 19866913 19720875 19659452 19597068
4560 19597068 19637613 19770116 19934264 20089520 20110941 20209083 20251840 20262314 20176815 20156778 20202019
4549 20202019 20332125 20485681 20712758 20938361 21171145 21592006 21907592 22257321 22591856
4540 22591856 22879327 23223631 23635486 24138923 24623591 25214275 25869347 26501671 27044335
4531 27044335 27621927 28292293 28891328 29663876 30599885 31774323 33044756 34370594 35892015
4522 35892015 37643366 39666140 42011715 44690933 47495870 49990529 51827602 52932427
4514 52932427 53374663 52953579 51974831 50814051 49471023 48073026 46421841 44598822 42832897
4505 42832897 41126964 39665754 38523612 37469913 36285507 35011738 33729187 32372323
4497 32372323 31158978 29993124 28858923 27805450 26791687 25869442 25012257 24531041 24402159
4488 24402159 24306768 24090680 23598048 22657028 21483474 20186389 18766051 17592058 16562839
4479 16562839 15647170 14971882 14236568 13616229 12998125 12662722 12238785 11886576 11585123
4470 11585123 11283022 10968298 10708747 10527246 10324211 10052691 9821250 9608675 9367651
4461 9367651 9185408 9083056 8804877 8773673 8695815 8510094 8420547 8264016 8161950 8029546
4451 8029546 7922981 7885547 7788256 7702500 7558826 7486507 7362077 7248027 7209795 7163459 7000613
4440 7000613 6972696 6858198 6813433 6728028 6607847 6574618 6576889 6487155 6385816 6388414 6325098
4429 6325098 6193486 6105153 6163859 6122612 6083244 6118731 6106690 6074003 6094737 6056479 6147819
4418 6147819 6153403 6185778 6277529 6388974 6503128 6498579 6576121 6513812 6549907 6514790 6546337
4407 6546337 6560256 6665922 6823298 6873028 6935242 7079894 7320039 7618410 7871169 8203635
4397 8203635 8338098 8367481 8548693 8643725 8640501 8769896 9016051 9184397 9107160 8944082
4387 8944082 8777445 8477869 8202157 8049388 8009075 7841399 7767303 7704697 7668377 7714025
4377 7714025 7791750 7847501 7894775 7880858 8027386 8149308 8145763 8157568 8178952 8200243 8211064
4366 8211064 8174020 8174468 8113977 8121432 8040173 7986275 7886670 7783848 7672268 7538733 7360274
4355 7360274 7222655 7086454 6944371 6808192 6761883 6651598 6595846 6470062 6435557 6321628
4345 6321628 6292946 6214534 6144432 6111361 6125539 6127752 6072909 6071874 6084759 6010032 6035434 5953031
4333 5953031 5956394 5823939 5760603 5646487 5748123 5899737 5949840 5804163 5742070 5741487 5775267
4322 5775267 5788268 5744941 5746717 5906419 5878040 6024194 6029394 5988468 6037472 6029168 5932345 5908951
4310 5908951 5871645 5835087 5844081 5886930 5819229 5834672 5832285 5853912 5834657 5746429 5688107 5776046
4298 5776046 5751622 5804310 5755422 5785676 5689426 5647811 5643721 5622653 5643971 5675157 5758213 5807385
4286 5807385 5834931 5762917 5668412 5583140 5602493 5549861 5475208 5538430 5526081 5597919 5570690
4275 5570690 5587671 5666197 5695091 5800736 5901161 5833088 5886755 5965976 6053362 6132570 6160440
4264 6160440 6235664 6272775 6357197 6412976 6585317 6684457 6853750 7021556 7207353 7282540 7481590
4253 7481590 7628303 7781147 7937686 8205450 8353556 8573593 8670992 8965222 9097033 9461535
4243 9461535 9760777 10031356 10297555 10654578 10912645 11286551 11588848 11865216 11980348 12246083
4233 12246083 12361833 12610677 12871154 13195412 13506656 13977634 14282025 14762205 15219005
4224 15219005 15553987 15824219 16117323 16304257 16621340 16772129 17142526 17488920 18003720
4215 18003720 18381491 19108330 19961463 20900948 21837077 23002271 24047238 25257126 26220860
4206 26220860 27057929 27434593 27774949 28030465 28624650 29211856 30075678 30949748 31973931
4197 31973931 32773959 33707537 34424160 35238410 35914429 36654969 37290083 38308893 39470481
4188 39470481 40839816 42245218 43857371 45294452 46835760 48407865 50211619 51885676
4180 51885676 53684199 55326830 57207496 58977286 61174099 63430409 66241945 69036620
4172 69036620 72608959 76410199 80750129 85217026 90616561 96649122 104262593 113085379
4164 113085379 124291162 136647456 150938366 167082414 187097560 212143543 247255567
4157 247255567 292057227 350182173 410753698 422865298 406755325 377474330 328380574
4150 328380574 268190013 218507778 182953436 157063527 136317778 119859525 106913170
4143 106913170 96224593 87575337 80747732 75153895 70418131 66323424 62639523 59097097
4135 59097097 55517108 52448468 49594494 47104759 44895883 43140863 41525994 40107947
4127 40107947 38802346 37688965 36501595 35491119 34609905 33963478 33405042 33089863 32660791
4118 32660791 32343520 31863945 31659221 31464137 31604328 31873925 32328881 32934551 33876899
4109 33876899 34880314 36444654 38468684 41532651 45514421 51007521 57312955 59304127
4101 59304127 57515109 54359535 49027932 42698525 37196880 33358489 30339888 27943411
4093 27943411 25838327 24288216 22888844 21819573 20937118 20361653 19723758 19392258 19053879
4084 19053879 18830067 18447705 18307738 18102104 17975920 17785826 17726310 17631528 17622628 17615425
4074 17615425 17593590 17584895 17836249 17967852 18367280 18789284 19408379 20005499 20783741 21523526
4064 21523526 22151971 22626615 22935506 22942876 22838749 22600828 22407836 22120910 21926981 21885755
4054 21885755 22002717 22121213 22526516 22888960 23363637 23751327 24210430 24684724 25167457
4045 25167457 25646975 26255095 26872467 27811516 28671102 29613622 30704536 31949856 33264906
4036 33264906 34902964 36606229 38457420 40382814 42402375 44270517 45989707 47244875
4028 47244875 48138498 48600610 48891622 48942492 49217869 49553159 50070790 50663716 51463447 52363536
4018 52363536 53407274 54491970 55710028 56805376 57876781 58586959 59104097 59174837 59157200
4009 59157200 58746980 58140070 57468181 57194516 57052350 57413692 58387095 60327485 63366838
4000 63366838 68105724 74155214 82137854 89401841 89742970 86576906 81382979 73829219
3992 73829219 65535936 58637655 53150430 49113148 45543931 42629984 40513561 39045555
3984 39045555 38146097 37612953 37102191 36541506 35662159 34602500 33150727 31567896 29907946
3975 29907946 28263289 26543407 25004651 23708640 22599454 21567750 20884052 20163332
3967 20163332 19551161 18937256 18454596 17901962 17551626 17129703 16809543 16517324 16297197
3958 16297197 16119003 15924562 15818514 15855782 15790815 15708202 15607444 15501390 15439286 15360111
3948 15360111 15311264 15336702 15442958 15587661 15816894 16162512 16546795 17028306 17569057 18224228
3938 18224228 19025396 19996217 21185052 22823427 24608656 26452743 27066937 26848003 26169075
3929 26169075 24791320 22652036 20595025 18865165 17497847 16495670 15676338 15061675
3921 15061675 14759588 14460755 14298494 14296502 14146588 13919041 13393254 12851672 12194152 11627374
3911 11627374 11079828 10659557 10301176 9910401 9616115 9386015 9115375 8916131 8762702
3902 8762702 8656871 8625182 8517258 8380780 8353432 8229970 8071715 7863142 7649261 7536313
3892 7536313 7409364 7321292 7180778 7146994 7054546 6998128 7030389 6932304 6806745 6821701 6768485
3881 6768485 6719898 6734185 6794880 6730926 6736216 6783849 6846919 6889289 6847452 6956118 7018200
3870 7018200 7091384 7236937 7312758 7542107 7718814 7739681 7925154 7947720 8120772 8263143
3860 8263143 8381257 8553445 8775229 8948581 9237058 9560487 9943260 10267006 10558766 11008690
3850 11008690 11569737 12066075 12550549 13161472 13621453 13925673 14300023 14829741 15392922
3841 15392922 16047366 16793534 17663394 18882024 20333696 22090774 23833910 25276412 25970109
3832 25970109 25849788 25158833 24136231 22845877 21733125 20965984 20461164 20105651 19802083
3823 19802083 19722367 19753069 19858506 20046924 20366962 20917595 21473872 22274124 23167441 24220703
3813 24220703 25439335 26978881 28679298 30562553 32750908 35156607 37769129 40804780
3805 40804780 44293027 48524572 53577727 59235826 64795096 69349543 71139868 69875100
3797 69875100 66355977 61079157 54867349 48894985 43740887 39613841 36333284 33673342
3789 33673342 31654145 30002308 28629048 27613322 26978872 26492904 26212289 26163561 26162260
3780 26162260 26075973 25803024 25519885 25232364 24866546 24531777 24501935 24550450 24661598 24930203
3770 24930203 25273048 25673649 26033505 26318268 26393908 26430679 26271741 26201262 26119229 25930917
3760 25930917 25634023 25072588 24264882 23430710 22705776 21995566 21518131 21022621 20753525
3751 20753525 20626679 20567793 20625022 20719202 21026534 21399630 22057058 22764356 23521329 24227026
3741 24227026 24772872 25243092 25498589 25675602 25773878 25772791 25774631 25769333 25953840 26219593 26716800
3730 26716800 27570406 28473738 29516570 30565696 31398178 32009525 32342924 32567926 32632520
3721 32632520 32789063 33026573 33404394 34044008 35058447 36456710 38130565 40274310 42764895
3712 42764895 45440977 48310561 51507783 55387683 60268371 66623740 74447295 82776771
3704 82776771 88254684 89093748 86647081 81369904 73765413 65342736 58140523 52465452
3696 52465452 48050411 44630551 41975580 39988999 38199486 36662799 35335879 34112535
3688 34112535 32942394 31822951 30978330 30427136 30171926 30217324 30605767 31383000 32408459
3679 32408459 33836334 35750984 38149496 41266310 45035736 49033545 51821147 52299366
3671 52299366 50943210 48025717 44188798 40124640 36541573 33779498 31769060 30286498
3663 30286498 29017468 28141332 27466203 26656834 25779708 24827879 23776371 22564902 21439581
3654 21439581 20282963 19325321 18568043 18007785 17480242 17237508 17071275 16755601 16378826
3645 16378826 15882091 15303258 14656484 14009857 13407408 12951700 12511647 12153649 11916971
3636 11916971 11605190 11495950 11426672 11449270 11465934 11596690 11846118 11992463 11940243 11945131
3626 11945131 11934444 11793921 11814197 11659283 11475797 11232147 11056913 10903479 10738515 10691493
3616 10691493 10577094 10482794 10274616 9969121 9634894 9266843 8725655 8240332 7867080 7586853
3606 7586853 7232708 6987071 6821392 6807510 6678436 6477448 6428609 6362381 6351899 6370582
3596 6370582 6381145 6366583 6358321 6330441 6405696 6393075 6332555 6316030 6403584 6513254 6516847 6530313
3584 6530313 6505965 6416293 6289616 6096283 5890626 5776761 5755508 5626230 5599376 5685136
3574 5685136 5673062 5645128 5718798 5879599 5977682 5907959 6013371 6055091 6130593 6195661 6189738
3563 6189738 6181433 6280065 6406694 6625108 6753519 6996035 7178951 7459047 7780624 8243560
3553 8243560 8558378 8935749 9515395 10100782 10746279 11350106 11976546 12863854 13882381
3544 13882381 15259635 15794394 15478800 15215052 14608112 13747825 12806705 12113445 11561778
3535 11561778 11155485 10762942 10511327 10341128 10295620 10178627 10032833 9900757 9862039 9624118
3525 9624118 9458949 9392791 9373578 9426608 9319565 9161614 8987864 8840557 8616385 8498455
3515 8498455 8455668 8446075 8503579 8559830 8645736 8725299 8760960 8854002 8911132 8930053 8911908 8947634
3503 8947634 8933832 8789707 8660971 8457516 8424758 8303124 8171169 8021309 7805096 7508004
3493 7508004 7348364 7209438 6996702 6898541 6942903 6954936 6990493 7251819 7495988 7807213
3483 7807213 8098153 8446290 8728989 8895674 9116599 9277837 9268717 9197633 9082636 8981950
3473 8981950 8769909 8600315 8425650 8151625 7890585 7708951 7524132 7426448 7401343 7377909
3463 7377909 7325960 7563605 7948566 8285352 8738314 9200437 9762425 10237808 10633916 10903949
3453 10903949 10992174 10890102 10437679 9856383 9290604 8786899 8234719 7785054 7445406 7194354
3443 7194354 7041736 6986992 6985541 6998596 7142386 7343094 7438521 7527995 7515631 7521746 7555747
3432 7555747 7483282 7487718 7501633 7488650 7507308 7564113 7559078 7325900 7079325 6834374 6586898
3421 6586898 6292581 6118124 5913443 5903164 5981079 6090895 6213558 6421387 6639066 6704342
3411 6704342 6871734 6915014 6790794 6576418 6339051 6000811 5543721 5203844 4879630 4496107
3401 4496107 4280184 4010280 3893624 3723717 3592463 3570993 3437488 3310973 3282469 3242591
3391 3242591 3144368 3178130 3314305 3277803 3398931 3484114 3631590 3683090 3688081 3698834 3639347
3380 3639347 3522697 3326368 3085565 2883986 2669537 2546246 2336433 2231254 2101730 1992842
3370 1992842 1980700 1910058 1801004 1757390 1703646 1682205 1645469 1551191 1428992 1452142 1462109
3359 1462109 1341225 1344791 1297988 1228221 1268092 1230579 1268318 1223608 1243356 1238064 1170811 1133879
3347 1133879 1199108 1199786 1250276 1195962 1172531 1173707 1147678 1177852 1169696 1127126 1104259 1131412
3335 1131412 1147472 1124207 1103616 1118957 1154268 1184802 1202002 1343497 1343863 1275370 1266333 1240127
3323 1240127 1248959 1172766 1080970 1066260 1035848 1014078 966142 1048466 925515 927756 959698 927456
3311 927456 835594 869630 855047 818750 816359 806214 822446 871940 798058 759205 752646 729328
3299 729328 686413 699414 706713 659599 623392 622642 612327 620816 655143 571626 537567 476035
3287 476035 535704 582122 502024 540544 530950 575063 573318 604502 625601 565522 493119 463028
3275 463028 523767 502634 445988 495915 521785 505738 551499 564775 530796 528942 500168 522703
3263 522703 545960 534453 480233 488659 496814 582085 634388 561660 519870 581040 501645 492598
3251 492598 552098 537926 587915 632446 563716 566936 552814 524471 497867 517755 592124 555889
3239 555889 537196 460112 496825 579129 529375 521371 540901 582803 600917 614974 714780 699293
3227 699293 709141 694581 699061 755214 697934 744935 725672 741597 812424 842925 830721 867958
3215 867958 864478 927898 864362 850919 932090 965024 958448 968239 1010119 1015300 1086927 1117777
3203 1117777 1095991 1121012 1211677 1211491 1190874 1210039 1284854 1270584 1267820 1189405 1239042 1239809
3191 1239809 1270384 1279913 1283572 1325507 1326059 1337935 1361129 1331464 1330014 1411468 1471521 1426014
3179 1426014 1507134 1498780 1475205 1536420 1508689 1573765 1606681 1571428 1510091 1523788 1572452 1540403
3167 1540403 1524060 1456766 1492546 1514578 1508812 1503039 1382898 1388145 1423526 1373845 1404170 1380323
3155 1380323 1384665 1428818 1402562 1414767 1450541 1419276 1370237 1346605 1307517 1267682 1257662 1234041
3143 1234041 1219751 1211752 1155493 1102875 1071312 1131209 1097828 1023405 1047573 1019168 935458 942519
3131 942519 946380 882498 891397 918946 866710 928415 968805 958586 878768 921870 944619 827256
3119 827256 802240 866742 850302 803691 805015 787267 768486 825636 698691 698845 675935 663699
3107 663699 730752 645827 603090 569135 625394 660445 680056 638553 622869 592133 621576 566455
3095 566455 673656 649302 622575 608745 680675 663634 642999 646198 660876 623229 611829 581393
3083 581393 541841 565318 574797 578125 616534 655998 651873 637202 653786 607217 594203 592679
3071 592679 498534 509975 513489 559157 591301 595262 594399 589375 558396 590893 617216 613970 669712
3058 669712 728472 721282 698351 729030 788107 700242 714447 726969 776921 821653 756575 673283
3046 673283 652748 774053 815450 857958 753726 872353 847674 882899 900323 905586 942549
3035 942549 929798 944693 880174 936644 1003922 986839 909834 951133 995933 1017482 1044678 1104327
3023 1104327 1125823 1183587 1228463 1318053 1300083 1297378 1354590 1407564 1372295 1419132 1489871 1633694
3011 1633694 1640143 1663983 1701005 1711194 1744872 1831450 1917429 1940772 1960701 2123616 2126555 2142691
2999 2142691 2253038 2406409 2448503 2576632 2731305 2755124 2760905 2786621 2917325 2995529 3074265
2988 3074265 3207921 3358637 3347708 3350854 3552274 3739397 3823725 3925954 4010890 4181612
2978 4181612 4317901 4438999 4630023 4788557 5033744 5159086 5256176 5419181 5638818 5856845
2968 5856845 6123025 6307241 6464454 6685306 6854285 7049517 7173274 7338206 7485660 7605336
2958 7605336 7780954 7996251 8151887 8292614 8545365 8703181 8830335 9119585 9347006 9559903
2948 9559903 9788998 10056552 10177543 10355136 10577064 10673474 10993236 11240970 11435474 11693706
2938 11693706 11902992 12190096 12513677 12882925 13296546 13795962 14313652 14943017 15651683
2929 15651683 16461660 17354277 18266926 19360099 20523870 21822447 23342143 24898672 26445820
2920 26445820 27884050 29085824 29795394 29782953 28903043 27096606 24850904 22439554 20038978
2911 20038978 17654634 15777244 14168830 12775959 11500762 10476122 9677175 8982526
2903 8982526 8357282 7927854 7619531 7348908 6978151 6783582 6719315 6587979 6660195 6800645
2893 6800645 7052028 7030279 6816236 6537936 6163802 5651339 5108041 4696793 4313884 4027868
2883 4027868 3818098 3657397 3473125 3299041 3191731 3145009 3133929 3014459 3019705 2988194
2873 2988194 2938062 3002467 3114172 3177557 3385103 3382438 3299597 3084148 2890896 2673323 2449248
2862 2449248 2279813 2073445 1946412 1920587 1809700 1693449 1547572 1492821 1405830 1494244
2852 1494244 1400654 1432109 1402856 1312136 1290011 1287520 1286667 1306185 1263294 1106152 1094159 1049417
2840 1049417 1005340 1012717 1014993 975581 978461 941945 913723 898905 857623 752646 804732 807628
2828 807628 759700 812188 745981 787388 743321 668720 541975 654528 729457 674809 679217
2817 679217 679231 712861 692237 671245 637734 590415 527442 535624 515860 523306 518031 526638 570874
2804 570874 540802 494209 437808 452848 506737 522421 523122 508338 520547 463895 433296 419464
2792 419464 401776 373956 410702 428733 475236 476100 420772 421286 399594 396861 419748 477051 484034
2779 484034 382214 410901 408745 417516 423791 429851 398757 430662 415843 417243 468663 340468
2767 340468 345700 348494 313821 373456 377045 388392 305790 356490 399359 416922 432809 424227
2755 424227 391855 426409 353345 397312 395698 382528 401952 412457 423122 427948 393322 447039
2743 447039 376683 407469 337817 350287 425929 465287 396346 462206 443213 409894 431570 452352
2731 452352 427531 451211 474548 466296 538849 509932 514568 604528 571635 536749 559782 591962
2719 591962 716772 642255 639266 605615 719301 722003 721227 756380 745538 793433 724006 733186
2707 733186 746675 752937 863741 927577 987071 958136 953360 954845 935011 1044947 1090833 1161599
2695 1161599 1222978 1233521 1344964 1380180 1476434 1572100 1648181 1674625 1813720 1887873 1972019
2684 1972019 1947388 2031107 2056117 2157066 2204941 2132455 2212595 2172332 2230864 2251528 2174615
2673 2174615 2311335 2327693 2390450 2478692 2576064 2701937 2752308 2961979 3171075 3312387
2663 3312387 3385144 3318706 3254784 3023789 2832143 2650756 2436041 2337213 2194953 2089004
2653 2089004 2071060 1956890 1907967 1873458 1774033 1758493 1844891 1816450 1822740 1845230 1826728
2642 1826728 1862153 1802684 1731616 1768637 1668846 1591798 1547121 1342710 1248394 1189101 1129778
2631 1129778 1042083 1051687 987971 915218 907412 851158 833045 817691 754105 610548 594134 623662
2619 623662 544099 552866 555500 496298 471401 476261 450256 479470 418733 366878 333792 292931
2607 292931 403751 368664 276118 293575 286983 303924 277196 342521 264053 199590 247796 288628
2595 288628 222444 242650 331958 201356 207670 171535 142724 154974 106849 148365 139616 160158
2583 160158 152425 132641 149325 106633 136429 164725 123104 134678 106001 51965 75571 127672
2571 127672 144941 189583 172704 136442 70299 79295 53872 14299 77484 45023 -16729 -46756
2559 -46756 25593 63124 54329 1119 12511 -11077 -11253 18915 5584 -8886 -27308 -23340 -35883
2546 -35883 13990 50817 45582 39927 -27545 -9026 89091 55197 28844 9995 7072 38774
2534 38774 67133 16559 -36310 -87814 -22602 -8881 -21291 -12466 -40306 -83537 -19800 -19695
2522 -19695 -35199 40466 45795 87102 59407 87351 12827 -13514 -44353 -58589 -8897 21843
2510 21843 -7113 -93839 -110524 -37963 -4401 9899 -22899 8588 -44485 -15780 240 -34833
2498 -34833 -78105 -112083 -6940 -4267 -23892 72396 64440 -76822 -76946 -7411 53465 103227
2486 103227 18015 -42894 -66845 -74545 -25349 10173 -8789 -49008 -98598 -34032 5952 -3582
2474 -3582 -36381 -937 18152 -97945 -40367 13770 59737 -54654 -65380 2621 4482 125922
2462 125922 80767 -60818 -70240 -47112 -120147 -133567 -80952 -47537 18246 -59667 -40744 630
2450 630 7314 -126293 -43913 -26079 -58448 16650 -65924 -20548 -10461 -121850 -125448 -72208
2438 -72208 21685 31858 -3364 -62478 -69787 -79025 -13243 -27361 -123264 -123091 -138556 -89835 -84258
2425 -84258 -124519 -96044 -12227 20511 50682 -67154 -65010 -26988 -41018 -135703 -129646 -83574
2413 -83574 -120782 -51924 -63703 -95150 -21099 -86992 -81223 -113377 -112392 -80494 -160216 -79621
2401 -79621 -85431 -49303 -52047 -13014 -24855 -71938 -71653 -37254 -36715 -7323 -44537 -66950 -70882
2388 -70882 -67422 -26048 2299 -55531 -54139 -69957 -72584 -110924 -55314 -30775 -60124 -32546
2376 -32546 -55372 -115542 -105342 -65726 -79749 -86708 -105137 -72128 -102435 -62517 -81038 -86049
2364 -86049 -49581 -17116 -43538 -38184 -60146 -4965 -42457 -44594 -15375 -14378 -82626 -48553 -613
2351 -613 -30584 -37880 -59252 -49245 -17306 -59621 -109103 -59988 -121298 -117967 -100793 -41992 4217
2338 4217 -74448 -21292 -22131 -13313 -53594 -95183 -68494 -84427 -93675 -138305 -72602 -70222 -72211
2325 -72211 -32822 -95966 -26246 -49728 -73515 44245 -34265 -114964 -13952 -4251 -71873 -104018
2313 -104018 -29961 -26322 -51925 -82184 -66452 -84537 6133 24193 -25466 -81253 -129120 -88312
2301 -88312 -70120 -54113 -80275 -70935 -57443 -47770 -8832 -10477 -7809 25023 20236 -5061 6121
2288 6121 -64285 -83065 -58705 -56429 -96971 -106556 -46832 -26355 -69575 -107860 -86634 -71043
2276 -71043 -123643 -41430 -76359 -2842 -20098 -33900 33250 53946 52537 1080 59422 50152
2264 50152 -4078 -15670 43799 -44382 -64127 -57766 -56578 -79664 -20282 -79046 -10899 -23578
2252 -23578 -96872 -108446 -113154 -97962 -14582 -19660 -41336 -43843 -58700 -30638 -35005 -7155 -11211
2239 -11211 -61773 -92890 -94792 -24645 -76593 -50305 -24021 -30930 6204 -54913 -72676 -56167
2227 -56167 -21076 -39526 -75026 12901 29314 -36340 4305 44729 -16444 -39904 -7304 25748
2215 25748 29478 51545 -33120 1042 21796 51765 -5709 -17043 -19780 -61865 -49640 -35208
2203 -35208 -23900 -9830 -4923 -122346 -103566 -98016 -41265 4203 -5525 8312 -27737 -82208
2191 -82208 9273 -15586 -74305 -68956 -32669 -88241 59305 72452 20770 84821 40314 17230
2179 17230 -67968 -54277 -7067 67097 46647 16822 -47820 -19509 49602 57176 67582 31268
2167 31268 5380 28569 17303 93001 77778 5590 18946 3487 -46309 -87170 -4666 48375
2155 48375 36946 32522 33681 47617 -19527 6752 63174 56650 100190 67002 19566 64378
2143 64378 68632 46152 121904 138588 97242 69523 102622 184099 153531 204078 200786 146327
2131 146327 177481 135870 114286 140783 162784 154501 226498 242974 301529 316871 354763 370222
2119 370222 323225 380546 400554 343886 426066 517660 460713 470215 413620 417758 516659 466910
2107 466910 487338 518646 609195 733012 684078 670741 699588 734611 807219 909184 941025
2096 941025 944494 1015793 1067073 1128704 1214639 1277535 1290051 1387756 1397657 1438608 1501994 1648989
2084 1648989 1787983 1872384 2038745 2248816 2462524 2708053 2946991 3229018 3500317 3827401
2074 3827401 4235234 4644885 5195043 5924069 6721684 8125409 9825163 12118700 13209695
2065 13209695 12618267 11778384 10231508 8261226 6580408 5470771 4631979 3927353 3388987
2056 3388987 3058371 2700659 2428887 2198346 1989720 1744759 1634499 1458680 1391145 1247758
2046 1247758 1239860 1133577 972969 950730 912081 943454 858846 767759 722788 640666 611328
2035 611328 642975 566964 537171 544061 504427 494145 439091 401740 492315 416800 457172 405595
2023 405595 371453 335077 335688 354073 353145 332206 253379 278982 278859 212834 184029 242352 217520
2010 217520 185224 205073 263630 226167 201420 107376 103470 148670 110823 65881 97721 128204
1998 128204 162015 139808 174375 59633 100754 102127 112968 149998 93708 112396 127694 89348
1986 89348 75855 111250 48478 34647 79085 76467 38223 -20186 10680 -38623 70430 79789
1974 79789 16573 87630 -1564 -24035 -35878 22179 30064 -5043 -22408 16479 35098 -14774
1962 -14774 -26948 -84295 -3777 12553 -17894 -78911 -56014 -25483 23608 3546 60407 69043
1950 69043 -14573 21140 -13472 -41511 -56886 -118063 -116113 -26532 -640 76007 17892 -1581
1938 -1581 -51799 -26677 14923 45042 26561 -11684 -71161 -39556 -43991 45251 1258 -29266
1926 -29266 -6917 -95004 -47704 -53681 -32339 12172 19129 18229 -52318 -94579 -63192 -14366 -30137
1913 -30137 -28037 -62021 -73928 -100128 -7174 -82810 -113962 -100914 -39457 -29269 20006 57732
1901 57732 -14100 41073 23948 -101200 -83374 -121454 -35086 -10113 -50459 11422 -10407 25859
1889 25859 20685 -59467 -54586 -35717 -27123 -41236 -136382 -44604 -66665 -39375 6682 -37450
1877 -37450 -58505 -6126 6152 -23249 -24859 67711 -7430 -605 35840 102669 19679 -20626
1865 -20626 -27095 -9820 58265 50608 94787 45026 15273 43833 11747 -13151 -65834 11922
1853 11922 95740 28691 30990 30321 48998 41191 37898 53248 -101551 -115217 -31883 -97438 -100414
1840 -100414 -70500 -49280 27091 -24725 -31044 -42384 4026 -101650 -71118 -42626 -80525 -17035
1828 -17035 -46562 -11436 -31239 -39383 -96718 -35048 -6978 -25237 -53585 -21858 -37125 -89297
1816 -89297 -89362 8194 -11061 -54834 -14510 -22897 -47975 -34571 89 23912 2302 -87384 -75374
1803 -75374 -39220 -52083 -104036 -98242 -50207 -83827 -33378 -41911 -38270 -25149 -50664 -95696
1791 -95696 -133484 -82766 -49826 -62094 -55608 -6856 -14988 -43821 -100774 -19552 -14 -105947
1779 -105947 -42363 -74131 -99430 -23871 -11893 -60641 -150851 -159926 -84085 25411 -28395 -38810
1767 -38810 -35929 -128718 -85861 -81125 -147890 -52768 -57946 -24239 -421 -8206 -32487 -56037 -62170
1754 -62170 -21235 -54896 -33344 -28774 -73232 -91296 -37351 -7746 -14210 -5254 5681 -73449
1742 -73449 -41911 22622 36329 20904 -66181 -52989 -37527 15173 -16449 322 -20526 -34316
1730 -34316 -24748 -29843 -38275 -56437 -63887 -34478 -105179 -66685 -92010 -68995 -96592 -93846 -71256
1717 -71256 40502 -28780 -47857 -55652 -356 -20246 -106279 -47021 -36207 -11854 2733 2197
1705 2197 -20500 -10967 -82350 -133305 -114409 -84019 -117611 -132205 -112826 -696 52319 -1403
1693 -1403 -4223 -21821 -28915 2064 -34755 -109516 -93732 -38369 -94245 -99079 -56002 -37503 -25160
1680 -25160 -40296 -2313 19618 -8912 -31971 -42675 -1497 -10181 -95720 -34948 -24126 -13597
1668 -13597 -43698 -67461 -64025 -77370 -121311 -81236 -1545 -1401 -10581 -13226 17553 104 26041
1655 26041 -33997 -46485 -85915 -17997 3284 -33960 -84523 -53398 -29626 -67230 -10342 -31483
1643 -31483 3967 47898 13496 -32445 -34508 -28324 -47418 -52981 4167 -12599 -44789 -72957
1631 -72957 -67236 -40148 -30925 -85121 -41282 -95834 -111764 -67856 -98895 -38755 -51401 -31798
1619 -31798 -5387 -88275 -103432 -56580 -105572 18673 -48430 -89029 -48626 -11272 43917 -8037
1607 -8037 -76009 -15469 -16145 -24705 -78735 -72598 -71702 -90775 -94402 -58858 -53907 -103128 -56223 -42639
1593 -42639 -17179 -2667 -85555 -109799 -66918 4213 -78576 -122742 -117292 -157233 -97516 -22778
1581 -22778 -66625 -60400 -82471 -31313 -12759 -47849 -76022 -46227 -109455 -50568 -11565 19998
1569 19998 -26706 -31437 -9121 -23609 -79166 -76553 -47850 -73611 -31628 -96390 -68322 -26609
1557 -26609 11458 -4801 -43431 -43316 -25983 -34147 4063 -21113 -48824 -58138 17628 3162 -47604
1544 -47604 -147581 -19016 -53172 -56755 -67983 -58269 -30261 -46594 -79703 14424 -34671 -56020
1532 -56020 -54607 10821 -13482 -60946 -27528 3978 41161 32723 35887 -32419 -54102 -25895
1520 -25895 -28370 12223 -569 -48767 -103141 -144627 -76901 -50484 -111037 -84889 4660 24912
1508 24912 31594 4043 -17545 -17538 -40073 -87379 -45562 -21617 30508 16056 7216 15096 52486
1495 52486 24231 12511 -12317 -82020 -61093 12889 19782 -34475 -37423 -33616 6878 -11704
1483 -11704 3604 20642 -27266 -32540 1442 83484 -5922 -76300 -40143 -23679 -28987 -18600
1471 -18600 -23243 8478 11371 -66933 -59840 -53842 -43364 104875 86961 9978 13398 -19593 -59885
1458 -59885 -86363 -92477 -91084 -16309 -26619 -46019 -82780 -89889 -38750 -72785 -83985 -48727
1446 -48727 8847 -626 -58852 -22268 -45507 -18155 -2236 -93399 -42104 29322 36571 61421
1434 61421 51209 6216 -59105 3808 13271 -46056 -43796 -37236 28146 31124 -52756 -74201 -62479
1421 -62479 -58600 -45001 -45625 11724 4029 -49769 -46922 -28194 -34126 -55506 42864 77101 81670
1408 81670 84436 6921 1698 -21 -1814 59861 28847 -48700 -11043 43279 -33959 -72279 -73365
1395 -73365 -70010 -9835 -113759 -77140 -76318 -89759 -82821 -61787 -27806 -57192 -75845 -7380
1383 -7380 12415 -58497 -70918 -26653 -35544 12071 -1690 -28936 -59718 -72334 -45262 32026
1371 32026 30427 -28788 -45523 -57186 -138709 -79245 -28238 -56082 -31213 -120582 -97527 -91440
1359 -91440 -71139 10211 70622 -55486 -84398 2171 78544 83443 22798 -30982 -80942 -102976
1347 -102976 -13874 -90163 -67189 -54200 8432 41268 49434 46964 -21453 -45407 -85683 -2609
1335 -2609 -28745 -72535 -41261 -36100 -14166 -30284 -119530 -1347 -15949 11564 -48957 -16267
1323 -16267 -18919 -32868 30906 16100 35726 13241 22124 21107 46629 90920 102297 52746
1311 52746 -2341 -57473 -65558 16110 -17346 -6113 64981 -2011 -16850 25463 -34130 12827
1299 12827 -26950 -54882 20078 -6480 16760 -47507 65785 89651 12382 -16771 -85288 -108433
1287 -108433 -108023 -25920 -59678 -73934 -23716 -78136 -64273 -29118 -2133 -38454 26752 -17126
1275 -17126 -63890 -2785 -28590 -6083 -481 38458 -6278 -15949 46652 4478 -8359 -11326
1263 -11326 -7598 -17351 31415 -91481 -59823 24603 -19500 -20810 -12343 20955 16395 62264 17764
1250 17764 -26383 30338 26785 -1930 32254 15321 -58481 -25595 -27230 -33899 829 16609
1238 16609 5080 23377 34477 41239 19270 -40567 3894 8401 64451 27693 69770 -1255
1226 -1255 -39185 45045 -6916 -10570 -62055 14961 42540 4336 32273 -7651 -13690 -1162
1214 -1162 -6170 13652 742 -61703 -21726 -27858 4633 -44542 -29714 -1407 -2303 -42971 -48728
1201 -48728 -12886 -49112 25268 -35760 -97651 -61498 -76 57907 28204 59880 -2110 -85879
1189 -85879 -29380 -57358 18517 -5286 -1382 -24638 -45498 -19819 55588 33083 40128 -50295
1177 -50295 -10060 6236 -39872 -21081 -3623 -18001 -35895 12779 6051 -22211 -25587 -40047
1165 -40047 -8061 -272 -65737 -46318 -19201 -9026 -42915 -15148 -16260 -95162 -38532 -60441
1153 -60441 -115126 12740 -33089 -55709 -61730 -48592 -50792 -41473 -60220 -8110 9973 -35550
1141 -35550 -33380 -57179 -98675 -66393 -34633 -14195 27227 -29444 -33301 -87912 -90623 -69470
1129 -69470 -43381 4751 9793 50491 39217 -1821 -20528 13951 22287 -11333 -94172 -57611
1117 -57611 -13108 -22635 -38241 19682 10709 25407 8849 -44682 -20016 16109 15682 -3554 9658
1104 9658 4529 -69764 9138 24551 -18998 46073 59289 54054 55938 -56141 -34427 -25040 -25485
1091 -25485 36602 -39568 -29220 22320 -21308 -18933 -798 11887 -45406 -28602 6470 -45066
1079 -45066 -12816 -16891 -14070 2651 -15978 37797 -39455 -78650 -37893 9984 63250 -36400
1067 -36400 -17869 -741 -56788 -32556 -36466 -3871 63949 -20635 -39989 7155 48091 10151
1055 10151 9282 -22156 -3542 26312 9028 -18429 -16294 37929 45763 30180 -2305 10225 -22618
1042 -22618 -44812 66722 -3367 -40987 -59597 -44627 -7293 38438 -31720 -22042 -22045 -105274 2155
1029 2155 -26327 34597 41466 46193 16731 -21406 16293 -37968 46658 22937 -17616 -19948 -53898
1016 -53898 16739 -49705 -87334 -28124 -47276 -48439 -64061 -42537 19168 7932 -88160 24241
1004 24241 23735 -41123 -51316 -43281 -25897 15496 10282 -13866 8434 55781 49903 -11299 12604
991 12604 177 -4029 -63863 -66913 -53516 -45755 19869 -6070 32197 128466 82547 29151 -50172
978 -50172 -33456 -52014 -32032 -95462 -62067 -55442 -6793 39189 28804 7949 -9710 35488
966 35488 39834 -6859 84581 129949 58630 47877 3906 -21244 51667 79829 3828 -39603
954 -39603 -71206 -5187 10988 54897 -12403 -8765 11036 33109 33917 -83114 36956 69926
942 69926 -14120 -47067 -59929 -26290 71510 22399 -42759 -75256 -54333 -31998 -46790 21989
930 21989 1042 25828 -17174 8152 -440 65106 32662 43530 10099 33417 14928 -22410
918 -22410 11786 -28854 -19844 4069 9924 -32879 24624 63683 -12938 38910 16038 28667
906 28667 -14253 -31864 76795 28471 16801 11989 -18591 -42303 43876 8543 -15481 -75261
894 -75261 -73634 16024 72035 86188 45357 7528 36246 18405 -23566 -29582 18375 34110
882 34110 53871 -11839 -7830 -30786 -17865 49261 45405 24810 36860 16630 -29585 27014
870 27014 -2783 39528 -50187 -25332 -36412 4032 46791 71363 75798 24875 33336 64353
858 64353 -25869 -5193 -5235 10699 44080 -27102 -9274 -68350 -37502 -27029 23263 48545 38257
845 38257 8188 7783 -25308 17435 35895 30951 44165 10866 -54729 -70492 20532 -17900 -12533
832 -12533 68936 -31427 11118 41144 7556 61304 51975 -2429 -13027 -28289 6628 2204
820 2204 -78090 20912 106061 54216 52905 46599 95033 45743 -4806 43800 73269 43519 -22985
807 -22985 35507 78715 27803 49158 -13260 138042 80913 2690 75653 -1430 85413 50047
795 50047 2397 -11158 -41801 -28806 -25555 63092 -324 -48273 15655 5440 35295 105461
783 105461 68900 -2118 16070 -17025 29594 71234 49052 76865 27029 -9977 -1717 14534
771 14534 24031 20601 -4814 -27344 14889 70819 54196 58865 56667 33209 -12434 -24999 22362
758 22362 -56059 24142 5561 -18685 -38729 -23984 42603 49777 76834 5735 31472 -16097
746 -16097 18538 35998 -26565 43945 13871 67701 83866 130489 97672 33180 4799 -60991
734 -60991 -60366 21761 84682 26342 -8513 7087 -18017 5908 31269 61820 84744 33529
722 33529 -15385 -48907 -27441 -63752 -64325 -63175 -24133 55888 39458 87224 46943 16904 -12005
709 -12005 33685 22272 9967 67585 9850 -18291 25972 31338 104639 -39109 14700 54056
697 54056 56095 71618 43183 66594 19191 84207 11913 46444 8471 -17474 -20168 30672
685 30672 -786 -6508 -7266 52441 42741 28297 14038 13101 41730 -35693 -55353 -99231 8397
672 8397 56541 -43536 -21558 53691 -14591 8350 -35863 -108260 -5014 20233 72582 53765
660 53765 -22935 -32646 -41589 27965 108528 57944 60022 126066 -13116 -58339 -11987 -8263 -49373
647 -49373 -17379 -22510 25255 15695 -22619 -33558 18106 48295 54977 -3513 -38564 60656 38385
634 38385 -69629 -65659 19888 39242 1540 -1846 49450 68412 165772 76123 -43370 -37102
622 -37102 46932 53988 -38383 -49735 20558 103401 91956 65055 66388 69687 74477 6403 73846
609 73846 43433 14588 26184 73350 8638 30278 72668 100711 69009 77412 59691 55464
597 55464 35163 -24766 104493 64320 42702 78469 96110 90076 75788 20953 26247 72433
585 72433 45202 54322 55454 -23576 24421 107307 55737 61869 74339 55611 37042 81932 48328
572 48328 32212 74899 13429 23648 13713 -8110 11521 77987 146132 98946 51540 66669
560 66669 112137 77182 76152 44143 20441 47960 45679 43699 -16518 55332 74754 43343 46076
547 46076 59215 -12105 69243 60406 -39003 10635 27969 -16721 -31448 11320 60117 53655
535 53655 11720 -25582 32044 65511 21467 86139 15295 46095 108460 108601 60634 28752
523 28752 141231 140429 113628 65181 48340 -9694 -17424 34648 48288 65261 76868 102845
511 102845 133516 104145 52176 76761 73744 76067 81970 90787 -4873 24031 45502 62853 55535
498 55535 33015 70699 71913 -36711 -48876 -13778 -9063 48059 21993 134036 100609 105073
486 105073 97964 -15028 899 50739 31852 65163 51657 40087 -50000 -3141 49418 36497
474 36497 28582 78517 12723 -34539 72435 59942 81258 61207 13225 55626 12208 -39262
462 -39262 5760 -8476 3646 -72694 8815 118104 55070 43870 123051 81164 67079 45060
450 45060 38778 63083 83093 31084 75019 56216 56086 88387 4256 5409 -4108 -116572 -64073
437 -64073 -2533 11277 76231 56000 25327 74834 87452 68343 86668 130522 124566 74922
425 74922 52406 110928 149131 103974 -506 64107 69052 -25902 23544 69389 47784 18140
413 18140 75582 52410 57036 -16939 29805 81513 75057 26612 57596 61728 8737 55482 52951
400 52951 599 6777 29878 86679 -1717 -19650 77817 75549 118335 83514 97335 69784
388 69784 26917 21564 -43353 -7434 60957 94792 18511 25757 12294 120035 83215 83351 101766
375 101766 -15959 78926 66305 46196 80699 61415 25054 8517 36122 108332 135115 50057
363 50057 83051 64455 105912 48014 27386 129024 79108 34252 -22734 38217 66009 98271
351 98271 -25886 24200 33284 -15391 -1758 -43402 -24347 -576 6715 15979 73968 57058
339 57058 53605 60100 37172 8321 87381 150714 40169 13503 93750 3801 66281 1430
327 1430 25122 78140 87004 84383 102052 129097 44583 19544 58487 88307 53172 -12373 -61032
314 -61032 29183 55638 118438 134344 40022 3014 104365 66969 83412 39242 36710 87169
302 87169 98252 120875 48850 55823 115323 95669 137345 115665 83253 75244 104780 49144
290 49144 8069 51765 36541 30074 34294 65572 -34369 40101 83186 58310 88766 193
278 193 19080 64627 29225 49576 20136 26616 16011 -3578 102002 68988 27612 52607
266 52607 9411 72372 123594 50061 48122 4475 59488 40143 13618 18227 14739 12533 4473
253 4473 55504 12493 -29176 41575 -33230 -7477 95903 139600 137329 155228 129085 96532
241 96532 62120 7663 37639 73025 70839 63944 62658 109978 72510 71005 14025 -25854 22987
228 22987 4338 26237 57332 15875 10784 40192 110471 56807 4496 121535 96967 42210
216 42210 33609 56139 16549 19420 58361 93675 92585 58884 48279 65185 14131 61595 98458
203 98458 126216 106853 105517 74506 125479 75635 5785 64692 50378 50220 -4049 49578 81333
190 81333 110464 63762 28467 12330 -41080 26091 97637 116919 109218 35154 23438 32252
178 32252 -4039 40317 49854 54119 60239 50480 13742 30831 80520 98900 109415 151861 110382
165 110382 72992 47925 20186 137395 146634 62973 38499 21597 47779 33379 52837 47032
153 47032 76159 41520 162785 108057 86131 69310 30217 20479 41697 18145 101350 49385
141 49385 72406 84372 45126 69386 17787 50892 82506 48443 66418 84307 57337 46469
129 46469 2749 14573 73131 64930 67510 84705 -2660 84465 117921 66336 29584 88754
117 88754 115576 63605 27183 126172 67903 13774 26749 -27679 -3278 54138 33840 69703
105 69703 25939 63644 95117 107616 52792 66567 44034 86144 26029 17668 45328 41045
93 41045 9666 71623 131240 17085 55466 40703 58012 105626 76183 73151 90171 81776
81 81776 50939 39530 19393 48447 84689 118330 86104 53231 47109 31525 81212 91295
69 91295 64158 113044 115918 48361 76284 102504 104820 53375 58173 74238 76874 53674 64078
56 64078 98986 89768 73863 79568 62101 59941 32577 52352 63238 87250 66040 94477 61940
43 61940 36664 21874 24768 32131 92645 52850 32440 96984 114382 120808 12244 -15421 22008
30 22008 46204 6787 -28861 16632 80499 80947 76749 71863 76470 57056 66113 73384 41681 31005
16 31005 32091 114612 85984 58269 113367 93973 21431 26712 63495 80281 70409 84089 105259
3 105259 78356 100376 63709
0 63709
$$ Imaginary data points
##PAGE= N=2
##DATA TABLE= (X++(I..I)), XYDATA
16383 -1208373 -1208449 -1213509 -1160401 -1087585 -1099900 -1111232 -1066597 -1036254 -1013355 -1028169 -1070640 -1064912
16371 -1064912 -995540 -1020789 -953182 -922167 -891737 -853709 -861543 -841801 -806870 -815348 -781320 -798029
16359 -798029 -813438 -794255 -778451 -703457 -775160 -765859 -699945 -691364 -665802 -646948 -586439 -588899
16347 -588899 -638943 -617392 -601570 -632292 -538402 -461561 -479335 -469772 -464902 -467638 -424502 -407575
16335 -407575 -454108 -439832 -393057 -369673 -324203 -303648 -353944 -285417 -223355 -242392 -208788
16324 -208788 -156041 -232749 -209839 -155590 -74818 -99977 -106153 -118373 -60019 -91769 -52851 -7265
16312 -7265 -41161 -76884 -6501 2371 6452 54149 64216 59167 106144 80907 151311 151934 157601
16299 157601 172325 245476 243273 225295 209063 140507 186256 213996 222648 279223 250478 259215
16287 259215 288786 357855 395357 397639 407549 379581 360945 395233 422556 433945 510625 489870
16275 489870 477427 452397 444782 475265 490279 574190 579616 479528 561988 640058 639361 670022
16263 670022 695649 710170 691582 676487 671275 663600 652531 669900 706864 733272 760857 744952
16251 744952 684483 738147 769672 745193 800839 853962 886378 872089 856057 812401 875189
16240 875189 857720 859201 921196 893772 896588 876179 881369 923951 926487 939923 964070 983969
16228 983969 1061298 1043884 975590 945401 980715 1051022 965439 1049992 1034557 1015874 966905
16217 966905 1070667 1060930 1103087 1152858 1133160 1109375 1202169 1158084 1144215 1105312 1157678
16206 1157678 1114786 1153337 1126657 1127622 1174600 1192025 1227095 1165483 1175194 1235876 1294121 1234917
16194 1234917 1235039 1303208 1346350 1296269 1295635 1288425 1288127 1257952 1285875 1347783 1328285 1318752 1359769
16181 1359769 1360656 1263498 1293834 1291167 1317524 1322253 1327741 1434928 1365217 1402261 1390601 1388221
16169 1388221 1365163 1403718 1506411 1401939 1395410 1411034 1443808 1416494 1454438 1419578 1454032
16158 1454032 1515721 1516929 1453171 1449527 1530622 1481202 1452213 1433883 1418857 1403795 1434330 1442013
16146 1442013 1445317 1379259 1448298 1503310 1531520 1490410 1546277 1570417 1501816 1485475 1440427
16135 1440427 1530774 1547326 1498082 1516446 1579700 1556441 1489827 1553002 1549427 1576573 1530621
16124 1530621 1513193 1509756 1589604 1576237 1585975 1626517 1592712 1583897 1626067 1577948 1611177 1626593
16112 1626593 1627162 1598147 1666104 1532439 1531666 1656426 1563051 1546174 1594761 1637081 1566971 1631223
16100 1631223 1681246 1586258 1619220 1630209 1632941 1616900 1665960 1629348 1637330 1629368 1631293 1669686
16088 1669686 1646386 1624638 1634788 1630601 1601315 1614929 1645104 1638004 1677196 1661376 1644883 1657392
16076 1657392 1573449 1586666 1664251 1672328 1645032 1639981 1685978 1705389 1655930 1701299 1689541 1640043
16064 1640043 1691795 1652288 1649142 1691755 1738822 1617085 1598581 1619458 1627410 1761742 1749956
16053 1749956 1735599 1755450 1694675 1688455 1607014 1680453 1757383 1724774 1591342 1561600 1686747
16042 1686747 1684535 1693694 1685248 1615792 1633275 1763352 1695335 1732570 1602480 1673161 1680381 1615746
16030 1615746 1649881 1679391 1666429 1681984 1673619 1696458 1661894 1693992 1667301 1620675 1659528
16019 1659528 1696881 1742383 1755370 1739195 1671156 1696622 1776867 1735734 1618911 1612413 1599392
16008 1599392 1628596 1637685 1649192 1664526 1641695 1655007 1630450 1687574 1713445 1690620 1676871
15997 1676871 1617241 1686046 1670969 1672450 1724264 1679125 1756201 1692284 1656808 1696806 1689245 1667883
15985 1667883 1656655 1743988 1684469 1705853 1666257 1627726 1719966 1724945 1768694 1742493 1699760
15974 1699760 1679013 1722747 1712137 1695364 1694230 1654128 1632160 1591725 1695290 1710394 1629403
15963 1629403 1663822 1675802 1716581 1683964 1687720 1676564 1689356 1679904 1691640 1645240 1687709 1755889
15951 1755889 1741431 1727333 1657463 1596804 1745566 1704804 1713557 1704038 1678736 1722359 1666572
15940 1666572 1690009 1700324 1736338 1670393 1650544 1673041 1718732 1665150 1635146 1685124 1720905
15929 1720905 1767826 1721230 1707384 1732121 1750963 1641721 1690445 1704964 1703686 1704739 1726933
15918 1726933 1702340 1723675 1681482 1623881 1628151 1606107 1727988 1690585 1670869 1664613 1652895
15907 1652895 1708678 1698777 1717585 1740549 1685934 1756269 1709783 1597769 1651739 1781898 1664247
15896 1664247 1686293 1676053 1659881 1636109 1750351 1773548 1726802 1740104 1704753 1677437 1648619
15885 1648619 1638976 1616014 1655620 1712481 1688158 1809543 1756229 1717582 1759847 1718460 1760059
15874 1760059 1755332 1692349 1717931 1698449 1718061 1747813 1678961 1671387 1703245 1671962 1655113 1713186
15862 1713186 1746972 1657277 1682476 1653855 1658251 1684749 1693071 1668930 1635630 1682991 1612179 1648970
15850 1648970 1709919 1733841 1712327 1696648 1796208 1792691 1729809 1740606 1735104 1743691 1713903 1603611
15838 1603611 1656932 1778600 1784866 1734881 1705271 1696921 1722678 1654073 1658912 1700134 1680861 1663206
15826 1663206 1680415 1684969 1653839 1690451 1709873 1768114 1777673 1745034 1717093 1716463 1719842 1664869
15814 1664869 1697583 1646601 1652395 1690787 1693633 1726822 1711323 1753361 1753078 1770339 1696525 1710731
15802 1710731 1706556 1728129 1671152 1696205 1681986 1582017 1671383 1703369 1701372 1799593 1725941 1759227
15790 1759227 1715385 1620502 1674839 1688015 1627677 1714808 1720816 1736579 1763130 1779275 1726881
15779 1726881 1690129 1658897 1570692 1567687 1651330 1718973 1715477 1714722 1701247 1649189 1661756 1647950
15767 1647950 1666088 1733269 1688018 1670727 1747210 1781549 1728827 1713606 1700266 1772214 1713909
15756 1713909 1743459 1687939 1668554 1687751 1733118 1757291 1701246 1763414 1771935 1792504 1742797
15745 1742797 1694887 1680878 1691544 1669215 1686040 1676872 1654465 1681861 1738389 1828720 1721659
15734 1721659 1696370 1737461 1779457 1751143 1712677 1726132 1705701 1693349 1750257 1657504 1722308
15723 1722308 1772592 1721319 1717843 1743210 1768500 1747042 1764804 1821922 1734298 1650051 1733263
15712 1733263 1742896 1788774 1721322 1683573 1690451 1713569 1755413 1747477 1723204 1721035 1717810 1705300
15700 1705300 1667127 1690023 1761928 1771211 1808620 1726897 1696729 1757297 1744791 1615655 1694677
15689 1694677 1687302 1632708 1635297 1718502 1756728 1761225 1855937 1748941 1736805 1725369 1665169 1644194
15677 1644194 1714498 1716212 1744164 1784576 1748075 1632632 1715803 1700826 1699323 1728446 1668383
15666 1668383 1645059 1737592 1793231 1766407 1733663 1745677 1723877 1706092 1696415 1702624 1748052 1756343
15654 1756343 1752469 1712432 1685144 1707228 1706135 1752020 1692079 1688971 1664073 1719141 1730282 1726260
15642 1726260 1702373 1751270 1768364 1633895 1699490 1714537 1752536 1730454 1794326 1726381 1734487
15631 1734487 1746289 1706955 1695190 1736291 1762149 1780398 1695010 1725005 1765347 1747509 1637327
15620 1637327 1705116 1720318 1667681 1713819 1752084 1752182 1730091 1781093 1696732 1754627 1706478 1706786
15608 1706786 1686064 1740361 1786955 1781346 1726839 1674190 1664477 1777364 1820354 1761211 1758473 1769228
15596 1769228 1700488 1702425 1750712 1751792 1804496 1719641 1761799 1762162 1805623 1747551 1724144 1813275
15584 1813275 1868360 1740495 1781734 1794343 1744004 1815468 1750238 1696182 1689471 1750155 1729956
15573 1729956 1756982 1802571 1753641 1758045 1654290 1697499 1722531 1763556 1791224 1755228 1796544
15562 1796544 1731803 1703405 1695953 1685656 1696173 1795554 1723640 1642412 1628291 1675861 1717049
15551 1717049 1711862 1766656 1810198 1820704 1811912 1840628 1783040 1751652 1741097 1726894 1736391 1799174
15539 1799174 1815153 1851842 1832342 1742184 1774092 1775887 1760073 1822111 1836632 1811872 1822582
15528 1822582 1709935 1651274 1733729 1785283 1763612 1789593 1771340 1756259 1785718 1735183 1759272
15517 1759272 1760178 1758177 1775946 1749200 1819737 1784449 1707244 1793538 1772774 1783997 1758006 1800664
15505 1800664 1787431 1778528 1745835 1747047 1836249 1732330 1717016 1788681 1849985 1855826 1820597 1815451
15493 1815451 1761442 1695694 1736729 1787937 1799044 1760225 1819983 1856184 1800255 1758490 1728659
15482 1728659 1720501 1767877 1785387 1795549 1782308 1776361 1726443 1773647 1767830 1785801 1694191 1733352
15470 1733352 1785646 1769700 1749522 1753127 1757328 1748343 1754304 1782509 1730405 1676605 1704721 1740213
15458 1740213 1741471 1689822 1743280 1755603 1709946 1805325 1825983 1754178 1849308 1822195 1804824
15447 1804824 1809911 1749245 1787842 1827707 1825777 1775519 1735178 1757295 1757352 1767453 1736611 1732356
15435 1732356 1742883 1760074 1804597 1762669 1715317 1776310 1779900 1857869 1835878 1726794 1726527 1742881
15423 1742881 1715971 1678334 1698926 1802701 1747065 1798154 1808689 1784676 1766766 1792192 1818743
15412 1818743 1774451 1829265 1744194 1742306 1736995 1735313 1717229 1709332 1773802 1816571 1849799 1825569
15400 1825569 1767290 1691703 1699307 1720121 1771048 1759132 1695086 1732370 1811181 1721212 1715415 1705008
15388 1705008 1754711 1766874 1769381 1791486 1739201 1801045 1780619 1792480 1833524 1745445 1757345
15377 1757345 1820939 1789818 1852179 1895030 1827480 1751087 1859283 1801146 1723789 1731628 1745797
15366 1745797 1801558 1787088 1820649 1862663 1795651 1812703 1817899 1834233 1817889 1764693 1790177
15355 1790177 1801573 1782064 1824193 1803408 1757168 1746025 1786568 1805913 1725684 1689921 1727871
15344 1727871 1788643 1725861 1765646 1792404 1789972 1836638 1772439 1819917 1865885 1833824 1783926
15333 1783926 1776794 1815602 1827819 1805731 1842712 1743838 1760377 1733227 1741696 1700534 1706586 1752279
15321 1752279 1721615 1731927 1695340 1714568 1745078 1778809 1752238 1758992 1741393 1814371 1764825
15310 1764825 1781840 1746377 1772986 1817240 1788871 1825982 1763600 1758586 1770770 1809715 1810147 1795125
15298 1795125 1771440 1718664 1720504 1786354 1794694 1748158 1835756 1841950 1751231 1819794 1826243 1749904
15286 1749904 1757847 1766174 1765253 1772830 1812693 1850472 1935115 1842896 1791427 1838932 1829736 1749478
15274 1749478 1813571 1769545 1744426 1748429 1674767 1769916 1834255 1803806 1800434 1782489 1778385 1856461
15262 1856461 1873275 1798806 1779594 1830988 1814836 1801398 1880775 1882867 1812613 1820064 1800556 1798155
15250 1798155 1814608 1770693 1807451 1817833 1772456 1702475 1781740 1752764 1791958 1802332 1788000
15239 1788000 1792265 1772408 1798957 1811909 1870885 1808264 1829595 1814893 1802791 1831125 1801778
15228 1801778 1822384 1837006 1814433 1846600 1876118 1851524 1897383 1899036 1823761 1790333 1812973
15217 1812973 1849479 1786547 1755040 1757940 1768576 1768814 1777002 1813488 1773389 1785563 1765112 1784329
15205 1784329 1814518 1810536 1766173 1745043 1800782 1781447 1774318 1730469 1791006 1835500 1830405 1861004
15193 1861004 1870195 1820982 1807550 1830659 1792577 1717580 1749138 1848471 1883618 1834104 1871378
15182 1871378 1796798 1758613 1798218 1864118 1816751 1753379 1754017 1723702 1721952 1773791 1794938 1742518
15170 1742518 1769140 1862683 1800267 1762608 1829691 1807465 1816892 1862949 1869122 1793823 1717474 1754710
15158 1754710 1830856 1807389 1854143 1842761 1803921 1760286 1764353 1790959 1757350 1810549 1806919 1767440
15146 1767440 1783130 1808297 1727782 1807339 1748763 1748899 1762668 1818166 1826681 1814848 1788745 1861607
15134 1861607 1857071 1858675 1903779 1813753 1818287 1818906 1890506 1849099 1829243 1877333 1821327 1826315
15122 1826315 1832532 1800488 1798192 1738085 1853420 1867040 1808434 1836484 1840137 1883365 1873300 1823103
15110 1823103 1827950 1765024 1775361 1760394 1738201 1786310 1875015 1850856 1839396 1871100 1839024
15099 1839024 1794730 1772879 1822551 1823438 1814079 1812319 1789768 1799012 1821351 1819025 1801476 1811289 1851627
15086 1851627 1826766 1805009 1831772 1871257 1875552 1808786 1886336 1876689 1842464 1835407 1852739 1858306
15074 1858306 1829668 1776914 1792177 1919996 1904964 1902509 1878553 1878076 1842528 1832898 1791421 1811245
15062 1811245 1838580 1809700 1838621 1833757 1798433 1802639 1813775 1843252 1827248 1800031 1794055 1772971
15050 1772971 1806884 1807224 1721098 1745559 1878694 1840695 1770154 1789739 1864160 1894407 1851563
15039 1851563 1873245 1893035 1864609 1907664 1842712 1828545 1810971 1863127 1859098 1845952 1806715
15028 1806715 1872721 1833592 1835367 1843888 1862145 1838396 1762368 1745550 1793043 1824612 1810259 1832055
15016 1832055 1836706 1771756 1746864 1840925 1852719 1816793 1894618 1841766 1855376 1818015 1805791
15005 1805791 1913197 1846024 1820506 1841726 1848234 1869185 1882235 1858545 1780545 1780709 1784279 1846512
14993 1846512 1938899 1849730 1858057 1870606 1893262 1885484 1833274 1931165 1871723 1852504 1829013 1841406
14981 1841406 1902490 1848765 1844696 1847324 1883522 1845957 1871120 1795168 1772306 1773895 1774315 1711298
14969 1711298 1802336 1802748 1820944 1828098 1826061 1826494 1817450 1782137 1826913 1884992 1862163 1896896 1924512
14956 1924512 1828830 1834340 1924410 1880681 1895212 1841648 1814757 1835533 1797193 1872358 1852362
$$ [...]
##END NTUPLES=NMR SPECTRUM
##END=
