##TITLE=1H_EC-3333(II-3)
 CDCl3
 8 sc, 
 4.10.2024
##JCAMPDX= 6.0         $$ Bruker NMR JCAMP-DX V2.0
##DATA TYPE= NMR SPECTRUM
##DATA CLASS= NTUPLES
##ORIGIN= UXNMR, Bruker Analytische Messtechnik GmbH
##OWNER= root
$$ XWIN-NMR		Version 3.5
$$ Fri Oct  4 14:07:29 2024 Russian Standard Time (UT+4h)  she@DPX200
##.OBSERVE FREQUENCY= 200.1318
##.OBSERVE NUCLEUS= ^1H
##.ACQUISITION MODE= SIMULTANEOUS
##.ACQUISITION SCHEME= undefined
##.AVERAGES= 8
##.DIGITISER RES= 18
##SPECTROMETER/DATA SYSTEM= spect
##.PULSE SEQUENCE= zg30
##.SOLVENT NAME= CDCl3
##.SHIFT REFERENCE= (INTERNAL, CDCl3, 0, 21.0282)
##AUDIT TRAIL= $$ (NUMBER, WHEN, WHO, WHERE, WHAT)
$$ ##TITLE= Audit trail, XWIN-NMR		Version 3.5
$$ ##JCAMPDX= 5.01
$$ ##ORIGIN= Bruker BioSpin GmbH
$$ ##OWNER= she
$$ F:/spectra/data/she/nmr/H-F/1/pdata/1/auditp.txt
$$ ##AUDIT TRAIL=  $$ (NUMBER, WHEN, WHO, WHERE, WHAT)
(   1,<2024-10-04 14:06:09.95 +0400>,<she>,<DPX200>,
      <created by zg, POWCHK disabled, PULCHK disabled
       configuration hash MD5:
       00 E9 B6 7A A2 85 ED C7 34 08 36 98 17 FE 4E 26
       data hash MD5: 16K
       89 99 EB E7 43 23 DB 10 DC F0 2E DB 2D 06 6E 59>)
(   2,<2024-10-04 14:06:12.48 +0400>,<she>,<DPX200>,
      <Start of raw data processing
       efp BC_mod = 2 LB = 0.24 FT_mod = 6 PKNL = 1 PHC0 = -26342.21 PHC1 = 9.38747 SI = 16K 
       data hash MD5: 16K
       EF 3A 9D 00 94 93 CD F1 8E 03 66 D4 78 80 9A 59>)
(   3,<2024-10-04 14:06:28.67 +0400>,<she>,<DPX200>,
      <pk PHC0 = 0.3874371 PHC1 = 0 
       data hash MD5: 16K
       41 3D 9A F2 28 3B 5D F7 9D 70 5A B4 24 78 0E E3>)
(   4,<2024-10-04 14:06:32.43 +0400>,<she>,<DPX200>,
      <abs ABSG = 5 
       data hash MD5: 16K
       29 A2 3F FB 72 C6 95 35 E4 BD A7 51 4E C7 F0 93>)
$$ ##END=
$$ 
$$ hash MD5
$$ B0 B5 BA 6F EF A7 C8 B1 BB 5B AA B7 EA 5C D3 80
##$RELAX= 
##$RELAX= 
##$RELAX= 
##$RELAX= 
##$RELAX= 
##$RELAX= 
$$ Bruker specific parameters
$$ --------------------------
##$DU= <F:/spectra>
##$EXPNO= 1
##$NAME= <H-F>
##$PROCNO= 1
##$TYPE= <nmr>
##$USER= <she>
##$AMP= (0..31)
100 100 100 100 100 100 100 100 100 100 100 100 100 100 100 100 100 100 
100 100 100 100 100 100 100 100 100 100 100 100 100 100 
##$AQSEQ= 0
##$AQ_mod= 1
##$AUNM= <au_zg>
##$AUTOPOS= <>
##$BF1= 200.13
##$BF2= 200.13
##$BF3= 200.13
##$BF4= 200.13
##$BF5= 200.13
##$BF6= 200.13
##$BF7= 200.13
##$BF8= 200.13
##$BYTORDA= 1
##$CFDGTYP= 0
##$CFRGTYP= 5
##$CHEMSTR= <none>
##$CNST= (0..31)
1 1 145 1 1 1 1 1 1 1 1 1 1 1 1 1 1 1 1 1 1 1 1 1 1 1 1 1 1 1 1 1 
##$CPDPRG= <>
##$CPDPRG1= <>
##$CPDPRG2= <>
##$CPDPRG3= <>
##$CPDPRG4= <mlev>
##$CPDPRG5= <mlev>
##$CPDPRG6= <mlev>
##$CPDPRG7= <mlev>
##$CPDPRG8= <mlev>
##$CPDPRGB= <>
##$CPDPRGT= <>
##$D= (0..31)
0 1.2 0 0 0 0 0 0 0 0.06 0 0.03 0 0 0 0 0.0002 0 0 0 0 0 0 0 0 0 0 0 0 
0 0 0 
##$DATE= 1728036369
##$DBL= (0..7)
120 120 120 120 120 120 120 120 
##$DBP= (0..7)
150 150 150 150 150 150 150 150 
##$DBP07= 0
##$DBPNAM0= <>
##$DBPNAM1= <>
##$DBPNAM2= <>
##$DBPNAM3= <>
##$DBPNAM4= <>
$$ [...]
##$SUBNAM3= <"">
##$SUBNAM4= <"">
##$SUBNAM5= <"">
##$SUBNAM6= <"">
##$SUBNAM7= <"">
##$SUBNAM8= <"">
##$SUBNAM9= <"">
##$SW= 24.0689170037331
##$SWIBOX= (0..15)
0 0 2 0 0 0 0 0 0 0 0 0 0 0 0 0 
##$SW_h= 4816.95568400771
##$TD= 16384
##$TD0= 1
##$TE= 0
##$TE2= 300
##$TE3= 300
##$TEG= 300
##$TL= (0..7)
0 120 120 120 120 120 120 120 
##$TP= (0..7)
150 150 150 150 150 150 150 150 
##$TP07= 0
##$TPNAME0= <>
##$TPNAME1= <>
##$TPNAME2= <>
##$TPNAME3= <>
##$TPNAME4= <>
##$TPNAME5= <>
##$TPNAME6= <>
##$TPNAME7= <>
##$TPOAL= (0..7)
0.5 0.5 0.5 0.5 0.5 0.5 0.5 0.5 
##$TPOFFS= (0..7)
0 0 0 0 0 0 0 0 
##$TUNHIN= 0
##$TUNHOUT= 0
##$TUNXOUT= 0
##$USERA1= <user>
##$USERA2= <user>
##$USERA3= <user>
##$USERA4= <user>
##$USERA5= <user>
##$V9= 5
##$VALIST= <valist>
##$VCLIST= <CCCCCCCCCCCCCCC>
##$VD= 0
##$VDLIST= <DDDDDDDDDDDDDDD>
##$VPLIST= <PPPPPPPPPPPPPPP>
##$VTLIST= <TTTTTTTTTTTTTTT>
##$WBST= 1024
##$WBSW= 4
##$XGAIN= (0..3)
0 0 0 0 
##$XL= 0
##$YL= 0
##$YMAX_a= 489279
##$YMIN_a= -428554
##$ZGOPTNS= <>
##$ZL1= 120
##$ZL2= 120
##$ZL3= 120
##$ZL4= 120
##$ABSF1= 21.03551
##$ABSF2= -3.033625
##$ABSG= 5
##$ABSL= 3
##$ALPHA= 0
##$AQORDER= 0
##$ASSFAC= 0
##$ASSFACI= 0
##$ASSFACX= 0
##$ASSWID= 0
##$AUNMP= <proc_1d>
##$AZFE= 0.1
##$AZFW= 0.1
##$BCFW= 0
##$BC_mod= 2
##$BYTORDP= 0
##$COROFFS= 0
##$CY= -3
##$DATMOD= 1
##$DC= 0
##$DFILT= <>
##$DTYPP= 0
##$F1P= 0
##$F2P= 0
##$FCOR= 1
##$FTSIZE= 16384
##$FT_mod= 6
##$GAMMA= 0
##$GB= 0
##$INTBC= 1
##$INTSCL= 3.70164e-10
##$ISEN= 128
##$LB= 0.24
##$LEV0= 0
##$LPBIN= 0
##$MAXI= 10000
##$MC2= 0
##$MEAN= 0
##$ME_mod= 0
##$MI= 1.114404
##$NCOEF= 0
##$NC_proc= -4
##$NLEV= 6
##$NOISF1= 3.799351
##$NOISF2= 2.8
##$NSP= 0
##$NTH_PI= 0
##$NZP= 0
##$OFFSET= 21.02817
##$PC= 1
##$PHC0= -26341.82
##$PHC1= 9.38747
##$PH_mod= 1
##$PKNL= yes
##$PPARMOD= 0
##$PSCAL= 0
##$PSIGN= 0
##$REVERSE= no
##$SF= 200.130000108521
##$SI= 16384
##$SIGF1= 3
##$SIGF2= 2
##$SINO= 5.538805
##$SIOLD= 16384
##$SREGLST= <1H.CDCl3>
##$SSB= 0
##$STSI= 16384
##$STSR= 0
##$SW_p= 4816.95568400771
##$SYMM= 0
##$S_DEV= 0
##$TDeff= 16384
##$TDoff= 0
##$TI= <>
##$TILT= no
##$TM1= 0
##$TM2= 0
##$TOPLEV= 0
##$USERP1= <user>
##$USERP2= <user>
##$USERP3= <user>
##$USERP4= <user>
##$USERP5= <user>
##$WDW= 1
##$XDIM= 16384
##$YMAX_p= 369434471
##$YMIN_p= -111382
$$ End of Bruker specific parameters
$$ ---------------------------------
##NTUPLES= NMR SPECTRUM
##VAR_NAME=  FREQUENCY,     SPECTRUM/REAL,   SPECTRUM/IMAG
##SYMBOL=    X,             R,               I
##VAR_TYPE=  INDEPENDENT,   DEPENDENT,       DEPENDENT
##VAR_FORM=  AFFN,          ASDF,            ASDF
##VAR_DIM=   16384,         16384,           16384
##UNITS=     HZ,            ARBITRARY UNITS, ARBITRARY UNITS
##FACTOR=    0.29402158847633, 1,            1
##FIRST=     4208.36759072575, 0,            0
##LAST=      -608.588093281956, 0,           0
##MIN=       -608.588093281956, -111382,     0
##MAX=       4208.36759072575, 369434471,    0
$$ Real data points
##PAGE= N=1
##DATA TABLE= (X++(R..R)), XYDATA
$$ [...]
$$ plain form
7533 79998 72349 86208 66848 77169 74367 69821 64756 39604 16605 21422 46370 28812 23494
7520 23494 31401 17018 28822 61321 49021 66091 23705 655 7826 -25226 -2313 6060
7508 6060 -16849 -16426 6637 -22019 -8127 10931 18146 -29106 -30641 -20711 -1204 -44089 -35666
7495 -35666 -21596 -16441 4332 -12636 -6444 -20424 -45888 -41349 -8129 -3036 19968 -3578 -4365
7482 -4365 -8536 -30956 10590 -2201 47436 27356 17986 -6290 -1603 -17668 -17876 17244 -13599
7469 -13599 -34362 -10925 -53462 -43156 -16088 -19714 5551 32450 25521 -3548 -12761 -25940
7457 -25940 -12130 -17584 -20524 18094 1550 7151 -11632 28623 13662 -2987 -4610 -8152 20219
7444 20219 12436 22961 -24216 -33441 -15490 -32719 -37135 -23181 -1972 30091 -3827 13579
$$ packed form
7533G9998p649J3859j9360J0321k802m546n065k5152k2999M817K4948j7558n318
7520B3494P907j4383J1804L2499j2300J7070m2386k3050P171l3052K2913Q373
7508F060k2909M23K3063k8656J3892J9058P215m7252j535R930J9507m2885Q423
7495c5666J4070N155K0773j6968O192j3980k5464M539L3220N093K3004k3546p87
7482d365m171k2420M1546j2791M9637k0080r370k4276M687j6065k08L5120l0843
7469a3599k0763K3437m2537J0306K7068l626K5265K6899o929k9069r213j3179
7457b5940J3810n454k940L8618j6544N601j8783M0255j4961j6649j623l542K8371
7444B0219p783J0525m7177r225J7951j7229m416J3954K1209L2063l3918J7406
$$ plain form
7432 13579 26603 31683 24015 8660 28376 17754 -4867 7754 -4982 -1191 28717 8665
7420 8665 -24610 -29678 1521 17359 4033 6597 -33441 5128 17145 -6527 -10687 -28128 36612
7407 36612 50390 21158 18775 41494 55833 6091 22978 8132 71406 49270 50319 20206
7395 20206 32177 21409 34482 36123 32154 25308 20688 43837 10515 10794 15595 -4262 -10920
7382 -10920 -24037 -11442 7251 16846 9660 -13117 23959 -634 19564 16820 14656 30977 -7908
7369 -7908 41477 7771 -15128 17013 20734 15878 22706 30064 -15837 4340 -19905 12154 8963
7356 8963 22518 26428 7071 19477 26423 24252 9327 30122 24130 -9093 30205 23529 21204
7343 21204 19899 7370 9276 15609 9408 13433 23100 11665 271 758 6986 -4497 -2594 22486
$$ packed form
7432A3579J3024N080p668j5355J9716j0622k2621J2621j2736L791K9908k0052
7420H665l3275n068L1199J5838j3326K564m0038L8569J2017k3672m160j7441O4740
7407C6612J3778k9232k383K2719J4339m9742J6887j4846O3274k2136J049l0113
7395B0206J1971j0768J3073J641l969o846m620K3149l3322K79M801j9857o658
7382a0920j3117J2595J8693R595p186k2777L7076k4593K0198k744k164J6321l8885
7369g908M9385l3706k2899L2141L721m856O828P358m5901K0177k4245L2059l191
7356H963J3555L910j9357J2406O946k171j4925K0795n992l3223L9298o676k325
7343B1204j305j2529J906O333o201M025R667j1435j1394M87O228j1483J903K5080
$$ plain form
7329 22486 26831 36011 44655 31088 8590 9179 26283 21913 22607 -21843 16889 27847 43038
7316 43038 17983 14808 21831 5624 -8273 11011 9939 8493 46260 15106 20343 17233 9807
7303 9807 57655 27947 5742 24406 13921 28410 17745 6732 13816 38311 14893 62630
7291 62630 51835 23330 44082 47478 39450 55004 56410 43606 19756 5074 -20896 31172
7279 31172 46237 17751 58975 62055 88050 70671 110248 96709 86516 113209 103298 99290
7267 99290 121842 115266 60297 54105 82649 82847 102897 91708 79002 111308 94179 145661 99858
7254 99858 63548 43936 63802 101901 80507 83471 61777 69242 89755 87229 84159 60568 69156
7241 69156 85526 61687 75894 115036 137345 99803 82958 69889 48981 81580 51788 67635
$$ packed form
7329B2486M345R180Q644j3567k2498N89J7104m370O94m4450L8732J0958J5191
7316D3038k5055l175P023j6207j3897J9284j072j446L7767l1154N237l110p426
7303I807M7848k9708k2205J8664j0485J4489j0665j1013P084K4495k3418M7737
7291F2630j0795k8505K0752L396q028J5554J406j2804k3850j4682k5970N2068
7279C1172J5065k8486M1224L080K5995j7379L9577j3539j0193K6693r911m008
7267I9290K2552o576n4969o192K8544J98K0050j1189j2706L2306j7129N1482m5803
7254I9858l6310j9612J9866L8099k1394K964k1694P465K0513k526l070k3591Q588
7241F9156J6370k3839J4207L9142K2309l7542j6845j3069k0908L2599k9792J5847
$$ plain form
7229 67635 103232 80549 13919 4990 25400 64178 36027 20668 3364 36991 75325 64572
7217 64572 48866 54448 46164 32052 70525 16870 48260 73459 73836 71774 63532 64640 43309
7204 43309 38533 35307 39199 60548 66773 69151 37167 33503 47039 35130 47945 73475 46266
7191 46266 40658 31933 48997 42990 47380 73900 49724 31092 46233 51611 40393 69971 84692
7178 84692 47527 60984 67774 39415 88161 90203 79274 73241 87132 85848 98139 92783 70363
7165 70363 57441 80570 68233 32564 74837 90167 57634 62958 74645 67290 62188 55260 77958
7152 77958 94471 101072 77787 77021 53806 65858 103392 104833 137691 161872 159367 157077 163455
7139 163455 144202 149363 155204 152198 176681 171220 178140 173096 172506 181734 204612 173823 182502 174216
$$ packed form
7229F7635L5597k2683o6630q929K0410L8778k8151j5359j7304L3627L8334j0753
7217F4572j5706N582q284j4112L8473n3655L1390K5199L77k062q242J108k1331
7204D3309m776l226L892K1349O225K378l1984l664J3536j1909J2815K5530k7209
7191D6266n608q725J7064o007M390K6520k4176j8632J5141N378j1218K9578J4721
7178H4692l7165J3457O790k8359M8746K042j0929o033J3891j284J2291n356k2420
7165G0363j2922K3129j2337l5669M2273J5330l2533N324J1687p355n102o928K2698
7152G7958J6513O601k3285p66k3215J2052L7534J441L2858K4181k505k290O378
7139A63455j9253N161N841l006K4483n461O920n044n90R228K2878l0789Q679q286
$$ plain form
7125 174216 175177 189595 204491 171307 179067 189388 206224 190856 215093 232737 251510 270886
7113 270886 256355 220345 246227 247471 240640 244904 265854 294003 316805 281684 286725 320627
7101 320627 321553 301363 327160 394230 378159 371539 372320 401845 411815 416168 451099 435109 454064
7088 454064 498794 495440 519335 545761 537499 548217 597026 554839 624507 625915 674168 710131
7076 710131 728319 758211 793155 823647 887501 925639 961434 996805 1046048 1096536 1158731 1177129
7064 1177129 1229415 1278937 1342311 1383467 1467377 1530253 1676996 1792345 1881114 2021195 2138958
7053 2138958 2263672 2500400 2719787 3035659 3368111 3760117 4186779 4736069 5465637 6552701
7043 6552701 8071999 9893877 11779070 11968138 10244421 8073335 6518939 5431871
$$ packed form
7125A74216R61J4418J4896l3184P760J0321J6836j5368K4237J7644J8773J9376
7113B70886j4531l6010K5882J244o831M264K0950K8149K2802l5121N041L3902
7101C20627R26k0190K5797O7070j6071o620P81K9525R970M353L4931j5990J8955
7088D54064M4730l354K3895K6426q262J0718M8809m2187O9668J408M8253L5963
7076G10131J8188K9892L4944L0492O3854L8138L5795L5371M9243N0488O2195J8398
7064A177129N2286M9522O3374M1156Q3910O2876J46743J15349Q8769J40081J17763
7053B138958J24714K36728K19387L15872L32452L92006M26662N49290P29568J087064
7043F552701J519298J821878J885193J89068j723717k171086j554396j087068
$$ plain form
7035 5431871 4660609 4093849 3621015 3278627 3062582 2889594 2692862 2580970 2441870 2309256
7025 2309256 2211385 2151798 2102357 2020508 1974306 1902939 1887122 1874880 1901624 1913129 1880788
7014 1880788 1877538 1843297 1772112 1721575 1689391 1699495 1667328 1633018 1595939 1588768 1587949 1555972
7002 1555972 1587011 1606270 1623154 1689840 1756663 1842523 1914939 1977527 1956662 2006772 2069122
6991 2069122 2150553 2267173 2515167 2662153 2830087 3007225 2992457 2897770 2682458 2455886
6981 2455886 2302076 2210534 2122976 2029829 1986099 1907730 1797828 1734480 1654072 1606817 1606489
6970 1606489 1603085 1600080 1615051 1677834 1686847 1736251 1804356 1888966 1937019 1986883 2111036 2239132
6958 2239132 2369945 2330386 2120059 1926221 1778091 1636246 1491166 1357606 1277317 1182121
$$ packed form
7035E431871p71262n66760m72834l42388k16045j72988j96732j11892j39100j32614
7025B309256r7871n9587m9441q1849m6202p1367j5817j2242K6744J1505l2341
7014A880788l250l4241p1185n0537l2184J0104l2167l4310l7079p171q19l1977
7002A555972L1039J9259J6884O6686O6823Q5860P2416O2588k0865N0110O2350
6991B069122Q1431J16620K47994J46986J67934J77138j4768r4687k15312k26572
6981B455886j53810r1542q7558r3147m3730p8369j09902o3348q0408m7255l28
6970A606489l404l005J4971O2783R013M9404O8105Q4610M8053M9864J24153J28096
6958B239132J30813l9559k10327j93838j48130j41845j45080j33560q0289r5196
$$ plain form
6948 1182121 1116200 1050872 992447 960686 892815 886031 876185 909801 936227 872112 837932 801286
6936 801286 794080 787442 761174 750581 765400 739937 728000 671475 656791 646130 626274 636390
6924 636390 642281 618390 589029 587178 631556 651828 633448 637837 636189 571446 634014 602816
6912 602816 640872 643579 654151 638731 649863 647960 614456 619474 627839 651440 654238 629262 622888
6899 622888 670406 644913 622381 613383 651672 642290 611950 622647 642224 670599 652985 687784
6887 687784 700738 721188 697902 666836 672366 655850 609195 612973 618463 643126 648734 645630 635384
6874 635384 597481 598381 577812 597675 556032 558620 534107 576111 579799 587570 588342 587218 568961
6861 568961 561981 550864 541570 530633 559836 593167 596113 568394 573459 611057 557717 539094
$$ packed form
6948A182121o5921o5328n8425l1761o7871o784r846L3616K6426o4115l4180l6646
6936H01286p206o638k6268j0593J4819k5463j1937n6525j4684j0661j9856J0116
6924F36390N891k3891k9361j851M4378K0272j8380M389j648o4743O2568l1198
6912F02816L8056K707J0572j5420J1132j903l3504N018Q365K3601K798k4976o374
6899F22888M7518k5493k2532q998L8289r382l0340J0697J9577K8375j7614L4799
6887F87784J2954K0450k3286l1066N530j6516m6655L778N490K4663N608l104j0246
6874F35384l7903R00k0569J9863m1643K588k4513M2004L688P771P72j124j8257
6861E68961o980j1117r294j0937K9203L3331K946k7719N065L7598n3340j8623
$$ plain form
6849 539094 573683 559493 545864 536372 531497 588362 586966 542685 522981 491074 465638 456622
6837 456622 456579 467025 456638 448967 429835 380479 408891 425814 421138 437068 467081 424812 413018
6824 413018 407062 394025 432069 434180 394962 385121 358552 378185 426795 362994 343419 363861
6812 363861 374495 379710 410133 414916 430708 443434 419059 450508 411984 418907 401501 391772
6800 391772 424089 377674 400270 428811 403642 398594 359744 399560 397441 401422 435963 441633
6788 441633 475204 463440 483803 503800 546051 553782 551898 539946 556638 598560 582085 603569
6776 603569 610768 606546 629342 623860 604829 661697 665775 629463 628024 654532 662510 665565 663817
6763 663817 625095 646530 676155 659991 666989 710408 740249 701830 707305 803491 850332 879856
$$ packed form
6849E39094L4589j4190j3629r492m875N6865j396m4281j9704l1907k5436r016
6837D56622m3J0446j0387p671j9132m9356K8412J6923m676J5930L0013m2269j1794
6824D13018n956j3037L8044K111l9218r841k6569J9633M8610o3801j9575K0442
6812C63861J0634N215L0423M783J5792J2726k4375L1449l8524O923j7406r729
6800C91772L2317m6415K2596K8541k5169n048l8850L9816k119L981L4541N670
6788D41633L3571j1764K0363J9997M2251P731j884j1952J6692M1922j6475K1484
6776F03569P199m222K2796n482j9031N6868M078l6312j439K6508P978L055j748
6763F63817l8722K1435K9625j6164O998M3419K9841l8419N475R6186M6841K9524
$$ plain form
6751 879856 871490 910257 936752 1027634 1107029 1181071 1257507 1321001 1416294 1433216 1423675 1405070
6739 1405070 1381388 1324015 1265604 1289156 1288344 1334851 1343735 1350490 1353969 1297082 1266245 1223671
6727 1223671 1188769 1166669 1114342 1063328 1057609 1067230 1027679 1063593 1068332 1056383 1050411 1078615
6715 1078615 1122988 1110374 1091956 1095835 1119368 1084036 1077261 1028511 1018084 990133 1026738 1077693
6703 1077693 1026226 1025214 1010466 1002499 965838 941559 893642 809097 780507 744932 681529 646239
6691 646239 653986 626790 550909 528042 505001 478669 476215 511811 520690 492257 456259 442072
6679 442072 410009 354732 344425 324021 338982 315526 311772 280734 282167 295517 280811 277777
6667 277777 276043 247275 239337 241147 236907 219799 247018 244955 238678 220963 228994 241311 223954
$$ packed form
6751H79856q366L8767K6495R0882P9395P4042P6436O3494R5293J6922r541j8605
6739A405070k3682n7373n8411K3552q12M6507Q884O755L479n6887l0837m2574
6727A223671l4902k2100n2327n1014n719R621l9551L5914M739j1949n972K8204
6715A078615M4373j2614j8418L879K3533l5332o775m8750j0427k7951L6605N0955
6703A077693n1467j012j4748p967l6661k4279m7917q4545k8590l5575o3403l5290
6691F46239P747k7196p5881k2867k3041k6332k454L5596Q879k8433l5998j4187
6679D42072l2063n5277j0307k0404J4961k3456l754l1038J433J3350j4706l034
6667B77777j734k8768p938J810m240j7108K7219k063o277j7715Q031J2317j7357
$$ plain form
6654 223954 173490 147877 174790 159240 177409 176242 148724 128123 140619 161200 129240 170450
6642 170450 197414 158466 136948 115758 120202 100835 120470 115298 126841 138824 172496 141061
6630 141061 93092 80716 92315 107659 83400 126934 116827 105337 81117 49823 76206 49485
6618 49485 59914 69783 67982 32627 54857 59599 70808 72228 55317 60356 12546 29845 27677
6605 27677 49591 69668 26729 37560 25760 67668 63957 57320 60828 40342 43757 47967 14565
6592 14565 10458 15025 69216 56287 38177 23031 39491 48633 44748 -1207 -6813 7872 37319
6579 37319 49383 32827 26591 8803 25661 30389 44313 9831 18112 -6302 9094 11299 45311
6566 45311 45040 10660 -2726 19429 33910 36571 22729 50780 45753 33126 10655 48430 24777
$$ packed form
6654B23954n0464k5613K6913j5550J8169j167k7518k0601J2496K0581l1960M1210
6642A70450K6964l8948k1518k1190M444j9367J9635n172J1543J1983L3672l1435
6630A41061m7969j2376J1599J5344k4259M3534j0107j1490k4220l1294K6383k6721
6618D9485J0429R869j801l5355K2230M742J1209J420j6911N039m7810J7299k168
6605B7677K1914K0077m2939J0831j1800M1908l711o637L508k0486L415M210l3402
6592A4565m107M567N4191j2929j8110j5146J6460R142l885m5955n606J4685K9447
6579C7319J2064j6556o236j7788J6858M728J3924l4482Q281k4414J5396K205L4012
6566D5311k71l4380j3386K2155J4481K661j3842K8051n027j2627k2471L7775k3653
$$ plain form
6553 24777 41954 30735 47250 12508 24457 37822 30713 38492 40367 46400 41555 3529 -2797
6540 -2797 905 -1433 -5842 19699 53161 42107 -9453 -29119 1634 -31649 18967 11024 17967
6527 17967 36828 39918 43832 29681 50730 83035 75503 78444 70429 87575 92767 99982 104488
6514 104488 87715 91452 75116 82530 105655 79545 81132 97848 99007 77455 46068 66642
6502 66642 66436 77759 44815 90929 91512 44744 41961 50729 58650 84309 84222 72017 91652 68157
6488 68157 120080 105413 95575 108218 129476 104508 132552 140735 107615 147268 172497 191897
6476 191897 177565 189138 180541 154529 178343 192775 155348 144474 158482 137042 94622 55109
6464 55109 61771 78560 84807 71796 53606 38935 61711 58501 80141 76873 77832 84047 87672
$$ packed form
6553B4777J7177j1219J6515l4742J1949J3365p109P779J875O033m845l8026o326
6540b797L702k338m409K5541L3462j1054n1560j9666L0753l3283N0616p943O943
6527A7967J8861L090L914j4151K1049L2305p532K941q015J7146N192P215M506
6514A04488j6773L737j6336P414K3125k6110J587J6716J159k1552l1387K0574
6502F6642k06J1323l2944M6114N83m6768k783Q768P921K5659q7j2205J9635k3495
6488F8157N1923j4667r838J2643K1258k4968K8044Q183l3120L9653K5229J9400
6476A91897j4332J1573q597k6012K3814J4432l7427j0874J4008k1440m2420l9513
6464E5109O662J6789O247j3011j8190j4671K2776l210K1640l268R59O215L625
$$ plain form
6451 87672 65026 105612 119764 123353 88161 91070 120034 116885 129887 126589 99911 62686 133250
6438 133250 140124 109441 126448 135799 144291 101257 106285 87713 74356 68584 70071 55649 67243
6425 67243 51397 34248 46635 51488 47025 23354 42371 45489 -3216 21247 42845 22192
6413 22192 69077 43158 24374 51996 51177 11750 18629 -13687 -2915 26608 31096 24498 58024
6400 58024 5285 -3909 20304 14600 23266 34604 27015 13598 -2199 18829 15677 -4104 -10646
6387 -10646 -15379 -48006 -38117 -1655 28422 23083 1248 9452 6604 14715 -8158 18042 35682
6374 35682 33183 13041 18278 37601 41889 39107 45159 -16693 -5566 23999 14493 -519 4436
6361 4436 -24990 -34131 -36135 -42578 20231 31129 -11818 -4957 -13194 12402 1252 -50341 -12739
$$ packed form
6451H7672k2646M0586J4152L589l5192K909K8964l149J3002l298k6678l7225P0564
6438A33250O874l0683J7007R351Q492m3034N028j8572j3357n772J487j4422J1594
6425F7243j5846j7149J2387M853m463k3671J9017L118m8705K4463K1598k0653
6413B2192M6885k5919j8784K7622q19l9427O879l2316J0772K9523M488o598L3526
6400E8024n2739r194K4213n704Q666J1338p589j3417j5797K1028l152j9781o542
6387a0646m733l2627R889L6462L0077n339k1835Q204k848Q111k2873K6200J7640
6374C5682k499k0142N237J9323M288k782O052o1852J1127K9565r506j5012M955
6361D436k9426r141k004o443O2809J0898m2947O861q237K5596j1150n1593L7602
$$ plain form
6348 -12739 -26930 -26660 -1991 -15782 4551 -7310 -33795 -20669 -9140 -7070 34486 26098 1667
6335 1667 -34921 -50596 -26162 -37579 550 7944 -3218 -14097 3529 -32242 -33771 10916
6323 10916 5473 -4766 -7773 -32134 -30207 -27755 -38183 -37420 -22016 1758 4592 -15657 -18599
6310 -18599 10483 -11765 -2952 38841 35249 26064 14322 -20898 -47898 -40327 -15998 -19848 -37070
6297 -37070 -17658 14574 -4051 -31438 -16706 -11077 -13561 -3986 -13147 -23531 21792 11510 5705
6284 5705 -1758 -3982 -11378 8499 9502 2386 11566 2624 15677 -31288 30120 19505 -22156
6271 -22156 2566 -39635 14694 2519 15546 -11493 -1869 -10315 -5249 43426 18938 3208
6259 3208 10808 20665 2939 3761 4755 10484 22363 12458 -1648 -38898 -36606 -4578 10937 32191
$$ packed form
6348a2739j4191K70K4669j3791K0333j1861k6485J3126J1529K070M1556q388k4431
6335A667l6588j5675K4434j1417L8129P394j1162j0879J7626l5771j529M4687
6323A0916n443j0239l007k4361J927K452j0428P63J5404K3774K834k0249k942
6310a8599K9082k2248Q813M1793l592r185j1742l5220k7000P571K4329l850j7222
6297c7070J9412L2232j8625k7387J4732N629k484R575r161j0384M5323j0282n805
6284E705p463k224p396J9877J003p116R180q942J3053m6965O1408j0615m1661
6271b2156K4722m2201N4329j2175J3027k7039R624q446N066M8675k4488j5730
6259C208P600R857j7726Q22R94N729J1879r905j4106l7250K292L2028J5515K1254
$$ plain form
6245 32191 11424 -2820 -3640 -16762 -14657 6436 -13282 -3525 -19935 -18209 -24070 -24941 -39995
6232 -39995 -26242 -21368 -17578 -13180 -5630 -3428 692 -1181 -5621 16041 39736 7460 -50233
6219 -50233 -21037 -12371 -11954 -34364 -7154 -12254 11949 -23129 6686 -18949 -19327 30947 38411
6206 38411 -4494 9723 55658 7721 -12210 -42596 -29303 5499 15231 -23130 2002 -25485
6194 -25485 -5869 -16038 -30187 -41227 -39154 -42184 -37802 -61222 -38785 -29570 8766 27432 -4457
6181 -4457 -17981 -11629 15509 2839 -48094 -50179 12269 47764 38562 56294 41618 -2738 41
6168 41 7112 26639 18053 24136 7533 -9116 -14129 -23080 -23806 -31491 -14277 51353 28920 -21902
6154 -21902 -20609 -25686 -28604 -18577 -9567 -17410 -29336 -16919 482 15380 19526 16919 7886
$$ packed form
6245C2191k0767j4244q20j3122K105K1093j9718R757j6410J726n861q71j5054
6232c9995J3753M874L790M398P550K202M120j873m440K1662K3695l2276n7693
6219e0233K9196Q666M17k2410K7210n100K4203l5078K9815k5635l78N0274P464
6206C8411m2905J4217M5935m7937j9931l0386J3293L4802R732l8361K5132k7487
6194b5485J9616j0169j4149j1040K073l030M382k3420K2437R215L8336J8666l1889
6181d457j3524O352K7138j2670n0933k085O2448L5495r202J7732j4676m4356K779
6168D1P071J9527q586O083j6603j6649n013q951p26p685J7214O5630k2433n0822
6154b1902J293n077k918J0027R010p843j1926J2417J7401J4898M146k607r033
$$ plain form
6141 7886 -3110 -39967 -29344 -11057 -36375 -34730 -5665 33869 10219 -9993 -19530 -17306 -23315
6128 -23315 -3681 -16270 -61167 -83276 -41007 -32443 -9596 -15597 3991 5893 -22985 -41511
6116 -41511 -36055 -24956 -8196 -7443 13820 18456 -28624 -44454 -35065 -7323 -831 -4388 -1238
6103 -1238 8766 -32480 -23096 -21838 -25630 -42350 -30292 -890 -4731 -3683 -35067 -9877 -6905
6090 -6905 -41324 -12104 -17026 -38212 -37356 -35760 6453 -4280 -18867 -31624 -28930 -19689 -8250
6077 -8250 74212 36191 -4656 -17121 -29518 -18240 -14616 -29869 -19800 -3350 12180 -8200
6065 -8200 18682 -794 -23794 -29090 -52186 -70402 -47301 -19362 9558 -6759 14514 -24477
6053 -24477 -26916 3280 -10565 7608 17187 28458 43837 50545 17684 15048 -14801 4569 2951
$$ packed form
6141G886j0996l6857J0623J8287k5318J645K9065L9534k3650k0212r537K224o009
6128b3315J9634j2589m4897k2109M2269Q564K2847o001J9588J902k8878j8526
6116d1511N456J1099J6760P53K1263M636m7080j5830R389K7742O492l557L150
6103a238J0004m1246R384J258l792j6720J2058K9402l841J048l1384K5190K972
6090f905l4419K9220m922k1186Q56J596M2213j0733j4587j2757K694R241J1439
6077h250Q2462l8021m0847j2465j2397J1278L624j5253J0069J6450J5530k0380
6065h200K6882j9476k3000n296k3096j8216K3101K7939K8920j6317K1273l8991
6053b4477k439L0196j3845J8173R579J1271J5379O708l2861k636k9849J9370j618
$$ plain form
6040 2951 9867 27003 26051 25091 3858 -9274 -37368 -16917 -21920 13405 29570 21567 22016 5628
6026 5628 28025 27306 -12182 32194 48398 47304 51640 43517 46129 56642 74153 53299 56894
6013 56894 31102 28247 77231 76564 69156 90263 76581 38614 38901 37618 32838 60801 53897 53091
5999 53091 29171 39531 13072 22342 22744 17804 36021 49978 87230 66781 59342 80084 85598
5986 85598 100509 163561 138945 131862 175364 183862 224376 230367 249705 265745 268133 272653 248059
5973 248059 247477 202934 203161 186331 154429 133805 115974 136158 113002 96279 76832 61623
5961 61623 64422 83992 67435 51800 108942 98118 102875 121776 93241 73880 82808 40461
5949 40461 45637 107135 74027 82048 102223 123506 116970 138097 153918 185439 225792 217484 231108
$$ packed form
6040B951O916J7136r52r60k1233j3132k8094K0451n003L5325J6165q003M49j6388
6026E628K2397p19l9488M4376J6204j094M336q123K612J0513J7511k0854L595
6013E6894k5792k855M8984o67p408K1107j3682l7967K87j283m780K7963o904q06
5999E3091k3920J0360k6459R270M02m940J8217J3957L7252k0449p439K0742N514
5986H5598J4911O3052k4616p083M3502Q498M0514N991J9338J6040K388M520k4594
5973B48059n82m4543K27j6830l1902k0624j7831K0184k3156j6723j9447j5209
5961F1623K799J9570j6557j5635N7142j0824M757J8901k8535j9361Q928m2347
5949D0461N176O1498l3108Q021K0175K1283o536K1127J5821L1521M0353q308J3624
$$ plain form
5936 231108 195847 191994 239793 222934 219807 201779 155418 121560 175862 155742 136174 121192
5924 121192 102505 114230 111341 104107 97225 70285 102133 110864 101920 90395 96934 75835 66656
5911 66656 75891 53697 89894 73408 108568 110500 88945 145154 121376 114843 159223 145841
5899 145841 132909 136063 121366 157285 199203 188474 157048 164766 138413 143842 135576 133601 144828
5886 144828 113689 127427 142291 145884 133682 144469 147181 154928 146305 151626 164570 200756 154876
5873 154876 127693 130459 147066 168341 189322 193465 158868 161684 200331 209619 216732 247386 261789
5860 261789 248278 254010 231159 232371 247609 210953 196985 202238 175587 165433 162441 174791
5848 174791 173120 144778 162782 181609 149873 146699 175395 227139 220227 227831 231333 223573 205500
$$ packed form
5936B31108l5261l853M7799j6859l127j8028m6361l3858N4302k0120j9568j4982
5924A21192j8687J1725k889p234o882k6940L1848Q731q944j1525O539k1099r179
5911F6656R235k2194L6197j6486L5160J932k1555N6209k3778o533M4380j3382
5899A45841j2932L154j4697L5919M1918j0729l1426P718k6353N429q266j975J1227
5886A44828l1139J3738J4864L593j2202J0787K712P747q623N321J2944L6186m5880
5873A54876k7183K766J6607K1275K0981M143l4597K816L8647R288P113L0654J4403
5860B61789j3511N732k2851J212J5238l6656j3968N253k6651j0154k992J2350
5848A74791j671k8342J8004J8827l1736l174K8696N1744o912P604L502p760j8073
$$ plain form
5835 205500 225787 233222 188942 187731 203881 217491 155080 169361 160400 168916 130486 134599 176687
5822 176687 138488 137632 150977 139635 149863 143328 75606 128342 125899 138706 158116 139640
5810 139640 147807 147571 158191 164538 207745 215497 249862 256580 248262 248950 273704 283322 304684 258129
5796 258129 300090 278470 219931 222886 198928 196720 203416 183057 152235 171573 137715 119275
5784 119275 118534 137848 95063 102930 94318 104643 118697 127818 126697 73881 137005 127686 141421
5771 141421 167260 106397 112280 163488 143945 106506 105216 125753 155991 154821 144360 138476
5759 138476 128615 98782 119875 129905 159021 149545 166739 139648 132917 166041 130254 152887
5747 152887 158308 184173 208489 241070 238289 291138 315225 308523 341973 383662 428555 470776
$$ packed form
5835B05500K0287P435m4280j211J6150J3610o2411J4281q961Q516l8430M113M2088
5822A76687l8199q56J3345j1342J0228o535o7722N2736k443J2807J9410j8476
5810A39640Q167k36J0620O347M3207P752L4365O718q318O88K4754R618K1362m6555
5796B58129M1961k1620n8539K955k3958k208O696k0359l0822J9338l3858j8440
5784A19275p41J9314m2785P867q612J0325J4054R121j121n2816O3124r319J3735
5771A41421K5839o0863N883N1208j9543l7439j290K0537L0238j170j0461n884
5759A38476r861k9833K1093J0030K9116r476J7194k7091o731L3124l5787K2633
5747A52887N421K5865K4316L2581k781N2849K4087o702L3450M1689M4893M2221
$$ plain form
5735 470776 512270 569433 582181 524143 539160 505627 455370 423375 372782 284008 260213 255596
5723 255596 219225 202921 198864 160222 127122 123594 167155 159016 122378 109859 105916 127725
5711 127725 84304 61008 89404 111513 99642 88893 77446 54307 79566 100407 55461 69390
5699 69390 80443 72316 50114 19708 47222 53056 56013 64980 72481 49582 53879 43341 59088
5686 59088 49564 49666 68168 33807 29356 37336 31125 35447 58563 53212 32145 49096 34125
5673 34125 9194 27178 45447 40965 16276 26226 51986 28485 4504 39149 27127 -10779
5661 -10779 36084 24208 -2867 -16795 -12773 -45301 -28019 9774 -17401 -27259 -13132 35492
5649 35492 18389 1769 9478 10547 -9291 -10071 25959 26367 25996 42234 49394 49810 24035 25048
$$ packed form
5735D70776M1494N7163J2748n8038J5017l3533n0257l1995n0593q8774k3795m617
5723B55596l6371j6304m057l8642l3100l528M3561q139l6638j2519l943K1809
5711A27725m3421k3296K8396K2109j1871j0749j1447k3139K5259K0841m4946J3929
5699F9390J1053q127k2202l0406K7514N834K957Q967P501k2899M297j0538J5747
5686E9088r524J02J8502l4361m451P980o211M322K3116n351k1067J6951j4971
5673C4125k4931J7984J8269m482k4689R950K5760k3501k3981L4645j2022l7906
5661a0779M6863j1876k7075j3928M022l2528J7282L7793k7175r858J4127M8624
5649C5492j7103j6620P709J069j9838p80L6030M08l71J6238P160M16k5775J013
$$ plain form
5635 25048 35801 25813 31189 30838 31422 27552 -8053 -1538 35534 13468 -21884 16382 1046
5622 1046 23236 6481 -26745 15157 30149 -9797 -33393 -37530 16063 12251 9584 18369 32242
5609 32242 13313 -3901 30789 67849 40661 58344 62104 59863 88452 97465 101801 118469 135207
5596 135207 88481 63005 41589 40025 55647 27145 10517 788 4518 5757 7626 38092 12839
5583 12839 9408 54429 63875 36525 34706 35928 16302 17213 -6117 12399 21343 28039 48747
5570 48747 39610 46407 30532 -27690 -7552 2766 -8202 10400 -21207 2947 16113 10564
5558 10564 6752 15102 29373 38863 28093 38132 36755 51233 38248 -6802 7418 55289 60900
5545 60900 29809 -29534 -19138 -3812 16893 26588 5550 -10628 52710 68597 61928 45338
$$ packed form
5635B5048J0753r988N376l51N84l870l5605O515L7072k2066l5352L8266j5336
5622A046K2190j6755l3226M1902J4992l9946k3596m137N3593l812k667Q785J3873
5609C2242j8929j7214L4690L7060k7188J7683L760k241K8589R013M336J6668J6738
5596A35207m6726k5476k1416j564J5622k8502j6628r729L730J239J869L0466k5253
5583A2839l431M5021R446k7350j819J222j9626R11k3330J8516Q944O696K0708
5570D8747r137O797j5875n8222K0138J0318j0968J8602l1607K4154J3166n549
5558A0564l812Q350J4271R490j0770J0039j377J4478j2985m5050J4220M7871N611
5545F0900l1091n9343J0396J5326K0705R695k1038j6178O3338J5887o669j6590
$$ plain form
5533 45338 4248 25756 29487 38689 32309 44481 42176 36336 57109 42544 25060 46364 87131
5520 87131 74394 64943 57026 66570 64884 34112 55888 75213 66794 50570 67757 39600 38199
5507 38199 38539 26443 10505 51113 87310 74755 67649 59556 65788 76301 50718 75270 47138
5494 47138 49890 41386 29835 37536 49615 66087 88690 80424 58893 83603 90128 76540 46438
5481 46438 65710 66496 117471 94231 92615 78547 84503 78027 91676 93929 108948 99016 84324
5468 84324 66903 98714 87169 81388 87376 103757 127246 102306 101032 72285 77080 71688 65563
5455 65563 81477 101590 108293 108823 110843 115619 136161 116323 120490 113952 119697 98394 59041
5442 59041 70636 98551 109030 93033 101867 108886 87537 137071 187366 145662 183967 194907
$$ packed form
5533D5338m1090K1508L731R202o380J2172k305n840K0773j4565j7484K1304M0767
5520H7131j2737r451p917R544j686l0772K1776J9325q419j6224J7187k8157j401
5507C8199L40j2096j5938M0608L6197j2555p106q093O232J0513k5583K4552k8132
5494D7138K752q504j1551P701J2079J6472K2603q266k1531K4710O525j3588l0102
5481D6438J9272P86N0975k3240j616j4068N956o476J3649K253J5019r932j4692
5468H4324j7421L1811j1545n781N988J6381K3489k4940j274k8747M795n392o125
5455F5563J5914K0113O703N30K020M776K0542j9838M167o538N745k1303l9353
5442E9041J1595K7915J0479j5997Q834P019k1349M9534N0295m1704L8305J0940
$$ plain form
5430 194907 216522 201587 199801 211569 169919 169592 190903 168991 143707 166646 152575 141835
5418 141835 150611 113123 166318 189394 174527 123121 126429 129395 98823 126425 137091 121879
5406 121879 109730 113068 125754 112061 55300 108586 121475 112490 105011 115544 112303 121045 157630
5393 157630 148608 115835 90383 125336 111245 105627 143996 163828 161805 162519 194667 184321 183940
5380 183940 180285 163545 209437 238914 185831 168797 189876 181579 182224 174732 138372 164730 164183
5367 164183 163981 158741 188597 182314 189888 202725 214648 212628 210615 229367 237006 198535 211628
5354 211628 234534 213496 230203 226833 228863 209472 231531 263339 243456 256581 309035 321057
5342 321057 330318 312915 356571 336000 381240 430475 418081 472071 510391 551942 602129 675166
$$ packed form
5430A94907K1615j4935j786J1768m1650l27K1311k1912k5284K2939j4071j0740
5418A41835Q776l7488N3195K3076j4867n1406L308K966l0572K7602J0666j5212
5406A21879j2149L338J2686j3693n6761N3286J2889q985p479J0533l241Q742L6585
5393A57630r022l2773k5452L4953j4091n618L8369J9832k023P14L2148j0346l81
5380A83940l655j6740M5892K9477n3083j7034K1079q297O45p492l6360K6358n47
5367A64183k02n240K9856o283P574J2837J1923k020k013J8752P639l8471J3093
5354B11628K2906k1038J6707l370K030j9391K2059L1808j9883J3125N2454J2022
5342C21057R261j7403M3656k0571M5240M9235j2394N3990L8320M1551N0187P3037
$$ plain form
5330 675166 772688 778485 825772 801251 765104 737945 778216 726596 745918 738190 736409 685130
5318 685130 640661 626190 647490 631466 639695 704247 707815 738531 696165 689963 710879 740846
5306 740846 768918 736275 696099 693088 669510 634096 648626 617515 625537 603820 611299 635053
5294 635053 643203 647081 672013 629429 614636 605479 546105 500892 480248 415763 397135 428931
5282 428931 429719 431583 380418 390627 353127 331316 375702 357969 308299 344371 385976 366858
5270 366858 342927 385871 377425 395897 394989 436937 435661 414563 393443 418866 452855 435958
5258 435958 421499 465935 470622 472593 533358 587134 593386 614441 640713 736789 803767 868564
5246 868564 870429 879409 862543 811845 741792 701751 681077 690827 641134 664828 650045 593498
$$ packed form
5330F75166R7522N797M7287k4521l6147k7159M0271n1620J9322p728j781n1279
5318F85130m4469j4471K1300j6024Q229O4552L568L0716m2366o202K0916K9967
5306G40846K8072l2643m0176l011k3578l5414J4530l1111Q022k1717P479K3754
5294F35053Q150L878K4932m2584j4793r157n9374m5213k0644o4485j8628L1796
5282D28931P88J864n1165J0209l7500k1811M4386j7733m9670L6072M1605j9118
5270C66858k3931M2944q446J8472r08M1948j276k1098k1120K5423L3989j6897
5258D35958j4459M4436M687J971O0765N3776O252K1055K6272R6076O6978O4797
5246H68564J865Q980j6866n0698p0053m0041k0674R750m9693K3694j4783n6547
$$ plain form
5234 593498 612351 625953 657184 609552 598634 603830 573568 587973 612129 622587 610350 586940
5222 586940 564255 573866 551294 576065 576575 562729 587193 609261 585657 574192 610736 583227
5210 583227 605574 579903 565028 588283 601486 656077 634293 592632 663194 694392 682011 669231
5198 669231 677015 655942 664791 708094 676337 673743 701363 707818 653934 684922 721246 729862 724678
5185 724678 763037 801752 810067 804257 859151 850347 805902 775415 805617 846493 821002 877456
5173 877456 947059 961663 947482 956266 977222 986307 1056530 1060977 1054479 1095680 1132608 1155457
5161 1155457 1170686 1142031 1133744 1199070 1265377 1282574 1310676 1397252 1386446 1398350 1455297 1482272
5149 1482272 1538180 1534462 1543454 1615201 1663802 1746610 1766738 1797074 1861453 1895032 1898329 1984004
$$ packed form
5234E93498J8853J3602L1231m7632j0918N196l0262J4405K4156J0458j2237k3410
5222E86940k2685R611k2572K4771N10j3846K4464K2068k3604j1465L6544k7509
5210E83227K2347k5671j4875K3255J3203N4591k1784m1661P0562L1198j2381j2780
5198F69231P784k1073Q849M3303l1757k594K7620O455n3884L0988L6324Q616n184
5185G24678L8359L8715Q315n810N4894q804m4445l0487L0202M0876k5491N6454
5173H77456O9603J4604j4181Q784K0956R085P0223M447o498M1201L6928K2849
5161A155457J5229k8655q287O5326O6307J7197K8102Q6576j0806J1904N6947K6975
5149A482272N5908l718Q992P1747M8601Q2808K0128L0336O4379L3579L297Q5675
$$ plain form
5137 1984004 2045915 2111051 2175030 2277428 2367993 2444339 2541983 2617365 2631760 2705492 2770480
5126 2770480 2855504 2944826 3029301 3150132 3234455 3356347 3484598 3645562 3832127 3963640
5116 3963640 4179764 4355910 4508925 4698133 4902424 5077999 5294959 5483767 5736239 5978267
5106 5978267 6294557 6560978 6884252 7260871 7618077 7977964 8379335 8794694 9254302 9721735
5096 9721735 10194988 10731661 11279186 11773094 12333988 12862159 13512572 14238109 14978769 15883324
5086 15883324 16810313 17790628 18796133 19875875 21057092 22401688 23903251 25671562
5078 25671562 27597161 29875966 32489531 35424552 38924961 43254584 48786890 55844362
5070 55844362 64482785 73798650 80036363 80406005 76440812 71460423 68574841 68108536
$$ packed form
5137A984004O1911O5136O3979J02398R0565P6346R7644P5382J4395P3732O4988
5126B770480Q5024Q9322Q4475J20831Q4323J21892J28251J60964J86565J31513
5116C963640K16124J76146J53015J89208K04291J75575K16960J88808K52472K42028
5106E978267L16290K66421L23274L76619L57206L59887M01371M15359M59608M67433
5096I721735M73253N36673N47525M93908N60894N28171O50413P25537P40660R04555
5086A5883324R26989R80315J005505J079742J181217J344596J501563J768311
5078B5671562J925599K278805K613565K935021L500409M329623N532306P057472
5070E5844362Q638423R315865O237713L69642l965193m980389k885582m66305
$$ plain form
5062 68108536 69889215 73694209 78954656 82940376 84448062 85084548 87094841 91585579
5054 91585579 96416109 98072155 95106015 89543503 84509815 82104006 82494402 84042318
5046 84042318 83208811 79648278 75089736 72270809 72258747 74985031 80021870 85844349 87735075
5037 87735075 82762897 72955030 62292047 53567808 46807704 41455813 37079877 33508255
5029 33508255 30567142 28169097 26152509 24406446 22689300 21136025 19736079 18568636
5021 18568636 17574615 16813654 16156094 15560479 14895707 14172186 13364741 12573820 11826973
5012 11826973 11172822 10631371 10169199 9738586 9324195 8965077 8626156 8321884 7982385
5003 7982385 7704072 7431247 7163749 6955147 6735254 6490863 6282521 6048819 5848620 5671921
$$ packed form
5062F8108536J780679L804994N260447L985720J507686O36486K010293M490738
5054I1585579M830530J656046k966140n562512n033688k405809L90396J547916
5046H4042318q33507l560533m558542k818927j2062K726284N036839N822479J890726
5037H7735075m972178r807867j0662983q724239o760104n351891m375936l571622
5029C3508255k941113k398045k016588j746063j717146j553275j399946j167443
5021A8568636r94021p60961o57560n95615o64772p23521q07445p90921p46847
5012A1826973o54151n41451m62172m30613m14391l59118l38921l04272l39499
5003G982385k78313k72825k67498k08602k19893k44391k08342k33702k00199j76699
$$ plain form
4993 5671921 5492984 5322239 5176444 5068532 4959188 4830177 4723365 4584135 4458707 4347775
4983 4347775 4226572 4078097 4004205 3894279 3820941 3823998 3785544 3739815 3726696 3682218 3592958
4972 3592958 3508669 3404552 3279677 3191408 3113578 3063814 3049134 2990560 2959370 2846463 2801378
4961 2801378 2754738 2708591 2667664 2675425 2603679 2568896 2541018 2471196 2412996 2385920 2364672 2302240
4949 2302240 2251123 2252723 2256115 2198123 2143607 2094295 2085042 2069913 2000618 1937019 1920037 1901614
4937 1901614 1887987 1852604 1819519 1812050 1817434 1802321 1765868 1684877 1674726 1643930 1618062 1569453
4925 1569453 1543525 1516548 1489499 1491416 1511965 1528112 1527367 1507213 1542420 1519524 1560499 1578102
4913 1578102 1612259 1615133 1610012 1599275 1574125 1556477 1565076 1536489 1532177 1524836 1516637 1509742 1541529
$$ packed form
4993E671921j78937j70745j45795j07912j09344j29011j06812j39230j25428j10932
4983D347775j21203j48475p3892j09926p3338L057l8454m5729j3119m4478q9260
4972C592958q4289j04117j24875q8269p7830m9764j4680n8574l1190j12907m5085
4961B801378m6640m6147m0927P761p1746l4783k7878o9822n8200k7076k1248o2432
4949B302240n1117J600L392n7992n4516m9312r253j5129o9295o3599j6982j8423
4937A901614j3627l5383l3085p469N384j5113l6453q0991j0151l0796k5868m8609
4925A569453k5928k6977k7049J917K0549J6147p45k0154L5207k2896M0975J7603
4913A578102L4157K874n121j0737k5150j7648Q599k8587m312p341q199o895L1787
$$ plain form
4900 1541529 1508994 1481966 1548145 1506890 1475609 1505876 1519670 1496052 1489018 1477106 1430258 1374929
4888 1374929 1355475 1320859 1339322 1310668 1317836 1304605 1288575 1281232 1213140 1189454 1118481 1071180
4876 1071180 1078166 1037871 1019640 1002625 1025361 1022736 1000702 986759 982794 968156 956579 964044
4864 964044 957943 970956 1006395 997791 1031030 1045612 1037760 1042437 1061286 1048865 1079299 1053153
4852 1053153 1012755 991002 1012366 987366 998014 1016721 1027439 1034285 1016986 1009048 1041532 1088452
4840 1088452 1097232 1067187 1051889 1078769 1055908 1070997 1084784 1081012 1080626 1051276 1085894 1109043
4828 1109043 1103039 1126450 1135821 1151053 1141080 1124544 1154643 1167862 1176797 1213948 1255906 1249960
4816 1249960 1246081 1276510 1330217 1366493 1342272 1359758 1361488 1361846 1384355 1396189 1389975 1355705
$$ packed form
4900A541529l2535k7028O6179m1255l1281L0267J3794k3618p034j1912m6848n5329
4888A374929j9454l4616J8463k8654P168j3231j6030p343o8092k3686p0973m7301
4876A071180O986m0295j8231j7015K2736k625k2034j3943l965j4638j1577P465
4864I64044o101J3013L5439q604L3239J4582p852M677J8849j2421L0434k6146
4852A053153m0398k1753K1364k5000J0648J8707J0718O846j7299p938L2484M6920
4840A088452Q780l0045j5298K6880k2861J5089J3787l772l86k9350L4618K3149
4828A109043o004K3411R371J5232r973j6536L0099J3219Q935L7151M1958n946
4816A249960l879L0429N3707L6276k4221J7486J730L58K2509J1834o214l4270
$$ plain form
4804 1355705 1411753 1443730 1467752 1517162 1511903 1572600 1572149 1573865 1549788 1500989 1500503 1494953 1524659
4791 1524659 1521195 1530068 1543996 1624220 1619473 1629677 1672927 1708074 1763479 1765608 1696788 1653102
4779 1653102 1585538 1568907 1579905 1552766 1565011 1570038 1559695 1553625 1564572 1608557 1602303 1622115
4767 1622115 1598857 1608968 1630295 1612242 1660593 1689717 1685412 1720170 1734791 1782800 1766025 1809447
4755 1809447 1867317 1906863 1948511 1943944 1996512 2061862 2090251 2124942 2166595 2230504 2297040 2354506
4743 2354506 2411051 2511982 2559115 2615971 2717675 2855651 2967929 3136103 3251746 3345605
4733 3345605 3421867 3460697 3496023 3590447 3697267 3819993 3925609 4050584 4149496 4234543 4397270
4722 4397270 4522084 4689331 4847195 5040793 5180208 5413772 5575110 5765336 5958994 6188882
$$ packed form
4804A355705N6048L1977K4022M9410n259O0697m51J716k4077m8799m86n550K9706
4791A524659l464Q873J3928Q0224m747J0204M3250L5147N5405K129o8820m3686
4779A653102o7564j6631J0998k7139J2245N027j0343o070J0947M3985o254J9812
4767A622115k3258J0111K1327j8053M8351K9124m305L4758J4621M8009j6775M3422
4755A809447N7870L9546M1648m567N2568O5350K8389L4691M1653O3909O6536N7466
4743B354506N6545J00931M7133N6856J01704J37976J12278J68174J15643R3859
4733C345605P6262L8830L5326R4424J06820J22726J05616J24975R8912Q5047J62727
4722D397270J24814J67247J57864J93598J39415K33564J61338J90226J93658K29888
$$ plain form
4712 6188882 6413812 6673590 6988862 7304494 7569952 7875643 8194879 8551534 8972879 9417227
4702 9417227 9848096 10319520 10828346 11366252 11883038 12435314 12944714 13453389 13989656 14625156
4692 14625156 15294987 16060361 16901933 17847130 18853045 19951056 21021496 22260108 23564420
4683 23564420 25073036 26809274 28791662 31034195 33728074 36691620 40189956 44230307
4675 44230307 49271358 55628807 63860987 73807199 84205371 90355365 89653876 84240250
4667 84240250 78353327 74974070 74385273 76295237 80102486 83930894 84974755 83993845
4659 83993845 83207887 84973469 89416654 95010805 98349078 97168191 92417752 87380136
4651 87380136 84539256 84034789 83004051 79456189 74368926 69768563 67468868 67586028
$$ packed form
4712F188882K24930K59778L15272L15632K65458L05691L19236L56655M21345M44348
4702I417227M30869M71424N08826N37906N16786N52276N09400N08675N36267O35500
4692A4625156O69831P65374Q41572R45197J005915J098011J070440J238612J304312
4683B3564420J508616J736238J982388K242533K693879K963546L498336M040351
4675D4230307N041051O357449Q232180R946212J0398172O149994p01489n413626
4667H4240250n886923l379257n88797J909964L807249L828408J043861r80910
4659H3993845p85958J765582M443185N594151L338273j180887m750439n037616
4651H7380136k840880n04467j030738l547862n087263m600363k299695J17160
$$ plain form
4643 67586028 70067290 74400020 78934749 79486633 74248040 65324783 56125607 48739017
4635 48739017 43083259 38672115 35135688 32220193 29777551 27709164 25969660 24484420
4627 24484420 23151182 21950973 20828327 19799900 18931876 18250674 17587833 16924799 16204110
4618 16204110 15429757 14698510 14059882 13481617 13054031 12659874 12415438 12106621 11803957
4609 11803957 11461625 11177336 10944852 10736892 10587054 10406539 10099036 9702690 9298654
4600 9298654 8974954 8712475 8531820 8376153 8269977 8209347 8235849 8227092 8262754 8252738 8212857
4589 8212857 8087718 7934927 7696170 7403075 7114812 6802827 6525184 6245049 5989519 5785940
4579 5785940 5599799 5408323 5254885 5157406 4982354 4887728 4747519 4598511 4525470 4382441
$$ packed form
4643F7586028K481262M332730M534729N51884n238593q923257r199176p386590
4635D8739017n655758m411144l536427k915495k442642k068387j739504j485240
4627B4484420j333238j200209j122646j028427q68024o81202o62841o63034p20689
4618A6204110p74353p31247o38628n78265m27586l94157k44436l08817l02664
4609A1803957l42332k84289k32484k07960j49838j80515l07503l96346m04036
4600I298654l23700k62479j80655j55667j06176o0630K6502q757L5662j0016l9881
4589H212857j25139j52791k38757k93095k88263l11985k77643k80135k55530k03579
4579E785940j86141j91476j53438r7479j75052r4626j40209j49008p3041j43029
$$ plain form
4569 4382441 4269630 4221139 4097367 4055925 3977967 3940053 3925922 3929890 3921936 3916775 3916421 3938170
4557 3938170 3960906 4007556 3998534 3962078 3926730 3918609 3875250 3885261 3881205 3824647 3763113 3683900
4545 3683900 3584719 3543318 3508348 3427776 3318936 3274729 3251440 3217818 3133604 3082841 3127390
4534 3127390 3156535 3143818 3145716 3107924 2990070 2889170 2807301 2703606 2599432 2534642 2464679
4523 2464679 2395966 2394282 2329490 2293198 2244861 2202646 2167479 2162041 2120097 2052301 2064517 2019407
4511 2019407 1961980 1895578 1847975 1762954 1720860 1701919 1629737 1593198 1570816 1523153 1505640
4500 1505640 1461654 1456118 1434917 1418174 1392750 1346890 1305921 1330330 1310983 1294581 1263683 1300317
4488 1300317 1266925 1250967 1188093 1186417 1166571 1156854 1129488 1100936 1119100 1140464 1097526 1103273
$$ packed form
4569D382441j12811m8491j23772m1442p7958l7914j4131L968p954n161l54K1749
4557C938170K2736M6650r022l6456l5348q121m3359J0011m056n6558o1534p9213
4545C683900r9181m1401l4970q0572j08840m4207k3289l3622q4214n0763M4549
4534C127390K9145j2717J898l7792j17854j00900q1869j03695j04174o4790o9963
4523B464679o8713j684o4792l6292m8337m2215l5167n438m1944o7796J2216m5110
4511B019407n7427o6402m7603q5021m2094j8941p2182l6539k2382m7663j7513
4500A505640m3986n536k1201j6743k5424m5860m0969K4409j9347j6402l0898L6634
4488A300317l3392j5958o2874j676j9846r717k7366k8552J8164K1364m2938N747
$$ plain form
4476 1103273 1085332 1084744 1103096 1040804 1002044 1057963 1005126 1007609 1031009 1041219 982367 996549
4464 996549 985071 973151 1015212 993848 989270 1023962 967686 953721 963342 948550 930297 928947
4452 928947 923820 984873 954138 980718 962686 974844 974910 982205 951490 999385 1014799 1030307 1014617
4439 1014617 1027555 1065297 1062361 1025834 1027256 1043341 1047320 1080735 1089901 1116816 1153405 1195268
4427 1195268 1253820 1322747 1345397 1382698 1364600 1385773 1384543 1374792 1402731 1413472 1386532 1380151
4415 1380151 1402159 1445679 1489948 1544430 1602620 1702611 1742235 1760332 1846596 1933816 2015354
4404 2015354 2118756 2237372 2428932 2683575 2992379 3151667 3038074 2741833 2407447 2204758
4394 2204758 1984757 1828251 1633332 1556998 1459801 1413577 1351277 1281177 1245607 1187890 1123270
$$ packed form
4476A103273j7941n88J8352o2292l8760N5919n2837K483K3400J0210n8852J4182
4464I96549j1478j1920M2061k1364m578L4692n6276j3965R621j4792j8253j350
4452I28947n127O1053l0735K6580j8032J2158O6P295l0715M7895J5414J5508j5690
4439A014617J2938L7742k936l6527J422J6085L979L3415R166K6915L6589M1863
4427A195268N8552O8927K2650L7301j8098K1173j230r751K7939J0741k6940o381
4415A380151K2008M3520M4269N4482N8190R9991L9624J8097Q6264Q7220Q1538
4404B015354J03402J18616J91560K54643L08804J59288j13593k96241l34386k02689
4394B204758k20001j56506j94919p6334r7197m6224o2300p0100l5570n7717o4620
$$ plain form
4383 1123270 1125385 1095082 1059446 1072047 1076216 1082916 1094167 1096581 1098210 1072161 1021482 1030617 974290
4370 974290 948921 920278 928149 895974 911915 885867 930444 970933 959454 971537 977926 992916
4358 992916 1011357 1023211 1048377 1054536 1037202 1004745 1040726 1041905 1083223 1061889 1058295 1035266
4346 1035266 1044296 1042509 1040534 1052778 1094515 1065300 1055741 1045674 1073221 1075082 1094181 1100020 1085194
4333 1085194 1091367 1137681 1082698 1079801 1090445 1144979 1088153 1091955 1119383 1117739 1180588 1143661
4321 1143661 1188179 1187064 1144961 1172354 1126448 1140611 1148813 1186687 1201932 1196442 1192141 1207416
4309 1207416 1169583 1155228 1112341 1118322 1122041 1090700 1068354 1134976 1166399 1238290 1261406 1292989
4297 1292989 1327848 1419549 1386001 1456434 1447649 1480243 1470741 1463732 1364804 1357865 1310358 1345561
$$ packed form
4383A123270K115l0303l5636J2601M169O700J1251K414J629k6049n0679R135n6327
4370I74290k5369k8643P871l2175J5941k6048M4577M0489j1479J2083O389J4990
4358I92916J8441J1854K5166O159j7334l2457L5981J179M1318k1334l594k3029
4346A035266R030j787j975J2244M1737k9215r559j0067K7547J861J9099N839j4826
4333A085194O173M6314n4983k897J0644N4534n6826L802K7428j644O2849l6927
4321A143661M4518j115m2103K7393m5906J4163Q202L7874J5245n490m301J5275
4309A207416l7833j4355m2887N981L719l1341k2346O6622L1423P1891K3116L1583
4297A292989L4859R1701l3548P0433q785L2594r502p009r8928o939m7507L5203
$$ plain form
4285 1345561 1363542 1418867 1467992 1502459 1567810 1656609 1698567 1731915 1780513 1796602 1781636
4274 1781636 1779587 1795846 1857742 1896768 1977847 2019862 2042735 2060699 2036896 2049820 2077972 2113186
4262 2113186 2189234 2297326 2411268 2444801 2511109 2588562 2626211 2682486 2732179 2792682 2846644
4251 2846644 2890273 2977601 3069510 3120394 3161951 3240999 3299281 3396544 3467661 3567069 3710688
4240 3710688 3794397 3918525 4005044 4118031 4218809 4357926 4452515 4627592 4801641 5065899
4230 5065899 5256330 5492780 5707287 5932207 6153267 6440672 6704669 7024135 7269820 7621775
4220 7621775 7930113 8269637 8573572 8914939 9254206 9719243 10216014 10946306 11695272 12241999
4210 12241999 12555079 13008515 13453726 14043597 14528872 15175112 15755154 16455589 17117424
$$ packed form
4285A345561J7981N5325M9125L4467O5351Q8799M1958L3348M8598J6089j4966
4274A781636k049J6259O1896L9026Q1079M2015K2873J7964k3803J2924K8152L5214
4262B113186P6048J08092J13942L3533O6308P7453L7649N6275M9693O0503N3962
4251B846644M3629Q7328R1909N0884M1557P9048N8282R7263P1117R9408J43619
4240C710688Q3709J24128Q6519J12987J00778J39117R4589J75077J74049K64258
4230E065899J90431K36450K14507K24920K21060K87405K63997L19466K45685L51955
4220G621775L08338L39524L03935L41367L39267M65037M96771P30292P48966N46727
4210A2241999L13080M53436M45211N89871M85275O46240N80042P00435O61835
$$ plain form
4201 17117424 17900913 18723851 19770845 20773322 21966171 23140670 24560712 25982357
4193 25982357 27582639 29076474 30638577 31941266 33396990 34731638 36386994 37980823
4185 37980823 40025571 42109541 44656625 47430668 50751603 54124654 57904635 61737930
4177 61737930 66560366 72001989 78887455 86692563 96484627 107559043 120675366 135930088
4169 135930088 156546583 183446701 221159371 269646196 329603820 369434471 356711124
4162 356711124 305683589 243366893 196804645 163460803 138991709 119626413 105109202
4155 105109202 92894733 83406277 75533301 69077352 62596721 56685298 51098704 46472706
4147 46472706 42856845 40168410 37920555 36007776 34193599 32595907 30899614 29016903
$$ packed form
4201A7117424P83489Q22938J046994J002477J192849J174499J420042J421645
4193B5982357J600282J493835J562103J302689J455724J334648J655356J593829
4185C7980823K044748K083970K547084K774043L320935L373051L779981L833295
4177F1737930M822436N441623O885466P805108R792064J1074416J3116323J5254722
4169A35930088K0616495K6900118L7712670M8486825N9957624L9830651j2723347
4162C56711124n1027535o2316696m6562248l3343842k4469094j9365296j4517211
4155A05109202j2214469r488456p872976o455949o480631n911423n586594m625998
4147D6472706l615861k688435k247855j912779j814177j597692j696293j882711
$$ plain form
4139 29016903 27072926 25475447 24088327 22962267 21875979 20960526 20051972 19269895 18460974
4130 18460974 17787530 17159790 16669621 16200208 15766296 15285162 14886296 14559729 14285784
4121 14285784 14087159 13932126 13822590 13767484 13751873 13835159 14157326 14623565 15334222 16295915
4111 16295915 17029014 16716392 15488432 13875225 12534924 11479791 10719447 10132573 9655513
4102 9655513 9220554 8849793 8467683 8161293 7825502 7530653 7257522 7047169 6822225 6650479
4092 6650479 6402497 6239940 6021636 5856669 5693823 5562361 5427033 5340081 5247037 5177047
4082 5177047 5109640 5064250 4947344 4959275 4913964 4970128 5099888 5281687 5379335 5440836 5318792
4071 5318792 5091611 4782714 4567472 4337641 4249767 4101592 4035033 3906127 3815535 3752795
$$ packed form
4139B9016903j943977j597479j387120j126060j086288r15453r08554p82077q08921
4130A8460974o73444o27740m90169m69413m33912m81134l98866l26567k73945
4121A4285784j98625j55033j09536n5106j5611Q3286L22167M66239P10657R61693
4111A6295915P33099l12622j227960j613207j340301j055133p60344n86874m77060
4102I655513m34959l70761l82110l06390l35791k94849k73131k10353k24944j71746
4092F650479k47982j62557k18304j64967j62846j31462j35328q6952r3044o9990
4082E177047o7407m5390j16906J1931m5311N6164J29760J81799R7648O1501j22044
4071E318792k27181l08897k15242k29831q7874j48175o6559j28906r0592o2740
$$ plain form
4061 3752795 3634047 3546034 3462563 3397210 3420994 3362787 3361023 3306700 3318083 3255431 3282590
4050 3282590 3220429 3235290 3240279 3256191 3301698 3372575 3454030 3508696 3564007 3691482 3727870
4039 3727870 3746049 3678079 3607926 3555059 3509157 3494531 3487165 3450384 3410977 3244915 3123673
4028 3123673 3068117 3008058 2941992 2875818 2788954 2679478 2558713 2522838 2455032 2367383 2339429
4017 2339429 2305601 2279539 2284641 2222804 2183378 2139308 2097190 2093281 2067051 2074820 2083233 2063685
4005 2063685 2163650 2292128 2482089 2617630 2616022 2479553 2295162 2104507 1979488 1896868
3995 1896868 1795757 1702412 1640770 1583216 1533722 1481829 1449966 1426085 1398897 1340008 1379378
3984 1379378 1396396 1397864 1389117 1386265 1407639 1366108 1364378 1350548 1298450 1334526 1342462 1323754
$$ packed form
4061C752795j18748q8013q3471o5353K3784n8207j764n4323J1383o2652K7159
4050C282590o2161J4861M989J5912M5507P0877Q1455N4666N5311J27475L6388
4039C727870J8179o7970p0153n2867m5902j4626p366l6781l9407j66062j21242
4028C123673n5556o0059o6066o6174q6864j09476j20765l5875o7806q7649k7954
4017B339429l3828k6062N102o1837l9426m4070m2118l909k6230P769Q413j9548
4005B063685R9965J28478J89961J35541j608j36469j84391j90655j25019q2620
3995A896868j01111r3345o1642n7554m9494n1893l1863k3881k7188n8889L9370
3984A379378J7018J468q747k852K1374m1531j730j3830n2098L6076P936j8708
$$ plain form
3972 1323754 1305520 1314722 1367678 1388284 1363615 1337746 1385578 1396723 1355095 1365876 1336391 1350669
3960 1350669 1345976 1312639 1335727 1336241 1350908 1310373 1327260 1352018 1369116 1345466 1326450 1306175
3948 1306175 1323116 1323288 1343182 1383813 1341880 1337065 1342248 1332584 1356988 1408807 1457239 1459197 1532409
3935 1532409 1567661 1633608 1690295 1796101 1916833 2059593 2219726 2517015 2816486 3031434
3925 3031434 2948341 2706004 2398129 2158923 2018713 1953026 1879127 1853166 1851230 1887621 1931515
3914 1931515 2000689 1930102 1811093 1671294 1496652 1378091 1299258 1219677 1172431 1073605 1024248
3903 1024248 970880 928582 914214 894874 844561 844501 810123 726523 703193 701868 699779 690388 661420
3890 661420 669192 649103 654492 592854 610784 603632 610297 604451 595126 612876 590073 556139 544613
$$ packed form
3972A323754j8234R202N2956K0606k4669k5869M7832J1145m1628J0781k9485J4278
3960A350669m693l3337K3088N14J4667m0535J6887K4758J7098k3650j9016k0275
3948A306175J6941J72J9894M0631m1933m815N183r664K4404N1819M8432J958P3212
3935A532409L5252O5947N6687J05806J20732J42760J60133K97289K99471K14948
3925C031434q3093k42337l07875k39206j40210o5687p3899k5961j936L6391M3894
3914A931515O9174p0587j19009j39799j74642j18561p8833p9581m7246r8826m9357
3903A024248n3368m2298j4368j9340n0313o0l4378q3600k3330j325k089r391k8968
3890F61420P772k0089N389o1638J7930p152O665n846r325J7750k2803l3934j1526
$$ plain form
3877 544613 567234 593827 602418 610651 582076 585907 571976 570665 568159 570293 578089 533319 550487
3864 550487 570211 593037 606901 610449 635509 628063 636479 655619 684750 707025 740130 710112
3852 710112 710533 724805 756765 769093 797793 814758 861136 883965 911257 940450 962813 1050860
3840 1050860 1075046 1099487 1174221 1230138 1315765 1398468 1386228 1345506 1268045 1218544 1206119
3829 1206119 1156329 1160468 1176265 1180524 1247385 1300693 1402400 1536355 1671653 1707222 1704090
3818 1704090 1639223 1582523 1489682 1457043 1415821 1361282 1324893 1279848 1265786 1222857 1179509
3807 1179509 1174904 1164120 1199262 1184532 1174444 1182533 1211441 1209713 1265784 1304934 1364279 1459387
3795 1459387 1553439 1651057 1740892 1765894 1765593 1672062 1578216 1520963 1437258 1349801 1313225 1248528
$$ packed form
3877E44613K2621K6593Q591Q233k8575L831j3931j311k506K134P796m4770J7168
3864E50487J9724K2826J3864L548K5060p446Q416J9140K9131K2275L3105l0018
3852G10112M21J4272L1960J2328K8700J6965M6378K2829K7292K9193K2363Q8047
3840A050860K4186K4441P4734N5917Q5627Q2703j2240m0722p7461m9501j2425
3829A206119m9790M139J5797M259O6861N3308J01707J33955J35298L5569l132
3818A704090o4867n6700r2841l2639m1222n4539l6389m5045j4062m2929m3348
3807A179509m605j0784L5142j4730j0088Q089K8908j728N6071L9150N9345R5108
3795A459387R4052R7618Q9835K5002l01r3531r3846n7253q3705q7457l6576o4697
$$ plain form
3783 1248528 1233469 1216120 1231917 1236277 1229776 1252300 1275623 1303526 1371329 1425048 1485930 1609729
3771 1609729 1738112 1897508 2027320 2100551 2087738 1976521 1851801 1727857 1614033 1503567
3761 1503567 1461466 1389720 1297931 1228280 1215778 1181362 1153672 1121189 1138200 1120508 1159187
3750 1159187 1152139 1181586 1208376 1222811 1241762 1255101 1301458 1331594 1400501 1480738 1556982 1705898
3738 1705898 1884580 2051180 2174344 2370536 2433788 2382763 2288861 2206069 2086881 1939174
3728 1939174 1829886 1734149 1632592 1549430 1490489 1407279 1386955 1377479 1373033 1363794 1353268 1406009
3716 1406009 1393028 1437977 1483314 1515980 1559632 1561790 1642787 1668227 1756025 1867280 1930250
3705 1930250 1972102 2048729 2112984 2209490 2243370 2260831 2246166 2274509 2291438 2327843 2370203
$$ packed form
3783A248528j5059j7349J5797M360o501K2524K3323K7903O7803N3719O0882J23799
3771A609729J28383J59396J29812P3231j2813j11217j24720j23944j13824j10466
3761A503567m2101p1746r1789o9651j2502l4416k7690l2483J7011j7692L8679
3750A159187p048K9447K6790J4435J8951J3339M6357L0136O8907Q0237P6244J48916
3738A705898J78682J66600J23164J96192O3252n1025r3902q2792j19188j47707
3728A939174j09288r5737j01557q3162n8941q3210k0324r476m446r239j0526N2741
3716A406009j2981M4949M5337L2666M3652K158Q0997K5440Q7798J11255O2970
3705A930250M1852P6627O4255R6506L3880J7461j4665K8343J6929L6405M2360
$$ plain form
3694 2370203 2468329 2539142 2663830 2863546 3075267 3299126 3623369 3998549 4450501 5016129
3684 5016129 5731047 6533476 7308388 7706331 7504528 6859359 5992376 5275558 4682813 4260647
3674 4260647 3905042 3616749 3444468 3299407 3071665 2798060 2585723 2306966 2131075 1959363
3664 1959363 1812468 1688806 1590943 1484494 1415951 1373850 1333699 1264001 1217947 1166492 1066498
3653 1066498 1016637 978325 945655 936053 909856 896203 858849 861663 835799 791823 787105 759179
3641 759179 752504 766072 746929 759661 752700 721585 688114 659389 666581 688180 676050 646785
3629 646785 659677 668393 659592 638409 638407 656721 640809 629120 630222 676363 648557 650285 667628
3616 667628 671412 655147 667751 689650 728689 710112 711887 708061 719152 783030 800404 794769
$$ packed form
3694B370203R8126P0813J24688J99716K11721K23859L24243L75180M51952N65628
3684E016129P14918Q02429P74912L97943k01803o45169q66983p16818n92745m22166
3674D260647l55605k88293j72281j45061k27742k73605k12337k78757j75891j71712
3664A959363j46895j23662r7863j06449o8543m2101m0151o9698m6054n1455r9994
3653A066498m9861l8312l2670r602k6197j3653l7354K814k5864m3976m718k7926
3641G59179o675J3568j9143J2732o961l1115l3471k8725P192K1599j2130k9265
3629F46785J2892Q716q801k1183kJ8314j5912j1689J102M6141k7806J728J7343
3616F67628L784j6265J2604K1899L9039j8577J775l826J1091O3878J7374n635
$$ plain form
3604 794769 817647 862593 889450 913318 934003 987119 969638 1030616 1038297 1058678 1090325 1128607
3592 1128607 1142701 1201214 1229291 1256162 1289920 1331799 1326705 1373909 1437036 1490762 1545426 1604769
3580 1604769 1693373 1736314 1779163 1851518 1967790 2049895 2097312 2203999 2273483 2331336 2424377
3569 2424377 2555578 2716433 2885372 3055949 3211556 3429114 3702072 4053899 4453057 4913499
3559 4913499 5376148 5969994 6720779 7636264 8918570 10712908 12975405 15674306 16520609
3550 16520609 15103816 12415456 9935988 8313733 7166019 6399810 5802673 5336324 4887384
3541 4887384 4552237 4253733 4013594 3697507 3484993 3273370 3091572 2921895 2792009 2686761
3531 2686761 2602383 2517268 2489164 2447603 2370523 2294470 2221961 2119379 2038949 1965961 1948097
$$ packed form
3604G94769K2878M4946K6857K3868K0685N3116j7481O0978P681K0381L1647L8282
3592A128607J4094N8513K8077K6871L3758M1879n094M7204O3127N3726N4664N9343
3580A604769Q8604M2941M2849P2355J16272Q2105M7417J06687O9484N7853R3041
3569B424377J31201J60855J68939J70577J55607K17558K72958L51827L99158M60442
3559D913499M62649N93846P50785R15485J282306J794338K262497K698901Q46303
3550A6520609j416793k688360k479468j622255j147714p66209n97137m66349m48940
3541D887384l35147k98504k40139l16087k12514k11623j81798j69677j29886j05248
3531B686761q4378q5115k8104m1561p7080p6053p2509j02582q0430p2988j7864
$$ plain form
3520 1948097 1865247 1836377 1848126 1892675 1901331 1892619 1873360 1879826 1842648 1808055 1810127 1771487
3508 1771487 1743277 1658463 1642014 1607182 1561586 1523077 1445182 1379172 1371745 1311652 1230418 1198281
3496 1198281 1189224 1148640 1106346 1090682 1098830 1114262 1099239 1138074 1127603 1136460 1132163 1150372
3484 1150372 1124215 1130117 1117143 1148189 1165659 1199507 1187672 1168610 1106803 1094601 1055823 1032791
3472 1032791 1053564 1057972 1043333 1036909 1014947 1045384 1096919 1125890 1085106 1116900 1132696 1120934
3460 1120934 1124766 1100528 1145871 1192083 1166522 1207464 1248102 1243654 1225737 1241045 1257399 1261955
3448 1261955 1265695 1280321 1329284 1385126 1444102 1468908 1501555 1561478 1601326 1619520 1696357 1708944
3436 1708944 1767475 1830371 1914954 2002840 2064184 2094710 2183655 2241404 2302854 2414619 2468450
$$ packed form
3520A948097q2850k8870J1749M4549Q656q712j9259O466l7178l4593K072l8640
3508A771487k8210q4814j6449l4832m5596l8509p7895o6010p427o0093q1234l2137
3496A198281r057m0584m2294j5664Q148J5432j5023L8835j0471Q857m297J8209
3484A150372k6157N902j2974L1046J7470L3848j1835j9062o1807j2202l8778k3032
3472A032791K0773M408j4639o424k1962L0437N1535K8971m0784L1794J5796j1762
3460A120934L832k4238M5343M6212k5561M0942M0638m448j7917J5308J6354M556
3448A261955L740J4626M8963N5842N8976K4806L2647N9923L9848J8194P6837J2587
3436A708944N8531O2896Q4583Q7886O1344L0526Q8945N7749O1450J11765N3831
$$ plain form
3425 2468450 2555357 2610475 2710896 2775733 2838989 2926247 3015434 3168830 3207822 3316783 3375511
3414 3375511 3484809 3560108 3572567 3583656 3593603 3630052 3671580 3616355 3569811 3510348 3441773
3403 3441773 3388777 3326619 3256511 3180792 3080400 2945116 2831558 2741291 2624301 2539545 2441490
3392 2441490 2371261 2228600 2140705 2045220 1968573 1905733 1867268 1796745 1706056 1624191 1555489
3381 1555489 1507851 1449614 1382309 1321359 1297423 1240916 1189897 1159514 1119001 1121361 1086836 1029843
3369 1029843 961564 928529 896358 857748 848015 827889 803009 802773 783527 785661 750257 731382
3357 731382 723478 674147 679317 656893 606681 596234 598931 555662 558380 543532 560508 530995
3345 530995 517733 483635 476669 496108 501754 478107 417651 445259 450513 441414 459508 468975 443504
$$ packed form
3425B468450Q6907N5118J00421O4837O3256Q7258Q9187J53396L8992J08961N8728
3414C375511J09298P5299J2459J1089R947L6449M1528n5225m6544n9463o8575
3403C441773n2996o2158p0108p5719j00392j35284j13558r0267j16990q4756r8055
3392B441490p0229j42661q7895r5485p6647o2840l8465p0523r0689q1865o8702
3381A555489m7638n8237o7305o0950k3936n6507n1019l0383m0513K360l4525n6993
3369A029843o8279l3035l2171l8610r733k0126k4880k36j9246K134l5404j8875
3357G31382p904m9331N170k2424n0212j0447K697m3269K718j4848J6976k9513
3345E30995j3262l4098o966J9439N646k3647o0456K7608N254r099J8094R467k5471
$$ plain form
3332 443504 434249 405123 388193 377226 340870 338278 316901 322149 305402 301485 305387 320304 319363
3319 319363 301342 284205 306896 324686 291957 259028 254781 252937 223889 209760 211882 218304
3307 218304 194431 186708 167808 160409 214602 199471 182488 193817 195255 184747 164093 142287
3295 142287 128552 109848 121525 133609 179422 174640 175156 169112 135724 151135 117445 100913
3283 100913 139963 121837 121813 107695 93698 134093 110200 105904 109682 86256 92877 161647 149081
3270 149081 121168 114817 131757 100210 80282 99341 72438 106227 122800 120576 120720 115273 130282
3257 130282 137579 136130 111488 117262 112089 96838 65572 67098 62365 58001 53104 101867 87000
3244 87000 54385 57347 53225 56309 75032 68567 58705 101458 79571 69068 70738 51765 63901
$$ packed form
3332D43504r255k9126j6930j0967l6356k592k1377N248j6747l917L902J4917r41
3319C19363j8021j7137K2691J7790l2729l2929m247j844k9048j4129K122O422
3307B18304k3873p723j8900p399N4193j5131j6983J1329J438j0508k0654k1806
3295A42287j3735j8704J1677J2084M5813m782N16o044l3388J5411l3690j6532
3283A00913L9050j8126k4j4118j3997M0395k3893m296L778k3426O621O8770j2566
3270A49081k7913o351J6940l1547j9928J9059k6903L3789J6573k224J44n447J5009
3257A30282P297j449k4642N774n173j5251l1266J526m733m364m897M8763j4867
3244H7000l2615K962m122L084J8723o465r862M2753k1887j0503J670j8973J2136
$$ plain form
3231 63901 86623 49318 62115 2904 10416 31992 57881 77352 92386 105199 88543 74840
3219 74840 74335 48159 18453 49444 62822 51956 56831 35199 13506 21923 52994 14003 38391
3206 38391 50662 35055 67835 57063 45379 41989 30757 64324 51786 69990 85211 93330
3194 93330 43466 40300 -4744 54362 71216 74181 53535 36949 51195 39892 59727 42795
3182 42795 62267 66494 72769 86684 96614 62612 70188 74095 70121 39713 66629 102353 88444
3169 88444 60756 81654 59373 52022 63116 28789 24636 14255 53631 91125 79767 89205
3157 89205 95272 75131 35581 51547 23276 36874 55811 82613 28959 -5868 32469 41345
3145 41345 46007 18735 20808 83621 77227 59338 88417 50305 49012 51017 18092 30435 54623
$$ packed form
3231F3901K2722l7305J2797n9211P512K1576K5889J9471J5034J2813j6656j3703
3219G4840n05k6176k9706L0991J3378j0866M875k1632k1693Q417L1071l8991K4388
3206C8391J2271j5607L2780j0772j1684l390j1232L3567j2538J8204J5221Q119
3194I3330m9864l166m5044N9106J6854K965k0646j6586J4246j1303J9835j6932
3182D2795J9472M227O275J3915R930l4002P576L907l974l0408K6916L5724j3909
3169H8444k7688K0898k2281p351J1094l4327m153j0381L9376L7494j1358R438
3157H9205O067k0141l9550J5966k8271J3598J8937K6802n3654l4827L8337Q876
3145D1345M662k7272K073O2813o394j7889K9079l8112j293K005l2925J2343K4188
$$ plain form
3132 54623 55748 63953 40836 49158 54255 9637 23656 48176 47445 20654 21228 -6092 35651
3119 35651 42398 64570 69720 53831 34902 40258 53178 31364 7413 20583 55917 18306
3107 18306 33066 68958 32461 35229 18998 26409 18422 22720 22065 37781 46049 46958 40277 39124
3093 39124 60204 66791 20050 22896 63402 48114 31276 30405 44490 17497 9672 18032 -268
3080 -268 16197 41105 61976 38462 44064 43979 27741 42467 42968 31366 32602 37874 25072 78141
3066 78141 93107 73120 58569 74187 111791 53085 43167 34650 39165 30211 41720 51031 21757
3053 21757 11886 40188 64714 46866 46671 36063 81491 40081 55755 43536 29717 54811
3041 54811 57432 21293 73419 77854 73380 104238 91616 71997 45270 23090 18250 50510 46102
$$ packed form
3132E4623J125Q205k3117Q322N097m4618J4019K4520p31k6791N74k7320M1743
3119C5651O747K2172N150j5889j8929N356J2920k1814k3951J3170L5334l7611
3107A8306J4760L5892l6497K768j6231P411p987M298o55J5716Q268R09o681j153
3093C9124K1080O587m6741K846M0506j5288j6838q71J4085k6993p825Q360j8300
3080b68J6465K4908K0871k3514N602q5j6238J4726N01j1602J236N272j2802N3069
3066G8141J4966j9987j4551J5618L7604n8706r918q517M515q954J1509R311k9274
3053B1757r871K8302K4526j7848j95j0608M5428m1410J5674j2219j3819K5094
3041E4811K621l6139N2126M435m474L0858j2622j9619k6727k2180m840L2260m408
$$ plain form
3028 46102 41894 52634 60092 69790 39003 39785 48864 30992 43602 78450 84820 70922 50921
3015 50921 106595 82590 78414 94170 98103 90996 67535 95681 50458 61475 71031 85555 120825
3002 120825 125827 74953 101242 83159 57927 74897 95801 74922 86429 106278 124312 145105
2990 145105 123272 145486 176471 144273 138213 177346 163351 127681 121315 175716 154168 161770
2978 161770 165907 156297 147259 169130 151347 173053 175018 200302 201521 200200 198012 198871 217939
2965 217939 225976 240713 265357 265035 290067 305110 288603 255506 263950 306464 325335 288203
2953 288203 306928 345508 344541 342921 343228 379586 377175 392158 403339 423964 436822 447876 472051
2940 472051 486500 476340 500711 500169 553972 619265 626438 692523 721636 723043 777958 795856
$$ packed form
3028D6102m208J0740P458R698l0787P82R079j7872J2610L4848O370j3898k0001
3015E0921N5674k4005m176J5756L933p107k3461K8146m5223J1017R556J4524L5270
3002A20825N002n0874K6289j8083k5232J6970K0904k0879J1507J9849J8034K0793
2990A45105k1833K2214L0985l2198o060L9133j3995l5670o366N4401k1548P602
2978A61770M137r610r038K1871j7783K1706J965K5284J219j321k188Q59J9068
2965B17939Q037J4737K4644l22K5032J5043j6507l3097Q444M2514J8871l7132
2953B88203J8725L8580r67j620L07L6358k411J4983J1181K0625J2858J1054K4175
2940D72051J4449j0160K4371n42N3803O5293P173O6085K9113J407N4915J7898
$$ plain form
2928 795856 836172 854985 846266 913538 974363 961378 975266 961883 907981 854977 766091 763275
2916 763275 732367 657769 654261 589682 560143 577845 616778 631345 669236 633876 539096 444748
2904 444748 448706 452430 435663 431815 448141 425865 389679 375866 363269 362919 330582 349819 336597
2891 336597 315135 285648 305846 313751 303572 327885 311686 329559 321667 307136 278852 240012
2879 240012 223013 213479 241451 228535 221430 211673 210287 195308 160417 192555 186209 159206 174871
2866 174871 167495 158811 143423 139265 87828 90632 114974 114933 141571 149672 132433 134732 149720
2853 149720 177233 151933 132298 146030 143950 127094 134249 119872 107097 121051 105726 125580
2841 125580 113323 103609 80556 83099 81479 104762 62339 79499 83623 63610 120967 112831 98654
$$ packed form
2928G95856M0316J8813q719O7272O0825j2985J3888j3383n3902n3004q8886k816
2916G63275l0908p4598l508o4579k9539J7702L8933J4567L7891l5360r4780r4348
2904D44748L958L724j6767l848J6326k2276l6186j3813j2597l50l2337J9237j3222
2891C36597k1462k9487K0198P905j0179K4313j6199J7873p892j4531k8284l8840
2879B40012j6999r534K7972j2916p105r757j386j4979l4891L2138o346k7003J5665
2866A74871p376q684j5388m158n1437K804K4342m1K6638Q101j7239K299J4988
2853A49720K7513k5300j9635J3732k080j6856P155j4377j2775J3954j5325J9854
2841A25580j2257r714k3053K543j620K3283m2423J7160M124k0013N7357q136j4177
$$ plain form
2828 98654 70052 68861 41899 72815 93965 107700 100204 85902 83684 20026 35205 51101
2816 51101 70627 74744 72477 75804 88264 76702 69326 54037 47217 30436 40621 65387 44848
2803 44848 42002 93096 61946 23749 16744 8211 52132 13825 13586 29593 32648 33282 51290
2790 51290 57916 47924 55376 77070 33896 390 25908 39392 32900 33747 21889 38230 11219
2777 11219 24949 24204 50098 73504 14465 20829 16343 28976 22676 3062 13272 51396 -8197
2764 -8197 -19062 6073 11188 8319 23395 46073 28817 16332 -1406 7381 -30319 13473 14497
2751 14497 11784 51566 40215 44821 31616 26978 15047 18724 43741 -5619 24143 30310 32034
2738 32034 16173 19756 29744 -7235 -495 27606 40491 31255 77960 23474 34587 26414 43488
$$ packed form
2828I8654k8602j191k6962L0916K1150J3735p496j4302k218o3658J5179J5896
2816E1101J9526M117k267L327J2460j1562p376j5289o820j6781J0185K4766k0539
2803D4848k846N1094l1150l8197p005q533M3921l8307k39J6007L055O34J8008
2790E1290O626r992P452K1694m3174l3506K5518J3484o492Q47j1858J6341k7011
2777A1219J3730p45K5894K3406n9039O364m486J2633o300j9614J0210L8124n9593
2764h197j0865K5135N115k869J5076K2678j7256j2485j7738Q787l7700M3792J024
2751A4497k713L9782j1351M606j3205m638j1931L677K5017m9360K9762O167J724
2738C2034j5861L583R988l6979O740K8101J2885r236M6705n4486J1113q173J7074
$$ plain form
2725 43488 51591 42347 53035 46823 10291 32767 59051 67749 67767 58673 46965 53724 70854 64484
2711 64484 37621 34853 49611 72808 60645 48941 77308 55959 60741 80350 50760 81862
2699 81862 107344 66422 95757 107041 86600 98056 122427 120771 109382 88245 125709 123360
2687 123360 114574 104076 115480 132196 147361 153956 149697 155703 134065 142822 132326 124788 109924
2674 109924 142083 189885 151264 151426 172113 154496 155025 163539 206200 151140 130015 187950 160395
2661 160395 127987 118134 122079 138804 154634 130067 137090 167722 156989 122973 108869 120565
2649 120565 158328 149264 114124 84806 102260 108369 98237 81683 65949 91576 86072 87390
2637 87390 74579 101257 113063 121282 140396 88747 119236 74393 27251 10201 44496 45251
$$ packed form
2725D3488Q103r244J0688o212l6532K2476K6284Q698J8r094j1708O759J7130o370
2711F4484k6863k768J4758K3197j2163j1704K8367k1349M782J9609k9590L1102
2699H1862K5482m0922K9335J1284k0441J1456K4371j656j1389k1137L7464k349
2687A23360q786j0498J1404J6716J5165O595m259O006k1638Q757j0496p538j4864
2674A09924L2159M7802l8621J62K0687j7617N29Q514M2661n5060k1125N7935k7555
2661A60395l2408r853L945J6725J5830k4567P023L0632j0733l4016j4104J1696
2649A20565L7763r064l5140k9318J7454O109j0132j6554j5734K5627n504J318
2637H7390j2811K6678J1806Q219J9114n1649L0489m4843m7142j7050L4295P55
$$ plain form
2625 45251 15058 14535 23901 39190 48171 35644 46872 19284 793 8841 29003 12198 49305
2612 49305 7409 7290 40645 -3420 -19159 -20762 -8200 -4872 18190 22181 -38928 -11135 -27759
2599 -27759 -5428 -24081 -50359 -40805 -17871 9864 -11953 -33615 -51851 -25792 -35379 -23567
2587 -23567 -38214 -50427 -32651 -4093 -9034 -12059 -66685 -37004 -29816 -16738 2134 -13655
2575 -13655 -30953 -39964 -33728 -2373 -19377 -34128 -29795 -21489 -27957 -20468 -4009 -17896 -21175
2562 -21175 -1606 -4670 5421 -8546 -21222 -22035 -35335 -83707 -59533 -13809 -26132 -69755
2550 -69755 -68915 -73574 -52952 -64269 -51156 -65010 -16150 -51951 -48579 -52870 -42388 -34288 -26985
2537 -26985 -83406 -54575 -35800 -55213 -34082 -42508 -69142 -80595 -45184 -44536 -67059 -58859 -44201
$$ packed form
2625D5251l0193n23R366J5289Q981j2527J1228k7588j8491Q048K0162j6805L7107
2612D9305m1896j19L3355m4065j5739j603J2562L328K3062L991o1109K7793j6624
2599b7759K2331j8653k6278R554K2934K7735k1817k1662j8236K6059r587J1812
2587b3567j4647j2213J7776K8558m941l025n4626K9681P188J3078J8872j5789
2575a3655j7298r011O236L1355j7004j4751M333Q306o468P489J6459j3887l279
2562b1175J9569l064J0091j3967j2676q13j3300m8372K4174M5724j2323m3623
2550f9755Q40m659K0622j1317J3113j3854M8860l5801L372m291J0482Q100P303
2537b6985n6421K8831J8775j9413K1131q426k6634j1453L5411O48k2523Q200J4658
$$ plain form
2524 -44201 -77780 -38339 -46251 -40638 -61476 -90940 -86804 -36424 -55424 -38376 -38377 -50698 -49651
2511 -49651 -80185 -50285 -6962 -34287 -44181 -33301 -44860 -32729 -43377 -46703 -55824 -111382
2499 -111382 -40873 -74515 -64379 -56135 -62826 -67732 -27302 -64735 -59675 -38933 -50830 -60068 -53164
2486 -53164 -67457 -96414 -76577 -89623 -103305 -81055 -49148 -52945 -78506 -47572 -39039 -58420
2474 -58420 -43679 -53123 -31592 -52734 -77785 -71111 -74334 -53418 -60306 -59633 -60785 -58077 -56823 -98832
2460 -98832 -97971 -87110 -48539 -70972 -79672 -76099 -63568 -45900 -14489 -48850 -47879 -44875 -30651
2447 -30651 -27888 -35629 -36447 -44521 -67705 -65059 -40849 -58601 -53583 -43064 -53649 -54832 -41057
2434 -41057 -44259 -66629 -58932 -74707 -64836 -57731 -36994 -66898 -59926 -23808 -16542 -28347 -17940
$$ packed form
2524d4201l3579L9441p912N613k0838k9464M136N0380j9000J7048jj2321J047
2511d9651l0534K9900M3323k7325r894J0880j1559J2131j0648l326r121n5558
2499a11382P0509l3642J0136Q244o691m906M0430l7433N060K0742j1897r238O904
2486e3164j4293k8957J9837j3046j3682K2250L1907l797k5561L0934Q533j9381
2474e8420J4741r444K1531k1142k5051O674l223K0916o888O73j152K708J254m2009
2460i8832Q61J0861L8571k2433q700L573J2531J7668L1411l4361R71L004J4224
2447c0651K763p741q18q074k3184K646K4210j7752N018J0519j0585j183J3775
2434d1057l202k2370P697j5775R871P105K0737k9904O972L6118P266j1805J0407
$$ plain form
2421 -17940 -22782 -23075 -12655 -38654 -69146 -42046 -67950 -81146 -65369 -69832 -95524 -88336 -53868
2408 -53868 -32219 -37848 -64824 -44054 -91904 -66965 -32580 -33918 -49522 -18474 -68195 -53974
2396 -53974 -18041 -18094 -16043 -25009 -33174 -26640 -62900 -31682 -54389 -69678 -70194 -36097 -33998 -55999
2382 -55999 -55758 -56021 -32281 -64030 -61245 -37360 -1889 -2333 -26773 -56721 -76701 -41544 -23872
2369 -23872 -62336 -88672 -83414 -46697 -46496 -35072 -46932 -38022 -42664 -69490 -54508 -72039 -22692
2356 -22692 -63782 -35243 -59007 -48816 -85782 -53741 -56336 -85403 -63932 -33316 -20169 -31952
2344 -31952 -57206 -42268 -34406 -70997 -59330 -72110 -44086 -22056 -66827 -75102 -55829 -61003
2332 -61003 -55787 -56694 -78841 -78177 -69797 -49915 -59463 -40916 -46128 -54853 -18683 -51215 5997 -6425
$$ packed form
2421a7940m842k93J0420k5999l0492K7100k5904j3196J5777m463k5692P188L4468
2408e3868K1649n629k6976K0770m7850K4939L4385j338j5604L1048m9721J4221
2396e3974L5933n3K051q966q165O534l6260L1218k2707j5289n16L4097K099k2001
2382e5999K41k63K3740l1749K785K3885L5471m44k4440k9948j9980L5157J7672
2369b3872l8464k6336N258L6717K01J1424j1860Q910m642k6826J4982j7531M9347
2356b2692m1090K8539k3764J0191l6966L2041k595k9067K1471L0616J3147j1783
2344c1952k5254J4938P862l6591J1667j2780K8024K2030m4771q275J9273n174
2332f1003N216r07k2147O64Q380J9882r548J8547n212q725L6170l2532N7212j2422
$$ plain form
2318 -6425 -20015 -56865 -46202 -44339 -78390 -55489 -45801 -47913 -8969 -26559 -43558 -85357 -63258
2305 -63258 -59387 -22164 -16526 -42895 -28887 -15796 -61436 -55488 -55674 -46975 -74360 -38804 -36575
2292 -36575 -26769 -625 -2531 -36242 -10532 -10810 -17715 -31603 -43874 -1785 -6117 -36053 -32246
2279 -32246 -6531 434 -21053 -31904 -18732 -8779 5883 -24740 -9546 -22303 -29596 -24425 -33
2266 -33 -24009 -60015 -67442 -46516 -32364 -55905 -31211 -11137 -13365 10918 -23897 -39552 -59775
2253 -59775 -35030 -48613 -25508 -2997 -11609 -37728 -49109 -18147 -37285 -68590 -27474 8607
2241 8607 -18154 -1315 -23602 -8324 -45323 -42808 -32042 -24723 -58053 -61973 -48371 -47403 -37044
2228 -37044 619 -21850 -15666 9190 -31867 -34212 884 -2965 -4755 -18573 -16483 -7110 -8872
$$ packed form
2318f425j3590l6850J0663J863l4051K2901R688k112L8944j7590j6999m1799K2099
2305f3258L871L7223N638k6369J4008J3091m5640N948j86Q699k7385L5556K229
2292c6575R806K6144j906l3711K5710k78o905j3888j2271M2089m332k9936L807
2279c2246K5715O965k1487j0851J3172R953J4662l0623J5194j2757p293N171K4392
2266c3k3976l6006p427K0926J4152k3541K4694K0074k228K4283l4815j5655k0223
2253e9775K4745j3583K3105K2511q612k6119j1381L0962j9138l1305M1116L6081
2241H607k6761J6839k2287J5278l6999K515J0766P319l3330l920J3602R68J0359
2228c7044L7663k2469O184K4856m1057k345L5096l849j790j3818K090R373j762
$$ plain form
2215 -8872 -36222 -72737 -24357 -22104 -15162 -39219 -21159 -10295 -13112 -15735 -32402 -9104 13752
2202 13752 -30178 -49610 -44047 -30211 -33014 -21747 11974 4352 -29060 -49459 -78317 -23310
2190 -23310 10002 -23110 -35566 -10542 -13595 22075 12672 -477 -13779 -58981 -32318 -12785
2178 -12785 -29935 -34554 -34451 -36296 6844 10413 5830 -8171 -28679 -5065 2144 -24487 -36603
2165 -36603 -8284 -25345 -1763 8732 -988 -1615 -2994 2106 5153 20404 32430 9341 6618
2152 6618 6005 22695 3376 -5114 14889 4733 4368 26043 51787 11687 -891 23370 59327
2139 59327 58972 59292 58966 50151 65019 57475 55446 104350 109926 78187 88798 95187 101035 83597
2125 83597 103587 116396 106299 122014 133780 159130 175768 203438 228270 197305 220862 202629
$$ packed form
2215h872k7350l6515M8380K253O942k4057J8060J0864k817k623j6667K3298K2856
2202A3752m3930j9432N563J3836k803J1267L3721p622l3412k0399k8858N5007
2190b3310L3312l3112j2456K5024l053L5670r403j3149j3302m5202K6663J9533
2178a2785j7150m619J03j845M3140L569m583j4001k0508K3614P209k6631j2116
2165c6603K8319j7061K3582J0495r720o27j379N100L047J5251J2026k3089k723
2152F618o13J6690j9319q490K0003j0156l65K1675K5744m0100j2578K4261L5957
2139E9327l55L20l26q815J4868p544k029M8904N576l1739J0611O389N848j7438
2125H3597J9990J2809j0097J5715J1766K5350J6638K7670K4832l0965K3557j8233
$$ plain form
2113 202629 229495 263062 284750 273961 267264 321368 350449 336052 342171 412951 438864 435714
2101 435714 456467 502126 565111 600341 625263 642525 656391 691033 748737 797969 831089 896557
2089 896557 954900 1047472 1147508 1207543 1276908 1423566 1545703 1693457 1870817 2035196
2079 2035196 2156400 2401757 2705206 3022249 3488039 4094134 5012520 6133360 7608588
2070 7608588 8395101 7877237 6539927 5117600 4159454 3438958 2939798 2536792 2224526
2061 2224526 2007057 1840918 1715596 1568803 1376256 1261572 1118734 984167 902370 859876
2051 859876 764201 729076 689589 643957 598847 551789 495243 467664 424278 422628 397053 391251
2039 391251 330647 294620 298127 278720 275501 248228 235535 244381 211736 207388 202822 188131 191958
$$ packed form
2113B02629K6866L3567K1688j0789o697N4104K9081j4397O119P0780K5913l150
2101D35714K0753M5659O2985L5230K4922J7262J3866L4642N7704M9232L3120O5468
2089H96557N8343R2572J00036O0035O9365J46658J22137J47754J77360J64379
2079B035196J21204K45357L03449L17043M65790O06095R18386J120840J475228
2070G608588P86513n17864j337310j422327r58146p20496m99160m03006l12266
2061B224526k17469j66139j25322j46793j92547j14684j42838j34567q1797m2494
2051H59876r5675l5125l9487m5632m5110m7058n6546k7579m3386j650k5575n802
2039C91251o0604l6027L507j9407l219k7273j2693Q846l2645m348m566j4691L827
$$ plain form
2026 191958 210313 182018 144908 167593 143122 150577 125538 148887 144182 152720 126965 102882
2014 102882 118837 122177 119756 96493 127653 142463 136935 109021 96584 76586 83049 94507
2002 94507 56187 69637 74515 56510 44872 41865 28562 40296 27188 38571 36742 30352 67881
1989 67881 30496 13313 11206 15627 16817 38839 56223 5047 -28918 22783 -1468 17141
1977 17141 25009 -6669 15566 -23555 -12048 -16487 -16397 -15413 28799 5581 -8459 31262 3255
1964 3255 301 -7656 -19033 6263 24575 -7806 -16326 20413 -20655 -46486 -28017 -19357 9905
1951 9905 -8343 -10667 13590 27703 10866 10520 6305 -945 -75 -31525 -23508 -676 -47924 -43190
1937 -43190 -8659 -632 -3626 -50717 -36788 -17762 -32842 -34657 -32192 -30507 -44664 -38156 -25715
$$ packed form
2026A91958J8355k8295l7110K2685k4471P455k5039K3349m705Q538k5755k4083
2014A02882J5955L340k421k3263L1160J4810n528k7914j2437j9998O463J1458
2002I4507l8320J3450M878j8005j1638l007j3303J1734j3108J1383j829o390L7529
1989F7881l7385j7183k107M421J190K2022J7384n1176l3965N1701k4251J8609
1977A7141P868l1678K2235l9121J1507m439R0R84M4212k3218j4040L9721k8007
1964C255k954p957j1377K5296J8312l2381q520L6739m1068k5831J8469Q660K9262
1951I905j8248k324K4257J4113j6837l46m215p250Q70l1450Q017K2832m7248M734
1937d3190L4531Q027k994m7091J3929J9026j5080j815K465J685j4157O508J2441
$$ plain form
1924 -25715 -4300 1889 -3403 17805 -7225 -28765 -45767 -28386 -14010 -28375 -37402 -35629 -27588
1911 -27588 -10323 -18964 -40296 -33796 -60763 -38540 -29692 -40392 -15699 -40381 -20402 7973
1899 7973 2342 -43979 -45636 -48712 -44483 -21456 -3049 -22442 -34326 -23188 -15015 -24536 -21982
1886 -21982 -13814 -5704 -15945 -36068 -18744 7288 -32656 -40538 -26023 -12504 -19420 -16538 21851
1873 21851 -5043 16797 -14292 29642 43196 12221 -32947 -53812 15170 -14433 -31701 -16529
1861 -16529 -8936 -17962 -35732 -23858 -38010 -58815 -57943 -57624 -15560 -12629 -21696 -20227 -1230 9616
1847 9616 -52540 -72571 -58578 -53624 -47505 -21513 -6355 -24942 -14087 2370 -40614 -63916
1835 -63916 -22467 308 -28217 -32068 -50685 -31510 -23134 -53805 -33148 -30630 -20652 -23113 -23492
$$ packed form
1924b5715K1415O189n292K1208k5030k1540j7002J7381J4376j4365r027J773Q041
1911b7588J7265q641k1332O500k6967K2223Q848j0700K4693k4682J9979K8375
1899G973n631m6321j657l076M229K3027J8407j9393j1884J1138Q173r521K554
1886b1982Q168Q110j0241k0123J7324K6032l9944p882J4515J3519o916K882L8389
1873B1851k6894K1840l1089M3934J3554l0975m5168k0865O8982k9603j7268J5172
1861a6529P593r026j7770J1874j4152k0805Q72L19M2064K931r067J469J8997J0846
1847I616o2156k0031J3993M954O119K5992J5158j8587J0855J6457m2984k3302
1835f3916M1449K2775k8525l851j8617J9175Q376l0671K0657K518R978k461l79
$$ plain form
1822 -23492 -50153 -56401 -54439 -16222 -50448 -70355 -76352 -66153 -50715 -9560 11781 -12586
1810 -12586 -68853 -93080 -54534 -22262 -39016 -51129 -42288 -59570 -34595 -35575 -38894 -15720 -24690
1797 -24690 6803 5984 -46266 -45144 -33779 -37041 -73481 -40747 -48790 -24631 7734 -22525 -36315
1784 -36315 -23752 -58435 -70420 -45444 -47891 -51345 -62710 -42403 -1046 -23042 -59396 -64972
1772 -64972 -47154 -53783 -37470 -30542 -357 -36666 -65683 -32253 -35186 -40182 -37751 -46885 -31952
1759 -31952 -62916 -30330 -35745 -73000 -57257 -46365 -32559 -43309 -47019 -55724 -55375 -17356 -56591
1746 -56591 -66791 -68237 -46206 -27749 -30045 -22935 -8608 -14909 -5854 -22566 -2944 -32799 -74395
1733 -74395 -38870 -45278 -65343 -79253 -31952 -34437 -33325 -19993 -59688 -39604 -27171 -21583 -24270
$$ packed form
1822b3492k6661o248J962L8217l4226j9907n997J0199J5438M1155K1341k4367
1810a2586n6267k4227L8546L2272j6754j2113Q841j7282K4975r80l319K3174q970
1797b4690L1493q19n2250J122J1365l262l6440L2734q043K4159L2365l0259j3790
1784c6315J2563l4683j1985K4976k447l454j1365K0307M1357k1996l6354n576
1772f4972J7818o629J6313O928L0185l6309k9017L3430k933m996K431r134J4933
1759c1952l0964L2586n415l7255J5743J0892J3806j0750l710q705L49L8019l9235
1746e6591j0200j446K2031J8457k296P110J4327o301R055j6712J9622k9855m1596
1733g4395L5525o408k0065j3910M7301k485J112J3332l9695K0084J2433N588k687
$$ plain form
1720 -24270 -56128 -36777 -30731 -41337 -34539 -12145 -30467 -55619 -71503 -46908 -15868 -41434
1708 -41434 -50915 -14521 -26899 -53393 -57132 -13836 -5488 -26574 16734 37190 -2365 1918 5212
1695 5212 12617 15283 20443 6063 -21284 -4350 -11644 -64720 -46076 -57112 -83134 -44652 -24414
1682 -24414 -30398 -24938 -26692 8781 -15419 -36760 -54329 -42147 -24253 -54684 -51441 -11374 -56952
1669 -56952 -28494 -54210 -50783 -47104 -53876 -74557 -56930 -40155 -58686 -36353 -61410 -25559
1657 -25559 -27433 -7117 4246 -4097 -38728 -54573 -47957 -26549 -13049 -16965 -60939 -34685 -24566
1644 -24566 -33971 -57182 -46339 -60216 -28642 -27765 -64430 -38185 -33146 -34432 -15272 -13363 -16501
1631 -16501 -41519 -48144 -52617 -33237 -38730 -29758 -30239 -20145 -17353 -26451 -44086 -70094 -8626
$$ packed form
1720b4270l1858J9351O046j0606O798K2394j8322k5152j5884K4595L1040k5566
1708d1434r481L6394j2378k6494l739M3296Q348k1086M3308K0456l9555M283L294
1695E212P405K666N160j4380k7347J6934p294n3076J8644j1036k6022L8482K0238
1682b4414n984N460j754L5473k4200k1341j7569J2182J7894l0431L243M0067m5578
1669e6952K8458k5716L427L679o772k0681J7627J6775j8531K2333k5057L5851
1657b5559j874K0316J1363q343l4631j5845O616K1408J3500l916m3974K6254J0119
1644b4566r405k3211J0843j3877L1574Q77l6665K6245N039j286J9160J909l138
1631a6501k5018o625m473J9380n493Q972m81J0094K792r098j7635k6008O1468
$$ plain form
1618 -8626 -1609 16220 -29778 -31636 -12997 -49856 -51027 -57855 -34567 -45123 -69917 -74931 -72114
1605 -72114 -57764 -81132 -36138 3475 -24493 -7980 -15249 -41424 -53684 -62050 -38918 -26919
1593 -26919 -35404 -50788 -45534 -68365 -46661 -17977 -17809 -21476 -17966 -27352 -45433 -45496 -48774 -76970
1579 -76970 -64505 -61158 -40468 -27398 -1931 -7509 3765 -25267 -39011 -32407 -41477 -29123 -6291
1566 -6291 -11694 -18397 -8394 -41943 -35720 -52483 -15311 -14163 -28938 -28847 -31892 2296 -2718 -49794
1552 -49794 -27468 -42825 -73897 -44668 -27117 -3411 -54772 -73166 -38242 -19346 -29319 -24635
1540 -24635 -9218 15372 -34961 -13291 -10058 -18578 -26692 -42582 -37178 -22048 -453 -16245 -26192
1527 -26192 -52390 -35517 -39077 -18156 -32425 -26374 -22412 -14101 -65510 -48519 -7757 -14329 -23731
$$ packed form
1618h626P017J7829m5998j858J8639l6859j171o828K3288j0556k4794n014K817
1605g2114J4350k3368M4994L9613k7968J6513p269k6175j2260q366K3132J1999
1593b6919q485j5384N254k2831K1704K8684J68l667L510r386j8081o3l278k8196
1579g6970J2465L347K0690J3070K5467n578J1274k9032j3744O604r070J2354K2832
1566f291n403o703J0003l3549O223j6763L7172J148j4775R1l045L4188n014m7076
1552d9794K2326j5357l1072K9229J7551K3706n1361j8394L4924J8896r973M684
1540b4635J5417K4590n0333K1670L233q520q114j5890N404J5130K1595j5792r947
1527b6192k6198J6873l560K0921j4269O051L962Q311n1409J6991M0762o572r402
$$ plain form
1514 -23731 -51487 -47078 -24236 21141 22839 12294 -21299 -68983 -69915 -38604 -54414 -50759 -13834
1501 -13834 -13131 -10331 -11571 -30749 -14996 -22744 -43029 -32142 -15778 19808 9060 -41099 -19797
1488 -19797 -29912 -4319 -5491 -56 -21025 -25141 24554 -16290 -37540 -19446 -54904 -44095
1476 -44095 -8121 -22694 -19998 -31827 -33222 -71735 -42666 -41383 -38412 -35386 -33033 -34743 -30996
1463 -30996 -38622 -552 -12599 26000 -10637 -58493 -53626 -25793 13103 -21149 -39722 -29656
1451 -29656 2921 18179 -6496 -6035 -20229 -23194 -35116 -3187 -18667 -52541 -28338 7189
1439 7189 -15410 -5686 33269 -650 -5164 -14850 -19379 -23746 -50608 -44875 -56749 -63747 -40992
1426 -40992 -38707 -19775 24223 7610 -25180 -36520 -26876 -2170 -40688 -33099 -19212 -29642
$$ packed form
1514b3731k7756M409K2842M5377J698j0545l3593m7684r32L1311j5810L655L6925
1501a3834P03K800j240j9178J5753p748k0285J0887J6364L5586j0748n0159K1302
1488a9797j0115K5593j172N435k0969m116M9695m0844k1250J8094l5458J0809
1476d4095L5974j4573K696j1829j395l8513K9069J283K971L026K353j710L747
1463c0996p626L8070j2047L8599l6637m7856M867K7833L8896l4252j8573J0066
1451b9656L2577J5258k4675M61j4194k965j1922L1929j5480l3874K4203L5527
1439G189k2599R724L8955l3919m514r686m529m367k6862N733j1874o998K2755
1426d0992K285J8932M3998j6613l2790j1340R644K4706l8518P589J3887j0430
$$ plain form
1414 -29642 -22918 -8915 -31067 -21328 8956 -20265 -41978 -45483 -389 -2007 -12361 877 -3179
1401 -3179 -37484 12783 -81 -7987 -11103 -47834 -30672 -17771 -24908 20661 75603 -6736 -26105
1388 -26105 -38416 -35720 -55295 -73845 -17491 6767 -43227 9753 11449 -19660 -36242 -43429
1376 -43429 -73322 -49712 -7769 -28180 -69829 -43011 -16903 -33195 -25648 4873 4688 -9163
1364 -9163 4710 -13217 -18746 -51117 -37578 294 -29189 -6169 -32577 -53572 -35863 -10395
1352 -10395 -43423 -25105 -26652 -41367 -20302 9534 -315 -12898 -6673 -130 -17944 657 6574
1339 6574 -16457 -23564 -60122 -39904 -26856 -33681 9429 -20897 -41219 -53920 -18456 -16098 -16529
1326 -16529 -32746 -12894 -5724 -14214 -4962 -7298 -8933 -26918 -24964 -41738 -45135 -17727 -5805
$$ packed form
1414b9642O724J4003k2152R739L0284k9221k1713l505M5094j618j0354J3238m056
1401c179l4305N0267j2864p906l116l6731J7162J2901p137M5569N4942q2339j9369
1388b6105j2311K696j9575j8550N6354K4258m9994N2980J696l1109j6582p187
1376d3429k9893K3610M1943k0411m1649K6818K6108j6292P547L0521j85j3851
1364i163J3873j7927n529l2371J3539L7872k9483K3020k6408k0995J7709K5468
1352a0395l3028J8318j547j4715K1065K9836r849j2583O225O543j7814J8601N917
1339F574k3031p107l6558K0218J3048o825M3110l0326k0322j2701L5464K358m31
1326a6529j6217J9852P170q490R252k336j635j7985J954j6774l397K7408J1922
$$ plain form
1313 -5805 -40300 -37502 -23346 -37969 -47821 -52620 -15986 -16733 -58745 -16795 29940 46786 28704
1300 28704 19079 -42634 -50747 -15796 -61423 -33998 -24006 15172 40758 20739 -408 -12718
1288 -12718 -8114 -30903 -1936 -19734 -17464 -41274 -24205 -14965 -3623 1641 -5405 -34421 -19839
1275 -19839 5617 -20685 -3921 -30456 315 14627 -11984 -21022 -802 -16706 -13110 39172
1263 39172 3784 -25568 -34584 -40676 -24886 -32613 -32294 -15417 -31928 2372 -8735 -31932 -28857
1250 -28857 -12650 -46607 -41178 -31448 -49114 -30636 69 26238 23618 -41767 2135 -2270 364
1237 364 22463 16927 4964 -21697 -36183 -43393 -54415 -31374 -15231 -1249 -5430 -6477 -17522
1224 -17522 6263 27426 44234 3241 -276 -8260 33999 11834 -8542 -21654 2708 -24129
$$ packed form
1313e805l4495K798J4156j4623r852m799L6634p47m2012M1950M6735J6846j8082
1300B8704r625o1713q113L4951m5627K7425R992L9178K5586k0019k1147j2310
1288a2718M604k2789K8967j7798K270k3810J7069R240J1342N264p046k9016J4582
1275a9839K5456k6302J6764k6535L0771J4312k6611r038K0220j5904L596N2282
1263C9172l5388k9352r016o092J5790p727L19J6877j6511L4300j1107k3197L075
1250b8857J6207l3957N429R730j7666J8478L0705K6169k620o5385M3902m405K634
1237C64K2099n536j1963k6661j4486p210j1022K3041J6143J3982m181j047j1045
1224a7522K3785K1163J6808m0993l517p984M2259k2165k0376j3112K4362k6837
$$ plain form
1212 -24129 -30753 32834 12691 -5769 -472 2945 -35866 -34940 -15890 -28193 -54431 -58528 -22967
1199 -22967 -3401 -21634 -23792 -8310 -26661 -15959 -7026 -7774 116 -1661 -16352 -32287 -18124
1186 -18124 -15565 11567 6717 -5312 -16422 -10906 10018 14750 -9688 -19547 -33510 -9686 -7151
1173 -7151 -39232 -29060 -36304 -38606 -19080 -44558 -14685 27708 2082 14549 6856 -8909 2993
1160 2993 -14388 27713 151 -3247 22883 41695 -2260 23812 3093 -3315 -16814 13589
1148 13589 13329 -6064 -8031 -17201 -4391 16809 -556 -26884 -50294 -11964 -10249 -10304 24586
1135 24586 31540 11694 9101 -15175 4292 -30546 5938 16771 -12151 -19808 -9380 -27934
1123 -27934 11865 -14690 15829 36375 10282 6697 -4588 6375 27774 18818 13984 -278
$$ packed form
1212b4129o624O3587k0143j8460N297L417l8811R26J9050j2303k6238m097L5561
1199b2967J9566j8233k158J5482j8351J0702Q933p48P890j777j4691j5935J4163
1186a8124K559K7132m850j2029j1110N516K0924M732k4438r859j3963K3824K535
1173g151l2081J0172p244k302J9526k5478K9873M2393k5626J2467p693j5765J1902
1160B993j7381M2101k7562l398K6130J8812m3955K6072k0719o408j3499L0403
1148A3589k60j9393j967r170J2810K1200j7365k6328k3410L8330J715n5L4890
1135B4586O954j9846k593k4276J9467l4838L6484J0833k8922p657J0428j8554
1123b7934L9799k6555L0519K0546k6093l585j1285J0963K1399q956m834j4262
$$ plain form
1111 -278 11819 51315 36402 22118 -936 -7485 9047 29141 11255 7519 -12682 17670 12450
1098 12450 591 -32950 -39197 5614 17646 -21303 -12781 13465 -17409 -5133 -11995 -22398
1086 -22398 -15085 10521 13082 18098 19527 -12456 8725 -19138 7764 -19376 2228 -13195 -15826
1073 -15826 -13750 20798 -44213 13322 14649 -870 -29969 5432 21069 18898 -33529 -53069
1061 -53069 -14484 -21211 -9767 -6556 -26859 -21341 -27758 -31452 7776 -20834 -37875 -43863 -42714
1048 -42714 -31779 -21484 -1199 27360 24615 13742 1121 -23544 14314 19949 3406 -5673
1036 -5673 12967 -43490 -28429 43162 20664 9167 -8520 9409 7617 22995 -4167 39003
1024 39003 9406 -16123 -15455 -13841 -4066 -19504 10548 -1098 -27846 -28156 -8903 -4827 13619
$$ packed form
1111b78J2097L9496j4913j4284k3054o549J6532K0094j7886l736k0201L0352n220
1098A2450j1859l3541o247M4811J2032l8949Q522K6246l0874J2276o862j0403
1086b2398P313K5606K561N016J429l1983K1181k7863K6902k7140K1604j5423k631
1073a5826K076L4548o5011N7535J327j5519k9099L5401J5637k171n2427j9540
1061e3069L8585o727J1444L211k0303N518o417l694L9228k8610j7041n988J149
1048d2714J0935J0295K0285K8559k745j0873j2621k4665L7858N635j6543r079
1036e673J8640n6457J5061P1591k2498j1497j7687J7929j792J5378k7162M3170
1024C9003k9597k5529O68J614R775j5438L0052j1646k6748l10J9253M076J8446
$$ plain form
1011 13619 -40278 -44495 -40464 -58681 83 -560 -12367 -25313 -32033 -17883 10819 31587 39249
998 39249 796 11690 23188 1267 -14886 6383 3027 -2455 -21461 -18415 -9691 -5748 26663
985 26663 25236 5758 14192 29551 33997 11512 4103 15036 20682 1132 8791 50427 25730
972 25730 19683 -8862 -23416 -10223 -19971 -58334 -61568 12510 8220 -2770 -673 16324 -13979
959 -13979 10650 7550 5836 -9066 -10338 -7376 14025 4359 -12701 -25665 -8086 -6233 911
946 911 32989 34440 7316 1806 1989 -19407 -5157 -25045 8342 27862 48343 47951 -24562 -12718
932 -12718 -4945 27077 21742 41677 32924 -30298 -25800 -17975 1525 -3011 -5827 2843 4374 30325
918 30325 29122 30486 36255 -4304 16680 14955 19574 13363 12410 989 4251 -29844 20028 10148
$$ packed form
1011A3619n3897m217M031j8217N8764o43j1807j2946o720J4150K8702K0768P662
998C9249l8453J0894J1498k1921j6153K1269l356n482j9006L046Q724L943L2411
985B6663j427j9478Q434J5359M446k2485p409J0933N646j9550P659M1636k4697
972B5730o047k8545j4554J3193r748l8363l234P4078m290j0990K097J6997l0303
959a3979K4629l100j714j4902j272K962K1401r666j7060j2964J7579J853P144
946I11L2078J451k7124n510J83k1396J4250j9888L3387J9520K0481l92p2513J1844
932a2718P773L2022n335J9935q753o3222M498P825J9500m536k816Q670J531K5951
918C0325j203J364N769m0559K0984j725M619o211r53j1421L262l4095M9872r880
$$ plain form
904 10148 23162 37555 55894 25624 -25066 -32477 32003 -2615 -38984 -17320 -7334 36737
892 36737 -11298 5715 6667 -1027 -20979 -784 6903 17705 15587 1301 27326 30758 41092
879 41092 38498 21379 -20026 -16372 -1738 9827 -8102 -25232 -16525 2390 33543 36213 2918
866 2918 29126 31321 19037 35214 38121 63877 -1068 -39821 24037 -4062 10187 37288 64389
853 64389 1359 13556 -5498 -11259 21049 -28161 -40674 13001 33923 52381 -8137 -10754
841 -10754 15121 -13871 -11110 -29432 7913 -3465 -14469 -10164 -12037 -29379 4997 11276 8953
828 8953 16655 28830 20137 4532 26364 44777 13884 8487 27701 49705 45947 38658 45253
815 45253 40125 42569 37364 1050 31644 7061 -6770 -5870 -22821 -3321 -7590 263 16782
$$ packed form
904A0148J3014J4393J8339l0270n0690p411O4480l4618l6369K1664R986M4071
892C6737m8035J7013R52p694j9952K0195P687J0802k118j4286K6025L432J0334
879D1092k594j7119m1405L654J4634J1565j7929j7130Q707J8915L1153K670l3295
866B918K6208K195j2284J6177K907K5756o4945l8753O3858k8099J4249K7101K7101
853F4389o3030J2197j9054n761L2308m9210j2513N3675K0922J8458o0518k617
841a0754K5875k8992K761j8322L7345j1378j1004M305j873j7342L4376O279k323
828H953P702J2175q693j5605K1832J8413l0893n397J9214K2004l758p289O595
815D5253n128K444n205l6314L0594k4583j3831R00j6951J9500m269P853J6519
$$ plain form
802 16782 26882 51913 11434 47538 30745 5597 35713 30454 48273 36467 22256 42005
790 42005 27087 30612 3760 26389 14442 21892 22494 -346 6518 20165 42682 14841 -4769
777 -4769 37167 39464 32858 4180 13815 25702 26204 16419 18580 -352 -8799 42471 19136 44937
763 44937 3366 -20138 23662 60635 73516 19080 9773 -5617 32176 26878 6990 19751
751 19751 35791 22390 30769 26171 16553 8565 34866 13112 357 12260 54424 33268 17657
738 17657 5887 -18511 13710 -15132 -8936 10720 18890 -17728 -14573 -14801 -7627 556 24028
725 24028 21842 27431 -1565 -16830 38444 56444 23509 22085 -27346 -2745 4813 8398 12587
712 12587 48711 31517 48620 26434 20461 28503 12368 1571 28384 26290 20367 14605 4498
$$ packed form
802A6782J0100K5031m0479L6104j6793k5148L0116n259J7819j1806j4211J9749
790D2005j4918L525k6852K2629j1947P450O02k2840O864J3647K2517k7841j9610
777d769M1936K297o606k8678R635J1887N02r785K161j8932q447N1270k3335K5801
763D4937m1571k3504M3800L6973J2881n4436r307j5390L7793n298j9888J2761
751A9751J6040j3401Q379m598r618p988K6301k1754j2755J1903M2164k1156j5611
738A7657j1770k4398L2221k8842O196J9656Q170l6618L155k28P174Q183K3472
725B4028k186N589k8996j5265N5274J8000l2935j424m9431K4601P558L585M189
712A2587L6124j7194J7103k2186n973Q042j6135j0797K6813k094n923n762j0107
$$ plain form
699 4498 18289 50497 40247 31262 37197 5107 32785 30193 9705 29781 54448 52572 74601
686 74601 56743 25167 4589 32291 44372 31815 44747 40054 42905 33052 42597 46483 43562
673 43562 15460 36678 12681 -6480 -7225 56865 60849 -3096 5482 50918 45395 52157 31713
660 31713 25589 36905 3405 6284 7193 18283 20795 5750 13278 11756 16393 36143 -13208 -28018
$$ packed form
699D498J3791L2208j0250q985N935l2090K7678k592k0488K0076K4667j876K2029
686G4601j7858l1576k0578K7702J2081j2557J2932m693K851r853R545L886k921
673D3562k8102K1218k3997j9161p45O4090L984o3945Q578M5436n523O762k0444
660C1713o124J1316l3500K879R09J1090K512j5045P528j522M637J9750m9351j4810
$$ [...]
##END NTUPLES=NMR SPECTRUM
##END=
