##TITLE=1H_EC-3333(41)
 CDCl3+DMSO
 8 sc, 
 2.10.2024
##JCAMPDX= 6.0         $$ Bruker NMR JCAMP-DX V2.0
##DATA TYPE= NMR SPECTRUM
##DATA CLASS= NTUPLES
##ORIGIN= UXNMR, Bruker Analytische Messtechnik GmbH
##OWNER= root
$$ XWIN-NMR		Version 3.5
$$ Wed Oct  2 14:26:26 2024 Russian Standard Time (UT+4h)  she@DPX200
##.OBSERVE FREQUENCY= 200.1318
##.OBSERVE NUCLEUS= ^1H
##.ACQUISITION MODE= SIMULTANEOUS
##.ACQUISITION SCHEME= undefined
##.AVERAGES= 8
##.DIGITISER RES= 18
##SPECTROMETER/DATA SYSTEM= spect
##.PULSE SEQUENCE= zg30
##.SOLVENT NAME= DMSO
##.SHIFT REFERENCE= (INTERNAL, DMSO, 0, 21.2177)
##AUDIT TRAIL= $$ (NUMBER, WHEN, WHO, WHERE, WHAT)
$$ ##TITLE= Audit trail, XWIN-NMR		Version 3.5
$$ ##JCAMPDX= 5.01
$$ ##ORIGIN= Bruker BioSpin GmbH
$$ ##OWNER= she
$$ F:/spectra/data/she/nmr/H-F/1/pdata/1/auditp.txt
$$ ##AUDIT TRAIL=  $$ (NUMBER, WHEN, WHO, WHERE, WHAT)
(   1,<2024-10-02 14:25:10.51 +0400>,<she>,<DPX200>,
      <created by zg, POWCHK disabled, PULCHK disabled
       configuration hash MD5:
       00 E9 B6 7A A2 85 ED C7 34 08 36 98 17 FE 4E 26
       data hash MD5: 16K
       0E DA 8F 95 3D 8C 24 13 BC F5 F0 C9 17 09 A1 12>)
(   2,<2024-10-02 14:25:13.17 +0400>,<she>,<DPX200>,
      <Start of raw data processing
       efp BC_mod = 2 LB = 0.24 FT_mod = 6 PKNL = 1 PHC0 = -26164.44 PHC1 = 21.78747 SI = 16K 
       data hash MD5: 16K
       37 BE F3 E1 51 E8 AE B6 A9 B8 3B 7E B0 C0 DA 36>)
(   3,<2024-10-02 14:25:35.26 +0400>,<she>,<DPX200>,
      <pk PHC0 = 156.0377 PHC1 = 2.8 
       data hash MD5: 16K
       2A B7 A3 21 F3 03 C7 E7 A9 06 AF 93 C6 A4 E7 46>)
(   4,<2024-10-02 14:25:38.54 +0400>,<she>,<DPX200>,
      <abs ABSG = 5 
       data hash MD5: 16K
       5A 5A 2F 31 90 3B 33 18 7C 51 6F 86 61 8D 98 A4>)
$$ ##END=
$$ 
$$ hash MD5
$$ 0E 4F E9 4E 1D 86 9B 56 F5 8E 5D 36 5D CC 50 50
##$RELAX= 
##$RELAX= 
##$RELAX= 
##$RELAX= 
##$RELAX= 
##$RELAX= 
$$ Bruker specific parameters
$$ --------------------------
##$DU= <F:/spectra>
##$EXPNO= 1
##$NAME= <H-F>
##$PROCNO= 1
##$TYPE= <nmr>
##$USER= <she>
##$AMP= (0..31)
100 100 100 100 100 100 100 100 100 100 100 100 100 100 100 100 100 100 
100 100 100 100 100 100 100 100 100 100 100 100 100 100 
##$AQSEQ= 0
##$AQ_mod= 1
##$AUNM= <au_zg>
##$AUTOPOS= <>
##$BF1= 200.13
##$BF2= 200.13
##$BF3= 200.13
##$BF4= 200.13
##$BF5= 200.13
##$BF6= 200.13
##$BF7= 200.13
##$BF8= 200.13
##$BYTORDA= 1
##$CFDGTYP= 0
##$CFRGTYP= 5
##$CHEMSTR= <none>
##$CNST= (0..31)
1 1 145 1 1 1 1 1 1 1 1 1 1 1 1 1 1 1 1 1 1 1 1 1 1 1 1 1 1 1 1 1 
##$CPDPRG= <>
##$CPDPRG1= <>
##$CPDPRG2= <>
##$CPDPRG3= <>
##$CPDPRG4= <mlev>
##$CPDPRG5= <mlev>
##$CPDPRG6= <mlev>
##$CPDPRG7= <mlev>
##$CPDPRG8= <mlev>
##$CPDPRGB= <>
##$CPDPRGT= <>
##$D= (0..31)
0 1.2 0 0 0 0 0 0 0 0.06 0 0.03 0 0 0 0 0.0002 0 0 0 0 0 0 0 0 0 0 0 0 
0 0 0 
##$DATE= 1727864709
##$DBL= (0..7)
120 120 120 120 120 120 120 120 
##$DBP= (0..7)
150 150 150 150 150 150 150 150 
##$DBP07= 0
##$DBPNAM0= <>
##$DBPNAM1= <>
##$DBPNAM2= <>
##$DBPNAM3= <>
##$DBPNAM4= <>
$$ [...]
##$SUBNAM3= <"">
##$SUBNAM4= <"">
##$SUBNAM5= <"">
##$SUBNAM6= <"">
##$SUBNAM7= <"">
##$SUBNAM8= <"">
##$SUBNAM9= <"">
##$SW= 24.0689170037331
##$SWIBOX= (0..15)
0 0 2 0 0 0 0 0 0 0 0 0 0 0 0 0 
##$SW_h= 4816.95568400771
##$TD= 16384
##$TD0= 1
##$TE= 0
##$TE2= 300
##$TE3= 300
##$TEG= 300
##$TL= (0..7)
0 120 120 120 120 120 120 120 
##$TP= (0..7)
150 150 150 150 150 150 150 150 
##$TP07= 0
##$TPNAME0= <>
##$TPNAME1= <>
##$TPNAME2= <>
##$TPNAME3= <>
##$TPNAME4= <>
##$TPNAME5= <>
##$TPNAME6= <>
##$TPNAME7= <>
##$TPOAL= (0..7)
0.5 0.5 0.5 0.5 0.5 0.5 0.5 0.5 
##$TPOFFS= (0..7)
0 0 0 0 0 0 0 0 
##$TUNHIN= 0
##$TUNHOUT= 0
##$TUNXOUT= 0
##$USERA1= <user>
##$USERA2= <user>
##$USERA3= <user>
##$USERA4= <user>
##$USERA5= <user>
##$V9= 5
##$VALIST= <valist>
##$VCLIST= <CCCCCCCCCCCCCCC>
##$VD= 0
##$VDLIST= <DDDDDDDDDDDDDDD>
##$VPLIST= <PPPPPPPPPPPPPPP>
##$VTLIST= <TTTTTTTTTTTTTTT>
##$WBST= 1024
##$WBSW= 4
##$XGAIN= (0..3)
0 0 0 0 
##$XL= 0
##$YL= 0
##$YMAX_a= 174209
##$YMIN_a= -156204
##$ZGOPTNS= <>
##$ZL1= 120
##$ZL2= 120
##$ZL3= 120
##$ZL4= 120
##$ABSF1= 21.00026
##$ABSF2= -3.068872
##$ABSG= 5
##$ABSL= 3
##$ALPHA= 0
##$AQORDER= 0
##$ASSFAC= 0
##$ASSFACI= 0
##$ASSFACX= 0
##$ASSWID= 0
##$AUNMP= <proc_1d>
##$AZFE= 0.1
##$AZFW= 0.1
##$BCFW= 0
##$BC_mod= 2
##$BYTORDP= 0
##$COROFFS= 0
##$CY= -3
##$DATMOD= 1
##$DC= 0
##$DFILT= <>
##$DTYPP= 0
##$F1P= 0
##$F2P= 0
##$FCOR= 1
##$FTSIZE= 16384
##$FT_mod= 6
##$GAMMA= 0
##$GB= 0
##$INTBC= 1
##$INTSCL= 3.70164e-10
##$ISEN= 128
##$LB= 0.24
##$LEV0= 0
##$LPBIN= 0
##$MAXI= 10000
##$MC2= 0
##$MEAN= 0
##$ME_mod= 0
##$MI= 1.114404
##$NCOEF= 0
##$NC_proc= -8
##$NLEV= 6
##$NOISF1= 3.799351
##$NOISF2= 2.8
##$NSP= 0
##$NTH_PI= 0
##$NZP= 0
##$OFFSET= 21.21769
##$PC= 1
##$PHC0= -26008.4
##$PHC1= 24.58747
##$PH_mod= 1
##$PKNL= yes
##$PPARMOD= 0
##$PSCAL= 0
##$PSIGN= 0
##$REVERSE= no
##$SF= 200.129962183823
##$SI= 16384
##$SIGF1= 3
##$SIGF2= 2
##$SINO= 5.538805
##$SIOLD= 16384
##$SREGLST= <1H.CDCl3>
##$SSB= 0
##$STSI= 16384
##$STSR= 0
##$SW_p= 4816.95568400771
##$SYMM= 0
##$S_DEV= 0
##$TDeff= 16384
##$TDoff= 0
##$TI= <>
##$TILT= no
##$TM1= 0
##$TM2= 0
##$TOPLEV= 0
##$USERP1= <user>
##$USERP2= <user>
##$USERP3= <user>
##$USERP4= <user>
##$USERP5= <user>
##$WDW= 1
##$XDIM= 16384
##$YMAX_p= 290316128
##$YMIN_p= -2888097
$$ End of Bruker specific parameters
$$ ---------------------------------
##NTUPLES= NMR SPECTRUM
##VAR_NAME=  FREQUENCY,     SPECTRUM/REAL,   SPECTRUM/IMAG
##SYMBOL=    X,             R,               I
##VAR_TYPE=  INDEPENDENT,   DEPENDENT,       DEPENDENT
##VAR_FORM=  AFFN,          ASDF,            ASDF
##VAR_DIM=   16384,         16384,           16384
##UNITS=     HZ,            ARBITRARY UNITS, ARBITRARY UNITS
##FACTOR=    0.29402158847633, 1,            1
##FIRST=     4246.29540009697, 0,            0
##LAST=      -570.66028391074, 0,            0
##MIN=       -570.66028391074, -2888097,     0
##MAX=       4246.29540009697, 290316128,    0
$$ Real data points
##PAGE= N=1
##DATA TABLE= (X++(R..R)), XYDATA
$$ [...]
6822B9628393p90828q21067O3386k70575j10372M63534k75809Q71132J97748K77740
$$ 29628393 28837565 28016498 28079884 27809309 27698937 28162471 27886662 28757794 28955542 29233282
6812B9233282l4847q8258L67205J93693L63099j30663j94785r663m09981l20053
$$ 29233282 29198435 29110177 29477382 29671075 30034174 29903511 29708726 29699063 29289082 28969029
6802B8969029k86026j84834p19784r97922q90786r46584j05210K62248j55046
$$ 28969029 28683003 28498169 27778385 26780463 25889677 24943093 24837883 25100131 24945085
6793B4945085r44256J93950J68466o03290J63079L78757R06416m99012k1336J052878
$$ 24945085 24000829 24194779 24363245 23759955 23923034 24301791 25208207 24709195 24687859 25740737
6783B5740737P47718P26997L48387K53133M22663j65484o63816O0054m42713l64009
$$ 25740737 26488455 27215452 27563839 27816972 28239635 28074151 27410335 27470389 27027676 26663667
6773B6663667R10635j75274l72982j495541K18544p75919M85716r2322m37204
$$ 26663667 27574302 27399028 27026046 25530505 25749049 24973130 25458846 25366524 24929320
6764B4929320o6285L90281q89682m70357N4979k82048m57530k60783M38099J08344
$$ 24929320 24863035 25253316 24363634 23893277 23948256 23666208 23208678 22947895 23385994 23494338
6754B3494338L51087N35236J80300K73087J186243Q26050j85753K83515K21655
$$ 23494338 23845425 24380661 24560961 24834048 26020291 26846341 26660588 26944103 27165758
6745B7165758l08905K03083n1024P54620J32483Q61431R58211O47272L93437J636823
$$ 27165758 26856853 27059936 27008912 27763532 27896015 28757446 29715657 30362929 30756366 32393189
6735C2393189J447278J846775J298470J700613J300194J580664N75339M05366
$$ 32393189 33840467 35687242 36985712 38686325 39986519 41567183 42142522 42547888
6727D2547888J27338N23226J97311R12021N02748J74903M84534k87353k65470
$$ 42547888 42675226 43198452 43395763 44307784 44810532 44985435 45469969 45182616 44917146
6718D4917146j523602o43748o11714k03748m7242m27705o3268J275075P00960
$$ 44917146 43393544 42749796 42138082 41934334 41887092 41459387 41396119 42671194 43372154
6709D3372154k13922K43292J247203q45171R28325M13490M30659Q79219P78510
$$ 43372154 43158232 43401524 44648727 43803556 44731881 45145371 45576030 46455249 47233759
6700D7233759J669029K222756J359912L07427J113281L14564m96577M4767O57485
$$ 47233759 48902788 51125544 52485456 52792883 53906164 54220728 53724151 53768918 54426403
6691E4426403L70336P64405J98267l60911n08475o3196r91416q86808r14631q53598
$$ 54426403 54796739 55561144 55759411 55398500 54890025 54826829 53835413 52948605 52033974 51180376
6681E1180376p6122k51023r92344r67694o72725j70149p12908r70843o03241j243046
$$ 51180376 51104254 50853231 49860887 48893193 48220468 48050319 47337411 46366568 45763327 44520281
6671D4520281l5011l22244j546550j197472j139555m76915l5339K78195r78465
$$ 44520281 44485270 44163026 42616476 41419004 40279449 39802534 39767195 40045390 39066925
6662C9066925l77875m9373o67324o89082m6942l94900K7226M4576k64607K92059
$$ 39066925 38689050 38639677 37972353 37283271 37236329 36841429 36868655 36913231 36648624 36940683
6652C6940683Q40587M12149o89561r39679J05470m26341N22358j22328p8083O09747
$$ 36940683 37781270 38193419 37503858 36564179 36669649 36243308 36765666 36643338 36565255 37175002
6642C7175002J143509L36216k38088L23022L5450o63542q81552j036883Q7091
$$ 37175002 38318511 38654727 38416639 38739661 38775111 38111569 37230017 36193134 36280225
6633C6280225K14969m38426r25951p90802l76962J09679j201174j019264p96461
$$ 36280225 36495194 36056768 35130817 34340015 33963053 34072732 32871558 31852294 31055833
6624C1055833o39700q22088n95979J67519n31763K87620N79190Q34771j03363
$$ 31055833 30416133 29594045 28998066 29165585 28633822 28921442 29500632 30335403 30232040
6615C0232040J112553J023386P02309J428666J780052J104425J201328J118402
$$ 30232040 31344593 32367979 33070288 34498954 36279006 37383431 38584759 39703161
6607C9703161K57333R2758m49060L01293j44560J0475m74143k31957j03483l92903
$$ 39703161 39960494 40053252 39604192 39905485 39760925 39771400 39297257 39065300 38961817 38568914
6597C8568914j358257j451539j446703j312630j213573j748542q37091q97110
$$ 38568914 37210657 35759118 34312415 32999785 31786212 30037670 29200579 28303469
6589B8303469L12027l17308k54791k97825R04P06799L28564J80141r2615Q76132
$$ 28303469 28615496 28298188 28043397 27745572 27746476 28453275 28781839 28961980 28869365 29745497
6579B9745497J756309M80651K58378j05022k16176q82462L7453J446l36112L1348
$$ 29745497 31501806 31982457 32240835 32135813 31919637 31037175 31074628 31076074 30739962 30771310
6569C0771310m28929q18929r08376k98944j92123j204821j997799n50192l40638
$$ 30771310 30342381 29523452 28615076 28316132 28124009 26919188 24921389 24371197 24030559
6560B4030559r35736j194526p80330l05363j075970K06302n90489q66408j49258
$$ 24030559 23094823 21900297 21119967 20814604 19738634 19944936 19354447 18488039 18338781
6551A8338781L12936q20747k4163r3065j92271j216446O55011r7678k32364l41245
$$ 18338781 18651717 17830970 17806807 17713742 17521471 16305025 16960036 16862358 16629994 16288749
6541A6288749m27498l76921k24800J59815k82121m91198q32897l64543Q064J05721
$$ 16288749 15861251 15484330 15259530 15419345 15137224 14646026 13813129 13448586 13456650 13562371
6531A3562371o80237o27909L67159k19544o62939k74153n47529j12796o98638
$$ 13562371 12882134 12254225 12621384 12401840 11738901 11464748 10917219 10804423 10105785
6522A0105785J42830k99616j35468m64774q67690m99449J9867r4970n41552r3973
$$ 10105785 10248615 9948999 9813531 9348757 8481067 7981618 8001485 7906515 7364963 7270990
6512G270990m82415K62471p44866l26821P55733j67259m75065k02272m0405l20515
$$ 7270990 6788575 7051046 6306180 5979359 6735092 6567833 6092768 5890496 5850091 5529576
6502E529576L2146m2512k65314q94515j21681L05176J92611q0077L46423j037579
$$ 5529576 5561722 5519210 5253896 4359381 4237700 4542876 4735487 4655410 5001833 3964254
6492C964254k24695M38478J2877p7126l19708K2456L19213J30466K10612p51248
$$ 3964254 3739559 4178037 4190914 4113788 3794080 3816536 4135749 4266215 4476827 3725579
6482C725579l84996j0102N13421l87454j75527L0949K43072p2990k13249K23745
$$ 3725579 3340583 3330481 3843902 3456448 3280921 3311870 3554942 3481952 3268703 3492448
6472C492448o46716k56823M16049j91212P2590J66432j30729L93634k48809J20853
$$ 3492448 2845732 2588909 3004958 2813746 2886336 3052768 2922039 3315673 3066864 3187717
6462C187717L26008o23554o26073L92206o9897l49198N94652K05221r5857j62127
$$ 3187717 3513725 2890171 2264098 2656304 2586407 2237209 2831861 3037082 2941225 2779098
6452B779098m85114M21768o7693J80797R9757l35047k64911O6242l75236N05988
$$ 2779098 2293984 2715752 2648059 2828856 2928613 2593566 2328655 2394897 2019661 2525649
6442B525649L49305q3643m62607J46709q1034k13340o6148J73433K58785m56673
$$ 2525649 2874954 2791311 2328704 2475413 2394379 2181039 2114891 2288324 2547109 2090436
6432B090436P4196m1609k86373K11589L23477l19474K02330m32196M07704J30845
$$ 2090436 2164632 2123023 1836650 2048239 2371716 2052242 2254572 1822376 2230080 2360925
6422B360925p4805N50765o08542j84741k11202N76981J06994p01058M43201n62859
$$ 2360925 2286120 2836885 2228343 2043602 1832400 2409381 2516375 1815317 2258518 1695659
6412A695659j9111K25077m5235K29950J87894o00807L22583l47016m60401N2611
$$ 1695659 1676548 1901625 1856390 2086340 2274234 1673427 1996010 1648994 1188593 1241204
6402A241204p69466O18690j44079N34047j53556n83452O31508o41456K68763M299
$$ 1241204 471738 1090428 946349 1480396 1326840 743388 1374896 733440 1002203 1006502
6392A006502O49317R5957j073355J96661J57147M45141j85897n24504n5652L44794
$$ 1006502 1655819 1751776 678421 875082 1032229 1477370 1291473 766969 711317 1056111
6382A056111Q0482j90671n59376M38913j01833l82923M31754M58364L81107p23166
$$ 1056111 1136593 945922 386546 825459 723626 340703 772457 1230821 1611928 888762
6372H88762J88292N72033r97043l4225J31254L66101K95615m09234k90940k16716
$$ 888762 1077054 1649087 652044 617819 749073 1115174 1410789 1001555 710615 493899
6362D93899M20140l84302Q991J66850R25342M6183n19390m61216j06478j39377
$$ 493899 914039 529737 538728 705578 1630920 1677103 1157713 696497 590019 450642
6352D50642P42515k11604N83649J90605k36231k43316J57194K2422k48108n92636
$$ 450642 1193157 981553 1565202 1755807 1519576 1276260 1433454 1455876 1207768 615132
6342F15132j17753L45898N96942O4758j50154k23414K1568M45122q3014k26943
$$ 615132 497379 843277 1440219 1504977 1354823 1131409 1152977 1598099 1515085 1288142
6332A288142n45146k71076j93178Q41574k23195r1955P43474l59673o58743K73038
$$ 1288142 742996 471920 278742 1120316 897121 805166 1548640 1188967 530224 803262
6322H03262M97132M35401K52238o64560j38513J940n53981M73668L18588L50599
$$ 803262 1300394 1735795 1988033 1323473 1184960 1186900 632919 1106587 1425175 1775774
6312A775774j55969k25111L88586m57211K50386J93677l96367k08546L09937k53714
$$ 1775774 1619805 1394694 1783280 1326069 1576455 1770132 1373765 1165219 1475156 1221442
6302A221442l61700Q21008n04104m2405l07472K40354N25395k97092j99426M15420
$$ 1221442 859742 1680750 1176646 1134241 826769 1067123 1592518 1295426 1096000 1511420
6292A511420l55824R01204p9358n30726M37367n11410l3251M97560o09742J35
$$ 1511420 1155596 2056800 1977442 1446716 1884083 1372673 1339422 1836982 1227240 1227375
6282A227375r8858M01793N12309k45915R369k43937k85364J35698n6902q5126
$$ 1227375 1128517 1530310 2042619 1796704 1806073 1562136 1276772 1412470 1355568 1270442
6272A270442l49810N50311M09203M74189N5992l96599m95622J85537K97254m59863
$$ 1270442 920632 1470943 1880146 2354335 2410327 2013728 1518106 1703643 2000897 1541034
6262A541034P5712P69432l31481j26368J77906l32724m43235Q43793k19771J30107
$$ 1541034 1616746 2386178 2054697 1928329 2106235 1773511 1330276 2174069 1954298 2084405
6252B084405l37711j9450L19324n27251m42803l09131j44162k54588M40930o74279
$$ 2084405 1746694 1727244 2046568 1519317 1076514 767383 623221 368633 809563 135284
6242A35284K1135p4778K38669K46634n0154K54348j85469N944N42405n44194m46505
$$ 135284 156419 81641 320310 566944 516790 771138 585669 591613 1134018 589824 143319
6231A43319j39020L66569N57070j87330l90594k4677n2947j30606N72080k07987
$$ 143319 4299 370868 927938 740608 350014 325337 272390 141784 713864 505877
6221E05877l87558r9443o1293j67232M48673O27029j70143m18880o05850j18936
$$ 505877 118319 18876 -42417 -209649 239024 866053 695910 277030 -328820 -447756
6211d47756j88745O83106J63068m98523L51845K67247j85488l69767Q67420J7892
$$ -447756 -636501 46605 209673 -288850 62995 330242 144754 -225013 642407 660299
6201F60299M005l21895L47637k90158p26780M62313J71642j8919p8887p6671n55054
$$ 660299 664304 342409 690046 399888 -326892 135421 307063 288144 209257 132586 -422468
6190d22468j66032K85742J68547N20649K35509m69203L08800k00306L82061m99176
$$ -422468 -588500 -302758 -134211 386438 621947 152744 461544 261238 643299 144123
6180A44123j0552L1863k92387K01870P92707o26j95284N30158m38606n93406O1272
$$ 144123 133571 165434 -126953 74917 867624 866998 671714 1201872 763266 169860 231132
6169B31132K39115L16748j00958k74574m78563N18279m83820J31156J58035q1774
$$ 231132 470247 786995 686037 411463 -67100 451179 -32641 98515 256550 174776
6159A74776l38904L96239L6544o5543n34274K37910P13480r7559q206m31070p9178
$$ 174776 -164128 232111 268655 203112 -331162 -93252 620228 522669 514463 83393 4215
6148D215N7964K82980l29001L73011J13429K02626J92988o64369M32793K0981
$$ 4215 62179 345159 16158 389169 502598 705224 898212 233843 666636 687617
6138F87617j54o32707N73218K5087o0075K09693k50935K10713o36425k68539J53218
$$ 687617 687463 54756 627974 653061 592986 802679 551744 762457 126032 -142507 10711
6127A0711J22789n9764n60807N89344J83807m54909L68289Q7246m61644O95808
$$ 10711 133500 73736 -487071 102273 286080 -168829 199460 286706 -174938 520870
6117E20870j47549K55419N2117o7679K23516m15096l02326O71040p7950Q1k83276
$$ 520870 373321 628740 680857 613178 836694 421598 119272 790312 712362 712443 429167
6106D29167m95834J23510l22427O2632M10174l4945o9451L97774l10606m4788
$$ 429167 -66667 56843 -265584 -202952 207222 172277 102826 500600 189994 145206
6096A45206L50084l96468q37640Q35148K68783m15187j75877J70287Q99303q80950
$$ 145206 495290 98822 -738818 96330 365113 -50074 -225951 -55664 843639 -37311
6086c7311o6770j08078m13738J30073P71655k42197k8655L54302q0003n6354l12612
$$ -37311 -104081 -212159 -625897 -495824 275831 33634 4979 359281 279278 222924 -89688
6075h9688Q94743j094619J24269Q9793J63795K1504j54292n96282J044601J37886
$$ -89688 805055 -289564 -165295 -75502 88293 109797 -44495 -640777 403824 541710
6065E41710m8536j110606K35738P9806n3480l0398L97993j83554K73160j44561
$$ 541710 493174 -617432 -381694 -301888 -355368 -385766 12227 -171327 101833 -42728
6055d2728M26015j79851j64754M00249q30812j26159Q50246o50462L5503K08584
$$ -42728 383287 203436 38682 438931 -391881 -518040 332206 -318256 -282753 -74169
6045g4169o1436L83006J7964m7069J12755K58305n42521p32409M92775J04349
$$ -74169 -135605 247401 265365 218296 331051 589356 46835 -685574 -192799 -88450
6035h8450m0716R1720k47431N2497k34740m339Q25294m03834Q7628k89181k14054
$$ -88450 -129166 -37446 -284877 -232380 -467120 -471459 353835 -49999 37629 -251552 -465606
6024d65606K37016k61254L35910J69961j90150K34926K41701j66157O2667J8964
$$ -465606 -228590 -489844 -153934 16027 -174123 60803 302504 136347 199014 217978
6014B17978L4405K9060J02526k03775l03575j96837j82965N4714P81759j5967
$$ 217978 252383 281443 383969 180194 -123381 -320218 -503183 -448469 333290 317323
6004C17323j77442k72294P02633l02444k28247r6515K520m67719P73194M5433
$$ 317323 139881 -132413 570220 267776 39529 -56986 -54466 -522185 251009 296442
5994B96442o68825N55219L24174r6853l96707p3147l5692p9199K76879m52844
$$ 296442 -372383 182836 507010 410157 13450 -59697 -95389 -174588 102291 -350553
5984c50553J80621j80118n53183K35422R01041k15491P28597l12941j000734M4761
$$ -350553 -169932 -350050 -903233 -667811 233230 17739 746336 433395 -567339 -522578
5974e22578Q05025N61785r9869m50886J22270j56205O15996o26572n14555R74011
$$ -522578 282447 844232 744363 293477 415747 259542 875538 248966 -265589 708422
5964G08422n91848J90026K96649j63007j7547J26791n40184o1J054087m37587
$$ 708422 116574 306600 603249 440242 422695 549486 9302 9241 1063328 625741
5954F25741l02571R5285l56128K25828K0947n41786k834K26283M94014K27296
$$ 625741 323170 418455 62327 288155 309102 -232684 -235518 -9235 484779 712075
5944G12075m34651j57215M1071m80738j47521M17827l55693j5829O52373o5231
$$ 712075 277424 120209 161280 -319458 -466979 -49152 -404845 -420674 231699 166468
5934A66468k95761j11086k65949l84804P64327M84160k80261L85833l13483j90495
$$ 166468 -129293 -240379 -506328 -891132 -126805 357355 77094 462927 149444 -41051
5924d1051K40102L14021k60966k46581K44625l28316K12617Q31281m80610k82838
$$ -41051 199051 513072 252106 5525 250150 -78166 134451 965732 485122 202284
5914B02284l13551L48415M21895l32476K23478L58944j63435m30802K91842o9149
$$ 202284 -111267 237148 659043 326567 550045 908989 745554 314752 606594 537445
5904E37445l89370L30101R9892j59940M43828m85463j7731K75692L0983O0981
$$ 537445 148075 478176 578068 418128 861956 376493 358762 634454 665437 726418
5894G26418K6927K44983k48190l4998K01839L55437l74801m9143k08667J4932
$$ 726418 753345 998328 750138 715140 916979 1272416 897615 848472 639805 654737
5884F54737N57171m99692J64398J8731N8222J34496r4050L26545J0922n28836
$$ 654737 1211908 712216 876614 895345 953567 1088063 994013 1320558 1331480 802644
5874H02644J60162k7229N05735K24089o43653K2321N51483j69194k44178J76241
$$ 802644 962806 935577 1441312 1665401 1021748 1044069 1595552 1426358 1182180 1358421
5864A358421j30526l83543K35401K69578O6861l34481l23M11813r5495P7853j07437
$$ 1358421 1227895 844352 1079753 1349331 1416192 1081711 1081388 1493201 1397706 1475559 1368122
5853A368122l01985N46153K90690m70691j94259L30056L88784l30485k22927J88846
$$ 1368122 1066137 1612290 1902980 1432289 1238030 1568086 1956870 1626385 1403458 1592304
5843A592304k63457m93546L28719o6330N78276o89900M58874N42177L0686L61106
$$ 1592304 1328847 835301 1164020 1097690 1675966 986066 1444940 1987117 2017803 2378909
5833B378909l30529n97950n4874j14977J12072j42144J61516J78079L08493l00758
$$ 2378909 2048380 1450430 1395556 1280579 1392651 1250507 1412023 1590102 1898595 1597837
5823A597837j05113m60007n31601J223307L89387k46383o00976L26860M02138
$$ 1597837 1492724 1032717 501116 1724423 2113810 1867427 1266451 1593311 1995449
5814A995449l87942p24864Q51258l25268m23307m7932j67271L52335M99429k53529
$$ 1995449 1607507 882643 1733901 1408633 985326 937394 770123 1122458 1621887 1368358
5804A368358m52755J84370j77614M67788J40256R3976o24561K60804K259l74073
$$ 1368358 915603 1099973 922359 1390147 1530403 1624379 999818 1260622 1262881 888808
5794H88808k23583O33646k32356R6585P97095l20835r51930K31021N29024J69775
$$ 888808 665225 1298871 1066515 1163100 1960195 1639360 687430 918451 1447475 1617250
5784A617250K60590P9966q54804q7862M80418q15632l38522L10178Q79753L32087
$$ 1617250 1877840 1957806 1103002 1015140 1495558 679926 341404 651582 1531335 1863422
5774A863422l16374j89619J12740m51201j16763l8307M8598M77524M2589m68682
$$ 1863422 1547048 1357429 1470169 1018968 902205 863898 912496 1390020 1432609 963927
5764I63927L04122l34975N09377J81553m7168J81137J28227M27620L73831m97420
$$ 963927 1268049 933074 1442451 1624004 1576836 1757973 1886200 2313820 2687651 2190231
5754B190231n89308j64104Q51990J588l48448N97963l84222M97417k08602j34534
$$ 2190231 1600923 1436819 2288809 2290397 1941949 2539912 2155690 2653107 2444505 2309971
5744B309971m54818P48305m072j91830k85264n36523J57039m73821K15785J11154
$$ 2309971 1855153 2603458 2599386 2407556 2122292 1585769 1742808 1268987 1484772 1595926
5734A595926m67421k9202L8522P18746l57586j14251L07693o74743L26146k36256
$$ 1595926 1128505 1099303 1137825 1856571 1498985 1384734 1692427 1017684 1343830 1107574
5724A107574R43787n00412j74773M2892n64634Q46177K27959q82731K48453J31234
$$ 1107574 2051361 1550949 1376176 1419068 854434 1700611 1928570 1045839 1294292 1425526
5714A425526m0379q1585n39045J265955k89648K67691k37683j776K85508M00879
$$ 1425526 1385147 1303562 764517 2030472 1740824 2008515 1770832 1769056 2054564 2455443
5704B455443q55004J058205J33376n21872o72241O7662P86879q6662l21662o29341
$$ 2455443 1600439 2658644 2792020 2270148 1597907 1665569 2452448 2365786 2044124 1414783
5694A414783N06196j27639N64264L70076P7331j37472j57639l83339L8196L1146
$$ 1414783 1920979 1793340 2357604 2727680 2805011 2667539 2509900 2126561 2164757 2195903
5684B195903L35733Q1666k7704m02701P96194o87362j23249M1217n9532l89894
$$ 2195903 2531636 2613302 2585598 2182897 2979091 2291729 2168480 2209697 2150165 1760271
5674A760271L74913J90795k66715q1459j24933L23553M306k66992Q3182l31260
$$ 1760271 2135184 2325979 2059264 1977805 1852872 2176425 2180731 1913739 1996921 1665661
5664A665661L51064l67183r5627J77614L33455j63156P6677K83727o82116O95801
$$ 1665661 2016725 1649542 1553915 1731529 2064984 1901828 1978505 2262232 1580116 2275917
5654B275917K84650K55721q8883k84323l72525J46952K53262R1597J70763m62748
$$ 2275917 2560567 2816288 2727405 2443082 2070557 2217509 2470771 2562368 2733131 2270383
5644B270383L14894L54252K64389j14853J46911r7880P570o98031M7312M25085
$$ 2270383 2585277 2939529 3203918 3089065 3235976 3138096 3145666 2447635 2494947 2920032
5634B920032j72096M44555Q7246n60091K33327J65770K51972n1205p2557j69894
$$ 2920032 2747936 3192491 3279737 2719646 2952973 3118743 3370715 3319510 3246953 3077059
5624C077059j55728L13649p61112Q4049N38515j71649J84928M04245p9105L42666
$$ 3077059 2921331 3234980 2473868 2557917 3096432 2924783 3109711 3513956 3434851 3777517
5614C777517k22838J46055L63462N96426R9670O46365k2874k27815k07984m29871
$$ 3777517 3554679 3700734 4064196 4660622 4760292 5406657 5383783 5155968 4947984 4518113
5604D518113K91831N32722L67574j99019k43060k31723O44604n06598n34806j46277
$$ 4518113 4809944 5342666 5710240 5511221 5268161 5036438 5681042 5174444 4639638 4493361
5594D493361J47418m9933K54909m51378J4309r4987M43960P1678q32940M11913
$$ 4493361 4640779 4590846 4845755 4394377 4408686 4313699 4757659 4829337 3996397 4408310
5584D408310L79492K30187l70830m61756K532K22248m41518K94705J74119j12538
$$ 4408310 4787802 5017989 4647159 4185403 4187935 4410183 3968665 4263370 4437489 4324951
5574D324951q32160K20791p5434o65094L36321j18378l85379l11051n4730l84470
$$ 4324951 3492791 3713582 3638148 2973054 3309375 3190997 2805618 2494567 2439837 2055367
5564B055367L57632K13203l99206L91097m89428M9098k80844M96511l37577k38357
$$ 2055367 2412999 2626202 2226996 2618093 2128665 2177763 1896919 2393430 2055853 1817496
5554A817496K43587l15783q2589K96220m40640J6518M2171O00204o03888j52962
$$ 1817496 2061083 1745300 1662711 1958931 1518291 1534809 1576980 2177184 1573296 1420334
5544A420334O0257m32281j32007l42874O05242O59467n33185J0408j66651M91496
$$ 1420334 1480591 1048310 916303 573429 1178671 1838138 1304953 1315361 1148710 1640206
5534A640206j52835n54247J39727R4447J57186J73743j65009N2157J94132o10924
$$ 1640206 1487371 933124 1072851 1167298 1324484 1498227 1333218 1385375 1579507 968583
5524I68583M62518J74594l8614L67851l62330m56402p8174r3412J31065Q6735
$$ 968583 1431101 1605695 1567081 1934932 1572602 1116200 1038026 944614 1075679 1162414
5514A162414L37204j88179j9989o89812P72802k22654m6171M75226m09870L12597
$$ 1162414 1499618 1311439 1291450 601638 1374440 1151786 1105615 1580841 1170971 1483568
5504A483568J02612j56583m74827L1848M66992l78644K55156N02949k95997J14256
$$ 1483568 1586180 1429597 954770 986618 1453610 1074966 1330122 1833071 1537074 1651330
5494A651330q0201k05394P810L87799l91124J76643L37054o98357m63372k74419
$$ 1651330 1571129 1365735 1373545 1761344 1370220 1546863 1883917 1185560 722188 447769
5484D47769o60813O26513J196534n36484n49265q673k12886P22327J71740m01107
$$ 447769 -213044 413469 1610003 1073519 524254 515581 302695 1025022 1196762 795655
5474G95655j41172L58334j85328l59395Q6460N60324k2657K78535j98278o49700
$$ 795655 654483 1012817 827489 468094 554554 1114878 1092221 1370756 1172478 522778
5464E22778O20203o089p58686K50961l29613K40509P2526L05827k74937J94029
$$ 522778 1142981 1136892 378206 629167 299554 540063 612589 918416 643479 837508
5454H37508K34055m10675m3758O49453k92143l56818P98792p57151M77991R7780
$$ 837508 1071563 660888 617130 1266583 974440 617622 1416414 659263 1137254 1235034
5444A235034m32819K6857o2272k44523j22827J89700N35138m18724L50842J56507
$$ 1235034 802215 829072 766800 522277 399450 589150 1124288 705564 1056406 1212913
5434A212913M452k60476K10279j73029O69173j16089k85832L5836K37856q21694
$$ 1212913 1217365 956889 1167168 994139 1663312 1547223 1261391 1297227 1535083 713389
5424G13389K30492R2744N63364J39054J49173m25606R06061j17723k06626P17176
$$ 713389 943881 1036625 1599989 1739043 1888216 1462610 2368671 2250948 2044322 2761498
5414B761498p76788l14497P84781l12269Q77136p13108O41736M17000m98152P25019
$$ 2761498 1984710 1670213 2454994 2142725 3019861 2306753 2948489 3365489 2867337 3592356
5404C592356J59494J23491l4442R90029K85989m7042Q1701K29838j9631L04622
$$ 3592356 3751850 3875341 3840899 4830928 5116917 5069875 5151576 5381414 5361783 5666405
5394E666405K02582N46188l17678n81071M67471l27981q75978j26463k79857o45985
$$ 5666405 5868987 6415175 6097497 5516426 5983897 5655916 4779938 4653475 4373618 3727633
5384C727633j85535J40309l49564P66291l08706j298163M84634J053747m13535
$$ 3727633 3542098 3682407 3332843 4099134 3790428 2492265 2976899 4030646 3617111
5375C617111n80425k70206K00196L62194R5848k77872l18715k1596L97853J38120
$$ 3617111 3036686 2766480 2966676 3328870 3424718 3146846 2828131 2806535 3204388 3342508
5365C342508O39412n77430j81590J69613N39438m1122R0085L56418N61557q4553
$$ 3342508 3981920 3404490 3222900 3392513 3931951 3890829 3980914 4337332 4898889 4814336
5355D814336J19943J63716p7313L88189L34873J90263O31386j5406j43255L74183
$$ 4814336 4934279 5097995 5020682 5408871 5743744 5934007 6565393 6549987 6406732 6780915
5345F780915k58199q70822K79240P8590M68309n04616k04853j90045p69156n27974
$$ 6780915 6522716 5651894 5931134 6009724 6478033 5973417 5768564 5578519 4809363 4281389
5335D281389k59412L78509k8212K6756l90600k41673l62646K81097k03231m36235
$$ 4281389 4021977 4400486 4372274 4399030 4008430 3766757 3404111 3685208 3481977 3045742
5325C045742m81570k56233M41734j26568m25791n32808O32632j35297j56859M64207
$$ 3045742 2564172 2307939 2749673 2623105 2197314 1664506 2297138 2161841 2004982 2469189
5315B469189n5388L4351M23255p19661j58720j35175M65476l00573L2814l48053
$$ 2469189 2413801 2448152 2871407 2151746 1993026 1857851 2323327 2022754 2055568 1707515
5305A707515k54768J77409M12925K34748l61603m20429k7764K55059p7650K79352
$$ 1707515 1452747 1630156 2043081 2277829 1916226 1495797 1468033 1723092 1645442 1924794
5295A924794K21286Q4879p66387L43045K06529L02648L10725k09060J82622N20278
$$ 1924794 2146080 2230959 1464572 1807617 2014146 2316794 2627519 2418459 2601081 3121359
5285C121359m20771k38673q6591m71837L63238j35311J611L74949j2112k23445
$$ 3121359 2700588 2461915 2375324 1903487 2266725 2131414 2133025 2507974 2495862 2272417
5275B272417m33643M59330L53025n82637J82153K48976k62961J48175m86772L38331
$$ 2272417 1838774 2298104 2651129 2068492 2250645 2499621 2236660 2384835 1898063 2236394
5265B236394j45185k68720N09173j21793j8403L22585P1109K86782q37004L60285
$$ 2236394 2091209 1822489 2331662 2209869 2191466 2514051 2585160 2871942 2034938 2395223
5255B395223K77501q2548j38921j38397j92815L29241o04573m34916L62187J16514
$$ 2395223 2672724 2590176 2451255 2312858 2120043 2449284 1844711 1409795 1771982 1888496
5245A888496O88167N03697j69277l18278J92831j54548k47270m30794N085L09279
$$ 1888496 2576663 3080360 2911083 2592805 2785636 2631088 2383818 1953024 1958109 2267388
5235B267388P59442M10297k97694J48755j51779J94698R44780o97646l95194P97480
$$ 2267388 3026830 3437127 3139433 3288188 3136409 3331107 4275887 3578241 3183047 3980527
5225C980527m19184l68564O3672N3496p40672N90720m60447L70510j91585m97889
$$ 3980527 3561343 3192779 3256451 3309947 2569275 3159995 2699548 3070058 2878473 2380584
5215B380584J15794K40721P59292m50682N4146K76545J62761l13058J06308K22378
$$ 2380584 2496378 2737099 3496391 3045709 3099855 3376400 3539161 3226103 3332411 3554789
5205C554789l43560n25662K59006M21018J01779J40572L09098n59247n36835J44316
$$ 3554789 3211229 2685567 2944573 3365591 3467370 3607942 3917040 3357793 2820958 2965274
5195B965274L83741K53969m06597K63226L56301m27211Q2478N25259o61690L86335
$$ 2965274 3349015 3602984 3196387 3459613 3815914 3388703 3471181 3996440 3334750 3721085
5185C721085r2700k16925K2946L43126J156208k09047l20694m27760M13199L90253
$$ 3721085 3628385 3411460 3434406 3777532 4933740 4724693 4403999 3976239 4389438 4779691
5175D779691K86298L03002L30736l22079j73482k32990M86605L41496l45851N71805
$$ 4779691 5065989 5368991 5699727 5377648 5204166 4971176 5457781 5799277 5453426 6025231
5165F025231K92175J83027l8487l22700o75307L44470N16468L02206q1685l5064
$$ 6025231 6317406 6500433 6461946 6139246 5463939 5808409 6324877 6627083 6545398 6510334
5155F510334P23198l85290L38048L29339l76881j25540n16418k82062N66651O98362
$$ 6510334 7233532 6848242 7186290 7515629 7138748 7013208 6496790 6214728 6781379 7479741
5145G479741L9258k56711N02704l89878L42009K07781m26355M40320M87699L30313
$$ 7479741 7518999 7262288 7764992 7375114 7717123 7924904 7498549 7938869 8426568 8756881
5135H756881j90465M10600R26648m67493j215L58126j48888k4605R35190j96914
$$ 8756881 8566416 8977016 9903664 9436171 9434956 9793082 9644194 9619589 10554779 10357865
5125A0357865L76327N45126n6598P69438O08706K16820l27437j72275N54300J75868
$$ 10357865 10734192 11279318 11222720 11992158 12600864 12817684 12490247 12317972 12872272 13048140
5115A3048140N44467q2709o951P96130m46640K77593k77310J93599M76221n22276
$$ 13048140 13592607 13509898 13502947 14299077 13852437 14130030 13852720 14046319 14522540 14000264
5105A4000264L92934p9257m74243N63266k36678j31382j07685k2989O49862N67456
$$ 14000264 14393198 14313941 13839698 14402964 14166286 14034904 13927219 13904230 14554092 15121548
5095A5121548n61005k6946k1420K38016Q7736M67128l4197L31058l93822p61537
$$ 15121548 14560543 14533597 14512177 14750193 14837929 15305057 15270860 15601918 15208096 14446559
5085A4446559j2939P19498k26151o72491L6867K62092M32767l09252l45992K34436
$$ 14446559 14433620 15153118 14926967 14254476 14291343 14553435 14986202 14676950 14330958 14565394
5075A4565394o2851j676J96281J4589L62222K21575J43543k81448P3483K67169
$$ 14565394 14502543 14500867 14697148 14711737 15073959 15295534 15439077 15157629 15231112 15498281
5065A5498281K47347l0753J59042J4822j67376k13461n4500l04311L4703k14328
$$ 15498281 15745628 15714875 15873917 15888739 15721363 15507902 15453402 15149091 15183794 14969466
5055A4969466L89512P60076j87120K37502j2898K59908n65541j96045K81788J79866
$$ 14969466 15358978 16119054 15931934 16169436 16156538 16416446 15850905 15654860 15936648 16116514
5045A6116514N68937P2448K59090o90882l90831n72080L41625k10059L97015j08179
$$ 16116514 16685451 16757899 17016989 16326107 15935276 15363196 15704821 15494762 15891777 15783598
5035A5783598p33972o77312j53332l33933L92352Q56786l83075m87221l13415
$$ 15783598 15049626 14372314 14218982 13885049 14277401 15134187 14751112 14263891 13950476
5026A3950476O4740L59552l7778q2682M54910N4847j09419j14343K16121M42104
$$ 13950476 14015216 14374768 14336990 14254308 14709218 14764065 14654646 14540303 14756424 15198528
5016A5198528M37940M95698K11012K28736o4253p7030j37450l83636k22202o5154
$$ 15198528 15636468 16132166 16343178 16571914 16507661 16430631 16293181 15909545 15687343 15622189
5006A5622189j65380m99387K02793p21188J46874j74832p85121K89113K96157
$$ 15622189 15456809 14957422 15160215 14439027 14585901 14411069 13625948 13915061 14211218
4997A4211218j57433l16203m30967J47909K53784k41693n9439R3613K12642k5506
$$ 14211218 14053785 13737582 13306615 13454524 13708308 13466615 13407176 13500789 13713431 13687925
4987A3687925j9741Q188O1689Q0787j05305M21490N59012l64233M67940M70713
$$ 13687925 13668184 13676372 13738061 13818848 13713543 14135033 14694045 14329812 14797752 15268465
4977A5268465Q57636k75472P02511O62530R2186J01110L07221O97070K70573J530643
$$ 15268465 16126101 15850629 16553140 17215670 17307856 17408966 17716187 18413257 18683830 20214473
4967B0214473L34629m5744L05686J10361l10786N570M43211j2503o19042o59793
$$ 20214473 20549102 20503358 20809044 20919405 20608619 20614189 21057400 21044897 20425855 19766062
4957A9766062o55517m41199O4171l97385k70886m58231P9913O2451l73381p7288
$$ 19766062 19110545 18669346 18733517 18336132 18065246 17607015 17686928 17749379 17375998 17298710
4947A7298710n42092J7231J25134M13152j75696j8262L53320L76170P731K55445
$$ 17298710 16756618 16773849 16898983 17312135 17136439 17118177 17471497 17847667 17855398 18110843
4937A8110843Q5353J00738O37840o13944n73446K42990r3156J59870L39831J75564
$$ 18110843 18196196 18296934 18934774 18320830 17747384 17990374 17897218 18057088 18396919 18572483
4927A8572483M34474M73163L8464L75578j3473M35153J73950J048294O13364k50267
$$ 18572483 19006957 19480120 19518584 19894162 19880689 20315842 20489792 21538086 22151450 21901183
4917B1901183k71256m9657L79322Q4562j52889J24088j49936N11115L22565m26781
$$ 21901183 21629927 21580270 21959592 22044154 21891265 22015353 21865417 22376532 22699097 22272316
4907B2272316M7287O35396j11418q98579J24702M58154l12904Q792n785K9955
$$ 22272316 22319603 22954999 22843581 21945002 22069704 22527858 22214954 22223746 22217961 22247916
4897B2247916L40512k66682j50720J61637M61555K55609l76452M1677L57160J89343
$$ 22247916 22588428 22321746 22171026 22332663 22794218 23049827 22673375 22715052 23072212 23261555
4887B3261555r62145L78074l16206M28496O2624Q6146J37045m17361M74141O4540
$$ 23261555 22299410 22677484 22361278 22789774 22852398 22938544 23075589 22658228 23132369 23196909
4877B3196909O07217k34448M40054N67585J247483k29110O00924N07582J029669
$$ 23196909 23804126 23569678 24009732 24577317 25824800 25595690 26196614 26704196 27733865
4868B7733865L07K76250K46566J422980Q79280R74493J093706J124207J085926
$$ 27733865 27734172 28010422 28256988 29679968 30559248 31533741 32627447 33751654 34837580
4859C4837580R54170J813035J058903K031226R95836K132865J105119J092342
$$ 34837580 35791750 37604785 38663688 40694914 41690750 43823615 44928734 46021076
4851D6021076J840409J848054J966945K467153L104021K678720L255347L795561
$$ 46021076 47861485 49709539 51676484 54143637 57247658 59926378 63181725 66977286
4843F6977286M461850M972497N123577M157303L026993K637969K261590K500495
$$ 66977286 71439136 76411633 81535210 85692513 88719506 91357475 93619065 96119560
4835I6119560K282950K753741L763411L817145M879401L414163K756482L381144
$$ 96119560 98402510 101156251 104919662 108736807 113616208 117030371 119786853 123167997
4827A23167997J868916K308351N73002o04276p1154N85497l59358L6096J566350
$$ 123167997 125036913 127345264 127918266 127313990 127242836 127828333 127468975 127505071 129071421
4818A29071421L38813M47162J776824L458603L213514L460452L724892K100210
$$ 129071421 129410234 129857396 131634220 135092823 138306337 141766789 145491681 147591891
4810A47591891n13559k964108m908674n823744o688106o662301o767462n827311
$$ 147591891 147078332 144114224 139205550 133381806 126693700 120031399 113263937 107436626
4802A07436626l944057m025307l382956k519725j910199q91558j144887j64014
$$ 107436626 103492569 99467262 96084306 93564581 91654382 90762824 89617937 89453923
4794H9453923j53684j641382j895972k635549l528164m479404m000664l685421
$$ 89453923 89300239 87658857 85762885 83127336 79599172 75119768 71119104 67433683
4786F7433683l823870k779834l006429k849734k226354j832876j957250j598686
$$ 67433683 63609813 60829979 57823550 54973816 52747462 50914586 48957336 47358650
4778D7358650j726157j590583j273459n70724j200148j188757n21405o58007l72557
$$ 47358650 45632493 44041910 42768451 42197727 40997579 39808822 39287417 38629410 38256853
4769C8256853j98435n86635j239057l43187p68782l20389p88069m66630l10797
$$ 38256853 38058418 37471783 36232726 35889539 35120757 34800368 34012299 33545669 33234872
4760C3234872k12585r99082l69933j55927q9896o91836q21538j59576K16841p21764
$$ 33234872 33022287 32023205 31653272 31497345 31407449 30715613 29894075 29734499 29951340 29229576
4750B9229576j157967J80122M05593m1416m41644K4119k85074J90825l49197J11691
$$ 29229576 28071609 28251731 28657324 28615908 28174264 28198383 27913309 28104134 27754937 27866628
4740B7866628M46009J06913K62250l76912J7046O36659J93696Q27033J97521P412
$$ 27866628 28312637 28419550 28681800 28304888 28321934 28958593 29152289 29979322 30176843 30184255
4730C0184255J97772O7610r3929m0248j50865L28345p83633j08930j2548L2170
$$ 30184255 30382027 30449637 30355708 30315460 30164595 30492940 29709307 29600377 29587829 29619999
4720B9619999k08786O92514M11979L23944O54762Q44766J041137l91084o1097
$$ 29619999 29411213 30103727 30515706 30839650 31494412 32339178 33380315 32989231 32928134
4711C2928134L83149M20400n2730n05409K61723k58823o2640j110062p45366n93629
$$ 32928134 33311283 33731683 33678953 33173544 33435267 33176444 33113804 32003742 31258376 30664747
4701C0664747m7223m18583k20070p7247r89045N49881k31878j44798O138Q20114
$$ 30664747 30617524 30198941 29978871 29901624 28912579 29462460 29230582 29085784 29091922 29912036
4691B9912036o15063P19711l15593o37866p68884j57078p78220m61123l74473
$$ 29912036 29296973 30016684 29701091 29063225 28294341 28137263 27359043 26897920 26523447
4682B6523447k93918n84832l15170j08992p37741m30862n14814m03009K87960
$$ 26523447 26229529 25644697 25329527 25220535 24482794 24051932 23537118 23134109 23422069
4673B3422069j30613n01484k10491P6917J67904k22526L53801j51813Q8088J05655
$$ 23422069 23291456 22789972 22579481 22656398 22824302 22601776 22955577 22803764 22891852 22997507
4663B2997507l22395L90639L89868p36877Q5412K71651m19464J110061J10340
$$ 22997507 22675112 23065751 23455619 22718742 22804154 23075805 22656341 23766402 23876742
4654B3876742J48993k33396J7050M26102n3076M26224l13520N17290K6374j06072
$$ 23876742 24025735 23792339 23809389 24235491 24182415 24608639 24295119 24812409 24838783 24732711
4644B4732711J151027K57877l76520m4680L58671K23536k2623J9001M48976L77724
$$ 24732711 25883738 26141615 25765095 25720415 26079086 26302622 26279999 26299000 26747976 27125700
4634B7125700K48368N17380k10119L92706L14546O06850N20064n68764J1949L72222
$$ 27125700 27374068 27891448 27681329 28074035 28388581 28995431 29515495 28946731 28958680 29330902
4624B9330902Q56919N66953Q0210P85006L23633O2546Q51880O24170J039028O24825
$$ 29330902 30187821 30754774 30834984 31619990 31943623 32006169 32858049 33482219 34521247 35146072
4614C5146072j81518P3230N23780N04079J79447J01222K81252J603933J278698
$$ 35146072 34964554 35037784 35561564 36065643 36245090 36346312 36627564 38231497 39510195
4605C9510195l76472O85941M41871M31600Q39570P78570R408j39904J095662P38648
$$ 39510195 39133723 39819664 40261535 40693135 41532705 42311275 42320683 42180779 43276441 44015089
4595D4015089P58067K69500J56963K36286P97011M87124L52346O21067O94449
$$ 44015089 44773156 45042656 45199619 45435905 46232916 46720040 47072386 47693453 48387902
4586D8387902L92281O08527P76695Q04702j70089P51261N29744J007183K86957
$$ 48387902 48780183 49388710 50165405 50970107 50800018 51551279 52081023 53088206 53375163
4577E3375163J32360M40355L32444K26855J519647O39636K66189l20913K11475
$$ 53375163 53507523 53947878 54280322 54507177 56026824 56666460 56932649 56611736 56823211
4568E6823211P2295P63307R50475M74220N49156m10880J059683L69169L37586
$$ 56823211 56895506 57658813 58609288 59083508 59632664 59221784 60281467 60650636 60988222
4559F0988222L96311M69119O79772N18308O87015K67404J035195j5113R85266
$$ 60988222 61384533 61853652 62533424 63051732 63738747 64006151 65041346 65026233 66011499
4550F6011499O71070K86664L05407Q15732M48057L29752R03754L90230R91937
$$ 66011499 66682569 66969233 67274640 68090372 68538429 68868181 69771935 70162165 71154102
4541G1154102O46511M36682K92377J235791L92981j45343L85236M51552K46827
$$ 71154102 71800613 72237295 72529672 73765463 74158444 74013101 74398337 74849889 75096716
4532G5096716J226433J84534M01628K96786J38108O38174J441470M29858M79039
$$ 75096716 76323149 76507683 76909311 77206097 77344205 77982379 79423849 79853707 80332746
4523H0332746J729231J031276J268548J502955J642724J363443J498474L468371
$$ 80332746 82061977 83093253 84361801 85864756 87507480 88870923 90369397 93837768
4515I3837768L284939K995329L049839K352794J488491J29901L89789l71824r58818
$$ 93837768 97122707 100118036 103167875 105520669 107009160 107139061 107528850 107157026 106198208
4506A06198208l22919m47320L94706j43024Q34102Q93089J722428L191824K958367
$$ 106198208 105875289 105427969 105822675 105679651 106513753 107406842 109129270 112321094 115279461
4497A15279461M000609M905144L450531K736923J100219k76849j598306k556196
$$ 115279461 119280070 124185214 127635745 130372668 131472887 131196038 129597732 127041536
4489A27041536m238330l619496l678094l314142k323875j802752k025922j631552
$$ 127041536 122803206 119183710 115505616 112191474 109867599 108064847 106038925 104407373
4481A04407373j362817n80172M06290N42374j66570O6586k16515j906372k806898
$$ 104407373 103044556 102464384 102870674 103413048 103246478 103313064 103096549 101190177 98383279
4472I8383279k370580k820469k897359l165998k461711j590293j811779j724903
$$ 98383279 96012699 93192230 90294871 87128873 84667162 83076869 81265090 79540187
4464G9540187l037197j015502j486422j276900k230370j810765j303854p81089
$$ 79540187 76502990 75487488 74001066 72724166 70493796 68683031 67379177 66598088
4456F6598088j828164p8028j032225o76767q73599q17163j002066o34026j05068
$$ 66598088 64769924 64691896 63659671 62982904 62109305 61292142 60290076 59656050 59550982
4447E9550982J13163p74217o41659q9012r38755M74342k72342M82113m1812m52893
$$ 59550982 59664145 58889928 58248269 58159257 57220502 57694844 57422502 57904615 57862803 57409910
4437E7409910k20489R7466k11247Q72061L79739L86042L90776R40930J717432
$$ 57409910 57189421 57286887 57075640 57947701 58327440 58713482 59104258 60045188 61762620
4428F1762620N17006M41998J630604J657996Q96248N44882J461348P95289P74482
$$ 61762620 62279626 62721624 64352228 66010224 66906472 67451354 68912702 69707991 70482473
4419G0482473K16890P64751J243864J433448R24659J372323J949208J552652K301432
$$ 70482473 70699363 71464114 72707978 74141426 75066085 76438408 78387616 79940268 82241700
4410H2241700K983345L293151L881252L840071M043825N421860N887192O584941
$$ 82241700 85225045 88518196 92399448 96239519 100283344 105705204 111592396 118177337
4402A18177337M808411L607926K953092L015810L523885L299557M066666N500268
$$ 118177337 122985748 126593674 129546766 132562576 136086461 139386018 143452684 148952952
4394A48952952N885108O417680O717897N816133O031917O257197M485176K408651
$$ 148952952 154838060 161255740 167973637 173789770 179821687 186078884 190564060 192972711
4386A92972711J4321j091594j936878l147298l394699m801346m945194m342050
$$ 192972711 192987032 191895438 189958560 186811262 183416563 178615217 173670023 169327973
4378A69327973m081428m002306l938910k940977k211304k150752k354980m309565
$$ 169327973 165246545 161244239 157305329 154364352 152153048 150002296 147647316 143337751
4370A43337751m893419m194625n163155n427301n209021m786201l938110m214087
$$ 143337751 138444332 134249707 129086552 123659251 118450230 113664029 109725919 105511832
4362A05511832l329994k637359l310126k883515k744762k921524k574690j787704
$$ 105511832 102181838 99544479 96234353 93350838 90606076 87684552 85109862 83322158
4354H3322158k243567k296017j569253j669840j845927k229609j804403j560244
$$ 83322158 81078591 78782574 77213321 75543481 73697554 71467945 69663542 68103298
4346F8103298k463953k426787k316625k214057k169695j178846j428429j766211
$$ 68103298 65639345 63212558 60895933 58681876 56512181 55333335 53904906 52138695
4338E2138695j198327j541185j209729j408269q69680j91903j778286p06751l18749
$$ 52138695 50940368 49399183 48189454 46781185 45911505 45719602 43941316 43234565 42915816
4329D2915816n53817j138325j173103k01142j254536j148393j007634n10859n36694
$$ 42915816 42361999 41223674 40050571 39849429 38594893 37446500 36438866 35928007 35391313
4320C5391313j338204p92536j49812n25927l87650r77480p05572j68146q14234
$$ 35391313 34053109 33260573 33110761 32584834 32197184 31219704 30514132 30345986 29531752
4311B9531752l76401j471406q07564k05607l12000l50166M44985p54385p61006
$$ 29531752 29155351 27683945 26876381 26670774 26358774 26008608 26453593 25699208 24938202
4302B4938202J56510n53634l68093l99775p37357n00593m70231K70880l20861
$$ 24938202 25094712 24541078 24172985 23773210 23035853 22535260 22065029 22335909 22015048
4293B2015048q19252m1227j51052l57961p78453N29625K90189m04393n20201j60964
$$ 22015048 21195796 21154569 21003517 20645556 19867103 20396728 20686917 20282524 19762323 19601359
4283A9601359P0090j2935p478K81528r86727k69391M73986o60044M42335l40665
$$ 19601359 19671449 19658514 19651036 19932564 18945837 18676446 19150432 18490388 18932723 18592058
4273A8592058j97179M5388J7071k75893j37423j71141J05149k29859n670l00894
$$ 18592058 18394879 18440267 18457338 18181445 18044022 17872881 17978030 17748171 17742501 17441607
4263A7441607q1772K45598l27627J93310K69584L20350k37314o57511j9563O22934
$$ 17441607 17359835 17605433 17277806 17471116 17740700 18061050 17823736 17166225 17146662 17769596
4253A7769596J08410k67478k20638L62922M2401j09459m64935K31163K30356M53262
$$ 17769596 17878006 17610528 17389890 17752812 17795213 17685754 17220819 17451982 17682338 18135600
4243A8135600N13709J227057L74573Q41036M81324M5642k97321j08977p13259
$$ 18135600 18649309 19876366 20250939 21091975 21573299 21618941 21321620 21212643 20499384
4234B0499384q22623m17632m14616q74598K617J39430l44221n73489k39691k87765
$$ 20499384 19676761 19259129 18844513 17969915 17972532 18111962 17767741 17194252 16954561 16666796
4224A6666796M13843L96369n86204M17898j2359m09584J11776j24366o03137O45809
$$ 16666796 17080639 17477008 16890804 17308702 17296343 16886759 16998535 16874169 16271032 16916841
4214A6916841j29663R5638L30685l76226L08351p3793P90603M14420N88249k5667
$$ 16916841 16787178 16882816 17213501 16837275 17145626 17071833 17862436 18276856 18865105 18839438
4204A8839438j87361K41346L08804J96516M27734p2618M09086J47228l42560L64414
$$ 18839438 18652077 18893423 19202227 19398743 19826477 19753859 20162945 20310173 19967613 20332027
4194B0332027j51877r9195l63549P3523R2247l94045q3294M41006N44191J57146
$$ 20332027 20180150 20080955 19717406 19790929 19883176 19489131 19405837 19846843 20391034 20548180
4184B0548180j68302k8635k6263o28522l9216P50541J64971K82739M76545J27240
$$ 20548180 20379878 20351243 20324980 19696458 19657242 20407783 20572754 20855493 21332038 21459278
4174B1459278j00155M15069M31887j51766o38730L43886L80846J41059M46115
$$ 21459278 21359123 21774192 22206079 22054313 21415583 21759469 22140315 22281374 22727489
4165B2727489L32390K65444k42034j33382O55946O9659M09864l24514M01230N14637
$$ 22727489 23059879 23325323 23083289 22949907 23605853 23675512 24085376 23760862 24162092 24676729
4155B4676729Q51718M43097M31554N76117P57504N2116j6665R36632J352286O24394
$$ 24676729 25528447 25971544 26403098 26979215 27736719 27788835 27772170 28708802 30061088 30685482
4145C0685482P66626N05707J166702R84987J046806Q19766O43478J213525J661512
$$ 30685482 31452108 31957815 33124517 34109504 35156310 35976076 36619554 37833079 39494591
4136C9494591J891920J731936J337651K104614J216197J500146J472641J17580
$$ 39494591 41386511 43118447 44456098 46560712 47776909 49277055 50749696 50867276
4128E0867276m05085p727l79476m95265k71557j576239j460391j193247j651183
$$ 50867276 50462191 50454464 50074988 49579723 49308166 47731927 46271536 45078289 43427106
4119D3427106r41371q31374q16209n58743j52024o50725m94938m74679l66151
$$ 43427106 42485735 41654361 40838152 40279409 40127385 39476660 38981722 38507043 38140892
4110C8140892j47023j69775j5782q18011L01467N79416J86379j87909N14799O75028
$$ 38140892 37993869 37824094 37808312 36990301 37291768 37871184 38057563 37869654 38384453 39059481
4100C9059481M86225J014435O42492n19774M26029Q97498J298688J077595O67734
$$ 39059481 39545706 40560141 41202633 40682859 41108888 42006386 43305074 44382669 45050403
4091D5050403R99431J497111J093077J654822J090923J629343J250882J678478
$$ 45050403 46049834 47546945 48640022 50294844 51385767 53015110 54265992 55944470
4083E5944470J292405J197675K075428J669501J725301J817006K318075K114829
$$ 55944470 57236875 58434550 60509978 62179479 63904780 65721786 68039861 70154690
4075G0154690K157731K500739K684733K398803K571032K407590L103473L040550
$$ 70154690 72312421 74813160 77497893 79896696 82467728 84875318 87978791 91019341
4067I1019341K960207L859728L277871L534874L969547L673773M475300M648627
$$ 91019341 93979548 97839276 101117147 104652021 108621568 112295341 116770641 121419268
4059A21419268L773665M906216N874628N585745N749033N769359O470897O887550
$$ 121419268 125192933 130099149 135973777 141559522 147308555 153077914 159548811 166436361
4051A66436361P282959P291630Q326755Q241371Q720239Q837240Q521683J0127900
$$ 166436361 173719320 181010950 189337705 197579076 206299315 215136555 223658238 233786138
4043B33786138R123400Q831538O779968O855439N955767N157130L361294J864102
$$ 233786138 242909538 251741076 258521044 265376483 271332250 276489380 279850674 281714776
4035B81714776P31461o34874j532800k749577l770629n245307o145188o293186
$$ 281714776 282446237 281811363 280278563 277528986 273758357 268513050 262367862 256074676
4027B56074676p711329p441694q173244p855403q645659q770199p394329o696643
$$ 256074676 248363347 240921653 232748409 224893006 216247347 207477148 200082819 193386176
4019A93386176o786455n900120o373777o045534n928910n905877n340515n161829
$$ 193386176 186599721 180699601 174325824 168280290 162351380 156445503 151104988 145943159
4011A45943159m624665n073817n250963m161091m557241m043395l268845l361377
$$ 145943159 141318494 136244677 130993714 126832623 122275382 118231987 114963142 111601765
4003A11601765l184628l400526k973210k531140k547670k700914k027695k052502
$$ 111601765 108417137 105016611 102043401 99512261 96964591 94263677 92235982 90183480
3995I0183480j469359o60136j281958n45568m74965k199922k042203k562837k032336
$$ 90183480 88714121 88053985 86772027 86226459 85751494 83551572 81509369 78946532 76914196
3986G6914196l007763l069435j968973k088272k073070j401321j616269q73124
$$ 76914196 73906433 70836998 68868025 66779753 64706683 63305362 61689093 60815969
3978F0815969j300393j012058q89552j39523j118751j053059q29990n87531q05045
$$ 60815969 59515576 58503518 57613966 57474443 56355692 55302633 54472643 53885112 53080067
3969E3080067p98816j009301L92124K27504j62773k50746q45281o40669L29295
$$ 53080067 52281251 51271950 51664074 51891578 51728805 51478059 50632778 49992109 50321404
3960E0321404m24274n7881J916M72230Q363n32509K59802J18276M09776L86502
$$ 50321404 49897130 49839249 49841165 50313395 50321758 49789249 50049051 50167327 50577103 50963605
3950E0963605M20186J361481J032430N00344N63000R51340M52156Q60936J274262
$$ 50963605 51383791 52745272 53777702 54278046 54841046 55792386 56244542 57105478 58379740
3941E8379740J401157J019287J075168J449187J380485J204022O07843J445497
$$ 58379740 59780897 60800184 61875352 63324539 64705024 65909046 66516889 67962386
3933F7962386J692152J638279J883839J624756K319956J386662J480220K074050
$$ 67962386 69654538 71292817 73176656 74801412 77121368 78508030 79988250 82062300
3925H2062300K009997J377228K095341K712679J979850J923433J658700K043686
$$ 82062300 84072297 85449525 87544866 90257545 92237395 94160828 95819528 97863214
3917I7863214L198401K409546K857933L371131L454638L035247L331724L234828
$$ 97863214 101061615 103471161 106329094 109700225 113154863 116190110 119521834 122756662
3909A22756662M378519M929243L344894L503939K999605L001255L098171K438758
$$ 122756662 127135181 132064424 135409318 138913257 141912862 144914117 148012288 150451046
3901A50451046K436051K955368L501493L901054L713852L370682L27263J81350
$$ 150451046 152887097 155842465 159343958 163245012 166958864 170329546 170656809 170838159
3893A70838159K76992J75894N53863M58463J544987K229155K985681M054687N868908
$$ 170838159 171115151 171291045 171844908 172303371 173848358 176077513 179063194 183117881 188986789
3884A88986789Q557186J2126111J7092734K2161505J8429782k071332o253018
$$ 188986789 197543975 209670086 226762820 248924325 267354107 265282775 259029757
3877B59029757r158040j2740224j8119239k0550091j6011930j4462531j1357847
$$ 259029757 249871717 237131493 219012254 198462163 182450233 167987702 156629855
3870A56629855r697287q869591p576741o677203n536205n249907m239978l279530
$$ 156629855 146932568 138062977 130486236 123809033 118272828 113022921 108782943 105503413
3862A05503413l401311k596899k596646k839565l504917k972818k804681k245040
$$ 105503413 102102102 99505203 96908557 94068992 90564075 87591257 84786576 82541536
3854H2541536k152941l078350k355651k102002k045412k202120j640727j933470
$$ 82541536 80388595 77310245 74954594 72852592 70807180 68605060 66964333 65030863
3846F5030863j664102k010771j249983j207705j456674j197325j222533o96554
$$ 65030863 63366761 61355990 60106007 58898302 57441628 56244303 55021770 54325216
3838E4325216o27420o10551o11422Q5553l62368L52721o51914m08686N35342l12260
$$ 54325216 53697796 53087245 52475823 52561376 52199008 52551729 51899815 51491129 52026471 51714211
3828E1714211o99064P62927M25949J424849M6403J461097J560916J137129J206625
$$ 51714211 51015147 51778074 52204023 53628872 53675275 55136372 56697288 57834417 59041042
3819E9041042J077113Q51854k00251l96799j540918j393932j509258j899400k086076
$$ 59041042 60118155 60970009 60769758 60372959 58832041 57438109 55928851 54029451 51943375
3810E1943375k117992k189819k311554k042321j662951j614391j280338j122829
$$ 51943375 49825383 47635564 45324010 43281689 41618738 40004347 38724009 37601180
3802C7601180j035301j396315q34210q62176l11249o32088n23812K49516n55468
$$ 37601180 36565879 35169564 34335354 33473178 33161929 32529841 32006029 32255545 31700077
3793C1700077p81104j064526j88289o11093o8024j57851n40533l68400N30455
$$ 31700077 30918973 29854447 29666158 29055065 28987041 28829190 28288657 27920257 28450712
3784B8450712m33193n02690k34016j94041K06194J4942o19165m76424l10962K57497
$$ 28450712 28017519 27514829 27280813 27086772 27292966 27307908 26688743 26212319 25901357 26158854
3774B6158854J2450m1132L6618m30640O0157O55812m2021n66055l45648q4842
$$ 26158854 26171304 26130172 26166790 25736150 25796307 26452119 26410098 25844043 25498395 25413553
3764B5413553Q6196l47774m5217M617J71074O07195K53402J45132L41684m21291
$$ 25413553 25499749 25151975 25106758 25111375 25282449 25889644 26143046 26288178 26629862 26208571
3754B6208571K04782L60573R2361R65283P24999K82820M51524J107173J377184
$$ 26208571 26413353 26773926 26866287 27831570 28556569 28839389 29290913 30398086 31775270
3745C1775270L28346N91383L03494J044055N02769M14891J300103J580667J583390
$$ 31775270 32103616 32694999 32998493 34042548 34545317 34960208 36260311 37840978 39424368
3736C9424368J114593K003688K539437J861058J574407K030958K722043K662906
$$ 39424368 40538961 42542649 45082086 46943144 48517551 50548509 53270552 55933458
3728E5933458K678934K375835L095096L047170L698383M174222L416661M523081
$$ 55933458 58612392 60988227 64083323 67130493 70828876 75003098 78419759 82942840
3720H2942840N640108O878222Q029138Q598954R471838J3433691J5390075J9527607
$$ 82942840 88582948 95461170 103490308 112089262 121561100 134994791 150384866 169912473
3712A69912473K4013590K7535726L0235817K7556036J1062486k632409q117775
$$ 169912473 193926063 221461789 251697606 279253642 290316128 287683719 279565944
3705B79565944j3617350j9827611k4411626k2406316j8723589j4389789j1643625
$$ 279565944 265948594 246120983 221709357 199303041 180579452 166189663 154546038
3698A54546038q936227q137295p085024o203283m182793m043488k703461k254440
$$ 154546038 145609811 137472516 130387492 124184209 120001416 115957928 113254467 111000027
3690A11000027p86599n9361N6299L46690J417967L491632M203654N567618Q070264
$$ 111000027 110213428 110154067 110210366 110557056 111975023 115466655 119670309 125237927 133308191
3681A33308191J0088735J2645370J4711166J5879289J4095219O032238M03064
$$ 133308191 143396926 156042296 170753462 186632751 200727970 206760208 207163272
3674B07163272l491416n991117q414496q654255p374211o436996n979685o104236
$$ 207163272 203671856 197680739 189266243 180611988 173237777 166800781 160821096 154716860
3666A54716860n707514o614969o041834o304162o377149o054968n325307n000868
$$ 154716860 149009346 142394377 136352543 130048381 123671232 117616264 112290957 107290089
3658A07290089m373315m244062m872204m343709l592729l192673l194742l356175
$$ 107290089 102916774 98672712 93800508 89456799 85864070 82671397 79476655 76120480
3650G6120480l365600l488496l151107k350826k507292k171598j819583j970986
$$ 76120480 72754880 69266384 66115277 63764451 61257159 59085561 57265978 55294992
3642E5294992j495269k052453k037484j578174j413294q00421j528001l56845
$$ 55294992 53799723 51747270 49709786 48131612 46718318 45917897 44389896 44033051
3634D4033051j053856j148559j286309m80576n14358m81196l81691n46131o49181
$$ 44033051 42979195 41830636 40544327 40063751 39549393 39068197 38686506 38140375 37491194
3625C7491194j464518j283246m57566q05672j206401m89644j255459j152625q91175
$$ 37491194 36026676 34743430 34285864 33480192 32273791 31784147 30528688 29376063 28484888
3616B8484888l35314j17222r83702p15264l5369p60418q69626J2165l61372j07062
$$ 28484888 28149574 28032352 27048650 26333386 26298017 25537599 24667973 24680138 24318766 24211704
3606B4211704n49218K55612M3636r9067m04119N31242p3194p37247L61392K11037
$$ 24211704 23662486 23918098 23961734 23862667 23458548 23989790 23916596 23179349 23540741 23751778
3596B3751778J99133r715O84576M99371O49262m23409L19168q3152k84256m05683
$$ 23751778 23950911 23941196 24625772 25125143 25774405 25350996 25670164 25587012 25302756 24897073
3586B4897073L2969N5972L80438n98350R7899j51083K27789R2115Q65092P96939
$$ 24897073 24930042 24986014 25366452 24768102 24866001 24714918 24942707 25034822 25899914 26696853
3576B6696853O97329N66568P64588l91328j041322m98424p98434m64947q39847
$$ 26696853 27394182 27960750 28725338 28334010 27292688 26794264 25995830 25530883 24691036
3567B4691036r57957j026325J80067m12769k89911j8923k11759K35192J9035p2255
$$ 24691036 23733079 22706754 22886821 22474052 22184141 22165218 21953459 22188651 22207686 22135431
3557B2135431J47225K20800J033145k24402Q18891J361702R26187J492086J343651
$$ 22135431 22282656 22503456 23536601 23312199 24131090 25492792 26418979 27911065 29254716
3548B9254716N81293j94507L59038p28934p45492r09455j435755k49643o93490
$$ 29254716 29836009 29641502 30000540 29271606 28526114 27616659 26180904 25931261 25237771
3539B5237771n95152r07356p30381p5652l60358m93728q97347k27181j26927q73128
$$ 25237771 24642619 23735263 23004882 22929230 22568872 22075144 21177797 20950616 20823689 19950561
3529A9950561M3526p24238L60832m45418l34145o85261p50809J89396k79779l47988
$$ 19950561 19994087 19269849 19630681 19185263 18851118 18165857 17415048 17604444 17324665 16976677
3519A6976677o97350k17652l5657j339282K99362j91392n5019L60699n14722l08893
$$ 16976677 16279327 16061675 16026018 14686736 14986098 14794706 14739687 15100386 14585664 14276771
3509A4276771l88187J33437k8730l2508M5037j80764p0441N05482L50997M7049
$$ 14276771 13888584 14022021 13993291 13960783 14005820 13825056 13754615 14260097 14611094 14658143
3499A4658143R17025J68924N94636R21326J123266J83077m88506m00892m87143
$$ 14658143 15575168 15744092 16338728 17260054 18383320 18566397 18077891 17676999 17189856
3490A7189856j71559l86167m83890m70446k1454j027167k68626L58320q45885
$$ 17189856 17018297 16632130 16148240 15677794 15656340 14629173 14360547 14718867 13872982
3481A3872982l48123k01292p95497j98816J67036N37872p54927n1235k51491k69944
$$ 13872982 13524859 13323567 12528070 12329254 12496290 13034162 12279235 12228000 11976509 11706565
3471A1706565l03409n2786p59668J343O28583J04638j76356Q0101o7260j95198
$$ 11706565 11403156 11350370 10590702 10592045 11220628 11325266 11148910 11229011 11161751 10966553
3461A0966553k29801l33178k95109N94456k90115m23086l66480j90895N98224
$$ 10966553 10736752 10403574 10108465 10702921 10412806 9989720 9623240 9432345 10030569
3452A0030569n45153J30786o6833l74574O75981n75075L83572n9175k47003P0063
$$ 10030569 9485416 9616202 9549369 9174795 9850776 9275701 9659273 9600098 9353095 9423158
3442I423158j09206M11038K6112K07949K19077p33150L3413l58968K18033K78642
$$ 9423158 9313952 9724990 9751102 9959051 10178128 9444978 9478391 9119423 9337456 9616098
3432I616098K5683k95205p6887L26561l22037j23967N66867R58026O09314J272183
$$ 9616098 9641781 9346576 9269689 9596250 9274213 9150246 9717113 10675139 11284453 12556636
3422A2556636R81081J716407J934794Q18356n35122m09907j211779o66075j241908
$$ 12556636 13537717 15254124 17188918 18007274 17472152 17062245 15850466 15184391 13942483
3413A3942483l83689j498770q08317j83380p55634k46483n61887n27308k57816
$$ 13942483 13558794 12060024 11251707 11068327 10312693 10066210 9504323 8977015 8719199
3404H719199j83935L84639J78137q08122l47736K34107n64341M56585n75987K08393
$$ 8719199 8535264 8919903 9098040 8289918 7942182 8176289 7611948 8068533 7492546 7700939
3394G700939m56028j72136n0298N9026Q80108n27568L03810M91455p51998N1109
$$ 7700939 7244911 7072775 7022477 7081503 7961611 7434043 7737853 8229308 7477310 7528419
3384G528419M05889l33425l3344k38849N95747k80597k83259O72666l91430m62439
$$ 7528419 7934308 7600883 7567539 7328690 7924437 7643840 7360581 8033247 7641817 7179378
3374G179378j29184k67223m87078m7026q6539j23712R22304l37158j01201k30321
$$ 7179378 7050194 6782971 6295893 6248867 6162328 6038616 6960920 6623762 6522561 6292240
3364F292240p46433l05163P49449J31566k94297L08324j62472k29005M86242J46863
$$ 6292240 5545807 5240644 5990093 6121659 5827362 6135686 5973214 5744209 6230451 6377314
3354F377314N20484q36150K99597K58657n149p74863j4434L04569n24603m12373
$$ 6377314 6897798 6061648 6361245 6619902 6614753 5839890 5825456 6130025 5605422 5193049
3344E193049R12239K86118p66425M71780L84899l77920j21430n5912p8545q2837
$$ 5193049 6105288 6391406 5624981 6096761 6481660 6103740 5982310 5926398 5847853 5765016
3334E765016M8174r1426M59793J14581n20528k7558K3004O19967K85693R9673
$$ 5765016 5813190 5721764 6181557 6296138 5775610 5748052 5771056 6391023 6676716 6776389
3324F776389o29383M79632L13160q94471j71739j32838p20646N29028L89409l87993
$$ 6776389 6147006 6626638 6939798 6045327 5873588 5740750 5020104 5549132 5938541 5550548
3314E550548J57249O67062r37984k70856J0246L91770j15832m74948m45945M03094
$$ 5550548 5707797 6374859 5436875 5166019 5176265 5568035 5452203 4977255 4531310 4934404
3304D934404l28276j80490O47740k4913k30052J98898l6674n89907q09626O18430
$$ 4934404 4606128 4425638 5073378 5048465 4818413 5017311 4980637 4390730 3581104 4199534
3294D199534k6132K74377P71r2513j14643p07716J69957j43269J37612L30407
$$ 4199534 4173402 4447779 4448550 4356037 4241394 3533678 3703635 3560366 3697978 4028385
3284D028385L54946K81432M34144j038557M1503K05605K80683m55636K97184q8522
$$ 4028385 4383331 4664763 5098907 4060350 4101853 4307458 4588141 4132505 4429689 4341167
3274D341167l17790p638j77549j16952k69324l54858M96197k74656n56543M18910
$$ 4341167 4023377 4015739 3838190 3721238 3451914 3097056 3593253 3318597 2762054 3180964
3264C180964j81082M46715K97230m97307j31124K84690P2423p4717Q188j82497
$$ 3180964 2999882 3446597 3743827 3246520 3115396 3400086 3472509 3397792 3405980 3223483
3254C223483o424j2904J1166k55813j48267K70247L33475l62313p35968j99364
$$ 3223483 3217059 3204155 3215321 2959508 2811241 3081488 3414963 3052650 2316682 2117318
3244B117318j64807R7900J96941K20086l05378k13142K87109K15475m85455J64640
$$ 2117318 1952511 2050411 2247352 2467438 2162060 1948918 2236027 2451502 1966047 2130687
3234B130687k07937J63562m42979m7744K24226P2848r8037k32814l7576l7508
$$ 2130687 1922750 2086312 1643333 1595589 1819815 1892663 1794626 1561812 1524236 1486728
3224A486728N25757m63881O1758j78395m01862K73269P75649k47041J75845k59423
$$ 1486728 2012485 1548604 1610362 1431967 1030105 1303374 2079023 1831982 2007827 1748404
3214A748404o66934L92485r8377m3630L22270J66578j71884k87082O3376k08657
$$ 1748404 1081470 1473955 1375578 1331948 1654218 1820796 1648912 1361830 1425206 1216549
3204A216549J98353p71854m3371P52822l05196J36951l65902l74079M25407O96073
$$ 1216549 1414902 643048 599677 1352499 1047303 1184254 818352 444273 869680 1565753
3194A565753k37909p28023l87487P30929K1415R0417K75615l75751J05312l17298
$$ 1565753 1327844 599821 212334 943263 964678 1055095 1330710 954959 1060271 742973
3184G42973L91510o1448M03448j87908n29900M22016r3477N71027k14305J54494
$$ 742973 1134483 1073035 1476483 1288575 758675 1180691 1087214 1658241 1443936 1598430
3174A598430j00794k07704j53344Q2561k11728j08886l12823j3558N42793m07205
$$ 1598430 1497636 1289932 1136588 1219149 1007421 898535 585712 572154 1114947 707742
3164G07742k83765p3038N07227k10746O27948k00326m65094M29021J29014j61898
$$ 707742 423977 350939 858166 647420 1275368 1075042 609948 1038969 1167983 1006085
3154A006085j12065p2291k77435M87558k7570n19556l68665Q49705K70433k942
$$ 1006085 894020 821729 544294 1031852 1004282 484726 116061 965766 1236199 1233257
3144A233257N4443n65037J0397N2958J81395N07109l76271r5094K0266Q9345l24908
$$ 1233257 1287700 722663 733060 786018 967413 1474522 1098251 1003157 1023423 1112768 787860
3133G87860K97336j78344k18029J49190j05780J71576m61394j6157j54443K41118
$$ 787860 1085196 906852 688823 838013 732233 903809 442415 426258 271815 512933
3123E12933J22678O6987J28139K18190R236l68870K94650R3969k49610M52416
$$ 512933 635611 702598 830737 1048927 1058163 689293 983943 1077912 828302 1280718
3113A280718m57307k09241K60060M52739j91771n72696N63824J68126J65291l99412
$$ 1280718 823411 614170 874230 1326969 1135198 562502 1126326 1294452 1459743 1060331
3103A060331k92810L90439l43542p4183O20105m6224o42580m29054J85511P98428
$$ 1060331 767521 1157960 814418 740235 1360340 1314116 671536 242482 427993 1226421
3093A226421Q1860M08548o28698l22600K61847m43648k26525o64614O32348M87214
$$ 1226421 1308281 1716829 1088131 765531 1027378 583730 357205 -307409 324939 812153
3083H12153K84966K06573o52648O4265K29325R1115Q55121k81454j45977p3195
$$ 812153 1097119 1303692 651044 715309 944634 1035749 1890870 1609416 1463439 1390244
3073A390244o41738L01955N42062r6545j59490o8669K56523M04291m61794k14954
$$ 1390244 748506 1050461 1592523 1495978 1336488 1267819 1524342 1928633 1466839 1251885
3063A251885J65825L28769k13583K40409l93590N9392M34454J63600k25843K59145
$$ 1251885 1417710 1746479 1532896 1773305 1379715 1439107 1873561 2037161 1811318 2070463
3053B070463k73964J55366J78149k79774P3543o58506M25298M87939J96723l88615
$$ 2070463 1796499 1951865 2130014 1850240 1923783 1265277 1690575 2178514 2375237 1986622
3043A986622M3069K72009l5598l9475R2348j71926k94918O63503l8808j65909
$$ 1986622 2029691 2301700 2266102 2226627 2318975 2147049 1852131 2515634 2476826 2310917
3033B310917P35704M7887k90631j99188j76335k87494P66890J10713m46405K09623
$$ 2310917 3046621 3094508 2803877 2604689 2428354 2140860 2907750 3018463 2572058 2781681
3023B781681L09770q6084j68463L57372k71942l00M28130K4049k32711j50168
$$ 2781681 3091451 3005367 2836904 3194276 2922334 2922034 3350164 3374213 3141502 2991334
3013B991334l24560K26146P26417o69136p8819m54726M07244K78125m91241L17371
$$ 2991334 2666774 2892920 3619337 2950201 2871382 2416656 2823900 3102025 2610784 2928155
3003B928155n33038J72957L23430k32899K09178L26027k82834l0926l24878M12901
$$ 2928155 2395117 2568074 2891504 2658605 2867783 3193810 2910976 2880050 2555172 2968073
2993B968073K864j15624j599K6339k35225R5248J37226r6404o61127J06234M14588
$$ 2968073 2970937 2855313 2853714 2880053 2644828 2740076 2877302 2780898 2119771 2226005 2640593
2982B640593p03370N0614K56154K46220m19280M52251n97091p25564M66767K28217
$$ 2640593 1937223 1987837 2243991 2490211 2070931 2523182 1926091 1200527 1667294 1895511
2972A895511j86213P89620p0906o83318M79937k46160l32240K1276M59905L48647
$$ 1895511 1709298 2498918 2428012 1744694 2224631 1978471 1646231 1667507 2127412 2476059
2962B476059k27950j54218l48072K41780l6987J01296K55720L9982m4433j1338
$$ 2476059 2248109 2093891 1745819 1987599 1950612 2051908 2307628 2347610 2303177 2291839
2952B291839p55910p52549N12230L16769N44171n40582O7371k64337K65403K43456
$$ 2291839 1535929 783380 1295610 1612379 2156550 1615968 1683339 1419002 1684405 1927861
2942A927861J62411l46385k32138Q03470n64581j32929j09057l40638M16867l04706
$$ 1927861 2090272 1743887 1511749 2315219 1750638 1617709 1508652 1168014 1584881 1280175
2932A280175j19330N06158k15147P18023n99797k36378J31358n49300L22134K64997
$$ 1280175 1160845 1667003 1451856 2169879 1570082 1333704 1465062 915762 1237896 1502893
2922A502893k95050N75104K91045p84072n81207N9254n33796P86949k87628M96172
$$ 1502893 1207843 1782947 2073992 1289920 708713 767967 234171 1021120 733492 1229664
2912A229664K60294l47193J08793J39765q2098q7848L86809P2787R3060J15452
$$ 1229664 1489958 1142765 1251558 1391323 1309225 1221377 1608186 1680973 1774033 1889485
2902A889485O2314p73841J65772N1482K61533j79595J39801k13443J61929J8066
$$ 1889485 1951799 1177958 1343730 1395212 1656745 1477150 1616951 1403508 1565437 1583503
2892A583503O20659k43752Q4194P6709k16610J165L26697r2175j21871k32238
$$ 1583503 2204162 1960410 2044604 2121313 1904703 1905868 2232565 2140390 2018519 1786281
2882A786281M15632k7831M22015L48990m62141q07499L45548R41820k30359P7158
$$ 1786281 2201913 2174082 2596097 2945087 2482946 1675447 2020995 2962815 2732456 2809614
2872B809614K6080P22294m89635O06112O50834p70065k74277P53353j40890q0203
$$ 2809614 2835694 3557988 3068353 3674465 4325299 3555234 3280957 4034310 3893420 3813217
2862C813217M0993k09765Q46283p683L46244K30982Q11368m93824K20261j2666
$$ 3813217 3854210 3644445 4490728 4483045 4829289 5060271 5871639 5377815 5598076 5585410
2852E585410k04651P50333K82192J10446l0980O81673O03768O94236o79089N68797
$$ 5585410 5380759 6131092 6413284 6523730 6492750 7174423 7778191 8472427 7793338 8362135
2842H362135p7796K68365L86868K55581M62452P70687N28911L48681J39692J84177
$$ 8362135 8284339 8552704 8939572 9195153 9657605 10428292 10957203 11305884 11445576 11629753
2832A1629753N11437J88043K86198L55513J262336L67020O42859K23119L74621
$$ 11629753 12141190 12329233 12615431 12970944 14233280 14600300 15243159 15466278 15840899
2823A5840899J016643N87297R41213R70819Q23441P47398N39128Q58026J345981
$$ 15840899 16857542 17444839 18386052 19356871 20180312 20927710 21466838 22324864 23670845
2814B3670845R31572J115642Q88078J150186J162874J434751Q49480J357215J643342
$$ 23670845 24602417 25718059 26606137 27756323 28919197 30353948 31203428 32560643 34203985
2805C4203985J513072J639589K234605K402757K295830L723787K942093M348890
$$ 34203985 35717057 37356646 39591251 41994008 44289838 48013625 50955718 55304608
2797E5304608M470631L181856L748799K777600J822914J90932p88391k499227
$$ 55304608 59775239 62957095 66705894 69483494 71306408 71497340 70708949 68209722
2789F8209722l917454m869600m047444m703446m747793l772769l097298l204365
$$ 68209722 64292268 59422668 55375224 50671778 45923985 42151216 39053918 35849553
2781C5849553l325787k395377j283672j165474j510459p11270j037567r78549
$$ 35849553 32523766 30128389 28844717 27679243 26168784 25457514 24419947 23441398
2773B3441398j146339j563296o60922j532826j251179r41098p38210l94119l40541
$$ 23441398 22295059 20731763 20070841 18538015 17286836 16345738 15607528 15213409 14872868
2764A4872868l26358o79942j58717j129245r9997N46287n26399n9385K90989O88140
$$ 14872868 14546510 13866568 13707851 12578606 12478609 13024896 12498497 12439112 12730101 13418241
2754A3418241N57395J196037R69556j98248n90795p53028q28759r98636j066126
$$ 13418241 13975636 15171673 16141229 15942981 15352186 14599158 13770399 12771763 11705637
2745A1705637j263869j513146j65497J98134j118511j62279o58623k25191j93708
$$ 11705637 10441768 8928622 8763125 8961259 7842748 7680469 7021846 6796655 6602947
2736F602947M48617J15393j65938n38034p8402Q44520Q6972M45011P73457o30753
$$ 6602947 7051564 7166957 7001019 6462985 6384583 7229103 7316075 7761086 8534543 7903790
2726G903790j36219l63426m91916n97679r20361J31192M31308l98964m47443q08109
$$ 7903790 7767571 7404145 6912229 6314550 5394189 5525381 5956689 5557725 5110282 4302173
2716D302173Q488J53823l40451r02905j72269J03268O24815K22048o34748O140
$$ 4302173 4310661 4464484 4124033 3221128 3048859 3152127 3776942 3998990 3364242 3370382
2706C370382J20872m86730k45728Q2716k28714M43542j14156J2149N2305m402
$$ 3370382 3491254 3004524 2758796 2841512 2612798 3056340 2942184 2954333 3006638 3002236
2696C002236J45286m03038J71897m84110l02761J15142K21797j42059K11666k26503
$$ 3002236 3147522 2744484 2916381 2432271 2129510 2244652 2466449 2324390 2536056 2309553
2686B309553k36985L54122l51648n51793L20045N8436k52058L72437r5154n6085
$$ 2309553 2072568 2426690 2075042 1523249 1843294 1901730 1649672 2022109 1926955 1870870
2676A870870P24447j25307p39273M31286m08680P0434Q2659K90434n8251m00279
$$ 1870870 2595317 2470010 1730737 2162023 1753343 1823777 1906436 2196870 2138619 1738340
2666A738340n64240J29787K43296p8794j20626N3525k10021K80679j86614n48763
$$ 1738340 1174100 1303887 1547183 1468389 1347763 1401288 1191267 1471946 1285332 736569
2656G36569J69469N23787m70131l09716M29607k14333N76256J2159M28890l75043
$$ 736569 906038 1429825 959694 649978 1079585 865252 1441508 1453667 1882557 1507514
2646A507514j15459R4663p36046M23762N46675J82874o55926K2835k53855J54137
$$ 1507514 1392055 1486718 750672 1174434 1721109 1903983 1248057 1270892 1017037 1171174
2636A171174R9019n66338k64213J15561P1770L03581k20509j20092L76592j08083
$$ 1171174 1270193 703855 439642 555203 626973 930554 710045 589953 966545 858462
2626H58462L53082L70955J32114K46015q51293p98004J263010l82666o78651O75918
$$ 858462 1211544 1582499 1714613 1960628 1109335 311331 1574341 1191675 513024 1188942
2616A188942P528l49469P3202j68229j37366k93030J35061J87031P4497l83439
$$ 1188942 1196470 847001 920203 751974 614608 321578 456639 643670 718167 334728
2606C34728O3891M65438K40561O92828k05212K41236n64806p5776N78914n574
$$ 334728 398619 864057 1104618 1797446 1592234 1833470 1268664 1192888 1771802 1766228
2596A766228m86989K1467j56361M90750l73005j99637Q27256O4316k86976m23202
$$ 1766228 1279239 1300706 1144345 1635095 1262090 1062453 1889709 1954025 1667049 1243847
2586A243847m94831L34446N29263M67277M0843k41167m59178L81812K31611O62596
$$ 1243847 749016 1083462 1612725 2080002 2120845 1879678 1420500 1802312 2033923 2696519
2576B696519R6051p48186M6797O13698N55178k60005m2844J72475L44487J11120
$$ 2696519 2792570 2044384 2091181 2704879 3260057 3000052 2957208 3129683 3474170 3585290
2566C585290j99698l9072n2429P83879o97815O84115M27391K07614M30777n41480
$$ 3585290 3385592 3346520 3294091 4077970 3380155 4064270 4491661 4699275 5130052 4588572
2556D588572M42226J33535k61073Q0721m3587P3477K06412j10835R39871L70332
$$ 4588572 5030798 5164333 4903260 4983981 4940394 5013871 5220283 5109448 6049319 6419651
2546F419651k81006o05M56456R4559R8068K41821Q74687j40942J45368J56003
$$ 6419651 6138645 6138040 6594496 6689055 6787123 7028944 7903631 7762689 7908057 8064060
2536H064060K06958l92357l40833o00419k30648m46457j94486q50701l53507P8209
$$ 8064060 8271018 7878661 7537828 6937409 6706761 6260304 6065818 5215117 4861610 4939819
2526D939819Q0027J49454q3057j02814j533j65240P82895j660p9174L74898n52781
$$ 4939819 5019846 5169300 5086243 4983429 4981896 4816656 5599551 5597891 5518717 5893615 5340834
2515E340834l0383k72828k83789j38938J8223l9989k37730k41236n91916K88320
$$ 5340834 5310451 5037623 4753834 4614896 4633119 4593130 4355400 4114164 3522248 3810568
2505C810568J78653n70505j91327J88880n98574M15006J58156l99753n6729k88154
$$ 3810568 3989221 3418716 3227389 3416269 2817695 3232701 3390857 2991104 2934375 2646221
2495B646221L4831r155J05868p02956L03206J9931o47720n60486L41881O9702
$$ 2646221 2681052 2671897 2777765 2074809 2378015 2397946 1750226 1189740 1531621 1601323
2485A601323k33250K62669N00559o6719q1185o0111l74526l54202n31305O76160
$$ 1601323 1368073 1630742 2131301 2064582 1983397 1923286 1548760 1194558 663253 1339413
2475A339413n82304p6499N03397l09698L24479k08236j39819J25020j51081J96964
$$ 1339413 757109 680610 1184007 874309 1198788 990552 850733 975753 824672 1021636
2465A021636N2040J30726M68987l85662n51985J66187P3921J85989j92169k64959
$$ 1021636 1073676 1204402 1673389 1287727 735742 901929 975850 1161839 969670 704711
2455G04711n47569N23922m77600l55726N02069O51873M7145p10701M43506k57808
$$ 704711 157142 681064 203464 -152262 349807 1001680 1048825 338124 781630 523822
2445E23822N3826j67977K27636J12925n63284J49040l4478J93198m21706J17111
$$ 523822 577648 409671 637307 750232 186948 335988 301510 494708 73002 190113
2435A90113O03137l58233k09635J44663l87862L80485K31266o22862O25835J24167
$$ 190113 793250 435017 225382 370045 -17817 362668 593934 -28928 596907 721074
2425G21074o29999k85032M06713j9581n56429L24759K2937K08760r3289j54479
$$ 721074 91075 -193957 212756 193175 -363254 -38495 -15558 193202 99913 -54566
2415e4566K57482o1705K30766J8703m61283l45709J43248L51830m64264Q7547
$$ -54566 202916 141211 371977 390680 -70603 -416312 -273064 78766 -385498 -297951
2405b97951K14119J06742L87643J23294L9716n10146k52928L26479L9571j22984
$$ -297951 -83832 22910 410553 533847 573563 63417 -189511 136968 176539 53555
2395E3555Q2766l38190O05245n7323j2219j14034l3955o11012L43095k61015P44049
$$ 53555 136321 -201869 403376 346053 333834 219800 185845 -425167 -82072 -343087 400962
2384D00962R6047k02500J31243m92816J59513k88263q35215L16278K58064q3224
$$ 400962 497009 294509 425752 -67064 92449 -195814 -1031029 -714751 -456687 -539911
2374e39911J17928M03245N4136P10830k85941l47752K95590K24701m62634P1854
$$ -539911 -421983 -18738 35398 746228 460287 112535 408125 632826 170192 242046
2364B42046K45624n28551M6245n76301M39567N57755j36736J12974k36299K80576
$$ 242046 487670 -40881 5364 -570937 -131370 426385 289649 402623 166324 446900
2354D46900j76881j61891K25815j8742p29070J41679O34230p65486O4779M59799
$$ 446900 270019 108128 333943 315201 -413869 -272190 362040 -403446 -338667 121132
2344A21132n67922L13408P85459p05466l32571J73090K36295K89795m364l57639
$$ 121132 -446790 -133382 652077 -53389 -385960 -212870 23425 313220 308856 -48783
2334d8783l5980L3110k29605J42746L68250P0912n60670o68093N40083N99487
$$ -48783 -84763 -51653 -281258 -138512 229738 300650 -260020 -928113 -388030 211457
2324B11457l72698k14712J20599k20937m2253K89718O98598k83829n09419J22612
$$ 211457 -161241 -375953 -255354 -476291 -518544 -228826 469772 185943 -323476 -200864
2314b00864J19303J39000L32190o38206M69637K46438n43058M29577p55322L23286
$$ -200864 -81561 57439 389629 -248577 221060 467498 -75560 354017 -401305 -78019
2304g8019L35972m16953K22087K33831j51270q82087N3089M88381K13495J13367
$$ -78019 257953 -159000 63087 296918 145648 -736439 -683350 -194969 18526 131893
2294A31893L69305L9812J54136q43727N0935K04511N2475J2021m4220p4169J62057
$$ 131893 501198 541010 695146 -148581 -97646 106865 159340 171361 127141 52972 215029
2283B15029k55838j27999M19435j81151l53884M87966o08593N43821K00347o48293
$$ 215029 -40809 -168808 250627 69476 -284408 203558 -405035 138786 339133 -309160
2273c09160l03741J43297J78575L65506J25038P3075m24836r7505J0183K85707
$$ -309160 -612901 -469604 -291029 74477 199515 272590 -152246 -249751 -239568 46139
2263D6139M9007p89825K53169L3029j16419M56311L05475m4549p2452j48607M55957
$$ 46139 95146 -694679 -441510 -408481 -524900 -68589 236886 192337 119885 -28722 427235
2252D27235j028356P11575o19645k92791L39653L49343J93728k11047L15535m03151
$$ 427235 -601121 110454 -509191 -801982 -462329 -112986 80742 -130305 185230 -217921
2242b17921J6304r2738j54519l81704L00876j56193K00487Q4260L29073J91040
$$ -217921 -201617 -294355 -448874 -830578 -529702 -685895 -485408 -401148 -72075 118965
2232A18965J21930o82115k46401K98759j45155J70004O74259l4314l97965k54841
$$ 118965 240895 -441220 -687621 -388862 -534017 -364013 310246 275932 -122033 -376874
2222c76874L36963k89168K59484l45360K4343k49233L17053O98308k17272L47716
$$ -376874 -39911 -329079 -69595 -414955 -390612 -639845 -322792 375516 158244 505960
2212E05960j163607m6320L22102l31078l42535P21156N49475j78037J66153O3874
$$ 505960 -657647 -703967 -381865 -712943 -1055478 -334322 215153 37116 203269 267143
2202B67143n95621K54909J52969m35565k85978N15020N9803M69800n3512k81167
$$ 267143 -328478 -73569 79400 -356165 -642143 -127123 -67320 402480 348968 67801
2192F7801l14083j41115M35444k4022M73148l35935m45404L55246k32383q9634
$$ 67801 -246282 -387397 48047 24025 497173 161238 -284166 71080 -161303 -250937
2182b50937l72922K12785N94084o02733J66262L45384o60951O59806l94869j11371
$$ -250937 -623859 -411074 183010 -419723 -253461 91923 -569028 90778 -304091 -415462
2172d15462L84750j65814p8675M4001J34183M41822k35092j71359L5292Q640L80459
$$ -415462 -30712 -196526 -275201 -231200 -97017 344805 109713 -61646 -26354 -17714 362745
2161C62745q12019j77950q112N10858L53324l27219m11101L80932k30714L8519
$$ 362745 -449274 -627224 -635336 -124478 228846 -98373 -509474 -128542 -359256 -320737
2151c20737J00102j45022M61230Q0004m43682L57041J55199O6861Q3457l19557
$$ -320737 -220635 -365657 95573 175577 -268105 88936 244135 310996 394453 74896
2141G4896Q44891J46412k10761k61740o32301L42996K56907n84600L09917R7463
$$ 74896 919787 1066199 855438 593698 -38603 304393 561300 -23300 286617 384080
2131C84080m59349k1419J44648l02692M06942J32473J78114n60145J23780k12198
$$ 384080 -75269 -96688 47960 -254732 152210 284683 462797 -97348 26432 -185766
2121a85766N162k78740L3041P56954k80453l01701Q46532n79298M15835o50162
$$ -185766 -180604 -459344 -426303 330651 50198 -251503 595029 15731 431566 -218596
2111b18596o62371N10723M34549J01367M34787p31997K81459M02734m63901j45809
$$ -218596 -880967 -370244 64305 165672 600459 -131538 149921 552655 88754 -57055
2101e7055L56669p5494L61906K9830j061529J44921o35095K55555j75646J42083
$$ -57055 299614 224120 586026 615856 -445673 -300752 -935847 -680292 -855938 -713855
2091g13855M16472j54538J8856J70975j16812k19763R7418K2340l3202N39215
$$ -713855 -297383 -451921 -433065 -262090 -378902 -598665 -501247 -478907 -512109 27106
2081B7106n90350Q98951M46922n79514P3876j49195p38559L70092N3507O3386
$$ 27106 -563244 335707 782629 203115 276991 127796 -610763 -240671 -187164 -123778
2071a23778M08828l36140K74688J31756p5532O3440J87529j70960k39272j67260
$$ -123778 285050 -51090 223598 355354 279822 343262 530791 359831 120559 -46701
2061d6701Q4196K46657K7039j67984k40609Q7003L78100M77455r8926l60314o71449
$$ -46701 37495 284152 311191 143207 -97402 -10399 367701 845156 746230 385916 -285533
2050b85533P09730J639j79776K56177m7810L9848L79651m39052n14358O25442
$$ -285533 424197 425836 246060 502237 454427 494275 873926 434874 -79484 545958
2040E45958p8389k02505J05275n88991O75977Q5928L96078n49187q07317L54000
$$ 545958 467569 265064 370339 -218652 457325 543253 939331 390144 -417173 -63173
2030f3173j27982K82525L98668K93455l85737l30896M4390k9537L94135j5117
$$ -63173 -191155 91370 490038 783493 397756 66860 111250 81713 475848 460731
2020D60731P8831j79712J77720k89229l12310P26257K86152m74168M65173l42435
$$ 460731 539562 359850 537570 248341 -63969 662288 948440 474272 939445 597010
2010E97010J64682k59185j2678O67380j74528M00825m5089m7047P86J50901J35760
$$ 597010 761692 502507 489829 1157209 982681 1383506 1338417 1291370 1292156 1443057 1578817
1999A578817n47859k95890m5922M93525Q60156M42499n42984J52120j79000M75240
$$ 1578817 1030958 735068 689146 1182671 2042827 2485326 1942342 2094462 1915462 2390702
1989B390702J06453L16888L54254L66021k3797J42007J20997M78717M7293L56644
$$ 2390702 2497155 2814043 3168297 3534318 3510521 3652528 3773525 4252242 4299535 4656179
1979D656179j2748K39477J051596N8380J62364k04579J50938L35613J35191J51023
$$ 4656179 4643431 4882908 5934504 5992884 6155248 5950669 6101607 6437220 6572411 6723434
1969F723434R67624L89401R37157J735671O43631R70492M19116O66674J114326
$$ 6723434 7691058 8080459 9017616 10753287 11396918 12367410 12786526 13453200 14567526
1960A4567526J368730J044467O31815J453530J079988J208103J457779K526622
$$ 14567526 15936256 16980723 17612538 19066068 20146056 21354159 22811938 25338560
1952B5338560K096268K726668K522866K946160M046293M820429O859490R928969
$$ 25338560 27434828 30161496 32684362 35630522 39676815 44497244 51356734 61285703
1944F1285703J3489889J5882977K3027754J3872496n844846l977229q030278r428214
$$ 61285703 74775592 90658569 113686323 127558819 121713973 117736744 109706466 100278252
1936A00278252j5238840j6112769j0374991q000726n382460n102797m069888m245580
$$ 100278252 85039412 68926643 58551652 50550926 45168466 40065669 35995781 31750201
1928C1750201l243240k072895k096933k513762k530013j664296l06993j528650
$$ 31750201 28506961 26434066 24337133 21823371 19293358 17629062 17322069 15793419
1920A5793419j164655o15587j208502l93447j052486o10859k16439m58055j11037
$$ 15793419 14628764 14013177 12804675 12411228 11358742 10747883 10531444 10073389 9962352
1911I962352j011089J87867m49315q69305J35293n96317J02987l47393q47552
$$ 9962352 8951263 9139130 8689815 7820510 7955803 7359486 7462473 7115080 6267528
1902F267528n21628j15274j65272k7688l36186k55663k29951K98441n97324k72063
$$ 6267528 5745900 5630626 5465354 5437666 5101480 4845817 4615866 4914307 4316983 4044920
1892D044920n14058K44607L32061l45694r7460l21013m96135L59817M68167l85206
$$ 4044920 3530862 3775469 4107530 3761836 3664376 3343363 2847228 3207045 3675212 3290006
1882C290006n06210J4726r6163K25148J06995m34495r9478r94915O30450M3623
$$ 3290006 2783796 2798522 2702359 2927507 3034502 2600007 2500529 1505614 2136064 2179687
1872B179687n33022P9912O9083K02236m61923k98624J20233Q5862O73150L9163
$$ 2179687 1646665 1726577 1795660 1997896 1535973 1237349 1357582 1443444 2116594 2155757
1862B155757l55635j6182O9619m8073j70667n43846L06859K8525l99576N40391
$$ 2155757 1800122 1783940 1853559 1805486 1634819 1090973 1397832 1426357 1026781 1567172
1852A567172r0280p80262L69305J00968k18882r6331L4002K23115o5552O4565
$$ 1567172 1476892 696630 1065935 1166903 948021 851690 885692 1108807 1043255 1107820
1842A107820R8103Q2348n09465M27517J08177J69249l69108m33687K73383l87532
$$ 1107820 1205923 1288271 778806 1206323 1314500 1483749 1114641 680954 954337 566805
1832E66805p7867r8191q6493Q1359J18130K03950M62264l50592j06051k69604
$$ 566805 488938 390747 304254 385613 503743 707693 1169957 819365 713314 443710
1822D43710l34365p1093N60873J18609O5587l75541L82630l35739P24543l66256
$$ 443710 109345 38252 599125 717734 783321 407780 790410 454671 1179214 812958
1812H12958k12194J87259K2260o03595M47624J43987q11473j60479N7180L21445
$$ 812958 600764 788023 810283 206688 654312 798299 -13174 -173653 -116473 204972
1802B04972L20363L43848l21664k22268Q1057N51752L966q42261J1180L79246
$$ 204972 525335 869183 547519 325251 406308 958060 962026 119765 130945 510191
1792E10191m14708K41004K13490m17123J13242p2006q1015O7472K78438J80046
$$ 510191 95483 336487 549977 132854 246096 174090 93075 160547 438985 619031
1782F19031K87108M47162r0383p95597j32705N00806l23567j40526K48894q7362
$$ 619031 906139 1353301 1262918 467321 334616 835422 511855 371329 620223 532861
1772E32861J33314l29683J77128k773K10157j73171k87124J34347n2558K23319
$$ 532861 666175 336492 513620 510847 721004 547833 260709 395056 342498 565817
1762E65817J62195p43836L07102M1727J45901l88739N7523K79350k16063l23563
$$ 565817 728012 -15824 291278 333005 478906 90167 147690 427040 210977 -112586
1752a12586m2554K54667j37546L79113K85752o33858J2563N32830k42350K11134
$$ -112586 -155140 99527 -38019 341094 626846 -7012 5551 538381 296031 507165
1742E07165L31453m49260N83949L92637j28431J60303k50825q21315j2242L99527
$$ 507165 838618 389358 973307 1365944 1237513 1397816 1146991 325676 313434 712961
1732G12961n88485M64018l34377q4360J62572L5649o25564J05351O7652N95979
$$ 712961 124476 588494 254117 169757 332329 367978 -257586 -152235 -84583 511396
1722E11396N507o30917l71190L68408k32707M62195J02687l19591J38663J1965
$$ 511396 516903 -114014 -485204 -116796 -349503 112692 215379 -104212 34451 46416
1712D6416k84836M81743J2133j57308j78342P67397n43645m01676j4299m15089
$$ 46416 -238420 243323 255456 98148 -80194 687203 143558 -258118 -272417 -687506
1702f87506M07884J0904L60066K71906o528k40596p88951L69883j22958j37407
$$ -687506 -279622 -268718 91348 363254 356726 116130 -672821 -302938 -425896 -563303
1692e63303K76912K14037q576K4856L4043m39013K62244k56340L13492L27603
$$ -563303 -286391 -72354 -80930 -56074 -22031 -461044 -198800 -455140 -141648 185955
1682A85955l94555J69747n08483P39781l25928N9267k51206m15146j28958P4941
$$ 185955 -208600 -38853 -547336 192445 -133483 -74216 -325422 -740568 -869526 -794585
1672g94585M57978J93751J35132K89627k40640K992j87509O6403J22626l0522
$$ -794585 -336607 -142856 -7724 281903 41263 44255 -143254 -76851 45775 15253
1662A5253N26993m20944l62811N31542j23544n0562L1458O67314q9300j56395
$$ 15253 542246 121302 -241509 290033 166489 115927 147385 814699 725399 569004
1652E69004Q7399m83892M79276l14778L9192j78416p18609N76087K26627o05643
$$ 569004 656403 172511 651787 337009 376201 197785 -520824 55263 281890 -323753
1642c23753j32583K42233J20194J56230L97197k01877k07702k67590j94363J8544
$$ -323753 -456336 -214103 -93909 62321 459518 257641 49939 -217651 -412014 -393470
1632c93470Q5275q1866m98983N72006R82271n42649P4867q72077L86765K46243
$$ -393470 -308195 -390061 -889044 -317038 665233 122584 197451 -674626 -287861 -41618
1622d1618K17973k64396m65880N93354L13505l10219p95598m02K29384M73896
$$ -41618 176355 -88041 -553921 39433 352938 42719 -752879 -753281 -523897 -50001
1612e0001q8321J74710K09451o96367L65361J70467R0765o34325J51151q5129
$$ -50001 -138322 36388 245839 -450528 -85167 85300 176065 -458260 -307109 -392238
1602c92238J54795M1017n3322J99306O19918J89746l70541l57582P4619r45958
$$ -392238 -237443 -196426 -249748 -50442 569476 759222 388681 31099 105718 -840240
1592h40240J68135N68334N3043k66104J33999M22423k55300j38062J08284L91787
$$ -840240 -672105 -103771 -50728 -316832 -182833 239590 -15710 -153772 -45488 346299
1582C46299m85036l4720L60960j59014M09797n14210n46934K65803Q01029l67467
$$ 346299 -138737 -173457 187503 28489 438286 -75924 -622858 -357055 443974 76507
1572G6507o97165K83470P83564m05092p25051j0713J039202l71305j60605K98097
$$ 76507 -620658 -337188 446376 41284 -683767 -694480 344722 -26583 -187188 110909
1562A10909o13968j9344L74429J043373m88660n26366r525j01630L80323L43318
$$ 110909 -503059 -522403 -147974 895399 406739 -119627 -129152 -230782 149541 492859
1552D92859Q6533m49808R3199l77885j45958L82839K37004k3839m82720R5614
$$ 492859 579392 129584 222783 -155102 -301060 81779 318783 294944 -187776 -92162
1542i2162j71716m0784l54948P76217J79932M9378p12096p7654J56709K43316
$$ -92162 -263878 -304662 -659610 116607 296539 345917 -366179 -443833 -287124 -43808
1532d3808J45769J30194J41786l20575Q640j97385M07827o09487R9711M62585
$$ -43808 101961 232155 373941 53366 62006 -135379 272448 -337039 -237328 225257
1522B25257K8887l15881n92179L04306N94676r6475J99961l62094L1384j13720
$$ 225257 254144 -61737 -653916 -349610 245066 148591 348552 -13542 17842 -95878
1512i5878j83681k743m86049O60094J39075K48419m12051K17731N8220J98214
$$ -95878 -279559 -282302 -768351 -108257 30818 279237 -132814 84917 143137 341351
1502C41351n09973j92926l9600L90435R1564J30807n08310J52659N99676k75671
$$ 341351 -168622 -361548 -401148 -10713 80851 211658 -296652 -143993 455683 180012
1492A80012j40193N21145k59601L10973n76387m4221q1764J82967M21747l3796
$$ 180012 39819 560964 301363 612336 35949 -8272 -90036 92931 514678 480882
1482D80882j28173K53488J630p66846K38309j3994L13344k68317l87350k86284
$$ 480882 352709 606197 607827 -159019 79290 65296 378640 110323 -277027 -563311
1472e63311q2951L70169N13544j33475m78259K64190j38030m67642K64852J82261
$$ -563311 -646262 -276093 237451 103976 -374283 -110093 -248123 -715765 -450913 -268652
1462b68652K33210l01786K17473L09767k50070K31784j5679l28558l6250K12315
$$ -268652 -35442 -337228 -119755 190012 -60058 171726 156047 -172511 -208761 3554
1452C554N10407m60995n16050l92742j16439N56326Q75093l04100k04967M2415
$$ 3554 513961 52966 -463084 -855826 -972265 -415939 459154 155054 -49913 -7498
1442g498P6013Q2694L54047n89963j79158N86521q81549m5323R54441L3269N64109
$$ -7498 68515 151209 505256 -84707 -263865 322656 -558893 -604216 350225 383494 947603
1431I47603J1548m96734n2893m28795M85787M0713m97971K86117l76407j98479
$$ 947603 959151 462417 409524 -19271 466516 507229 9258 295375 -81032 -279511
1421b79511p578O88883n65726J36913M26227m55565r38502Q9814N09906m2373
$$ -279511 -287089 401794 -163932 -27019 399208 -56357 -994859 -905045 -395139 -437512
1411d37512K96459O9450n10700k43039M79094j319J20693m22359M35059M3397
$$ -437512 -141053 -71603 -582303 -825342 -346248 -347567 -226874 -649233 -214174 -170777
1401a70777j28509M48342n84211N95427J92578m98718l97386O18178j96065j55251
$$ -170777 -299286 149056 -435155 160272 352850 -145868 -543254 74924 -121141 -276392
1391b76392J15360j92739M95724p15979L32447K48750J30383k05789N0662p11723
$$ -276392 -161032 -353771 141953 -574026 -241579 7171 137554 -68235 -17573 -729296
1381g29296M41097M25945N36666k29682J440J60886j42198l80943q39910O01013
$$ -729296 -288199 137746 674412 444730 446170 607056 464858 83915 -755995 -154982
1371a54982M47343K30237k58037l4801J46269n04068K6911l01864J46430R5568
$$ -154982 292361 522598 264561 229760 376029 -128039 -101128 -402992 -256562 -160994
1361a60994j63965R4917M70118k430j08844p6150K98755N0483r38209M76986j17809
$$ -160994 -324959 -230042 240076 237646 128802 52652 351407 401890 -536319 -59333 -177142
1350a77142j89735q6387M17823J13392K48432j63363m72778l82360N34052K36233
$$ -177142 -366877 -453264 -35441 77951 326383 163020 -309758 -692118 -158066 78167
1340G8167J39846K72023J78118m97975M385L37928q67959K4348K16692J26892
$$ 78167 218013 490036 668154 170179 174564 512492 -355467 -331119 -114427 12465
1330A2465r8332m6999l00957K7092J50228J43849J74292P4407l38751k32101j31050
$$ 12465 -85867 -132866 -433823 -406731 -256503 -112654 61638 136045 -202706 -434807 -565857
1319e65857M99619j25015N77001K32538n77889l18507K63004j33758N2164l60385
$$ -565857 -66238 -191253 385748 618286 40397 -278110 -15106 -148864 -96700 -457085
1309d57085J99861m41137M40857M66664n89348O4501K91503j4676j35194M58506
$$ -457085 -257224 -698361 -257504 209160 -380188 -315687 -24184 -38860 -174054 284452
1299B84452K082O23189r12899L22983J52793J78641o41129j40904J123m45070
$$ 284452 286534 909723 -3176 319807 472600 651241 10112 -130792 -129669 -574739
1289e74739K04043K34170N41740l73132j39466J92648o605M98290k82717O8212
$$ -574739 -370696 -136526 405214 32082 -107384 85264 78659 576949 294232 362444
1279C62444L1339j44543l36482Q197m3986l81867L18606m89591J0127K66985O44560
$$ 362444 393783 249240 -87242 -79045 -123031 -504898 -186292 -675883 -665756 -398771 245789
1268B45789k30195o6379N97738m9456l44456o45143n3695L11915o2726L97685
$$ 245789 15594 -50785 546953 497497 153041 -492102 -545797 -233882 -296608 101077
1258A01077K4265L45894l39470J59788N036p17011P45379j33155J8793K38156
$$ 101077 125342 471236 131766 291554 296590 -420421 324958 191803 210596 448752
1248D48752r48671l79368M67325j5897R46106k31303k11552O7067k89504k79019
$$ 448752 -499919 -879287 -411962 -427859 518247 286944 75392 142459 -147045 -426064
1238d26064M4875L46320O3918j76681k22176J34860L39704j89090M45779L34292
$$ -426064 -381189 -34869 29049 -147632 -369808 -234948 104756 -84334 361445 695737
1228F95737o70005k21444J30343N65604n8791n75572N72817J9154o90380K15834
$$ 695737 25732 -195712 -65369 500235 441444 -134128 438689 457843 -232537 -16703
$$ [...]
##END NTUPLES=NMR SPECTRUM
##END=
