##TITLE=1H_EC-3333(4)
 CDCl3
 8 sc, 
 1.10.2024
##JCAMPDX= 6.0         $$ Bruker NMR JCAMP-DX V2.0
##DATA TYPE= NMR SPECTRUM
##DATA CLASS= NTUPLES
##ORIGIN= UXNMR, Bruker Analytische Messtechnik GmbH
##OWNER= root
$$ XWIN-NMR		Version 3.5
$$ Tue Oct  1 14:10:12 2024 Russian Standard Time (UT+4h)  she@DPX200
##.OBSERVE FREQUENCY= 200.1318
##.OBSERVE NUCLEUS= ^1H
##.ACQUISITION MODE= SIMULTANEOUS
##.ACQUISITION SCHEME= undefined
##.AVERAGES= 8
##.DIGITISER RES= 18
##SPECTROMETER/DATA SYSTEM= spect
##.PULSE SEQUENCE= zg30
##.SOLVENT NAME= DMSO
##.SHIFT REFERENCE= (INTERNAL, DMSO, 0, 21.0003)
##AUDIT TRAIL= $$ (NUMBER, WHEN, WHO, WHERE, WHAT)
$$ ##TITLE= Audit trail, XWIN-NMR		Version 3.5
$$ ##JCAMPDX= 5.01
$$ ##ORIGIN= Bruker BioSpin GmbH
$$ ##OWNER= she
$$ F:/spectra/data/she/nmr/H-F/1/pdata/1/auditp.txt
$$ ##AUDIT TRAIL=  $$ (NUMBER, WHEN, WHO, WHERE, WHAT)
(   1,<2024-10-01 14:09:00.06 +0400>,<she>,<DPX200>,
      <created by zg, POWCHK disabled, PULCHK disabled
       configuration hash MD5:
       00 E9 B6 7A A2 85 ED C7 34 08 36 98 17 FE 4E 26
       data hash MD5: 16K
       C1 CB 60 31 64 24 C6 28 B4 58 DF 8A 4C AA 12 24>)
(   2,<2024-10-01 14:09:02.10 +0400>,<she>,<DPX200>,
      <Start of raw data processing
       efp BC_mod = 2 LB = 0.24 FT_mod = 6 PKNL = 1 PHC0 = -25995.4 PHC1 = 6.787477 SI = 16K 
       data hash MD5: 16K
       C2 D3 F6 A5 4C F3 3E 32 18 89 50 B0 0E 9F 54 D6>)
(   3,<2024-10-01 14:09:20.98 +0400>,<she>,<DPX200>,
      <pk PHC0 = -9.545314 PHC1 = 14.8 
       data hash MD5: 16K
       F3 C3 6D 42 E8 33 C8 BA 1C 72 7D DB 73 2A EC CB>)
(   4,<2024-10-01 14:09:24.32 +0400>,<she>,<DPX200>,
      <abs ABSG = 5 
       data hash MD5: 16K
       F4 46 3D 26 D7 22 4E 9D 7F 98 E5 1E 8C DA 39 77>)
$$ ##END=
$$ 
$$ hash MD5
$$ A9 A6 38 85 CB D3 F8 61 20 01 B4 DC 9A 01 C1 72
##$RELAX= 
##$RELAX= 
##$RELAX= 
##$RELAX= 
##$RELAX= 
##$RELAX= 
$$ Bruker specific parameters
$$ --------------------------
##$DU= <F:/spectra>
##$EXPNO= 1
##$NAME= <H-F>
##$PROCNO= 1
##$TYPE= <nmr>
##$USER= <she>
##$AMP= (0..31)
100 100 100 100 100 100 100 100 100 100 100 100 100 100 100 100 100 100 
100 100 100 100 100 100 100 100 100 100 100 100 100 100 
##$AQSEQ= 0
##$AQ_mod= 1
##$AUNM= <au_zg>
##$AUTOPOS= <>
##$BF1= 200.13
##$BF2= 200.13
##$BF3= 200.13
##$BF4= 200.13
##$BF5= 200.13
##$BF6= 200.13
##$BF7= 200.13
##$BF8= 200.13
##$BYTORDA= 1
##$CFDGTYP= 0
##$CFRGTYP= 5
##$CHEMSTR= <none>
##$CNST= (0..31)
1 1 145 1 1 1 1 1 1 1 1 1 1 1 1 1 1 1 1 1 1 1 1 1 1 1 1 1 1 1 1 1 
##$CPDPRG= <>
##$CPDPRG1= <>
##$CPDPRG2= <>
##$CPDPRG3= <>
##$CPDPRG4= <mlev>
##$CPDPRG5= <mlev>
##$CPDPRG6= <mlev>
##$CPDPRG7= <mlev>
##$CPDPRG8= <mlev>
##$CPDPRGB= <>
##$CPDPRGT= <>
##$D= (0..31)
0 1.2 0 0 0 0 0 0 0 0.06 0 0.03 0 0 0 0 0.0002 0 0 0 0 0 0 0 0 0 0 0 0 
0 0 0 
##$DATE= 1727777339
##$DBL= (0..7)
120 120 120 120 120 120 120 120 
##$DBP= (0..7)
150 150 150 150 150 150 150 150 
##$DBP07= 0
##$DBPNAM0= <>
##$DBPNAM1= <>
##$DBPNAM2= <>
##$DBPNAM3= <>
##$DBPNAM4= <>
$$ [...]
##$SUBNAM3= <"">
##$SUBNAM4= <"">
##$SUBNAM5= <"">
##$SUBNAM6= <"">
##$SUBNAM7= <"">
##$SUBNAM8= <"">
##$SUBNAM9= <"">
##$SW= 24.0689170037331
##$SWIBOX= (0..15)
0 0 2 0 0 0 0 0 0 0 0 0 0 0 0 0 
##$SW_h= 4816.95568400771
##$TD= 16384
##$TD0= 1
##$TE= 0
##$TE2= 300
##$TE3= 300
##$TEG= 300
##$TL= (0..7)
0 120 120 120 120 120 120 120 
##$TP= (0..7)
150 150 150 150 150 150 150 150 
##$TP07= 0
##$TPNAME0= <>
##$TPNAME1= <>
##$TPNAME2= <>
##$TPNAME3= <>
##$TPNAME4= <>
##$TPNAME5= <>
##$TPNAME6= <>
##$TPNAME7= <>
##$TPOAL= (0..7)
0.5 0.5 0.5 0.5 0.5 0.5 0.5 0.5 
##$TPOFFS= (0..7)
0 0 0 0 0 0 0 0 
##$TUNHIN= 0
##$TUNHOUT= 0
##$TUNXOUT= 0
##$USERA1= <user>
##$USERA2= <user>
##$USERA3= <user>
##$USERA4= <user>
##$USERA5= <user>
##$V9= 5
##$VALIST= <valist>
##$VCLIST= <CCCCCCCCCCCCCCC>
##$VD= 0
##$VDLIST= <DDDDDDDDDDDDDDD>
##$VPLIST= <PPPPPPPPPPPPPPP>
##$VTLIST= <TTTTTTTTTTTTTTT>
##$WBST= 1024
##$WBSW= 4
##$XGAIN= (0..3)
0 0 0 0 
##$XL= 0
##$YL= 0
##$YMAX_a= 626591
##$YMIN_a= -515694
##$ZGOPTNS= <>
##$ZL1= 120
##$ZL2= 120
##$ZL3= 120
##$ZL4= 120
##$ABSF1= 21.02964
##$ABSF2= -3.039494
##$ABSG= 5
##$ABSL= 3
##$ALPHA= 0
##$AQORDER= 0
##$ASSFAC= 0
##$ASSFACI= 0
##$ASSFACX= 0
##$ASSWID= 0
##$AUNMP= <proc_1d>
##$AZFE= 0.1
##$AZFW= 0.1
##$BCFW= 0
##$BC_mod= 2
##$BYTORDP= 0
##$COROFFS= 0
##$CY= -3
##$DATMOD= 1
##$DC= 0
##$DFILT= <>
##$DTYPP= 0
##$F1P= 0
##$F2P= 0
##$FCOR= 1
##$FTSIZE= 16384
##$FT_mod= 6
##$GAMMA= 0
##$GB= 0
##$INTBC= 1
##$INTSCL= 3.70164e-10
##$ISEN= 128
##$LB= 0.24
##$LEV0= 0
##$LPBIN= 0
##$MAXI= 10000
##$MC2= 0
##$MEAN= 0
##$ME_mod= 0
##$MI= 1.114404
##$NCOEF= 0
##$NC_proc= -5
##$NLEV= 6
##$NOISF1= 3.799351
##$NOISF2= 2.8
##$NSP= 0
##$NTH_PI= 0
##$NZP= 0
##$OFFSET= 21.00026
##$PC= 1
##$PHC0= -26004.95
##$PHC1= 21.58748
##$PH_mod= 1
##$PKNL= yes
##$PPARMOD= 0
##$PSCAL= 0
##$PSIGN= 0
##$REVERSE= no
##$SF= 200.130005696403
##$SI= 16384
##$SIGF1= 3
##$SIGF2= 2
##$SINO= 5.538805
##$SIOLD= 16384
##$SREGLST= <1H.CDCl3>
##$SSB= 0
##$STSI= 16384
##$STSR= 0
##$SW_p= 4816.95568400771
##$SYMM= 0
##$S_DEV= 0
##$TDeff= 16384
##$TDoff= 0
##$TI= <>
##$TILT= no
##$TM1= 0
##$TM2= 0
##$TOPLEV= 0
##$USERP1= <user>
##$USERP2= <user>
##$USERP3= <user>
##$USERP4= <user>
##$USERP5= <user>
##$WDW= 1
##$XDIM= 16384
##$YMAX_p= 334283667
##$YMIN_p= -313954
$$ End of Bruker specific parameters
$$ ---------------------------------
##NTUPLES= NMR SPECTRUM
##VAR_NAME=  FREQUENCY,     SPECTRUM/REAL,   SPECTRUM/IMAG
##SYMBOL=    X,             R,               I
##VAR_TYPE=  INDEPENDENT,   DEPENDENT,       DEPENDENT
##VAR_FORM=  AFFN,          ASDF,            ASDF
##VAR_DIM=   16384,         16384,           16384
##UNITS=     HZ,            ARBITRARY UNITS, ARBITRARY UNITS
##FACTOR=    0.29402158847633, 1,            1
##FIRST=     4202.78203323068, 0,            0
##LAST=      -614.173650777033, 0,           0
##MIN=       -614.173650777033, -313954,     0
##MAX=       4202.78203323068, 334283667,    0
$$ Real data points
##PAGE= N=1
##DATA TABLE= (X++(R..R)), XYDATA
$$ [...]
7017A7012323l4027k38699l2832m2023K91627J71620K20304J75111K91395K81048
$$ 17012323 16978296 16739597 16706765 16664742 16956369 17127989 17348293 17523404 17814799 18095847
7007A8095847M45578M84345P18982O80026Q16710Q54019J227781J431277J734141
$$ 18095847 18541425 19025770 19744752 20424778 21241488 22095507 23323288 24754565 26488706
6998B6488706K265526K830950K762729K016833O54944r81191k074035j952868
$$ 26488706 28754232 31585182 34347911 36364744 37019688 36038497 33964462 32011594
6990C2011594j455660q36328m16501j89416K13889O22873J113265J660096K104232
$$ 32011594 30555934 29719606 29303105 29113689 29327578 29950451 31063716 32723812 34828044
6981C4828044K312243J322567k29228j632369k401782k126257j255789p16589
$$ 34828044 37140287 38462854 38233626 36601257 34199475 32073218 30817429 30100840
6973C0100840k89414J29539N78472Q84710J211455J831645K360939K863809K250561
$$ 30100840 29811426 29940965 30519437 31404147 32615602 34447247 36808186 39671995 41922556
6964D1922556O96950j479095k944575k985682k423076j699742j131342q38734
$$ 41922556 42619506 41140411 38195836 35210154 32787078 31087336 29955994 29117260
6956B9117260k12904K87902J046548J568267K194664K271844J053364n95011k500844
$$ 29117260 28904356 29192258 30238806 31807073 34001737 36273581 37326945 36731934 34231090
6947C4231090l432204l439142k828251k199063j773291j376966j077574q65419
$$ 34231090 30798886 27359744 24531493 22332430 20559139 19182173 18104599 17239180
6939A7239180q54522p16870o94078o61605m98668m07437k93171k64916k24504
$$ 17239180 16384658 15667788 14973710 14312105 13813437 13406000 13112829 12847913 12623409
6930A2623409k08578j73622j89010j97235o4494M2353q4995j59160l6422j90363
$$ 12623409 12414831 12241209 12052199 11854964 11790470 11832823 11747828 11588668 11552246 11361883
6920A1361883j23973l8404J1533l4533Q7558J68199J37395J69810J62635K07048
$$ 11361883 11237910 11199506 11211039 11176506 11264064 11432263 11569658 11739468 11902103 12109151
6910A2109151K73462K22969J70287R4665J83048Q8413M8487J39223L35035J82014
$$ 12109151 12382613 12605582 12775869 12870534 13053582 13141995 13190482 13329705 13664740 13846754
6900A3846754L84671N89539N88776O40712R10614R02332R28101R40280R68959
$$ 13846754 14231425 14820964 15409740 16050452 16961066 17863398 18791499 19731779 20700738
6891B0700738R01339J237643J509257K007744K537891L266178K925607J858858
$$ 20700738 21602077 22839720 24348977 26356721 28894612 32160790 35086397 36945255
6883C6945255K08181j247937j454580p41660L98587J395126J841487J065811l33898
$$ 36945255 37153436 35905499 34450919 33709259 34107846 35502972 37344459 38410270 38076372
6874C8076372k336547l353393l286655k776211j987145j399617j122438q13897
$$ 38076372 35739825 32386432 29099777 26323566 24336421 22936804 21814366 21000469
6866B1000469m47785k28510J26271J56296L00712M50412N79240N89590Q49229
$$ 21000469 20552684 20324174 20450445 20606741 20907453 21357865 21937105 22526695 23375924
6857B3375924J127683J623876K223410K823967L001745K250451N73174j017701
$$ 23375924 24503607 26127483 28350893 31174860 34176605 36427056 37000230 35982529
6849C5982529j669241j338224k90413Q14978J419592J174515n9961j780214l306918
$$ 35982529 34313288 32975064 32684651 33499629 34919221 36093736 36033775 34253561 30946643
6840C0946643l603897l200538k516182j849665j590235j283379j161861q58976
$$ 30946643 27342746 24142208 21626026 19776361 18186126 16902747 15740886 14881910
6832A4881910p61312o68611n39569m26177l50409k74181k41524j46517r0020r6715
$$ 14881910 14120598 13451987 12912418 12486241 12135832 11861651 11620127 11473610 11383590 11286875
6822A1286875J4976M0024K2464N9558O8855J40710J90211J45070P5267r0774p4974
$$ 11286875 11301851 11341875 11364339 11423897 11492752 11633462 11823673 11968743 12044010 11953236 11878262
6811A1878262k30027j5908j29822r8041Q5818J7733J57395j9735J22760J78648
$$ 11878262 11648235 11632327 11502505 11404464 11490282 11508015 11665410 11645675 11768435 11947083
6801A1947083K17688L36138N03845M65600O07767P00611R85134J136507J453977
$$ 11947083 12164771 12500909 13004754 13470354 14078121 14778732 15763866 16900373 18354350
6792A8354350J853247K127001J995773R49761l14385r48568r62986k31342L43528
$$ 18354350 20207597 22334598 24330371 25280132 24965747 24017179 23054193 22822851 23166379
6783B3166379O39601Q56719M19114o72261j521541j800319j451320r67968p18035
$$ 23166379 23805980 24662699 25081813 24409552 22888011 21087692 19636372 18668404 17950369
6774A7950369n21921k93574j04083l774L15511N03065O04580P28722P97967R44785
$$ 17950369 17428448 17134874 17030791 17027017 17342528 17845593 18450173 19178895 19976862 20921647
6764B0921647J288092J809077K280122K838158L188995K630402J239109n87545
$$ 20921647 22209739 24018816 26298938 29137096 32326091 34956493 36195602 35608057
6756C5608057j707861j740662r82492N8124J002995J105944L03986q52568k017658
$$ 35608057 33900196 32159534 31177042 31235166 32238161 33344105 33648091 32795523 30777865
6747C0777865k560375k369885j813156j543381j298409j093788q14026n17564
$$ 30777865 28217490 25847605 24034449 22491068 21192659 20098871 19284845 18767281
6739A8767281k73547j49449p5751J63940K87504J97249K17758M68178O60206R72196
$$ 18767281 18493734 18344285 18268534 18432474 18719978 18917227 19134985 19603163 20263369 21235565
6729B1235565J214205R65772J39778r25612j294573r91494m10234O528L05528
$$ 21235565 22449770 23415542 23555320 22629708 21335135 20343641 19933407 19939935 20245463
6720B0245463M04163k2238p60454j342233j507296j149490r77389o60004m83254
$$ 20245463 20649626 20627388 19866934 18524701 17017405 15867915 14890526 14230522 13747268
6711A3747268n17775n00852m07322l61373k75067j84502k65157k06295j80842
$$ 13747268 13229493 12728641 12321319 11959946 11684879 11500377 11235220 11028925 10848083
6702A0848083k11324r0499j25907l00035k24337k47784k76750k95975k97046j79931
$$ 10848083 10636759 10546260 10420353 10120318 9895981 9648197 9371447 9075472 8778426 8598495
6692H598495k67699k03248j86880q6182j64350r1307L9065P6859O8183J58587
$$ 8598495 8330796 8127548 7940668 7854486 7690136 7598829 7637894 7714753 7782936 7941523
6682G941523N1697j71630k78472k01745k51146j90781l13250k92151k13257k81084
$$ 7941523 7993220 7821590 7543118 7341373 7090227 6899446 6586196 6294045 6080788 5799704
6672E799704k3826j56615j95045j95939q3554J4338n9299j38539r6375j03120
$$ 5799704 5775878 5619263 5424218 5228279 5144725 5159063 5099764 4961225 4864850 4761730
6662D761730q5825j86945k59477j49095r0709j77117n5421o0741J9197k331k7227
$$ 4761730 4675905 4488960 4229483 4080388 3989679 3812562 3757141 3696400 3715597 3713266 3686039
6651C686039p4069J08151q9544j17294k38485j16467m7240j72289j34447k9289
$$ 3686039 3611970 3720121 3630577 3513283 3274798 3158331 3111091 2938802 2804355 2775066
6641B775066o3256p9142l5953q2136L7759q0336r3138k9394n6368j5502r6772
$$ 2775066 2711810 2632668 2596715 2514579 2552338 2472002 2378864 2349470 2293102 2277600 2180828
6630B180828l2101m6001j5016r1513j1999L1072q8216m2048n9103R5023l9448
$$ 2180828 2148727 2102726 2087710 1996197 1984198 2015270 1927054 1885006 1825903 1920926 1881478
6619A881478l5216J2367l4805N0504k2045r522k1434n5192l7448M819m6621j6644
$$ 1881478 1846262 1858629 1823824 1874328 1852283 1842761 1821327 1766135 1728687 1733506 1686885 1670241
6607A670241k3946j35565k8650J9375n1004l3087K7013M7056k7885o8777q524
$$ 1670241 1646295 1510730 1482080 1501455 1450451 1417364 1444377 1491433 1463548 1394771 1386247
6596A386247q1882o7776O8189n9379m5280M6504k404l05o0295O7160m7418K0634
$$ 1386247 1304365 1236589 1304778 1245399 1200119 1246623 1244219 1243914 1183619 1250779 1203361 1223995
6584A223995J01482o523k0840j6070J28606k0621R8121J2713m7415K4914n4203
$$ 1223995 1325477 1318954 1298114 1282044 1410650 1390029 1488150 1500863 1453448 1478362 1424159
6573A424159j00301o5653L3468o8578M8373l3520j9772l5350K8648L7995O9852
$$ 1424159 1323858 1258205 1291673 1223095 1271468 1237948 1218176 1182826 1211474 1249469 1319321
6562A319321l1862n0304p823r881K9274k2790L485r6522Q564M93J3651O4073l6470
$$ 1319321 1287459 1237155 1229332 1219451 1248725 1225935 1229420 1132898 1141462 1141955 1155606 1219679 1183209
6549A183209k559L8121O2910m3961p0095l2909j3651O039o8006n0901M6576l9973
$$ 1183209 1180650 1218771 1281681 1237720 1167625 1134716 1121065 1127104 1059098 1008197 1054773 1014800
6537A014800J550J36269o9593p8891N8108J11645n428P628J01733l014k6771O4811
$$ 1014800 1016350 1152619 1083026 1004135 1062243 1173888 1168460 1176088 1277821 1274807 1248036 1312847
6525A312847K8843J9922k7531p7121K1799N7943J3689L9270p478M6476J25928
$$ 1312847 1341690 1361612 1334081 1256960 1278759 1336702 1350391 1389661 1382183 1428659 1554587
6514A554587M14R4432N601J406m8253Q5308J28551P7473J08599M6987j1362n8135
$$ 1554587 1555001 1649433 1655034 1656440 1608187 1693495 1822046 1899519 2008118 2055105 2043743 1985608
6502A985608p9r911k0500k1664o0277l3741n5289n6346k1641r0420j56034n3417
$$ 1985608 1985529 1975618 1955118 1933454 1873177 1839436 1784147 1727801 1706160 1615740 1459706 1406289
6490A406289r6762j03309m6834P643M5944J7187J04199j4442j5014J6206K6798
$$ 1406289 1309527 1206218 1159384 1167027 1212971 1230158 1334357 1319915 1304901 1321107 1347905
6479A347905P8252R0605M1964M1282J085M7756N6087M4996N9858k2806q5462p6873
$$ 1347905 1426157 1516762 1558726 1600008 1601093 1648849 1704936 1749932 1809790 1786984 1701522 1624649
6467A624649p2284L8390K0671k5316J4761r1526r9725j30176l5504r6620j74636
$$ 1624649 1552365 1590755 1611426 1586110 1600871 1509345 1409620 1279444 1243940 1147320 972684
6456I72684q3685m2760M2009m0991K8201q4434q1148m8472O509K6178l1235n9918
$$ 972684 888999 846239 888248 847257 875458 791024 709876 661404 667913 694091 662856 602938
6444F02938p3856K033J0203J3354j10200m7070O7727p1681m4737Q0154m222l1088
$$ 602938 529082 531115 541318 554672 444472 397402 465129 393448 348711 428865 424643 393555
6432C93555J9361K8751k7044J4008o3835n249j533K9540m3623q3567l1256j5572
$$ 393555 412916 441667 414623 428631 364796 359547 358014 387554 343931 260364 229108 213536
6420B13536K0585M9938M1642M109m0641q3416l2486P1350K010k9764O411N1819
$$ 213536 234121 284059 325701 329810 289169 205753 173267 244617 246627 216863 223274 275093
6408B75093p7713j6054j8995K0607l09l0517K376L1159o7114P000k1964l5310
$$ 275093 197380 181326 162331 182938 182629 152112 154488 185647 118533 125533 103569 68259
6396F8259Q6197l415L5225q626R972K5128m1141j575J1717n8493m2894p1372M6314
$$ 68259 154456 151041 186266 177640 187612 212740 171599 170024 181741 123248 80354 8982 55296
6383E5296L4782M891N9161m6721r2517M3737o3853J2297L1976j7267R9268n6188
$$ 55296 90078 94969 154130 107409 14892 58629 -5224 7073 39049 21782 121050 64862
6371F4862k2122K4050L9993k6710J7183L2996o4907M379p5984M0024N6054n1731
$$ 64862 42740 66790 106783 80073 97256 130252 65345 69724 -6260 33764 89818 38087
6359C8087o3598O3180k5200M750O6963L9143j03034O1403j2328k5221R3028j08545
$$ 38087 -25511 37669 12469 17219 84182 123325 20291 81694 69366 44145 137173 28628
6347B8628j2539k9382L6441q845k6321N1617M8911N1026k3318K3279k4731p122
$$ 28628 16089 -13293 23148 14303 -12018 39599 88510 139536 116218 139497 114766 107644
6335A07644k0262q4777k3603R8430P145j17694O6289L2076k463k7255r955j7458
$$ 107644 87382 2605 -20998 77432 84577 -33117 33172 65248 62785 35530 25575 8117
6323H117j57211J02522L4889O2120M048n5028n5195M8637J09198p5205r7530N6090
$$ 8117 -149094 -46572 -11683 50437 54485 -543 -55738 -7101 102097 26892 -70638 -14548
6311a4548j2510N3962k8078J6505J6667n4310n3888n5111R5549R7258m4578r2791
$$ -14548 -27058 26904 -1174 15331 31998 -22312 -76200 -131311 -35762 61496 16918 -75873
6299g5873R7535l3446m3382L5014O1015o6653Q8614j0525o1879o99m8506o2065
$$ -75873 21662 -11784 -55166 -20152 40863 -25790 62824 52299 -9580 -10279 -58785 -120850
6287a20850P0526O5116m0720M5620K2648j659k3301k8397N3498k7989J3998K3184
$$ -120850 -50324 14792 -25928 19692 42340 40681 17380 -11017 42481 14492 28490 51674
6275E1674l2146m1636K3985N658J548R719N279J0636J1483n1097K4430P638K9525
$$ 51674 19528 -22108 1877 7535 9083 18802 24081 34717 46200 -4897 19533 27171 56696
6262E6696o4463k4516N4228O8800J7869k4594n0583O4367K7605k6740J3737o5078
$$ 56696 -7767 -32283 21945 90745 108614 84020 33437 97804 125409 98669 112406 47328
6250D7328O2821r6387j8939M4746q268O0022J2532r4167K6039r5048J7932M923
$$ 47328 110149 13762 -5177 39569 31301 91323 103855 9688 35727 -59321 -41389 -36466
6238c6466O5349Q1142m1112n8486J0377J3737l7655K8578M0693k8763r859M6423
$$ -36466 28883 110025 68913 10427 20804 34541 -3114 25464 66157 37394 27535 73958
6226G3958j4497k6730n2414R4208J3247l1099K6204q612L6293k9677P2347l5748
$$ 73958 59461 32731 -19683 74525 87772 56673 82877 74265 110558 80881 153228 117480
6214A17480j9141M228k119r1044P0507O8010o5919O2570m554o0330k0777J9343
$$ 117480 98339 102567 100448 9404 79911 147921 82002 144572 140018 79688 58911 78254
6202G8254L8596m2727o1714K4707J32370P393p1227j9997q6273J12574n9608j6219
$$ 78254 116850 74123 12409 37116 169486 176879 105652 85655 -618 111956 52348 36129
6190C6129K6984r5448K0038l4851l0679J0547P3415l3130M1215L0671o9595P0063
$$ 36129 63113 -32335 -12297 -47148 -77827 -67280 6135 -26995 14220 44891 -24704 45359
6178D5359M6787p3390k1842J9794k456M8291p2568m3582n063N5695k4673k8092
$$ 45359 92146 18756 -3086 16708 14252 62543 -10025 -53607 -58670 -2975 -27648 -55740
6166e5740N4188Q9738j6963m1285m6528j473j5150l6889Q2248Q6787k5357n1701
$$ -55740 -1552 88186 71223 29938 -16590 -18063 -33213 -70102 12146 98933 73576 21875
6154B1875j12425L5438Q3272M6283r5453J5093L56j888J8537O2156n7073r8840
$$ 21875 -90550 -55112 28160 74443 -21010 -5917 -5561 -7449 11088 73244 16171 -82669
6142h2669l73n0255R2982Q7760r0024K6812l8140k4645Q1079M2013j419l0561
$$ -82669 -83042 -133297 -40315 47445 -42579 -15767 -53907 -78552 2527 44540 43121 12560
6130A2560p52L1052l72p9053J2600K5227N366M0105o0922K8820P0741p6652l0712
$$ 12560 11808 42860 42488 -36565 -23965 1262 6628 46733 -14189 14631 85372 8720 -21992
6117b1992R1206j9972m9935k3419M6915j2018K2838L8547q418M404j42988J1895
$$ -21992 69214 49242 -693 -24112 22803 10785 33623 72170 63752 68156 -74832 -62937
6105f2937j0432M3351j04258O8152P576j1659K4190l4465l3110J26342J0084o725
$$ -62937 -73369 -30018 -134276 -66124 -58548 -70207 -46017 -80482 -113592 12750 22834 16109
6093A6109N1838M0562n3875j5813J5132o4144L6514k4487L471L8971m4144l752
$$ 16109 67947 108509 54634 38821 53953 -10191 26323 1836 5307 44278 134 -3618
6081c618N7786N191p8645j2154M0820J6217n28k2668M907r541p2302O509L5377
$$ -3618 54168 59359 -19286 -31440 9380 25597 25069 2401 7308 -2233 -74535 -68026 -32649
6068c2649m444o250j8882K8953Q6133k8503n4218j637j8220N8131K960Q141J3220
$$ -32649 -37093 -43343 -62225 -33272 52861 24358 -29860 -31497 -49717 8414 11374 19515 32735
6055C2735r5131K8545k4779J9994K6035P2930L3433o8345J9948q1260O5167m5061
$$ 32735 -62396 -33851 -58630 -38636 -12601 60329 93762 25417 45365 -35895 29272 -15789
6043a5789O2056q045j3217R6085k9542o3254O629N4904O728o836q5752k8674O2756
$$ -15789 46267 38222 25005 121090 91548 28294 34923 89827 96555 89719 3967 -24707 38049
6030C8049k2713L9160K6860j8757J7441p3278N3056R1305m3933J518M9815J0872
$$ 38049 15336 54496 81356 62599 80040 6762 59818 151123 107190 108708 158523 169395
6018A69395q507L4845k0591K4271o623J6060l7709J4273O4268m7784k556M9241
$$ 169395 160888 195733 175142 199413 192790 208850 171141 185414 249682 201898 199342 248583
6006B48583K0796j2355L4635J7751O3665J0791L410o5605j7574M9763o623J7880
$$ 248583 269379 257024 291659 309410 373075 383866 387276 321671 304097 353860 347237 365117
5994C65117M6771j2194m8977O0426P7187k6871L4454O3750L3410R5575J90535
$$ 365117 411888 399694 350717 411143 488330 461459 495913 559663 593073 688648 879183
5983H79183O5370J11745Q8472R7649J02545M1271j2485j8923k2338p7570j96706
$$ 879183 944553 1056298 1144770 1242419 1344964 1386235 1373750 1354827 1332489 1254919 1058213
5972A058213q2527j36874k6025n8313j04447l9445Q236j5471l8998k4640k9541
$$ 1058213 975686 838812 812787 754474 650027 610582 618818 603347 564349 539709 510168
5961E10168Q2891j4813r11j9553l4308J11104j0780M570K1908K7011K5121K163
$$ 510168 593059 578246 577335 557782 523474 634578 623798 628368 650276 677287 702408 704571
5949G04571L2167K4674J23260Q8152J07994K1879J29629J00657J38776L3101L1683
$$ 704571 736738 761412 884672 972824 1080818 1102697 1232326 1332983 1471759 1504860 1536543
5938A536543j5122M147O7708l6232k28406j12025o6701j04679l4457K4628o4624
$$ 1536543 1521421 1525568 1593276 1557044 1328638 1216613 1149912 1045233 1010776 1035404 970780
5927I70780p1714M2213j05526J9824J47253K1890O5564m095j0548N6806k6180
$$ 970780 899066 941279 835753 855577 1002830 1024720 1090284 1086189 1075641 1132447 1106267
5916A106267m4953p582j724j3823k2608m398n6195Q91N8425k4542L92R1253l8399
$$ 1106267 1061314 1053732 1052008 1038185 1015577 1011179 954984 955875 1014300 989758 990150 1081403 1043004
5903A043004L2595J5992L2128R343P3324J34118L9310L8917J14875m4039j3910
$$ 1043004 1075599 1091591 1123719 1133062 1206386 1340504 1379814 1418731 1533606 1489567 1475657
5892A475657J37128J16694Q4623J08736Q025P2434N0195K9674N4463O4821j4081
$$ 1475657 1612785 1729479 1814102 1922838 1930863 2003297 2053492 2083166 2137629 2202450 2188369
5881B188369n195j6597o263k8549k6203O5543j38966r7552q9533l4740J8196M2144
$$ 2188369 2183174 2166577 2160314 2131765 2105562 2171105 2032139 1934587 1845054 1810314 1828510 1870654
5869A870654L1796N8563Q0865P4464m0782J42347L5506l4804n0640n8031j09598
$$ 1870654 1902450 1961013 2041878 2116342 2075560 2217907 2253413 2218609 2167969 2109938 2000340
5858B000340j45976j12883j99606j30060n527j16148j24987j1821n5255o6335
$$ 2000340 1854364 1741481 1541875 1411815 1406288 1290140 1165153 1153332 1098077 1031742
5848A031742l6795r0592k2938J911R11K6484n5159P398M771k447J6632l1155J2241
$$ 1031742 994947 904355 881417 883328 884239 910723 855564 862962 867733 865286 881918 850763 863004
5835H63004K4440o7588M9260N1895l6131J3195r7581k4283m1231J9062O0361K62
$$ 863004 887444 819856 869116 921011 884880 898075 800494 776211 734980 754042 814403 814665
5823H14665K4391J0601J8034n0214P3772k3256k0367q408O4268J4491J4423l6037
$$ 814665 839056 849657 867691 817477 891249 867993 847626 839218 903486 917977 932400 896363
5811H96363R3707N1763O0768N5704R0559J02715Q3170J86689R6725R6249j18559
$$ 896363 990070 1041833 1102601 1158305 1248864 1351579 1434749 1621438 1718163 1814412 1695853
5800A695853N7075L4853p446q5093r9433j86334k2729p3143l1738r2059j38363
$$ 1695853 1752928 1787781 1780335 1695242 1595809 1409475 1386746 1313603 1281865 1189806 1051443
5789A051443J2103j18543L1269j6400m0110N3080l0251p6358j570o215r8063L4643
$$ 1051443 1063546 945003 976272 959872 919762 972842 942591 866233 864663 858448 760385 795028
5777G95028K5974p821j9558R1978J300j07908K4055K9718j8656P6681J18526O1485
$$ 795028 821002 813181 793623 885601 886901 778993 803048 832766 814110 890791 1009317 1070802
5765A070802j4316O7998n2518J02054k5966j169R8436k3156K4847J50096J00200
$$ 1070802 1056486 1124484 1071966 1174020 1148054 1146885 1245321 1222165 1247012 1397108 1497308
5754A497308m7952N7350J1551N5843o4830P4928J21286k6145J30682Q4202R7872
$$ 1497308 1449356 1506706 1518257 1574100 1509270 1584198 1705484 1679339 1810021 1894223 1992095
5743A992095R0448P4445M4402P9433J32124J21134M2601J01851J17765J58334
$$ 1992095 2082543 2156988 2201390 2280823 2412947 2534081 2576682 2678533 2796298 2954632
5733B954632J95829J66457K77995K66891K19659L22579M68262L10836J71832m7975
$$ 2954632 3150461 3316918 3594913 3861804 4081463 4404042 4872304 5183140 5354972 5306997
5723E306997k61805l27509m29347m00305k93591k34764k24436k27732j65075p8190
$$ 5306997 5045192 4717683 4288336 3888031 3594440 3359676 3135240 2907508 2742433 2664243
5713B664243q400m5267k6082r4373j0196n5657N9563R4254P5254P9811O0229J5470
$$ 2664243 2655843 2610576 2584494 2490121 2479925 2424268 2483831 2578085 2653339 2733150 2793379 2808849
5701B808849n9382j78543j87686q7919k36840j85146m4151j64634p1403j8436
$$ 2808849 2749467 2570924 2383238 2295319 2058479 1873333 1829182 1664548 1593145 1574709
5691A574709j35162j43250j21792k7663o750l5609j5439M809n8604o0871l7507
$$ 1574709 1439547 1296297 1174505 1146842 1140092 1104483 1089044 1093853 1035249 974378 936871
5680I36871n3361P0519k7987l2418O8786J1406m6054K5520j01675L4173O1637
$$ 936871 883510 954029 926042 893624 962410 973816 927762 953282 851607 885780 947417
5669I47417n9271j4009K3124j7137Q508n2715K0865j38002m5883N3505J482n0639
$$ 947417 888146 874137 897261 880124 888632 835917 856782 718780 672897 726402 727884 677245
5657F77245o8204p6955L3401k6501n2650k1041M2663k7225J3699q7188k0700N038
$$ 677245 609041 532086 565487 538986 486336 465295 507958 480733 494432 407244 386544 391582
5645C91582K0520l1585j6719L1106p6279j9971J4714N0501N961k8460r7050k0183
$$ 391582 412102 380517 363798 394904 318625 298654 313368 363869 369830 341370 244320 224137
5633B24137M1671N0916r311j11413l2184J27204p2453L5137K5857r9614j986K3559
$$ 224137 265808 316724 307413 196000 163816 291020 218567 253704 279561 179947 177961 201520
5621B01520m5286N9114K4779o8604J8431k5433N5498Q401m8069K0588L5723p72
$$ 201520 156234 215348 240127 171523 189954 164521 220019 228420 180351 200939 236662 235890
5609B35890l1517j3156m1261M5717K3318p0715q472O9918K1813k4097j05726L9731
$$ 235890 204373 191217 149956 195673 218991 148276 139804 209722 231535 207438 101712 141443
5597A41443K8995J7171P7350L0853p7769N7533K6362J6930p3569R5520M562l8789
$$ 141443 170438 187609 264959 295812 218043 275576 301938 318868 245299 340819 345381 306592
5585C06592j15052K704o0678O3710m4779K1946L5498p1776j5744O059p195m7311
$$ 306592 191540 194244 133566 197276 152497 174443 209941 138165 122421 128480 121285 73974
5573G3974j2151O3703J05779l6387j04027J15762m4001l7996L2049n2650J6827
$$ 73974 61823 125526 231305 194918 90891 206653 162652 124656 156705 104055 120882
5562A20882K3732L0875k1961l0856k4919O2355j6547q5601M1735O6722k8334j4615
$$ 120882 144614 175489 153528 122672 97753 160108 143561 57960 99695 166417 138083 123468
5550A23468K6250K6274o1140J3025k3137M2479j5802L8743r39k098m4996J5965
$$ 123468 149718 175992 114852 127877 104740 147219 131417 170160 169221 167123 122127 138092
5538A38092j3925l7799K9312J7104n7529N9252M0884l3413k756k3104m0641l1985
$$ 138092 124167 86368 115680 132784 75255 134507 175391 141978 139222 116118 75477 43492
5526D3492M5927q142l6349N7113R9028o6127j4709J5314o1931L6556r71M1773
$$ 43492 89419 81277 44928 102041 201069 134942 120233 135547 73616 110172 109201 150974
5514A50974n3108k8619M7799j1481M9249k368J4667j7223k2717N3721o493K2775
$$ 150974 97866 69247 117046 105565 154814 152446 167113 149890 127173 180894 174401 197176
5502A97176l7623k9236P290k6019J0276Q4676o9758n6647L4139n1566m2712M7227
$$ 197176 159553 130317 137607 111588 121864 206540 136782 80135 114274 62708 19996 67223
5490F7223q5M6587l061m9473L5083m2403J7739O1291K642J869L0536o3302j2614
$$ 67223 67138 113725 110664 61191 96274 53871 71610 132901 135543 137412 167948 104646 92032
5477I2032K7110l2722j3989K3850N0501P20q4961N0275M7766M21m5774p142J8659
$$ 92032 119142 86420 72431 96281 146782 147502 62541 112816 160582 161003 115229 108087 126746
5464A26746L279P6903n9623M336m17r3230J49797m2993p9191J1999M6335P873
$$ 126746 130025 206928 147305 151641 151224 57994 207791 164798 85607 97606 143941 151814
5452A51814n1760j0729K2984L6825l5773N2202n4944J3446j9602j1406J2978j0107
$$ 151814 100054 89325 112309 149134 113361 165563 110619 124065 104463 93057 106035 95928
5440I5928N4821m2025L7117P0330j39745J1735j3363O380M6544k2273N7534M9623
$$ 95928 150749 108724 145841 216171 76426 88161 74798 81178 127722 105449 162983 212606
5428B12606K4285l6063l3328r1013N3422l8363p62N9271k6906j2793k8090K45
$$ 212606 236891 200828 167500 76487 129909 91546 90784 150055 123149 110356 82266 82511
5416H2511J921o1313K9167L6533M8998P076n104J2356j09738O6314j838o2156
$$ 82511 84432 23119 52286 88819 137817 144893 139789 152145 42407 108721 106883 44727
5404D4727k3535R1270j4045K3063K0101K3695Q0256q1905l7001L6243J2736J662
$$ 44727 21192 112462 98417 121480 141581 165276 245532 163627 126626 162869 175605 177267
5392A77267j9144R9903l5977M1363k6039j5712j4957K6833k2223j7910j9126K8807
$$ 177267 158123 258026 222049 263412 237373 221661 206704 233537 211314 193404 174278 203085
5380B03085m047J1860k8309L0755l2660j442P7049K5484l1739k7773O1643J764
$$ 203085 199038 210898 182589 213344 180684 179242 256291 281775 250036 222263 283906 285670
5368B85670r3836m2296M4395L2202J5563o800j12610K5574J02921l079l2183l9836
$$ 285670 191834 149538 193933 226135 241698 234898 122288 147862 250783 247704 215521 175685
5356A75685P8989p1933n1447O481J21232Q714m9703J91j6272K9779L570J6501
$$ 175685 254674 182741 131294 137775 259007 267721 218018 218209 201937 231716 235286 251787
5344B51787M8044q11P888o9832M4734j2322L3231l321J1019J1499N8631m6796
$$ 251787 299831 299020 306908 237076 281810 269488 302719 299398 310417 321916 380547 333751
5332C33751n218k4605k734r4139O3009K9695K5161J6972J8321P6796n5318j9447
$$ 333751 328533 303928 301194 207055 270064 299759 324920 341892 360213 437009 381691 362244
5320C62244J6576k8751l889J0080K1917m6831M7934k1388K6625l6581l9418m0612
$$ 362244 378820 350069 346180 356260 378177 331346 379280 357892 384517 347936 308518 267906
5308B67906r354k7385O2146O7268K0217K5518P369l3284o5362M7123M3294L6482
$$ 267906 258552 231167 293313 360581 380798 406316 413685 380401 315039 362162 405456 441938
5296D41938J0693p9889N111K61N517L1063o0242P3505o3190J6709R3581k1395
$$ 441938 452631 372742 377853 378114 383631 414694 354452 427957 364767 381476 475057 453662
5284D53662l9680m391o2208M9213M4618q4099L7489l314k5947L6962K6968j0661
$$ 453662 413982 409591 347383 396596 441214 357115 394604 391290 365343 402305 429273 418612
5272D18612M6159J5740j14075M9287J05349m4370j657k4340m9346J07704N1264
$$ 418612 464771 480511 366436 415723 521072 476702 475045 450705 401359 509063 560327
5261E60327k846l3047q278M4551L5831J9393J5361l46Q400K5922N0139J5506l1417
$$ 560327 557481 524434 516156 560707 596538 615931 631292 630946 639346 665268 715407 730913 699496
5248F99496O186O5219P39O2757n848j0101l9693l2169m298K8550j6099J6199J12028
$$ 699496 705682 770901 771640 834397 828549 818448 778755 746586 742288 770838 754739 770938 882966
5235H82966M6272j26816Q9903J1971j6698K2429q4365O2973M9147N0243l4342
$$ 882966 929238 802422 892325 904296 887598 910027 825662 888635 937782 988025 953683
5224I53683O322K0975l6453j6395l189M3822M2016M8171l6837K7282m0620Q149
$$ 953683 960005 980980 944527 928132 924943 968765 1010781 1058952 1022115 1049397 1008777 1016926
5212A016926m0754Q4311j8635Q6423l9857q5948Q5710r806K6311J1956K2721k3640
$$ 1016926 976172 1060483 1041848 1128271 1088414 1002466 1088176 1078370 1104681 1116637 1139358 1115718
5200A115718K8051P5976K5813p8097O4692K2965k4866p5603j1056P9526o961J5963
$$ 1115718 1143769 1219745 1245558 1167461 1232153 1255118 1230252 1154649 1143593 1223119 1216158 1232121
5188A232121J6659j2713P3706L6229j07366P7848j4050r338o5335M2542Q1002
$$ 1232121 1248780 1236067 1309773 1346002 1238636 1316484 1302434 1293096 1227761 1270303 1351305
5177A351305k4460l1772j7833O9819M6750N1478k2968L747j5212L3111O4208Q4968
$$ 1351305 1326845 1295073 1277240 1347059 1393809 1445287 1422319 1426066 1410854 1443965 1508173 1593141
5165A593141N8716M9986L2632L3137M4027M7447P8405k0786M0912o6411j05839
$$ 1593141 1651857 1701843 1734475 1767612 1811639 1859086 1937491 1916705 1957617 1891206 1785367
5154A785367J4412p0049q1380M2110l0229O7139k3925r5363q9819P9003p0669
$$ 1785367 1799779 1729730 1648350 1690460 1660231 1727370 1703445 1608082 1518263 1597266 1526597
5143A526597m9127N8858M981Q4347j6479J6339l1074K0702j2720R3182o7149L1694
$$ 1526597 1477470 1536328 1541309 1625656 1609177 1625516 1594442 1615144 1602424 1695606 1628457 1660151
5131A660151o102K9174O6994j5688q917J9578r690O705O8191P2184k82P3079O9410
$$ 1660151 1654049 1683223 1750217 1734529 1725612 1745190 1735500 1742205 1810396 1882580 1882298 1955377 2024787
5118B024787P4727R1810j1419J18019J12882J6636J26453p3973j555J31992p6203
$$ 2024787 2099514 2191324 2179905 2297924 2410806 2427442 2553895 2479922 2478367 2610359 2534156
5107B534156L3130M3665j27030p5354p3666M1366k7871r1483k5167k0437j8806
$$ 2534156 2567286 2610951 2483921 2408567 2334901 2376267 2348396 2256913 2231746 2211309 2192503
5096B192503R9613j9897L7394n4077K7123O7146o8409j6935J27631p384o6573
$$ 2192503 2292116 2272219 2309613 2255536 2282659 2349805 2281396 2264461 2392092 2384708 2318135
5085B318135R6483N9701n1769O7305J09818O9390J07370L735J17237O3233R5999
$$ 2318135 2414618 2474319 2422550 2489855 2599673 2669063 2776433 2780168 2897405 2960638 3056637
5074C056637Q4662N9237P4184Q8044P5922J79484R1980J01158J96335J43059J76841
$$ 3056637 3141299 3200536 3274720 3362764 3438686 3618170 3710150 3811308 4007643 4150702 4327543
5063D327543J90258L66168K71243L87779M38210L70869J18871K535P3096K1375
$$ 4327543 4517801 4883969 5155212 5542991 5981201 6352070 6470941 6473476 6546572 6567947
5053F567947K49953L36685L73809N11912M66822N27641L77033J27793N3613J7361
$$ 6567947 6817900 7154585 7528394 8040306 8507128 9034769 9411802 9539595 9593208 9610569
5043I610569J10866k9619O3389R1229K71363L96218L54850L08932K5243M2232
$$ 9610569 9721435 9691816 9755205 9846434 10117797 10514015 10868865 11177797 11203040 11245272
5033A1245272K51825J57747Q2040J05417R6380j23995l4923j79558l55529l38844
$$ 11245272 11497097 11654844 11736884 11842301 11938681 11814686 11779763 11600205 11244676 10905832
5023A0905832j89246q7347m8289J97710K32031L59584K02925J41374r9787k00197
$$ 10905832 10716586 10629239 10580950 10778660 11010691 11370275 11573200 11714574 11614787 11414590
5013A1414590r5010j90151k34018j60939j75987k19489q0383p9152O1252Q0964
$$ 11414590 11319580 11129429 10895411 10734472 10558485 10338996 10258613 10179461 10240713 10321677
5003A0321677J19687K07066K24086K64259L00452L48368M43460M19800L56269
$$ 10321677 10441364 10648430 10872516 11136775 11437227 11785595 12229055 12648855 13005124
4994A3005124L52399M17302M08502L51868M34014M21138M74394M57234N41786
$$ 13005124 13357523 13774825 14183327 14535195 14969209 15390347 15864741 16321975 16863761
4985A6863761N03219P21544O53000O78471Q18036P67301R42932J043780J214322
$$ 16863761 17366980 18088524 18741524 19419995 20238031 21005332 21948264 22992044 24206366
4976B4206366J230046J400497J595096J702663J912636K309830K502789K849292
$$ 24206366 25436412 26836909 28432005 30134668 32047304 34357134 36859923 39709215
4968C9709215L289271M026273M966689N912544O426521O170744L643610Q11038
$$ 39709215 42998486 47024759 51991448 57903992 64330513 70501257 74144867 74955905
4960G4955905r13384j071275J39447J546641K969868M364591N113938M579866
$$ 74955905 74042521 72971246 73110693 74657334 77627202 81991793 87105731 91685597
4952I1685597L737535L642597M745184O055201N842161L646047N30873j998964
$$ 91685597 95423132 99065729 103810913 109866114 115708275 119354322 119885195 117886231
4944A17886231k926983k503807j546451j489273k461151k644255k134811l43159
$$ 117886231 114959248 112455441 110908990 109419717 106958566 104314311 102179500 101836341
4936A01836341J991506L955388N519397N839624M279685J881660M68441K4716
$$ 101836341 103827847 107783235 113302632 119142256 123421941 125303601 125772042 125796758
4928A25796758l27860k249716n369164q168163r343521r012232p706581o348919
$$ 125796758 125468898 123219182 117850018 109681855 100338334 91326102 83619521 77270602
4920G7270602n039110l857454k900087j913716j219239n49069K46407R42118J656310
$$ 77270602 72231492 68374038 65473951 63560235 62340996 61791927 62038334 62980452 64636762
4911F4636762K033389J850057Q20453j027720l179443m519730m992785m858440
$$ 64636762 66670151 68520208 69340661 68312941 65133498 60613768 55620983 50762543
4903E0762543m254656l792308l260588k787089k458346k063283j701265j607700
$$ 50762543 46507887 42715579 39454991 36667902 34209556 32146273 30445008 28837308
4895B8837308j418774j157632j093138r94749r29114r09306q36199q20376o89361
$$ 28837308 27418534 26260902 25167764 24173015 23243901 22334595 21498396 20678020 19988659
4886A9988659p02264p42320o61566n75014n73310n43210n30184m86415m36963
$$ 19988659 19286395 18544075 17882509 17307495 16734185 16190975 15660791 15174376 14737413
4877A4737413m52296l59596m21355l56081k15877l32128l10846l49223k50066
$$ 14737413 14285117 13925521 13504166 13148085 12932208 12600080 12289234 11940011 11689945
4868A1689945k42736l21848l08667l09739k38532k93346k02707k10520k43209
$$ 11689945 11447209 11125361 10816694 10506955 10268423 9975077 9772370 9561850 9318641
4859I318641j67344m1268r8265m1251o7512j11478n2894L7299J5197r3465j09400
$$ 9318641 9151297 9110029 9011764 8970513 8903001 8791523 8738629 8775928 8791125 8697660 8588260
4848H588260p6906j26614m9752o8990j21037k40349r0886l4107q4438p3960q657
$$ 8588260 8511354 8384740 8334988 8265998 8144961 7904612 7813726 7779619 7695181 7621221 7612564
4837G612564R8741o9802L4101n460L8763J31130J18495J20835L0853K9214j39325
$$ 7612564 7711305 7641503 7675604 7670144 7708907 7840037 7958532 8079367 8110220 8139434 8000109
4826H000109j08955j82048j83676k21081j60768j61956M7664j41529j16875n885
$$ 8000109 7891154 7709106 7525430 7304349 7143581 6981625 7029289 6887760 6770885 6765000
4816F765000K4556j13599p6042L0147L758r958P6309J4881r5606j13348o0636
$$ 6765000 6789556 6675957 6599915 6630062 6633820 6623862 6700171 6715052 6619446 6506098 6445462
4805F445462q4175j03683j670j75413j22633m2421q9745l0369n8026j11739l6846
$$ 6445462 6361287 6257604 6255934 6080521 5957888 5915467 5825722 5795353 5737327 5625588 5588742
4794E588742p4853n0650o0261L0593j53652q3098J07661j1849K5375p1692j9770
$$ 5588742 5513889 5463239 5402978 5433571 5279919 5196821 5304482 5292633 5318008 5246316 5226546
4783E226546Q8217l6193P7168k8111n1914j0865N2354l3666R1106N5468k2926
$$ 5226546 5314763 5278570 5355738 5327627 5275713 5264848 5317202 5283536 5374642 5430110 5407184
4772E407184J2215q0583m4794L9391o236M1873K9670O2888R9165p568M4716K0739
$$ 5407184 5419399 5338816 5294022 5333413 5327177 5369050 5398720 5461608 5560773 5553205 5597921 5618660
4760E618660R9572J06876m892o785P9147M752M726L8401k8455l7851k9823M4454
$$ 5618660 5718232 5825108 5820216 5813431 5892578 5897330 5902056 5940457 5912002 5874151 5844328 5888782
4748E888782J714l5153J391j1082N074J4560L2015K0990Q6191L3085Q1089j0327
$$ 5888782 5890496 5855343 5856734 5845652 5850726 5865286 5897301 5918291 6004482 6037567 6118656 6108329
4736F108329J20209l2526o5843L8910K8975J11494K273P7466o1633R1394J7917
$$ 6108329 6228538 6196012 6130169 6169079 6198054 6309548 6311821 6389287 6327654 6419048 6436965
4725F436965M9849M2823P7572L7306R8102P2005J78314J43822J21374O165R6082
$$ 6436965 6486814 6529637 6607209 6644515 6742617 6814622 6992936 7136758 7258132 7264297 7360379
4714G360379Q0231J37816N1742R3841R3361J49296K14594J66520J39472J4585
$$ 7360379 7440610 7578426 7630168 7724009 7817370 7966666 8181260 8347780 8487252 8501837
4704H501837O2728P4405J5616Q6247J63950J35433J25947J84349J10053J46227
$$ 8501837 8564565 8638970 8654586 8740833 8904783 9040216 9166163 9350512 9460565 9606792
4694I606792J67665J56681J97452K72215J48605J05396K23480J92045J71070K49575
$$ 9606792 9774457 9931138 10128590 10400805 10549410 10654806 10878286 11070331 11241401 11490976
4684A1490976J90593J31145M9332L7564J38128K25379K08099Q9682J40893R2218
$$ 11490976 11681569 11812714 11862046 11899610 12037738 12263117 12471216 12560898 12701791 12794009
4674A2794009J26639K00884J19672J90428K30586L41427L01383M40642M84769
$$ 12794009 12920648 13121532 13241204 13431632 13662218 14003645 14305028 14745670 15230439
4665A5230439N34626O35539M97577N90650N68869N56686N51392O50217Q16498
$$ 15230439 15765065 16400604 16898181 17488831 18057700 18614386 19165778 19815995 20632493
4656B0632493R24076R07554Q08554P36542P55878Q54235Q87792J164659J420726
$$ 20632493 21556569 22464123 23272677 24009219 24765097 25619332 26507124 27671783 29092509
4647B9092509J571675J620570J677230J743139J837627K153144K458169K677461
$$ 29092509 30664184 32284754 33961984 35705123 37542750 39695894 42154063 44831524
4639D4831524K641617L028154L300457L910656M538598M743077L833838K082926
$$ 44831524 47473141 50501295 53801752 57712408 62251006 66994083 70827921 72910847
4631G2910847k28247j946862k665406k346270j640749o99192k4761L95105P83281
$$ 72910847 72682600 70735738 68070332 65724062 64083313 63384121 63359360 63754465 64537746
4622F4537746J124497J702935K699672L914385N198604O523458P260592O501797
$$ 64537746 65662243 67365178 70064850 73979235 79177839 85701297 92961889 99463686
4614I9463686L603419r37903n104306p149550p213696o287532n232146m527050
$$ 99463686 103067105 102129202 97024896 89875346 82661650 76374118 71141972 66614922
4606F6614922l737126k821769j878386j218521m18120J63508P78663J428516K009366
$$ 66614922 62877796 60056027 58177641 56959120 56541000 56704508 57483171 58911687 60921053
4597F0921053K099563J587955R8537j711729l176014l973726l903231l614696
$$ 60921053 63020616 64608571 64707108 62995379 59819365 55845639 51942408 48327712
4589D8327712l176821k721080k383474k016474j580802j242388j032354p59275
$$ 48327712 45150891 42429811 40046337 38029863 36449061 35206673 34174319 33415044
4581C3415044p84276p88740n51170o48357n41659m58764k72422k82402j41285
$$ 33415044 32630768 31842028 31290858 30642501 30100842 29642078 29369656 29087254 28945969
4572B8945969m3390n9783Q6473O0424J70621K70805L45456M88573N60447O38648
$$ 28945969 28902579 28842796 28929269 28989693 29160314 29431119 29776575 30265148 30825595 31464243
4562C1464243Q44767R29409J258597J543406J680329J300149J029623Q76124P19412
$$ 31464243 32309010 33238419 34497016 36040422 37720751 39020900 40050523 40926647 41646059
4553D1646059P70215Q37787J181137J454115J528599J609103J866325K088916
$$ 41646059 42416274 43254061 44435198 45889313 47417912 49027015 50893340 52982256
4545E2982256K201909K500406K839633L280444L763744M562072N258756O109017
$$ 52982256 55184165 57684571 60524204 63804648 67568392 72130464 77389220 83498237
4537H3498237P179811Q104820Q902154R311502Q915546Q266934P623449O381834
$$ 83498237 90678048 98782868 107685022 116996524 125912070 134179004 141802453 148184287
4529A48184287M556103J916263r58188l339114m558859m873487m760903m543797
$$ 148184287 152740390 154656653 153698465 150359351 145800492 140927005 136166102 131622305
4521A31622305l587002k335046j065720k33053j623490m340480o154214o425349
$$ 131622305 128035303 125700257 124634537 124401484 122777994 118437514 112283300 105857951
4513A05857951m987657l005817j163047L04028R05351n0419j080938j252151j87133
$$ 105857951 100870294 97864477 96701430 97005458 97910809 97860390 96779452 95527301 95340168
4504I5340168J233866K144178J240357r58939k705000l271436k640828j626945
$$ 95340168 96574034 98718212 99958569 98999630 96294630 93023194 90382366 88755421
4496H8755421j914866l053308l912147l713454k448172r48060L51427J373222
$$ 88755421 86840555 83787247 79875100 76161646 73713474 72765414 73116841 74490063
4488G4490063J481680j999k916573n240792o261778n818586m722615l874735l263732
$$ 74490063 75971743 75969744 73053171 67812379 61550601 55732015 51009400 47134665 43870933
4479D3870933k652959k356878j866001j701237j566143j302271j159346j042566
$$ 43870933 41217974 38861096 36995095 35293858 33727715 32425444 31266098 30223532
4471C0223532j079317j022615r95658j106190j054825q28759p92859p94727q42452
$$ 30223532 29144215 28121600 27125942 26019752 24964927 24136168 23343309 22548582 21706130
4462B1706130o81513o71297m89468m99492m80030l62740n43512m89436m66302
$$ 21706130 21024617 20353320 19863852 19364360 18884330 18521590 17978078 17488642 17022340
4453A7022340m18920m28306m14439l98573l36480l21415m64215l77622m73426
$$ 17022340 16603420 16175114 15760675 15362102 15025622 14704207 14239992 13862370 13388944
4444A3388944m16133l11272l82401l89806k49470j82384k30135j88241l04896
$$ 13388944 12972811 12661539 12279138 11889332 11639862 11457478 11227343 11039102 10734206
4435A0734206k20905k29526k23594j08683k21783l32430j87984j80741q5791j10390
$$ 10734206 10513301 10283775 10060181 9951498 9729715 9397285 9209301 9028560 8942769 8832379
4425H832379j88899j13406r5362j36368k30927j28261j07824j68198j08652j47989
$$ 8832379 8643480 8530074 8434712 8298344 8067417 7939156 7831332 7663134 7554482 7406493
4415G406493l6498j28194j51907p9950p4462j4396j22427p1956n329o098q4313
$$ 7406493 7369995 7241801 7089894 7009944 6935482 6921086 6798659 6726703 6721374 6715276 6630963
4404F630963j20181r1653p9319K7721k1840r5718n0492r2172M8176o012k7856
$$ 6630963 6510782 6419129 6339810 6367531 6345691 6249973 6199481 6107309 6155485 6149473 6121617
4393F121617q5379K4732j7558m8854n0745L763j63595L6718l7691q6413L951n1082
$$ 6121617 6036238 6060970 6043412 5994558 5943813 5947576 5783981 5820699 5783008 5696595 5700546 5649464
4381E649464j34037Q4311J8746K9184l9367L2084K9849P7437M2093J11394J13813
$$ 5649464 5515427 5599738 5618484 5647668 5608301 5640385 5670234 5747671 5789764 5901158 6014971
4370F014971J7827J69958J67874J13962K14991L79893M57264O73695P63394K38677
$$ 6014971 6032798 6202756 6370630 6484592 6699583 7079476 7536740 8210435 8973829 9212506
4360I212506m4732l38941q44264p45765o17024m18586l43626k86960k18222k96470
$$ 9212506 9167774 8828833 7984569 7238804 6621780 6203194 5859568 5572608 5354386 5057916
4350E057916k01423j81869j54581k32906q4431r7116n1651j06130n3637j32589
$$ 5057916 4856493 4674624 4520043 4287137 4202706 4105590 4053939 3947809 3894172 3761583
4340C761583j7761q9911l8886l1246p8045n3423j04629K6395m7810L8822o7374
$$ 3761583 3743822 3653911 3615025 3583779 3505734 3452311 3347682 3374077 3326267 3365089 3297715
4329C297715J8819m3697K072L6696j0822N8868j6900N8783j077J8782L187k5895
$$ 3297715 3316534 3272837 3274909 3311605 3300783 3359651 3342751 3401534 3400457 3419239 3422426 3396531
4317C396531L5223k722n5398j7547k7173K1363m4623m4224j4308L1447J0034K943
$$ 3396531 3431754 3429032 3373634 3356087 3328914 3350277 3305654 3261430 3247122 3278569 3288603 3291546
4305C291546j3847M7354R0353O6985p8290l7959Q8324l1303l7528j2284o2641
$$ 3291546 3277699 3325053 3415406 3482391 3404101 3366142 3454466 3423163 3385635 3373351 3310710
4294C310710p8395J6734o1625m1767m0043m6666N882L4438p0279j552J520M1715
$$ 3310710 3232315 3249049 3187424 3145657 3105614 3058948 3064830 3099268 3028989 3027437 3028957 3070672
4282C070672K7667k0759K8068o34L4746M693q6350P6796O5067K2846p3021M3101
$$ 3070672 3098339 3077580 3105648 3105014 3139760 3144453 3058103 3134899 3199966 3222812 3149791 3192892
4270C192892N4382L8860o56L9386M295N2545J16418K1484L7968P8107J6549K3102
$$ 3192892 3247274 3286134 3285478 3324864 3329159 3381704 3498122 3519606 3557574 3635681 3652230 3675332
4258C675332Q4631K7702P6236L6240n6974k6205J69346L3682j8439J18699Q1624
$$ 3675332 3759963 3787665 3863901 3900141 3843167 3816962 3986308 4019990 4001551 4120250 4201874
4247D201874J36599N4478J32942J20744K12745R9730Q7414N9679K09284J73921
$$ 4201874 4338473 4392951 4525893 4646637 4859382 4959112 5046526 5106205 5315489 5489410
4237E489410J57875J68466Q2722m9950j24290k99347n1818j08118j38282j40736
$$ 5489410 5647285 5815751 5898473 5848523 5724233 5424886 5373068 5264950 5126668 4985932
4227D985932q1265o9301q863n5717p4667Q3807J05145O4641J71134J70493J23649
$$ 4985932 4904667 4835366 4826503 4770786 4696119 4779926 4885071 4949712 5120846 5291339 5414988
4216E414988R9510J70765J04870O6816M2812P9899j4014M3017N5075j632J51538
$$ 5414988 5514498 5685263 5790133 5856949 5899761 5979660 5965646 6008663 6063738 6062106 6213644
4205F213644P7169m4435J58688j4276o8773j28103p0853j09327r9382o6173j08672
$$ 6213644 6290813 6246378 6405066 6390790 6322017 6193914 6123061 6013734 5914352 5848179 5739507
4194E739507n4395N5660P1553J05859L2239J91874J68180J19706Q7469P0989J28363
$$ 5739507 5685112 5740772 5812325 5918184 5950423 6142297 6310477 6430183 6517652 6588641 6717004
4183F717004J56957o2073N8008R5540J1772J46728Q5960J21118J36712K6992J30892
$$ 6717004 6873961 6811888 6869896 6965436 6977208 7123936 7209896 7331014 7467726 7494718 7625610
4172G625610N6607P0137R5558J64609K67638J70724L37318L77498M64264L99648
$$ 7625610 7682217 7752354 7847912 8012521 8280159 8450883 8788201 9165699 9629963 10029611
4162A0029611M55245N09556P27254J141769J454985J703608K057913Q29088n90305
$$ 10029611 10484856 10994412 11721666 12863435 14318420 16022028 18079941 18909029 18318724
4153A8318724j520643j562789r10475n46503l87795r1270J5875K00631K71615
$$ 18318724 16798081 15235292 14324817 13778314 13390519 13299249 13315124 13515755 13787370
4144A3787370L13827J55257m9928j17319k01813l62734l95822m42788l85227l89528
$$ 13787370 14101197 14256454 14206526 14089207 13887394 13524660 13128838 12686050 12300823 11911295
4134A1911295l07025k65557j79350j98315p3440o9472M7442J20130M5366O8009
$$ 11911295 11604270 11338713 11159363 10961048 10887608 10818136 10865578 10985708 11031074 11099083
4124A1099083M9625J57149K24018J83313K67198J50188L01840L02106M41847M05509
$$ 11099083 11148708 11305857 11529875 11713188 11980386 12130574 12432414 12734520 13176367 13581876
4114A3581876N20570M98459O33738O72245R65685J143617J777824K067258K661799
$$ 13581876 14102446 14600905 15234643 15906888 16872573 18016190 19794014 21861272 24523071
4105B4523071J401728p74891k061728k601370j845378j112023r53548o45653m77687
$$ 24523071 25924799 25149908 23088180 20486810 18641432 17529409 16575861 15930208 15452521
4096A5452521k17735r6991m4125r9198n947l5671J27275J49321K06788K41097
$$ 15452521 15234786 15137795 15093670 14994472 14988525 14952854 15080129 15229450 15436238 15677335
4086A5677335M09282L42240L80997N64556O04802O50157Q65790Q20526R56439
$$ 15677335 16086617 16428857 16809854 17374410 17979212 18629369 19495159 20315685 21272124
4077B1272124R17009R99335J015166R88148Q76751Q19918Q53797R67723R15256
$$ 21272124 22189133 23188468 24203634 25191782 26068533 26888451 27742248 28709971 29625227
4068B9625227R82431J049173J088643J226255J324104J306591J365386J424776
$$ 29625227 30607658 31656831 32745474 33971729 35295833 36602424 37967810 39392586
4060C9392586J461262J480035J468429J418571J617157J843620K039398K368562
$$ 39392586 40853848 42333883 43802312 45220883 46838040 48681660 50721058 53089620
4052E3089620K774782L201409L650756L882703M101788M094233L955716M155605
$$ 53089620 55864402 59065811 62716567 66599270 70701058 74795291 78751007 82906612
4044H2906612M405094M339666M201035L854068L312218K973214L156961L517398
$$ 82906612 87311706 91651372 95852407 99706475 103018693 105991907 109148868 112666266
4036A12666266L994148M233351M420741M832043M915409M992101M704380M306564
$$ 112666266 116660414 120893765 125314506 130146549 135061958 140054059 144758439 149065003
4028A49065003L866854L837461L516325L221244K713151J870259L45407j270719
$$ 149065003 152931857 156769318 160285643 163506887 166220038 168090297 168435704 167164985
4020A67164985l096347m271565m918394m117089l016841j018080Q75493L389862
$$ 167164985 164068638 159797073 154878679 150761590 147744749 146726669 147602162 150992024
4012A50992024N121871O686293O648560O015380M698439M761913N685511J0414326
$$ 150992024 156113895 162800188 169448748 175464128 180162567 184924480 190609991 201024317
4004B01024317J6874191K6874699L3590533M1496998J4422929j9585791l9413599
$$ 201024317 217898508 244773207 278363740 319860738 334283667 314697876 275284277
3997B75284277m5684951l1804203k2770369j8189763j6160060j3298529j1540962
$$ 275284277 229599326 197795123 175024754 156834991 140674931 127376402 115835440
3990A15835440r109805q561775o997480o118447n015432m365043l393480l143606
$$ 115835440 106725635 98163860 91166380 85047933 80032501 75667458 72273978 69130372
3982F9130372k798290k806590k517536k575313k345019k419943k086863k061209
$$ 69130372 66332082 63525492 61007956 58432643 56087624 53667681 51580818 49519609
3974D9519609j496758j533632j271904j085418q54279j042857q26921r19482o59381
$$ 49519609 48022851 46489219 45217315 44131897 43277618 42234761 41407840 40488358 39828977
3965C9828977o72307l92495m03636k94610l76973k65280l44243m41742n26360
$$ 39828977 39156670 38764175 38360539 38065929 37688956 37423676 37079433 36637691 36111331
3956C6111331m77012n86742n74653n26531l92323m24883l57949l31800k47906
$$ 36111331 35634319 35047577 34472924 33946393 33554070 33129187 32771238 32439438 32191532
3947C2191532l59035k52296k38180l2313J24280N27693Q57976J281756J343682
$$ 32191532 31832497 31580201 31342021 31309708 31433988 31961681 32819657 34101413 35445095
3938C5445095O00463r39419j975797k413404j795374j568373j331926j319781
$$ 35445095 36045558 35106139 33130342 30716938 28921564 27353191 26021265 24701484
3930B4701484j173899j045003r13097q83859p62727n92177m99691m21488l84559
$$ 24701484 23527585 22482582 21569485 20685626 19922899 19330722 18831031 18409543 18024984
3921A8024984l81969k88641l47640k50878k34129l07557k81548l18314m63730
$$ 18024984 17643015 17354374 17006734 16755856 16521727 16214170 15932622 15614308 15150578
3912A5150578l07963k54149k47292k35685k64320k42436j60969k19525k17569
$$ 15150578 14842615 14588466 14341174 14105489 13841169 13598733 13437764 13218239 13000670
3903A3000670j83846l16933j39650j65709j72222j45885j24755j39036j15411
$$ 13000670 12816824 12499891 12360241 12194532 12022310 11876425 11751670 11612634 11497223
3894A1497223j15339j00387o3466L106j3323p5094j66624o2013q6210r0797L4170
$$ 11497223 11381884 11281497 11218031 11221137 11207814 11132720 10966096 10904083 10817873 10727076 10761246
3883A0761246J4835k1578j7157Q1157P9541J44133O2225J73738Q9392N0214K32712
$$ 10761246 10776081 10754503 10737346 10818503 10898044 11042177 11104402 11278140 11367532 11417746 11650458
3872A1650458K61929K04453K28800K86319L19121M50620M08442N96128L76732
$$ 11650458 11912387 12116840 12345640 12631959 12951080 13401700 13810142 14406270 14783002
3863A4783002L17311K71583J88513K42712K85354L93138M29586N74273O74943
$$ 14783002 15100313 15371896 15560409 15803121 16088475 16481613 16911199 17485472 18160415
3854A8160415O17810Q61645R45659R75619J001842J086684J140285J255140J290600
$$ 18160415 18778225 19639870 20585529 21561148 22562990 23649674 24789959 26045099 27335699
3845B7335699J330192J326684J371113J305841J337692J188586J407103J457900
$$ 27335699 28665891 29992575 31363688 32669529 34007221 35195807 36602910 38060810
3837C8060810J680752J838456J943416K302241K634433K956515L508773L920934
$$ 38060810 39741562 41580018 43523434 45825675 48460108 51416623 54925396 58846330
3829E8846330M726568N571348O559465P480936Q490060R543174J1035836J3179424
$$ 58846330 63572898 69144246 75703711 83184647 91674707 101217881 112253717 125433141
3821A25433141J6309811K0281149K4277174K6096997K2672313Q371453j0190402
$$ 125433141 141742952 162024101 186301275 212398272 235070585 243442038 233251636
3814B33251636k2889117k6322519k2820568j8481287j5338109j2737693j0430114
$$ 233251636 210362519 184040000 161219432 142738145 127400036 114662343 104232229
3807A04232229q547532p184784o291710n556623m592247l569878k839080k425147
$$ 104232229 95684697 88499913 82208203 76651580 72059333 68489455 65650375 63225228
3799F3225228k140539k064213k191827k273407k473331k550617k430048k036625
$$ 63225228 61084689 59020476 56828649 54555242 52081911 49531294 47101246 45064621
3791D5064621j849015j679544j576805j658706j547464j389099j198152j114587
$$ 45064621 43215606 41536062 39959257 38300551 36753087 35363988 34165836 33051249
3783C3051249q86663p20420o81417o24387o50735q74545r27719r14224r08167
$$ 33051249 32164586 31444166 30762749 30138362 29487627 28613082 27685363 26771139 25862972
3774B5862972r24218p31602p47538n75687o23170o34401n64459n12829k44640
$$ 25862972 24938754 24207152 23459614 22883927 22260757 21626356 21061897 20549068 20304428
3765B0304428j79990m1863p2775j35133m33462o07505m84507n45744n73580l07052
$$ 20304428 20124438 20082575 20009800 19874667 19441205 18833700 18349193 17803449 17229869 16922817
3755A6922817l35921k91396k29946k41520m8713O206J7581Q0647J03650O5510
$$ 16922817 16586896 16295500 16065554 15824034 15775321 15781527 15799108 15879755 15983405 16048915
3745A6048915n1667j29836k34789k06134j94626k15436j87663j93066j99635j20747
$$ 16048915 15997248 15867412 15632623 15426489 15231863 15016427 14828764 14635698 14436063 14315316
3735A4315316j30689r0580l5534K2787j2248J45476R6233J72054L40012L95046
$$ 14315316 14184627 14094047 14058513 14081300 14069052 14214528 14310761 14482815 14822827 15217873
3725A5217873L82760L02967L89066M31531N14180O79599Q84947J106987R71030
$$ 15217873 15600633 15903600 16292666 16724197 17238377 17917976 18802923 19909910 20880940
3716B0880940M05985m11738j206460j353195r89756q44649n74231n06530m08356
$$ 20880940 21286925 20875187 19668727 18315532 17325776 16481127 15906896 15400366 14992010
3707A4992010n07840l21823l67548l57636j91483k66218K1404J35583K14066L10395
$$ 14992010 14484170 14162347 13794799 13437163 13245680 12979462 13000866 13136449 13350515 13660910
3697A3660910L30512N69967P39572R40026J270114J527197J587967J080042j02596
$$ 13660910 13991422 14561389 15300961 16240987 17511101 19038298 20626265 21706307 21603711
3688B1603711j129879j742159j623071j305724j076552r10729o13338m35914l59960
$$ 21603711 20473832 18731673 17108602 15802878 14726326 13815597 13202259 12766345 12406385
3679A2406385m26749l41353l42763l51091l87151m13494l80313l85816l86456
$$ 12406385 11979636 11638283 11295520 10944429 10557278 10143784 9763471 9377655 8991199
3670H991199l29374k24539k36702j52491j08116j66195m8765n1226p4718j31464
$$ 8991199 8661825 8437286 8200584 8048093 7939977 7773782 7725017 7673791 7599073 7467609
3660G467609j27495j08672j13752n7453P5242K5526n1978j7612J54646J79300
$$ 7467609 7340114 7231442 7117690 7060237 7135479 7161005 7109027 7091415 7246061 7425361
3650G425361K66121K72349K60567L33652M71416O33787O63866P80763O36870j44778
$$ 7425361 7691482 7963831 8224398 8558050 9029466 9663253 10327119 11107882 11744752 11599974
3640A1599974q04434r55462q38029o54099n33764m93890l06071l34999j88537
$$ 11599974 10795540 9840078 9002049 8347950 7814186 7320296 7014225 6679226 6490689
3631F490689l64743k47566j39168k57182j33584j87885q8191m6282j6959m5011
$$ 6490689 6125946 5878380 5739212 5482030 5348446 5160561 5072370 5026088 5009129 4964118
3621D964118j31317p4813m404r0995p6215l8613J6815M463L3877j3812k1470o3336
$$ 4964118 4832801 4757988 4753584 4662589 4586374 4547761 4564576 4569039 4602916 4589104 4567634 4504298
3609D504298o2471J6430j1095K1486m2428K0029O4150j2519L3775k7516K3609
$$ 4504298 4441827 4458257 4447162 4468648 4426220 4446249 4510399 4497880 4531655 4504139 4527748
3598D527748Q4606Q0050K0203n8434K3113N4601M5440J26384O9657R3597m5123
$$ 4527748 4612354 4692404 4712607 4654173 4677286 4731887 4777327 4903711 4973368 5066965 5021842
3587E021842J0833j29734m9511j06737j18949n3961P5170M6815K8323J5534J07303
$$ 5021842 5032675 4902941 4853430 4746693 4627744 4573783 4648953 4695768 4724091 4739625 4846928
3576D846928J37662J49082P9897J30326J36001R0914q752j7096n558r6765o4865
$$ 4846928 4984590 5133672 5213569 5343895 5479896 5570810 5562058 5544962 5539404 5442639 5377774
3565E377774r3702j17553m1315Q0865R0305N1133J78524Q6728J15919P2183p6579
$$ 5377774 5284072 5166519 5125204 5206069 5296374 5347507 5526031 5612759 5728678 5800861 5724282
3554E724282j21531j30722o0827q4916k8759N2866L9179J7715M9909J31380J09020
$$ 5724282 5602751 5472029 5411202 5326286 5297527 5350393 5389572 5407287 5457196 5588576 5697596
3543E697596K0534q5854j65612j45609k85054j91728j06628j14087j13404j29754
$$ 5697596 5718130 5632276 5466664 5321055 5036001 4844273 4737645 4623558 4510154 4380400
3533D380400L7815o6592m6276r5621m3321j50825k7064P3036k0957j4787J3436
$$ 4380400 4418215 4351623 4305347 4209726 4166405 4015580 3988516 4061552 4040595 4025808 4039244
3522D039244M9500k0672K3572J08382j3593K4906p6562r2128O0104p3167k89j5076
$$ 4039244 4088744 4068072 4091644 4200026 4186433 4211339 4134777 4042649 4102753 4029586 4029297 4014221
3510D014221j15041P412j10712j60786m1496m6286l1383o9448j20468p127J7173
$$ 4014221 3899180 3906592 3795880 3635094 3593598 3547312 3515929 3446481 3326013 3318886 3336059
3499C336059L6473L6637m6281m4805q3682J4645n8596M8963j6989N3762P5365
$$ 3336059 3372532 3409169 3362888 3318083 3234401 3249046 3190450 3239413 3222424 3276186 3351551
3488C351551K0561N5769l7551L3608M2902M570o1068O8211n1647j01790p2476
$$ 3351551 3372112 3427881 3390330 3423938 3466840 3471410 3410342 3478553 3426906 3325116 3252640
3477C252640q280J366l1947q8600j1494N6907L2384M733o7974r1625M662k7587
$$ 3252640 3244360 3245726 3213779 3125179 3113685 3170592 3202976 3207709 3139735 3048110 3052772 3025185
3465C025185q455J21381L6156j248L6376Q6013q2198P9279K1018j40772p3551
$$ 3025185 3016730 3138111 3174267 3173019 3209395 3295408 3213210 3292489 3313507 3172735 3099184
3454C099184q7406m060r4821j88477k1156j05487l416n8111J0876N3329N7597
$$ 3099184 3011778 3007718 2912897 2724420 2703264 2597777 2594361 2536250 2547126 2600455 2658052
3443B658052r8946O3945P5661J38221Q126q8546j1259O279o342K6664N2695m532
$$ 2658052 2559106 2623051 2698712 2836933 2845059 2756513 2745254 2751533 2745191 2771855 2824550 2820018
3431B820018k7440k0040j1520j16020o0614n5339n1610l8052m2105r6454n3352
$$ 2820018 2792578 2772538 2761018 2644998 2584384 2529045 2477435 2439383 2397278 2300824 2247472
3420B247472J06229M4246m4234J14012M8075p4018m509k2554o6379k9680K1483
$$ 2247472 2353701 2397947 2353713 2467725 2515800 2441782 2437273 2414719 2348340 2318660 2340143
3409B340143p5618p5454r8523l0111l3311j2870k0128n8091q039l2247n9261o4366
$$ 2340143 2264525 2189071 2090548 2060437 2027126 2014256 1994128 1936037 1927998 1895751 1836490 1772124
3397A772124l0424o0446j6731j6208j3727m0326M6656k1576L0114k3396L3835
$$ 1772124 1741700 1681254 1664523 1648315 1634588 1594262 1640918 1619342 1649456 1626060 1659895
3386A659895m0258p3505N4423j07858q5308m0560N512p3528m3600O275q6068j2695
$$ 1659895 1619637 1546132 1600555 1492697 1407389 1366829 1372341 1298813 1255213 1261488 1175420 1162725
3374A162725k0154q4385j99k029M7264r7857K4493p1565J5404k5136Q8339K1965
$$ 1162725 1142571 1058186 1057987 1055958 1103222 1005365 1029858 958293 973697 948561 1036900 1058865
3362A058865o5208n5509k441P4014j1234M4826m3072q4743Q814M3649J9876j02749
$$ 1058865 993657 938148 935707 1009721 998487 1043313 1000241 915498 924312 967961 987837 885088
3350H85088J02853o6533j3224L7063O927m2647m4147q33n2286R3746j9756l9753
$$ 885088 987941 921408 908184 945247 952174 909527 865380 864547 812261 906007 886251 846498
3338H46498j7901j3231k3250O2175K2702p3890m8708j3835j9454K3778O454M6661
$$ 846498 828597 815366 792116 854291 876993 803103 754395 740560 721106 744884 751338 797999
3326G97999p2713N2329j2796m9129m7553K2497P300n6588j4169N8503k9648N566
$$ 797999 725286 777615 764819 715690 668137 690634 697934 641346 627177 685680 656032 661598
3314F61598m275o265N6089j9051r478n751j12135M0346Q094K0581j13460N7005
$$ 661598 657323 651058 707147 688096 678618 672867 560732 601078 609172 629753 516293 573298
3302E73298j9657M879J8101J6229p1547R1217r3370l234N6589K1159L2856o5385
$$ 573298 553641 558520 576621 592850 521303 612520 519150 515916 572505 593664 626520 561135
3290E61135p8223K1235Q4558p74k6592L5779l3838K4980k6076n0991j7916L775
$$ 561135 482912 504147 588705 587931 561339 597118 563280 588260 562184 511193 493277 497052
3278D97052j2305L7097j539J7068P8809q8613J3859l3086J6288m3516J9645M8332
$$ 497052 484747 521844 520305 537373 616182 527569 541428 508342 524630 481114 500759 549091
3266E49091K5603j28858O8126J366m2109L1383O048J6835O9166p0852n546n0677
$$ 549091 574694 445836 513962 515328 473219 504602 510650 527485 596651 525799 520253 469576
3254D69576O8668k8864p9612N737J6483M373N900J9596k3565j3271K8812k0722
$$ 469576 538244 509380 429768 435505 451988 456361 462261 481857 458292 445021 473833 453111
3242D53111n6608J19624K1910j02098l8425J9559L5785K1667L506M1722j8598
$$ 453111 396503 516127 538037 435939 397514 417073 452858 474525 478031 519753 501155
3231E01155p8411R0769j9890l2786j7762J8432R6352K0443J6705p9128P7314q8724
$$ 501155 422744 513513 493623 460837 443075 461507 557859 578302 595007 515879 593193 504469
3219E04469N1612n3267L9011J17242n5649n5561J0282J8563M5789j4027j5969
$$ 504469 556081 502814 541825 659067 603418 547857 558139 576702 622491 608464 592495
3208E92495K741O208K5406O5979l0641r7729q552O5584L0311J1145K4242o0981
$$ 592495 595236 601444 626850 692829 662188 564459 555907 621491 651802 662947 687189 626208
3196F26208O1808K6489K4463J4860K3547O3727k3748o3170K9197k6287j718J14224
$$ 626208 688016 714505 738968 753828 777375 841102 817354 754184 783381 757094 755376 869600
3184H69600j8931J0781M0011J1432K1023n4667M5735m928Q9459R86m7721O0282
$$ 869600 850669 861450 901461 912893 933916 879249 924984 920056 1009515 1010501 962780 1023062
3172A023062l6497M4696L6470l2618Q6368l3152M3523N0543l98n6217R2627L0429
$$ 1023062 986565 1031261 1067731 1035113 1121481 1088329 1131852 1182395 1181997 1125780 1218407 1248836
3160A248836K9252p174k245L0009M1048j6526N0575J8301p5322N2508J0353p7856
$$ 1248836 1278088 1270914 1268669 1298678 1339726 1323200 1373775 1392076 1316754 1369262 1379615 1301759
3148A301759P8686L1795n8820k184k6006m0281N5323j0424O3973o1994j5718n030
$$ 1301759 1380445 1412240 1353420 1351236 1325230 1284949 1340272 1329848 1393821 1331827 1316109 1311079
3136A311079K0095m807j35248K6859j8276o5738j7845N9548j6178K821r972N2503
$$ 1311079 1331174 1326367 1191119 1217978 1199702 1133964 1116119 1175667 1159489 1162310 1152338 1204841
3124A204841l2776m5106P2349M0056l9508p235k3742k1555j04642L9752J3959
$$ 1204841 1172065 1126959 1199308 1239364 1199856 1192621 1168879 1147324 1042682 1082434 1096393
3113A096393p9383m0833k1405J7537O8535o6152k8485J5646j36065m700o046K5322
$$ 1096393 1017010 976177 954772 972309 1040844 974692 946207 961853 825788 821088 815042 840364
3101H40364n5893J1952J4199N6834m3949J8092r715l9544J7306J77q11p5809q3921
$$ 840364 784471 796423 810622 867456 823507 841599 831884 792340 809646 809823 809012 733203 649282
3088F49282K9667K1043k8936l5005P7291m7630o0896L5263k3607j7958M3370q760
$$ 649282 678949 699992 671056 636051 713342 665712 604816 640079 616472 598514 641884 633124
3076F33124n380q0383k0639Q4744m4438J7114p9779Q200L835q4765L8530Q7512
$$ 633124 627744 547361 526722 611466 567028 584142 504363 512563 516398 431633 470163 557675
3064E57675J4683L2665k2595L7258l1369K8992k7743J652m5969o458N387L7737
$$ 557675 572358 605023 582428 619686 588317 617309 589566 591218 545249 538791 544178 581915
3052E81915J0081n9955m0188P1072M0200J05566l6107j6124j0462Q3410J7746
$$ 581915 591996 532041 491853 562925 603125 708691 672584 656460 645998 729408 747154
3041G47154m587l6763p2323Q6798j3213m436P0389j9915r28N3533j8458J9847
$$ 747154 742567 705804 633481 720279 707066 702630 773019 753104 752176 805709 787251 807098
3029H07098n64K5071J36704m2831j6148O0759M1140K2729j9870N7417k1459O6814
$$ 807098 806534 831605 968309 925478 909330 970089 1011229 1033958 1014088 1071505 1050046 1116860
3017A116860P1562N4535j4919J4571J0389O3070P5165l354k6559l4672M5538O6815
$$ 1116860 1188422 1242957 1228038 1242609 1252998 1316068 1391233 1387879 1361320 1326648 1372186 1439001
3005A439001Q9910R3339l861m4326J20337P0964L3769O368J10307K3933J4655
$$ 1439001 1528911 1622250 1618389 1574063 1694400 1765364 1799133 1805501 1915808 1939741 1954396
2994A954396N0784J10579J06264K8263O6989J33302N0323N3673J15827M2738J49811
$$ 1954396 2005180 2115759 2222023 2250286 2317275 2450577 2500900 2554573 2670400 2713138 2862949
2983B862949J22775J53123J06111J02939J06199J43297O4457J48101J24372J75751
$$ 2862949 2985724 3138847 3244958 3347897 3454096 3597393 3661850 3809951 3934323 4110074
2973D110074J34018K01000K27083J34271J37972K06486K27536K13447K24446K14624
$$ 4110074 4244092 4445092 4672175 4806446 4944418 5150904 5378440 5591887 5816333 6030957
2963F030957K94676K50970K52427K48731K48386M36683M12186L79325M05957M24662
$$ 6030957 6325633 6576603 6829030 7077761 7326147 7762830 8175016 8554341 8960298 9384960
2953I384960O14272M60388N19319P62876P45463P15170Q13673R13170R13952P70087
$$ 9384960 9999232 10459620 10978939 11741815 12487278 13202448 14016121 14929291 15843243 16613330
2943A6613330Q22122P11473N18895L65817J49639Q3457K2019j01679j64309k53833
$$ 16613330 17435452 18146925 18665820 19031637 19181276 19264733 19286752 19185073 19020764 18766931
2933A8766931k94992l68393n18615p66655p89723r83102j064349j083872r89877
$$ 18766931 18471939 18103546 17584931 16818276 16028553 15045451 13981102 12897230 11907353
2924A1907353r36107p58988o91199o21543m98466m44982l51651l77154l21617
$$ 11907353 10971246 10212258 9521059 8899516 8401050 7956068 7604417 7227263 6905646
2915F905646j77705j78500o6146m7703M0219K3160Q4644J99954L42983N07407
$$ 6905646 6727941 6549441 6483295 6435592 6475811 6498971 6583615 6783569 7126552 7633959
2905G633959O58702P08198n7422l38883o86385q52180o58933l98022k31129k30063
$$ 7633959 8292661 9000859 8943437 8604554 7918169 7065989 6407056 6009034 5777905 5547842
2895E547842k56837p2706j34020l8438P3965R7937J48597J48596K82105K97118
$$ 5547842 5291005 5218299 5084279 5045841 5119806 5217743 5366340 5514936 5797041 6094159
2885F094159L36464O90689Q87828J148779J548857J231025L5176o40458j560997
$$ 6094159 6430623 7121312 8009140 9157919 10706776 11937801 11972977 11332519 9771522
2876I771522j496753j175262q21406o11218m82464l94325k63727k08215k37540
$$ 9771522 8274769 7099507 6278101 5666883 5184419 4790094 4526367 4318152 4080612
2867D080612q2633j32108n8249M0111L9599O6754K28755K36526M00089N36453
$$ 4080612 3997979 3865871 3807622 3847733 3887332 3954086 4182841 4419367 4819456 5355909
2857E355909O68033M99372j64695l78150p42929q17285n37224m82539l33219k21459
$$ 5355909 6023942 6523314 6358619 5980469 5237540 4420255 3883031 3400492 3067273 2845814
2847B845814k82084j19493j19852k04642p4703l6204j9587j05846l1907q0967
$$ 2845814 2563730 2444237 2324385 2119743 2045040 2008836 1989249 1883403 1851496 1770529
2837A770529j95853j2178q0737k3393J0974n2386M5370j56918l0985L6607n6928
$$ 1770529 1574676 1562498 1481761 1458368 1469342 1416956 1462326 1305408 1274423 1311030 1254102
2826A254102j8049k0189r528r2080j5704J0401j1765L2856j03330L935j31145
$$ 1254102 1236053 1215864 1206336 1114256 1098552 1108953 1097188 1130044 1026714 1030649 899504
2815H99504j3788L7314L7552o0053L7032k0601o5255n8859K01n5495N7996J2314
$$ 899504 885716 923030 960582 900529 937561 916960 851705 792846 793047 737552 795548 807862
2803H07862O8907J5715p5541q0767J03507p5762r540L1115N4231q6583r3428n043
$$ 807862 876769 892484 816943 736176 839683 763921 754381 785496 839727 753144 659716 654673
2791F54673k1895m0178P7215n1738m9774N1005m6066r980K0328L4279J4894m9277
$$ 654673 632778 592600 669815 618077 568303 619308 573242 563262 583590 617869 632763 583486
2779E83486O068K6150n446M4717m3239q678j39717n329J8688K8396q362L6689
$$ 583486 589554 615704 610258 654975 611736 603058 463341 458012 476700 505096 496734 533423
2767E33423O1001m9020q8325K984K8379k6014J3141N6936J320J9364L7123k2614
$$ 533423 594424 545404 457079 460063 488442 462428 475569 532505 533825 553189 590312 567698
2755E67698l7183j3853K0163J0663p6865j274J05298K5262n0302L1430O404j0002
$$ 567698 530515 516662 536825 547488 470623 469349 574647 599909 549607 581037 587441 577439
2743E77439l5022O7570k1847k3202j896k8508R5412J6712j248K9843l6320K9480
$$ 577439 542417 609987 588140 564938 563042 534534 629946 646658 645410 675253 638933 668413
2731F68413o046L9251Q431L1263M7704m0190P1772L1318n05J2440J4096k2015
$$ 668413 662367 701618 710049 741312 789016 748826 820598 851916 851411 863851 877947 855932
2719H55932J02244Q7915k4728L3067J20248Q2283J2783K9808L805J03905O9215
$$ 855932 958176 1046091 1021363 1054430 1174678 1256961 1269744 1299552 1303357 1407262 1476477
2708A476477R5250O0864R2724K5772k0492K4711J0013L7209O0497l6862M6160
$$ 1476477 1571727 1632591 1725315 1751087 1730595 1755306 1765319 1802528 1863025 1826163 1872323
2697A872323L1449m831P4622J5011N9357J18390J42097P6471J29400K04329J31758
$$ 1872323 1903772 1898941 1973563 1988574 2047931 2166321 2308418 2384889 2514289 2718618 2850376
2686B850376M2991j3709j23057k65868r3795j51761j50421o6685q9487N1097p9974
$$ 2850376 2893367 2879658 2756601 2490733 2396938 2245177 2094756 2028071 1938584 1989681 1909707
2675A909707q0188K3788l6330j6633K6794l2142j2502Q1806j6383o6458Q0322
$$ 1909707 1829519 1853307 1816977 1800344 1827138 1794996 1782494 1864300 1847917 1781459 1861781
2664A861781m9855k2906r7629J1614j04524o6454n3320n4206l4750m6939n0178
$$ 1861781 1811926 1789020 1691391 1703005 1598481 1532027 1478707 1424501 1389751 1342812 1292634
2653A292634j63318r73j33959K1054j9175O294o1530l0799j6576m4154J6084o3476
$$ 1292634 1129316 1128343 994384 1015438 996263 1002557 941027 910228 893652 849498 865582 802106
2641H02106q910m8428N6503j70625Q836M996k5031n2602l4012K0900q3105P9602
$$ 802106 793196 744768 801271 630646 639482 644478 619447 566845 532833 553733 470628 550230
2629E50230N6571l5375J4488m9604k7510q4444l8848M7066p5453K2066K9917Q93
$$ 550230 606801 571426 585914 536310 508800 424356 385508 432574 357121 379187 409104 409997
2617D09997q3880M8820L4524o5725j1696Q6597l3987k316k5523k5740L7141l3458
$$ 409997 326117 374937 409461 343736 332040 418637 384650 382334 356811 331071 368212 334754
2605C34754k4004K6088p4339l8666M5489K3021J1824O095m5400j7885O5176m0226
$$ 334754 310750 336838 262499 223833 269322 292343 304167 310262 264862 246977 312153 271927
2593B71927k0950J0823j3731P7568j18676q1116K6539O966J5981J8443P413Q3847
$$ 271927 250977 261800 248069 325637 206961 125845 152384 159350 175331 193774 201187 285034
2581B85034k9081m1752j167k9151L1427O8480m3406k7828R92m3141j6118J5478
$$ 285034 255953 214201 213034 183883 215310 283790 240384 212556 213548 170407 154289 169767
2569A69767J960m6011r335M6476L1355J3431j4297j6190j12464O2761N3682M8641
$$ 169767 171727 125716 116381 162857 194212 207643 193346 177156 64692 127453 181135 229776
2557B29776K1511j34050k7538L9570n2423R0P5274L3592j4283o4509P921m8288
$$ 229776 251287 117237 89699 129269 76846 76936 152210 185802 171519 107010 114931 66643
2545F6643J4655O0710J2171L1897N8325q8114Qj4974j4392L5198p040j13819m1838
$$ 66643 81298 142008 154179 186076 244401 156287 156295 141321 126929 162127 155087 41268 -570
2532e70P8556P3271l0365m5807k3079k2122N7649j8159n8096Q0488k033n1277
$$ -570 77986 151257 120892 75085 52006 29884 87533 69374 11278 91766 89733 38456
2520C8456K8909M8994O3268j22047P332L9397Q498J7165N574m5566o7355Q3058
$$ 38456 67365 116359 179627 57580 64912 104309 112807 129972 135546 89980 22625 105683
2508A05683N7520k1324p0258J0562J2377n56K1247q6654O437N3099p302K1701
$$ 105683 163203 141879 71621 82183 94560 94004 115251 28597 35034 88133 80831 102532
2496A02532j11110R8555r458L7023l5566k1127J6662N7107J9702n5280J5174p1890
$$ 102532 -8578 89977 80519 117542 81976 60849 77511 134618 154320 99040 114214 42324
2484D2324K4195K3510P6273L3812j43836K2732n4493M2531k1044K6844K5945l7762
$$ 42324 66519 90029 166302 200114 56278 79010 24517 67048 46004 72848 98793 61031
2472F1031K9583k0286M3534j62513N2662J15237K205j17709k2249M8293J6778
$$ 61031 90614 70328 113862 -48651 4011 119248 121453 3744 -18505 29788 46566
2461D6566J00961j13015J4676l7668P4291l2896K169L6259k4993O606K4343j12754
$$ 46566 147527 34512 49188 11520 85811 52915 55084 91343 66350 72956 97299 -15455
2449a5455N3082M5679k2765L3439p6653k2723M0649L1896l4701K7958k9271r004
$$ -15455 37627 83306 60541 93980 17327 -5396 35253 67149 32448 60406 31135 22131
2437B2131Q009O4323l5617m2157M9694n0731M1774M4121k4473m1039P6380o2603
$$ 22131 30140 94463 58846 16689 66383 15652 57426 101547 77074 36035 112415 49812
2425D9812k4395O6014n0141M957K2231j7347o5318q432J5072J7161O5352q564
$$ 49812 25417 91431 41290 46247 68478 51131 -14187 -22619 -7547 9614 74966 66402
2413F6402m9494O7830q1110O9919m0315J4527m3128K0719K087N3168L7679J8507
$$ 66402 16908 84738 3628 73547 33232 47759 4631 25350 27437 80605 118284 136791
2401A36791m2847m7997O9140J7568n240k8223r0501j815j417r698L5135L5095
$$ 136791 93944 45947 115087 132655 127415 99192 8691 6876 5459 -4239 30896 65991
2389F5991j1598K690J1497m683m1612M5189l6474R001p2309K1083j5355j6546
$$ 65991 54393 57083 68580 63897 22285 67474 31000 40001 -32308 -11225 -26580 -43126
2377d3126k346N6142J5825m0165K3364j4515K7088m2940m075N6981n4688J23634
$$ -43126 -45472 10670 26495 -13670 9694 -4821 22267 -20673 -24748 32233 -22455 101179
2365A01179M2384n1023J6056j6732j14607J2432R9369M3345l4901o6369L5420
$$ 101179 143563 92540 108596 91864 -22743 -10311 89058 132403 97502 31133 66553
2354F6553l0430j2240q296o347M3333j8195K4007K4561k5720m3778Q060m5593
$$ 66553 36123 23883 15587 9240 52573 34378 58385 82946 57226 13448 21508 -24085
2342b4085R3711M6524q5061j1266m3624Q9094o0936J7829M7447K5747o2334l6769
$$ -24085 69626 116150 31089 19823 -23801 65293 4357 22186 69633 95380 33046 -3723
2330c723Q452q541j0575N9892k3911j0222l1634N3318K3159O6299k2539l3622
$$ -3723 4729 -3812 -14387 45505 21594 11372 -20262 33056 56215 122514 99975 66353
2318F6353q2090O2529p7761m1037P9012l495k8746K0149O7719N101M5255L9528
$$ 66353 -15737 46792 -30969 -72006 7006 3511 -25235 -5086 62633 67734 112989 152517
2306A52517q4796n9043k273m6596R7633M8596l8595J7913j4669m091p1953Q9810
$$ 152517 67721 8678 6405 -40191 57442 106038 67443 85356 70687 66596 -5357 84453
2294H4453J3142k9362O4655J6075o4332N031N3059m2300k6264n117k9901M9775
$$ 84453 97595 68233 132888 148963 84631 89662 142721 100421 74157 69040 39139 88914
2282H8914Q524k8327Q478m1855k2561K3131j5637j5873N807l4323J06891j3858
$$ 88914 97438 69111 77589 35734 13173 36304 20667 4794 10601 -23722 83169 69311
2270F9311o0873K4739J1826p180L5786n5461o598m9628M5654P8200k1715o2008
$$ 69311 8438 33177 45003 37823 73609 18148 11550 -38078 7576 85776 64061 2053
2258B053J6677Q9787k8651j9654q7920L9405N1064l1758j2152l975N8203q2340
$$ 2053 18730 108517 79866 60212 -27708 11697 62761 31003 18851 14876 73079 -9261
2246i261N5558P805k9975J9235M6005r9344j1436K8403J3350K8515P347k5296
$$ -9261 46297 54102 24127 43362 89367 -9977 -21413 6990 20340 48855 56202 30906
2234C0906k5828N7498l079q3652p487L7248J1339k1691O1374l0056M581K6447
$$ 30906 5078 62576 59497 -24155 -31642 5606 16945 -4746 56628 26572 31153 57600
2222E7600l1838m1421j1803Q4798l4672j4244k866O036l943m103j0997K1661P9472
$$ 57600 25762 -15659 -27462 57336 22664 8420 5554 11590 7647 3544 -7453 14208 93680
2209I3680j396o8961K1314R485k3814r720l884M9604k6782N5805J0591r1445N0752
$$ 93680 92284 23323 44637 54122 30308 20588 16704 66308 39526 95331 105922 14477 65229
2196F5229k9270J3579q5572P0395N3728k2167o767M1809r656q9539o6632K4436
$$ 65229 35959 49538 -36034 34361 88089 65922 59155 100964 91308 1769 -64863 -40427
2184d0427N9911N310r759k7274J20831N2280p371n0714l4435K5418o561q795j4701
$$ -40427 19484 24794 15035 -12239 108592 160872 153501 102787 68352 93770 87209 78414 63713
2171F3713M5801n0259M7589j0087l1840J4132N2087m4199P3055j3011K3639K2492
$$ 63713 109514 59255 106844 96757 64917 79049 131136 86937 159992 146981 170620 193112
2159A93112l5414L67j01314N3534J00742j0883k1554R3935K158o7150l3585M8188
$$ 193112 157698 158065 56751 110285 211027 200144 178590 272525 274683 207533 173948 222136
2147B22136J6880k0843o6285M877P7742O1265K7460N5529K1647J2603n0174l998
$$ 222136 239016 218173 151888 156765 234507 295772 323232 378761 400408 413011 362837 358839
2135C58839O2903q363J29476q6232N4939R0550k402J0476q97K038P0015k794J15587
$$ 358839 421742 413379 542855 456623 511562 602112 599710 610186 609289 611327 681342 678548 794135
2122G94135M2176L2916N0443M5415N8706J04865R1430R9910J01928k2639R9114
$$ 794135 836311 869227 919670 965085 1023791 1128656 1220086 1319996 1421924 1399285 1498399
2111A498399O0604L8328J48756J02418R5380K57188J14614K68316K61322K09877
$$ 1498399 1559003 1597331 1746087 1848505 1943885 2201073 2315687 2584003 2845325 3055202
2101C055202L67819L69092L83549L36428M09132O86073P83774J035243J489918
$$ 3055202 3423021 3792113 4175662 4512090 4921222 5607295 6391069 7426312 8916230
2092H916230K178319K522252L114553K37172k353005l117483k361901j392304
$$ 8916230 11094549 13616801 16731354 16968526 14615521 11498038 9136137 7743833
2084G743833j181805r51368p55884n67135l71637k36932k63332l39283l61821
$$ 7743833 6562028 5610660 4854776 4287641 3916004 3679072 3415740 3076457 2714636
2075B714636k79648j87113j87202k11574l5685r0037p7146j44261j06989o2417
$$ 2714636 2434988 2247875 2060673 1849099 1813414 1723377 1646231 1501970 1394981 1332564
2065A332564l0627r8562K143l2420m8370k6045o3111j17985k9065l5564Q2071
$$ 1332564 1301937 1203375 1205518 1173098 1124728 1098683 1035572 917587 888522 852958 935029
2054I35029k8480k5644q8631o5958J06871m6465o0323J9008p5317q7856q8152
$$ 935029 906549 880905 792274 726316 833187 786722 726399 745407 670090 582234 494082
2043D94082P7720j35858K5004q6533J5993Q960J8851K9393l682n8735l7461r42
$$ 494082 571802 435944 460948 374415 390408 399368 418219 447612 443930 385195 347734 346792
2031C46792M8039O165J9320o0970k8092n2132o3136p00M5634q455n9123K8810
$$ 346792 394831 400996 420316 359346 331254 279122 215986 215286 260920 252465 193342 222152
2019B22152L8449P4946j27763O1013K3911q7195l8878l4445M2284O6712k8811
$$ 222152 260601 335547 207784 268797 292708 205513 166635 132190 174474 241186 212375
2008B12375o142M820l4543q4376K8921j2088R814q467K1180l075l2802J2041J3743
$$ 212375 206233 211053 176510 92134 121055 108967 118781 110314 131494 128419 95617 107658 121401
1995A21401k4291K5123M397k4560k2917q961k4767K3980q529Q4030p2611m5309
$$ 121401 97110 122233 126630 102070 79153 70192 45425 69405 60876 144906 72295 26986
1983B6986J10946R927J9485j831k3692n426l4661q2936L4652M9313m04k759m98
$$ 26986 137932 147859 167344 165513 141821 136395 101734 18798 53450 102763 102359 99600 99102
1970I9102K1946L7172p7579K3114o07M5233q513q5863P77Q0714j1278j4663J7441
$$ 99102 121048 158220 80641 103755 103148 148381 139868 54005 54782 135496 124218 109555 126996
1957A26996k4517q616K1066K9891R573n1701j6193P944K2068P361J1549m9184
$$ 126996 102479 93863 114929 144820 154393 102692 86499 94443 116511 123872 135421 86237
1945H6237Q033j431l1752P897n4166N664N21K3045K6883J6095m1696n4220Q633
$$ 86237 94270 92839 61087 68984 14818 20482 21003 44048 70931 87026 45330 -8890 -257
1932b57J3594M2346o2473J15420J019o5837k7536K5935j8332q52j8791j7438l0745
$$ -257 13337 55683 -6790 108630 109649 43812 16276 42211 23879 23027 4236 -13202 -43947
1919d3947K6478L7357J3699J0226M8151J01450p1894m7145M8874n8271m1939K1322
$$ -43947 -17469 19888 33587 43813 91964 193414 121520 74375 123249 64978 23039 44361
1907D4361q218l0509k8117L6368O0050j6138L1671K3692o0593n5069K9584M9419
$$ 44361 36143 5634 -22483 13885 73935 57797 89468 113160 52567 -2502 27082 76501
1895G6501m2723M2158R68j4545R808L0185m1999P1846p6349L9992Q2315o5448
$$ 76501 33778 75936 76904 62359 72167 102352 60353 132199 55850 95842 178157 112709
1883A12709j9906P420k383Q589p6098J1460l0921N2400O8367l7845o6898o8848
$$ 112709 92803 100223 97840 106429 30331 41791 10870 63270 131637 93792 26894 -41954
1871d1954N2743O9587j5890M3590P156k8934n7946K5605L033k4093J5496P057
$$ -41954 10789 80376 64486 108076 115232 86298 28352 53957 56990 32897 48393 55450
1859E5450o5515P9512k5230n6445l8346Q795N1553K5043L4053m5013q117m066
$$ 55450 -10065 69447 44217 -12228 -50574 -41779 9774 34817 68870 23857 15740 11674
1847A1674n8501l8088J05538j3070J8023K7277j5280p2777R024M5650n8822P3648
$$ 11674 -46827 -84915 20623 7553 25576 52853 37573 -35204 -26180 19470 -39352 34296
1835C4296l6479N0696j8783k8280P7103k3584k0466m12m4523m391j8167K7541
$$ 34296 -2183 48513 29730 1450 78553 54969 34503 34091 -10432 -14823 -32990 -5449
1823e449l0468O8237k0587L0461K8959j00340R1774k4065j3613n8818L3009L4396
$$ -5449 -35917 32320 11733 42194 71153 -29187 62587 38522 24909 -33909 -900 33496
1811C3496K0063k4444k1416O4665L5150p4463M0382k0502n4586l6675J0527m0002
$$ 33496 53559 29115 7699 72364 107514 33051 73433 52931 -1655 -38330 -27803 -67805
1799f7805K5076J2093O0722j1401l2825O7664l888q0M3458l0131j7655O0906k4384
$$ -67805 -42729 -30636 30086 18685 -14140 53524 49636 49556 93014 62883 45228 106134 81750
1786H1750m9174l4033K851j2960N0029k5574K932K8466n3517L7359p1776L2424
$$ 81750 32576 -1457 1394 -11566 38463 12889 15821 44287 -9230 28129 -43647 -11223
1774a1223L1396q365r945l4621J0510K6054J8309k8639J2655P861j9074O4372
$$ -11223 20173 11808 1863 -32758 -22248 3806 22115 -6524 6131 13992 -5082 59290
1762E9290n8839r5982J12469L1692n2204O918J0344p822j0344L5636K5434m7091
$$ 59290 451 -95531 16938 48630 -3574 3344 13688 5866 -4478 31158 56592 9501
1750I501J3357r149k1254l9560j1986P0509q0J520J2020j06454L3476K510n0675
$$ 9501 22858 13709 -7545 -47105 -59091 11418 11338 12858 24878 -81576 -48100 -45590 -96265
1737i6265P4483k5036j670M1905J0114k1914K7629M11k3123J0679J8968j2942
$$ -96265 -21782 -46818 -48488 -6583 3531 -18383 9246 9657 -13466 -2787 16181 3239
1725C239P674n2926n6990M9024O3665K0612n734m235p2614M6177K9762J8214j6472
$$ 3239 10913 -42013 -99003 -49979 13686 34298 28564 24329 -48285 -2108 27654 45868 29396
1712B9396j7857l4893k7101L0758Q7042J73j05671k0537K6234N1638K1915l4183
$$ 29396 11539 -23354 -50455 -19697 67345 67518 -38153 -58690 -32456 19182 41097 6914
1700F914J9321K3735J5082M612l7524J625n9277k436n280k0828N0882L4562O8070
$$ 6914 26235 49970 65052 69664 32140 33765 -25512 -27948 -33228 -54056 -3174 31388 99458
1687I9458n9828N539K4852o4590j5006m1862l5751R7663n4524o95K0909l469Q248
$$ 99458 39630 45169 70021 5431 -9575 -51437 -87188 10475 -44049 -44744 -23835 -27304 -19056
1674a9056q7199P7583K5248K2J1559k4272l0069M129J9016N5354q590n5149M8182
$$ -19056 -106255 -28672 -3424 -3402 8157 -16115 -46184 -42055 -23039 32315 23725 -31424 16758
1661A6758k0933q823l476j7671L1070l578J425o6019K1282M292Q9427K2464j1566
$$ 16758 -4175 -12998 -16474 -34145 -3075 -6653 -5228 -71247 -49965 -45673 43754 66218 54652
1648E4652m6656K8708K8723J813k0567l8027n7034j3937K1455J9889m575L4359
$$ 54652 7996 36704 65427 67240 46673 8646 -48388 -62325 -40870 -20981 -25556 8803
1636H803j2875n092N0528n3279M118L0629m8302N194K9652k0789l2085J475N7627
$$ 8803 -4072 -9164 41364 -11915 -7797 22832 -25470 -20276 9376 -11413 -43498 -42023 15604
1623A5604K0564j3196j1705k0785L210K5995r3780N199j1071l2615L5586R9650
$$ 15604 36168 22972 11267 -9518 -6308 19687 -74093 -68894 -79965 -112580 -76994 22656
1611B2656N8794o5505m6401m0566J5496O6937j9232o112Q0048n4009o3025L2539
$$ 22656 81450 15945 -30456 -71022 -55526 11411 -7821 -13933 66115 12106 -50919 -18380
1599a8380Q1111m0469n347P8014p4190m3363Q7622m9621m1626J8395m5751J16563
$$ -18380 62731 22262 16915 94929 20739 -22624 64998 15377 -26249 -7854 -53605 62958
1587F2958m5331M0802m2939l51M3582k3998k1885o5614k3443J7423M0559L3635
$$ 62958 17627 58429 15490 15139 58721 34723 12838 -52776 -76219 -58796 -18237 15398
1575A5398k1656j2562n9434J3251O2082q155L5977m054L5071J9698l7016K3033
$$ 15398 -6258 -18820 -78254 -65003 -2921 -11076 24901 20847 55918 75616 38600 61633
1563F1633q164L8939o6508m7338j5097N0419m48k4030L8389M3050q5992J9269
$$ 61633 53469 92408 25900 -21438 -36535 13884 13436 -10594 27795 70845 -15147 4122
1551D122p752n8271O1414r4185K5970j8753O9518k5082J7678n388o547N9074k9489
$$ 4122 -3630 -61901 -487 -94672 -68702 -87455 -17937 -43019 -25341 -30729 -37276 21798 -7691
1538g691N1143j2032q037m1001N974j328m4648P4781J2487n4475j4152L855L5553
$$ -7691 43452 31420 23383 -17618 -11644 -12972 -57620 17161 29648 -24827 -38979 -35124 429
1525D29p9631l519K4115Q966N4278l1448L8531L2171j20044Q122R59j6499O6920
$$ 429 -79202 -82721 -58606 -49640 4638 -26810 11721 43892 -76152 -68030 -67071 -83570 -16650
1512a6650K9938K4900l4378k2422L6041l8659J5959J3899k8799P7841q260M300
$$ -16650 13288 38188 3810 -18612 17429 -21230 -5271 8628 -20171 57670 49410 53710
1500E3710J4867n7860l2843J09064l5394m0073n017k3665L3553m0311l8429K5792
$$ 53710 68577 10717 -22126 86938 51544 11471 6454 -17211 16342 -23969 -62398 -36606
1488c6606P9682P582j7693m2265K3421P506m5571K4935P795l8240Q829K5090m263
$$ -36606 43076 50658 32965 -9300 14121 21627 -23944 991 8786 -29454 -20625 4465 202
1475B02k4649j9305J8221M1935L4838K3686k3011p3641L8438l3024J5591R0615
$$ 202 -24447 -43752 -25531 16404 51242 74928 51917 -21724 16714 -16310 -719 89896
1463H9896l4948L8522o0266R737j7682l3018l1589L5989j0483k637j1407l9645
$$ 89896 54948 93470 33204 42941 25259 -7759 -39348 -3359 -13842 -16479 -27886 -67531
1451f7531K2775o177M5756l4461P3242q3514j3235L4347M6609k9225J0142l0667
$$ -67531 -44756 -50933 -5177 -39638 33604 -49910 -63145 -28798 17811 -11414 -1272 -31939
1439c1939l3364p674L6083Q1738j5250L2262M3288j40370M2397K1719o9285L9478
$$ -31939 -65303 -72977 -36894 44844 29594 61856 105144 -35226 7171 28890 -40395 -917
1427i17L5398q2126j721l1137L9687L4626n8348P9035j6689n3474M3697p718J2168
$$ -917 34481 -47645 -49366 -80503 -40816 -6190 -64538 14497 -2192 -55666 -11969 -19687 -7519
1414g519K161J561P514k3038k7565l8536O9469N0662j6568L270l8864n9461Q394
$$ -7519 -5358 -3797 3717 -19321 -46886 -85422 -15953 34709 18141 21411 -17453 -76914 -68520
1401f8520K5376M7174p1609Q4513n0541n6493Q052M826M4375j804M0514m697k0102
$$ -68520 -43144 4030 -67579 16934 -33607 -90100 -82048 -77222 -32847 -34651 5863 1166 -18936
1388a8936l6280j8074K6979O0768O4660j07168k2646o946K1626J6652P0785k8258
$$ -18936 -55216 -73290 -46311 14457 79117 -28051 -50697 -57643 -36017 -19365 51420 23162
1376B3162j2636l1273k8245N9138n1039N4105K1085k3347m7270R3064o299l6654
$$ 23162 10526 -20747 -48992 10146 -40893 13212 34297 10950 -36320 56744 50445 13791
1364A3791m4812P549n0864N601r7502J08563K6583o2284J03106Q250l0047j8000
$$ 13791 -31021 -23472 -74336 -68735 -166237 -57674 -31091 -93375 9731 17981 -12066 -30066
1352c0066L1342l5134J6959l7194j0901n0836P8851l2506k678N9660k8144j2590
$$ -30066 1276 -33858 -16899 -54093 -64994 -115830 -36979 -69485 -72163 -12503 -40647 -53237
1340e3237m1540P6253P0635q9660m5067M3661J144N5561j4469j3344Q3919q9420
$$ -53237 -94777 -18524 52111 -37549 -82616 -38955 -37811 17750 3281 -10063 73856 -15564
1328a5564m9925N5357K3960o9709M9360l063J4278K3711n910m0811o8870N266
$$ -15564 -65489 -10132 13828 -55881 -6521 -9584 4694 28405 22495 -18316 -87186 -81920
1316h1920L9111J1397k722Q6668q5955J565q3523Q9795J09920n1898o30L571j0341
$$ -81920 -42809 -31412 -34134 52534 -33421 -31856 -115379 -25584 84336 32438 31808 35379 25038
1303B5038n2774P436k6450O6248l1097k859J1490r66n1678L9336M8699K3613l2471
$$ 25038 -27736 -20300 -46750 19498 -11599 -14458 -2968 -3934 -55612 -16276 32423 56036 23565
1290B3565j5408l9691n3217m3022J2377L731K1711Q1617k6069J9344K0674m8366
$$ 23565 8157 -31534 -84751 -127773 -115396 -111665 -89954 -8337 -34406 -15062 5612 -42754
1278d2754q984l3227k0150m4493P7829J1811P4299n5066N402O847K1920P75n355
$$ -42754 -51738 -84965 -105115 -149608 -71779 -59968 14331 -40735 -35333 -28486 -6566 -5791 -11146
1265a1146M5360l9710O2596r1482l7031m2032O2815N8510K0225j4387j8408n2424
$$ -11146 34214 -5496 57100 -34382 -71413 -113445 -50630 7880 28105 13718 -4690 -57114
1253e7114L8838N8483k3966K4612j5281K5535J144l0130N43j9662L343P2997o4823
$$ -57114 -18276 40207 16241 40853 25572 51107 52251 22121 22664 3002 6345 79342 14519
1240A4519J6466K1566j36437o3571J37504j7614o1826R0250j28333K1015R3856
$$ 14519 30985 52551 -83886 -147457 -9953 -27567 -89393 857 -127476 -106461 -12605
1229a2605N2858p213l2592K1995K0668j2760j2386n1552L7280m1808n073n3451
$$ -12605 40253 33040 448 22443 43111 30351 17965 -33587 3693 -38115 -43188 -96639
1217i6639J01853O716j5774p4651L2343M9671k11J0668J6589j376k7501L7446
$$ -96639 5214 11930 -3844 -78495 -46152 3519 3308 13976 30565 29189 1688 39134
1205C9134j6544o9173Q839m0339l0452J35910j253J1569m0700K7503j8021j682
$$ 39134 22590 -46583 -37744 -78083 -108535 27375 26122 37691 -3009 24494 6473 4791
1193D791l2698K810m917J4975m4889K1273j5127k8206R600Q223N6194N6487O729
$$ 4791 -27907 -25097 -30014 -15039 -59928 -38655 -53782 -81988 -72388 -64165 -7971 48516 55245
1180E5245q9165j1800Q3781n7854M339m2907J7047N3153n6555M9460J0018l1879
$$ 55245 -33920 -45720 38061 -19793 -15454 -58361 -41314 11839 -44716 4744 14762 -17117
1168a7117j1856l5246j6144N2063R2882N2763l3228m7833l7921J7043j1280j0206
$$ -17117 -28973 -64219 -80363 -28300 64582 117345 84117 36284 -1637 15406 4126 -6080
1156f080J2337Q229m4753R3190j00706k9543J5195N9497k1654L7794L901q2343
$$ -6080 6257 14486 -30267 62923 -37783 -67326 -52131 7366 -14288 23506 27407 -54936
1144e4936J0473J3701j3129L8989k0682K6706j9009l4916RQ8186n6008j3292L0846
$$ -54936 -44463 -30762 -43891 -4902 -25584 1122 -17887 -52803 -52794 35392 -20616 -33908 -3062
1131c062k5153L3061l1875K5009N1538J2101q9701n404K2402j854l5655L9802
$$ -3062 -28215 4846 -27029 -2020 49518 61619 -28082 -33486 -11084 -12938 -48593 -8791
1119h791L9926l8512l6668P7083o41K8639p5936l6484M3797M4166l116r009K4026
$$ -8791 31135 -7377 -44045 33038 32397 61036 -14900 -51384 -7587 36579 33463 24454 48480
1106D8480j4527K3194m7371j753k3589n98j2002n6499J1553n7984Q31O7895M3202
$$ 48480 33953 57147 9776 8023 -15566 -16164 -28166 -84665 -73112 -131096 -130265 -62370 -19168
1093a9168P7473j8950J4267q0447K3443m6887l8275L5532O568J45090p2449p6922
$$ -19168 58305 39355 53622 -26825 -3382 -50269 -88544 -53012 -46444 98646 26197 -50725
1081e0725K0798N0192l5472L5458n4023j8172j4961q691M1285j8388k7396O1462
$$ -50725 -29927 20265 -15207 20251 -33772 -51944 -66905 -75596 -34311 -52699 -80095 -18633
1069a8633K0945k8333O699n778K2585J4558k9165l407k9872M1344l6355L0484
$$ -18633 2312 -26021 -19322 -25100 -2515 12043 -17122 -20529 -50401 -9057 -45412 -14928
1057a4928O230K2915l5639J4423P741K6664m5091k1197K4970M3258J723k7634
$$ -14928 -8698 14217 -21422 -6999 742 27406 -17685 -38882 -13912 29346 31069 3435
1045C435k2707N9452j00625M1392M6021j2013K3269k3849J6904o9567J347N688
$$ 3435 -19272 40180 -60445 -19053 26968 14955 38224 14375 31279 -38288 -36941 -31253
1033c1253K3730L184q366j876O8963K9168p7994o714O2721o2465o5278Q8171P3170
$$ -31253 -7523 -4339 -12705 -14581 54382 83550 5556 -1158 61563 -902 -66180 21991 95161
1020I5161o4802n9067M893Q1678k7434J0102o0332m13j145k0844L0405O728o1730
$$ 95161 30359 -28708 -23815 57863 30429 40531 -19801 -20214 -21359 -42203 -11798 -5070 -66800
1007f6800Q5382K2026M51j01482J5813Q6711k3849L3235m2829q3768N231M0382
$$ -66800 18582 40608 41059 -60423 -44610 42101 18252 51487 8658 -75110 -69879 -29497
995b9497q96O959k3864M4049j5970J1332K3256j7376o0420j3444R5991M1572l4263
$$ -29497 -30393 -23434 -47298 -3249 -19219 -7887 15369 -2007 -62427 -75871 20120 61692 27429
982B7429o5963j8883P3455J8191k9408l2990L1243o5178M7604L5054L3289j1675
$$ 27429 -38534 -57417 16038 34229 4821 -28169 3074 -62104 -14500 20554 53843 42168
970D2168q3947k276J0882M1500k8195P5207l7805L6068r6735M2088m1068m2165
$$ 42168 -41779 -44055 -33173 8327 -19868 55339 17534 53602 -43133 -1045 -42113 -84278
958h4278Q2397l8422Q1432K2427p9463K4558j12889O2705J5985O135O3578l5432
$$ -84278 -1881 -40303 41129 63556 -15907 8651 -104238 -41533 -25548 -19413 44165 8733
946H733l1375j0812l2066N1422Q5085l432o7520j1558J08323n5372k339m9757
$$ 8733 -22642 -33454 -65520 -14098 70987 67555 35 -11523 96800 41428 39089 -10668
934a0668O4859k0336p9661L3441k2209k4280O9213j0739M8594J813q5082l6365
$$ -10668 54191 33855 -45806 -12365 -34574 -58854 10359 -380 48214 50027 -35055 -71420
922g1420K7284L9329n4005N5418P121R935l6289L9082K8519m8542M695M4485n7678
$$ -71420 -44136 -4807 -58812 -3394 3727 13662 -22627 16455 44974 -3568 1127 45612 -12066
909a2066r997L5739J1256K8475m9867J5940R154L1365m2646l2241n0625K6068
$$ -12066 -22063 13676 24932 53407 3540 19480 28634 59999 17353 -14888 -65513 -39445
897c9445N2055J276O2516j15175j9823k1928R3275j6552K0584N2847r8583j7848
$$ -39445 12610 13886 76402 -38773 -58596 -80524 12751 -3801 16783 69630 -28953 -46801
885d6801m8685K6169N2843L2521k0887J2792J420N7629j6184k1856m2150l4474
$$ -46801 -95486 -69317 -16474 16047 -4840 7952 9372 67001 50817 28961 -13189 -47663
873d7663M5205q2162L3716L4596l9279N5766J9076q8690N4441N536l704Q6711
$$ -47663 -2458 -84620 -50904 -16308 -55587 179 19255 -69435 -14994 -9458 -13162 73549
861G3549q3736l9669j7967p0428K3410P1073k8265O4499m0668L0269o5898M3064
$$ 73549 -10187 -49856 -67823 -138251 -114841 -43768 -72033 -7534 -48202 -17933 -83831 -40767
849d0767L7734J9151l934J313m2213o205j919K870J1218Q0379n9040n1764Q1519
$$ -40767 -3033 16118 12184 13497 -28716 -34921 -36840 -33970 -22752 57627 -1413 -53177 28342
836B8342r572p139n2220n0312J6380M0620J54M1985J5199K0361m1022M350k1040
$$ 28342 18770 11631 -40589 -90901 -74521 -33901 -33747 8238 23437 43798 2776 7126 -13914
823a3914K5465M5514k7254n2409l3003J1679M626l0426o739K5771R807j7126M6087
$$ -13914 11551 57065 29811 -22598 -55601 -43922 -39296 -69722 -76461 -50690 -40883 -58009 -11922
810a1922j7727J1o554O8527j05903j9502O4532Q764L2655q855q9073J44983N1663
$$ -11922 -29649 -29638 -36192 32335 -73568 -93070 -28538 -19774 12881 4026 -85047 59936 111599
797A11599l8480l705m9664J1458L1753m2866p240m7250M9206M2427q5262J0239
$$ 111599 73119 69414 19750 31208 62961 20095 12855 -34395 14811 57238 -28024 -17785
785a7785k8564O8295n6165Q1901n1665P3756l1468K9131l8796p8157P5898L480
$$ -17785 -46349 21946 -34219 47682 -3983 69773 38305 67436 28640 -49517 26381 29861
773B9861k7311j3085K991K390J07722m0275j3962m5261p6521L9956J2788J1237
$$ 29861 2550 -10535 -7544 -5154 102568 62293 48331 3070 -73451 -33495 -20707 -9470
761i470N2498n2679p887J7770J6865k5903j8068J4641p991M6470m7214k1771m9610
$$ -9470 43028 -9651 -17538 232 17097 -8806 -26874 -12233 -20224 26246 -20968 -42739 -92349
748i2349Q7410k113L8671j2287o7338K5962L137m4107k0501J35552N923n5925
$$ -92349 -4939 -7052 31619 19332 -48006 -22044 -18907 -63014 -83515 52037 57960 2035
736B035k2513l1738P32N4561R6011q4395K1655m1571n6905K9996K9892L1355m9999
$$ 2035 -20478 -52216 -51484 3077 99088 14693 36348 -5223 -62128 -32132 -2240 29115 -20884
723b0884l3375K8825K6429m0657N4750L7370j7586n2594R6185l0143l1280k4591
$$ -20884 -54259 -25434 995 -39662 15088 52458 34872 -17722 78463 48320 17040 -7551
$$ [...]
##END NTUPLES=NMR SPECTRUM
##END=
