##TITLE=1H_EC-3333(3)
 CDCl3
 8 sc, 
 1.10.2024
##JCAMPDX= 6.0         $$ Bruker NMR JCAMP-DX V2.0
##DATA TYPE= NMR SPECTRUM
##DATA CLASS= NTUPLES
##ORIGIN= UXNMR, Bruker Analytische Messtechnik GmbH
##OWNER= root
$$ XWIN-NMR		Version 3.5
$$ Tue Oct  1 14:04:41 2024 Russian Standard Time (UT+4h)  she@DPX200
##.OBSERVE FREQUENCY= 200.1318
##.OBSERVE NUCLEUS= ^1H
##.ACQUISITION MODE= SIMULTANEOUS
##.ACQUISITION SCHEME= undefined
##.AVERAGES= 8
##.DIGITISER RES= 18
##SPECTROMETER/DATA SYSTEM= spect
##.PULSE SEQUENCE= zg30
##.SOLVENT NAME= DMSO
##.SHIFT REFERENCE= (INTERNAL, DMSO, 0, 21.0296)
##AUDIT TRAIL= $$ (NUMBER, WHEN, WHO, WHERE, WHAT)
$$ ##TITLE= Audit trail, XWIN-NMR		Version 3.5
$$ ##JCAMPDX= 5.01
$$ ##ORIGIN= Bruker BioSpin GmbH
$$ ##OWNER= she
$$ F:/spectra/data/she/nmr/H-F/1/pdata/1/auditp.txt
$$ ##AUDIT TRAIL=  $$ (NUMBER, WHEN, WHO, WHERE, WHAT)
(   1,<2024-10-01 14:03:27.53 +0400>,<she>,<DPX200>,
      <created by zg, POWCHK disabled, PULCHK disabled
       configuration hash MD5:
       00 E9 B6 7A A2 85 ED C7 34 08 36 98 17 FE 4E 26
       data hash MD5: 16K
       52 35 65 28 5D 86 B1 7A EB 55 00 EE 42 A8 1B 41>)
(   2,<2024-10-01 14:03:30.45 +0400>,<she>,<DPX200>,
      <Start of raw data processing
       efp BC_mod = 2 LB = 0.24 FT_mod = 6 PKNL = 1 PHC0 = -26154.57 PHC1 = 8.587477 SI = 16K 
       data hash MD5: 16K
       E6 D1 42 8C 42 99 04 8F CA 5F B5 46 99 0E ED CF>)
(   3,<2024-10-01 14:03:49.67 +0400>,<she>,<DPX200>,
      <pk PHC0 = 159.1735 PHC1 = -1.8 
       data hash MD5: 16K
       82 11 37 40 C8 2E 6B 56 2D 71 3A C6 DB 2C 96 41>)
(   4,<2024-10-01 14:03:53.39 +0400>,<she>,<DPX200>,
      <abs ABSG = 5 
       data hash MD5: 16K
       D4 73 82 D9 F9 4A 54 54 3B 49 47 31 BB 3F 82 20>)
$$ ##END=
$$ 
$$ hash MD5
$$ 0D AA 00 31 51 E7 89 EF E8 D3 4D 1B 3B CD C8 E8
##$RELAX= 
##$RELAX= 
##$RELAX= 
##$RELAX= 
##$RELAX= 
##$RELAX= 
$$ Bruker specific parameters
$$ --------------------------
##$DU= <F:/spectra>
##$EXPNO= 1
##$NAME= <H-F>
##$PROCNO= 1
##$TYPE= <nmr>
##$USER= <she>
##$AMP= (0..31)
100 100 100 100 100 100 100 100 100 100 100 100 100 100 100 100 100 100 
100 100 100 100 100 100 100 100 100 100 100 100 100 100 
##$AQSEQ= 0
##$AQ_mod= 1
##$AUNM= <au_zg>
##$AUTOPOS= <>
##$BF1= 200.13
##$BF2= 200.13
##$BF3= 200.13
##$BF4= 200.13
##$BF5= 200.13
##$BF6= 200.13
##$BF7= 200.13
##$BF8= 200.13
##$BYTORDA= 1
##$CFDGTYP= 0
##$CFRGTYP= 5
##$CHEMSTR= <none>
##$CNST= (0..31)
1 1 145 1 1 1 1 1 1 1 1 1 1 1 1 1 1 1 1 1 1 1 1 1 1 1 1 1 1 1 1 1 
##$CPDPRG= <>
##$CPDPRG1= <>
##$CPDPRG2= <>
##$CPDPRG3= <>
##$CPDPRG4= <mlev>
##$CPDPRG5= <mlev>
##$CPDPRG6= <mlev>
##$CPDPRG7= <mlev>
##$CPDPRG8= <mlev>
##$CPDPRGB= <>
##$CPDPRGT= <>
##$D= (0..31)
0 1.2 0 0 0 0 0 0 0 0.06 0 0.03 0 0 0 0 0.0002 0 0 0 0 0 0 0 0 0 0 0 0 
0 0 0 
##$DATE= 1727777006
##$DBL= (0..7)
120 120 120 120 120 120 120 120 
##$DBP= (0..7)
150 150 150 150 150 150 150 150 
##$DBP07= 0
##$DBPNAM0= <>
##$DBPNAM1= <>
##$DBPNAM2= <>
##$DBPNAM3= <>
##$DBPNAM4= <>
$$ [...]
##$SUBNAM3= <"">
##$SUBNAM4= <"">
##$SUBNAM5= <"">
##$SUBNAM6= <"">
##$SUBNAM7= <"">
##$SUBNAM8= <"">
##$SUBNAM9= <"">
##$SW= 24.0689170037331
##$SWIBOX= (0..15)
0 0 2 0 0 0 0 0 0 0 0 0 0 0 0 0 
##$SW_h= 4816.95568400771
##$TD= 16384
##$TD0= 1
##$TE= 0
##$TE2= 300
##$TE3= 300
##$TEG= 300
##$TL= (0..7)
0 120 120 120 120 120 120 120 
##$TP= (0..7)
150 150 150 150 150 150 150 150 
##$TP07= 0
##$TPNAME0= <>
##$TPNAME1= <>
##$TPNAME2= <>
##$TPNAME3= <>
##$TPNAME4= <>
##$TPNAME5= <>
##$TPNAME6= <>
##$TPNAME7= <>
##$TPOAL= (0..7)
0.5 0.5 0.5 0.5 0.5 0.5 0.5 0.5 
##$TPOFFS= (0..7)
0 0 0 0 0 0 0 0 
##$TUNHIN= 0
##$TUNHOUT= 0
##$TUNXOUT= 0
##$USERA1= <user>
##$USERA2= <user>
##$USERA3= <user>
##$USERA4= <user>
##$USERA5= <user>
##$V9= 5
##$VALIST= <valist>
##$VCLIST= <CCCCCCCCCCCCCCC>
##$VD= 0
##$VDLIST= <DDDDDDDDDDDDDDD>
##$VPLIST= <PPPPPPPPPPPPPPP>
##$VTLIST= <TTTTTTTTTTTTTTT>
##$WBST= 1024
##$WBSW= 4
##$XGAIN= (0..3)
0 0 0 0 
##$XL= 0
##$YL= 0
##$YMAX_a= 724176
##$YMIN_a= -615010
##$ZGOPTNS= <>
##$ZL1= 120
##$ZL2= 120
##$ZL3= 120
##$ZL4= 120
##$ABSF1= 21.00173
##$ABSF2= -3.067404
##$ABSG= 5
##$ABSL= 3
##$ALPHA= 0
##$AQORDER= 0
##$ASSFAC= 0
##$ASSFACI= 0
##$ASSFACX= 0
##$ASSWID= 0
##$AUNMP= <proc_1d>
##$AZFE= 0.1
##$AZFW= 0.1
##$BCFW= 0
##$BC_mod= 2
##$BYTORDP= 0
##$COROFFS= 0
##$CY= -3
##$DATMOD= 1
##$DC= 0
##$DFILT= <>
##$DTYPP= 0
##$F1P= 0
##$F2P= 0
##$FCOR= 1
##$FTSIZE= 16384
##$FT_mod= 6
##$GAMMA= 0
##$GB= 0
##$INTBC= 1
##$INTSCL= 3.70164e-10
##$ISEN= 128
##$LB= 0.24
##$LEV0= 0
##$LPBIN= 0
##$MAXI= 10000
##$MC2= 0
##$MEAN= 0
##$ME_mod= 0
##$MI= 1.114404
##$NCOEF= 0
##$NC_proc= -5
##$NLEV= 6
##$NOISF1= 3.799351
##$NOISF2= 2.8
##$NSP= 0
##$NTH_PI= 0
##$NZP= 0
##$OFFSET= 21.02964
##$PC= 1
##$PHC0= -25995.4
##$PHC1= 6.787477
##$PH_mod= 1
##$PKNL= yes
##$PPARMOD= 0
##$PSCAL= 0
##$PSIGN= 0
##$REVERSE= no
##$SF= 200.129999816588
##$SI= 16384
##$SIGF1= 3
##$SIGF2= 2
##$SINO= 5.538805
##$SIOLD= 16384
##$SREGLST= <1H.CDCl3>
##$SSB= 0
##$STSI= 16384
##$STSR= 0
##$SW_p= 4816.95568400771
##$SYMM= 0
##$S_DEV= 0
##$TDeff= 16384
##$TDoff= 0
##$TI= <>
##$TILT= no
##$TM1= 0
##$TM2= 0
##$TOPLEV= 0
##$USERP1= <user>
##$USERP2= <user>
##$USERP3= <user>
##$USERP4= <user>
##$USERP5= <user>
##$WDW= 1
##$XDIM= 16384
##$YMAX_p= 529487285
##$YMIN_p= -932132
$$ End of Bruker specific parameters
$$ ---------------------------------
##NTUPLES= NMR SPECTRUM
##VAR_NAME=  FREQUENCY,     SPECTRUM/REAL,   SPECTRUM/IMAG
##SYMBOL=    X,             R,               I
##VAR_TYPE=  INDEPENDENT,   DEPENDENT,       DEPENDENT
##VAR_FORM=  AFFN,          ASDF,            ASDF
##VAR_DIM=   16384,         16384,           16384
##UNITS=     HZ,            ARBITRARY UNITS, ARBITRARY UNITS
##FACTOR=    0.29402158847633, 1,            1
##FIRST=     4208.6618889194, 0,             0
##LAST=      -608.29379508831, 0,            0
##MIN=       -608.29379508831, -932132,      0
##MAX=       4208.6618889194, 529487285,     0
$$ Real data points
##PAGE= N=1
##DATA TABLE= (X++(R..R)), XYDATA
$$ [...]
$$ plain form
7093 2858445 2939747 3119137 3198429 3363750 3408073 3424570 3509145 3627401 3721906 3844863 3939569
7082 3939569 4052544 4149129 4287931 4446046 4586823 4707388 4903504 4969820 5125438 5297519
7072 5297519 5503782 5712368 6073337 6239181 6377136 6547854 6790960 7106608 7566899 7942297
7062 7942297 8300675 8680234 8980820 9261810 9697934 10133211 10577443 11133215 11866691 12684813
7052 12684813 13583553 14600331 15961125 17546605 19512914 21884730 25398708 30117979
7044 30117979 36430856 44156261 55445197 62535967 56322449 45281969 35881411 30003217
7036 30003217 25977003 23258022 20957184 19120094 17559556 16456003 15401785 14563034
7028 14563034 13831659 13260149 12736630 12407163 12153751 12047000 12013957 12072708 12139367 12280335
$$ packed form
7093B858445Q1302J79390P9292J65321M4323J6497Q4575J18256R4505J22957R4706
7082C939569J12975R6585J38802J58115J40777J20565J96116O6316J55618J72081
7072E297519K06263K08586L60969J65844J37955J70718K43106L15648M60291L75398
7062G942297L58378L79559L00586K80990M36124M35277M44232N55772P33476Q18122
7052A2684813Q98740J016778J360794J585480J966309K371816L513978M719271
7044C0117979O312877P725405J1288936P090770o213518j1040480r400558n878194
7036C0003217m026214k718981k300838j837090j560538j103553j054218q38751
7028A4563034p31375n71510n23519l29467k53412j06751l3043N8751O6659J40968
$$ plain form
7018 12280335 12728998 13184817 13436430 13512018 13422585 13326336 13384156 13723493 14271035 14886798
7008 14886798 15677276 16591229 17164266 17358016 17392270 17369197 17341493 17359676 17251756 17138017
6998 17138017 17109937 17204887 17418957 17860829 18479213 19378859 20439462 21743773 22955060
6989 22955060 24070780 24996818 25584135 25977258 26338557 26737905 27624592 29091901 30758251
6980 30758251 32696293 35017443 37130159 37887303 37145343 35532747 33788483 32447630
6972 32447630 31115738 29578724 28024620 26554092 25460926 24677407 24201442 24001395 24066278
6963 24066278 24463366 25092446 26065639 27114867 27894188 28567636 29099976 29114641 28697682
6954 28697682 28437817 28641104 29449685 30961967 31627888 30599246 29053094 27276996 25820933
$$ packed form
7018A2280335M48663M55819K51613P5588q9433r6249N7820L39337N47542O15763
7008A4886798P90478R13953N73037J93750L4254k3073k7704J8183j07920j13739
6998A7138017k8080R4950K14070M41872O18384Q99646J060603J304311J211287
6989B2955060J115720R26038N87317L93123L61299L99348Q86687J467309J666350
6980C0758251J938042K321150K112716P57144p41960j612596j744264j340853
6972C2447630j331892j537014j554104j470528j093166p83519m75965k00047O4883
6963B4066278L97088O29080R73193J049228P79321O73448N32340J4665m16959
6954B8697682k59865K03287Q08581J512282O65921j028642j546152j776098j456063
$$ plain form
6945 25820933 24393837 22863138 21088383 19543898 18090257 17217278 16457684 15933758 15502136
6936 15502136 15268182 15027730 14943178 14959283 15025644 14976926 14881917 14450276 13933829 13472249
6926 13472249 12988079 12612221 12329817 12176598 12019371 12086646 12159702 12285719 12526268 12819000
6916 12819000 12784348 12657736 12226086 11770614 11482091 11160697 10978361 10921370 11011643 11139723
6906 11139723 11333857 11574458 11849152 12242635 12742310 13084714 13126115 12814273 12419461 12013292
6896 12013292 11612681 11430746 11471122 11521340 11660237 11901173 12239553 12528348 12966207 13385703
6886 13385703 13720609 13740444 13551025 13309903 13036219 13027064 13197999 13564207 14238610 14759406
6876 14759406 15003937 15028193 14868860 14736290 14793728 15083876 15502119 16096770 16675869 17101918
$$ packed form
6945B5820933j427096j530699j774755j544485j453641q72979p59594n23926m31622
6936A5502136k33954k40452q4552J6105O6361m8718r5009m31641n16447m61580
6926A3472249m84170l75858k82404j53219j57227O7275P3056J26017K40549K92732
6916A2819000l4652j26612m31650m55472k88523l21394j82336n6991R0273J28080
6906A1139723J94134K40601K74694L93483M99675L42404M1401l11842l94812m06169
6896A2013292m00611j81935M0376N0218J38897K40936L38380K88795M37859M19496
6886A3385703L34906J9835j89419k41122k73684r155J70935L66208O74403N20796
6876A4759406K44531K4256j59333j32570N7438K90148M18243N94651N79099M26049
$$ plain form
6866 17101918 17356314 17186626 16717491 16151173 15401461 14952673 14796233 14804857 14982626 15126951
6856 15126951 15009819 14562240 13949974 13340082 12767670 12382539 12202230 12211896 12350778 12600446
6846 12600446 12975616 13415649 13826855 13936944 13921110 13836295 13746415 13995886 14433981 15041931
6836 15041931 15694796 16275217 16434097 16385206 15993292 15379324 14697056 14098819 13662801 13561753
6826 13561753 13544258 13579632 13476018 13103357 12449079 11679751 10940599 10328623 9828238 9340016
6816 9340016 9062427 8860637 8636818 8422598 8319431 8244809 8250333 8195628 7995590 7844135
6806 7844135 7776671 7773984 7739211 7672186 7631131 7651257 7552504 7516934 7430424 7426940 7390731 7340991
6794 7340991 7369066 7447553 7561768 7708069 7813995 7774457 7920696 8009107 8253177 8546772
$$ packed form
6866A7101918K54396j69688m69135n66318p49712m48788j56440Q624J77769J44325
6856A5126951j17132m47579o12266o09892n72412l85131j80309R666J38882K49668
6846A2600446L75170M40033M11206J10089j5834q4815q9880K49471M38095O07950
6836A5041931O52865N80421J58880m8891l91914o13968o82268n98237m36018j01048
6826A3561753j7495L5374j03614l72661o54278p69328p39152o11976n00385m88222
6816I340016k77589k01790k23819k14220j03167p4622N524n4705k00038j51455
6806G844135o7464k687l4773o7025m1055K0126r8753l5570q6510l484l6209m9740
6794G340991K8075P8487J14215J46301J05926l9538J46239Q8411K44070K93595
$$ plain form
6784 8546772 8881148 9331279 9775832 10313586 10927855 11365229 11667097 11689669 11685219 11730799
6774 11730799 11976384 12322006 12572427 12734290 12625553 12474987 12443710 12538142 12657512 12964900
6764 12964900 13379338 13757814 13945436 14127659 14070730 13879376 13672604 13597911 13595780 13728669
6754 13728669 13906801 14258697 14497475 14824030 15110409 15235482 15620142 16074440 16753332
6745 16753332 17591157 18739669 20020115 21676647 23325674 24702037 25615486 25684246 25349519
6736 25349519 25124461 25268902 25560349 25879601 25957528 26124484 26269151 26178802 25936063 25644416
6726 25644416 25389551 25084745 24877893 24821774 25288294 25753918 25838736 25281365 24264637 23037461
6716 23037461 22079940 21399576 21226647 21254605 21445150 21644294 21643765 21452419 20951980 20606028
$$ packed form
6784H546772L34376M50131M44553N37754O14269M37374L01868K2572m450M5580
6774A1730799K45585L45622K50421J61863j08737j50566l1277R4432J19370L07388
6764A2964900M14438L78476J87622J82223n6929j91354k06772p4693k131J32889
6754A3728669J78132L51896K38778L26555K86379J25073L84660M54298O78892
6745A6753332Q37825J148512J280446J656532J649027J376363R13449O8760l34727
6736B5349519k25058J44441K91447L19252P7927J66956J44667r0349k42739k91647
6726B5644416k54865l04806k06852n6119M66520M65624Q4818n57371j016728j227176
6716B3037461r57521o80364j72929K7958J90545J99144n29j91346n00439l45952
$$ plain form
6706 20606028 20190774 19722564 19335901 19198723 19152831 19296927 19481642 19371329 18892819 18607284
6696 18607284 18457417 18594380 18845144 19023306 19092424 19056478 18869928 18365985 17554601 16555165
6686 16555165 15957081 15511082 15388219 15565741 15699611 15762381 15525284 15038639 14136440 13102488
6676 13102488 12169077 11285089 10613014 9990312 9508787 9198403 8841746 8430628 8227077
6667 8227077 8145974 8001095 7872450 7858096 7761926 7803144 7806423 7894576 7981545 7844227 7663924
6656 7663924 7434527 7203358 7061393 6917487 6858130 6763800 6654859 6395853 6034015 5703355
6646 5703355 5418330 5192888 5004355 4898018 4738905 4572244 4475485 4362329 4269984 4209212
6636 4209212 4018344 3922184 3912325 3866607 3734281 3653671 3526619 3504662 3444305 3327346 3288804
$$ packed form
6706B0606028m15254m68210l86663j37178m5892J44096J84715j10313m78510k85535
6696A8607284j49867J36963K50764J78162O9118l5946j86550n03943q11384r99436
6686A6555165n98084m45999j22863J77522J33870O2770k37097m86645r02199j033952
6676A3102488r33411q83988o72075o22702m81525l10384l56657m11118k03551
6667H227077q1103j44879j28645j4354r6170M1218L279Q8153Q6969j37318j80303
6656G663924k29397k31169j41965j43906n9357r4330j08941k59006l61838l30660
6646E703355k85025k25442j88533j06337j59113j66661r6759j13156r2345o0772
6636D209212j90868r6160r859m5718j32326q0610j27052k1957o0357j16959l8542
$$ plain form
6625 3288804 3227715 3089172 3021943 2945263 2940018 2829476 2781688 2722247 2559551 2547575 2493199
6614 2493199 2474364 2376727 2409501 2388592 2363124 2416272 2312540 2258211 2259752 2226934 2135932
6603 2135932 2022206 2027347 1926943 1881223 1855486 1841079 1775201 1797707 1831720 1761063 1724154
6592 1724154 1781590 1773287 1722004 1665927 1635913 1643916 1705997 1761065 1718262 1721834 1682950 1616681
6580 1616681 1590673 1567294 1506270 1463281 1510553 1454068 1442292 1368227 1433932 1431104 1371312 1322303
6568 1322303 1313255 1228517 1195425 1277225 1242977 1213177 1221836 1210375 1231308 1232865 1240776 1278137
6556 1278137 1277301 1295880 1227220 1174286 1161298 1174780 1190462 1232194 1192611 1145553 1126635 1156290
6544 1156290 1048937 1061838 1031318 1099038 1107826 1121647 1020418 988085 974509 1032924 1011719
$$ packed form
6625C288804o1089j38543o7229p6680n245j10542m7788n9441j62696j1976n4376
6614B493199j8835r7637L2774k0909k5468N3148j03732n4329J541l2818r1002
6603B135932j13726N141j00404m5720k5737j4407o5878K2506L4013p0657l6909
6592A724154N7436q303n1283n6077l0014Q003O2081N5068m2803L572l8884o6269
6580A616681k6008k3379o1024m2989M7272n6485j1776p4065O5705k828n9792m9009
6568A322303r048q4738l3092Q1800l4248k9800Q659j1461K0933J557P911L7361
6556A278137q36J8579o8660n2934j2988J3482J5682M1732l9583m7058j8918K9655
6544A156290j07353J2901l0520O7720Q788J3821j01229l2333j3576N8415k1205
$$ plain form
6533 1011719 1002500 1024267 1023612 968821 1014477 1053828 1061041 1148481 1113296 1103576 1098248 1091978 1176383
6520 1176383 1289016 1293475 1260049 1227771 1324678 1446383 1356326 1394219 1439851 1448333 1436788
6509 1436788 1501748 1622841 1638081 1750749 1691941 1730567 1782021 1726253 1706467 1751146 1792262
6498 1792262 1864439 1913640 1966806 1998531 2073839 2201511 2291461 2244820 2359355 2541408 2648453
6487 2648453 2711460 2845710 2921192 3029121 3214403 3363257 3522582 3793578 4216430 4663299
6477 4663299 5215513 5734453 6080648 6236078 6129182 5864621 5717696 5652496 5769179 5927174
6467 5927174 6080660 6036896 5788588 5385747 4862337 4467916 4103401 3852642 3708550 3593141
6457 3593141 3481902 3431143 3383055 3308138 3301918 3299205 3338003 3499917 3530463 3632648 3819743
$$ packed form
6533A011719r219K1767o55n4791M5656L9351P213Q7440l5185r720n328o270Q4405
6520A176383J12633M459l3426l2278R6907J21705r0057L7893M5632Q482j1545
6509A436788O4960J21093J5240J12668n8808L8626N1454n5768j9786M4679M1116
6498A792262P2177M9201N3166L1725P5308J27672Q9950m6641J14535J82053J07045
6487B648453O3007J34250P5482J07929J85282J48854J59325K70996M22852M46869
6477D663299N52214N18940L46195J55430j06896k64561j46925o5200J16683J57995
6467E927174J53486m3764k48308m02841n23410l94421l64515k50759j44092j15409
6457C593141j11239n0759m8088p4917o220k713L8798J61914L0546J02185J87095
$$ plain form
6446 3819743 4067095 4386934 4848309 5359341 5823242 6015674 5937402 5716535 5386227 5274196
6436 5274196 5270702 5355230 5558951 5566845 5311820 4910430 4347826 3873007 3406581 3088290
6426 3088290 2893528 2669707 2485041 2339080 2106107 2086178 1938993 1822079 1754542 1615389
6416 1615389 1591333 1506075 1469634 1494242 1457328 1477672 1436444 1331295 1285169 1346128 1323256
6405 1323256 1265116 1231709 1251831 1224462 1214069 1145118 1149728 1232160 1180434 1103856 1041435 1044519
6393 1044519 986567 1021676 984670 987715 947211 893931 849231 883816 867017 798518 803533 807949
6381 807949 787412 744707 750776 798133 795721 832943 820459 761382 726263 710290 677276 645911
6369 645911 696770 715023 718504 643631 647442 639822 598281 533108 598906 600697 507738 497890 443533
$$ packed form
6446C819743K47352L19839M61375N11032M63901J92432p8272k20867l30308j12031
6436E274196l494Q4528K03721P894k55025m01390n62604m74819m66426l18291
6426C088290j94762k23821j84666j45961k32973j9929j47185j16914o7537j39153
6416A615389k4056q5258l6441K4608l6914K0344m1228j05149m6126O0959k2872
6405A323256n8140l3407K0122k7369j0393o8951M610Q2432n1726p6578o2421L084
6393A044519n7952L5109l7006L045m0504n3280m4700L4585j6799o8499N015M416
6381H07949k0537m2705O069M7357k412L7222j2484n9077l5119j5973l3014l1365
6369F45911N0859J8253L481p4873L811p620m1541o5173O5798J791r2959r848n4357
$$ plain form
6356 443533 486436 497524 511878 466199 368757 384659 375205 352870 391711 418662 422943 425654
6344 425654 393778 330570 395233 366350 346238 304934 289233 333730 379533 306370 270191 278165
6332 278165 377326 335151 278099 286675 321760 347886 387570 347758 339526 360543 324174 399523
6320 399523 332342 303581 321032 347776 316505 273822 261373 343608 438130 419131 410465 457646
6308 457646 442422 446032 407402 388639 451499 488527 438771 539362 619816 564700 659919 588329
6296 588329 634640 602890 613757 577290 580883 614984 621755 645625 701025 697379 614755 605152
6284 605152 588237 535647 462367 500121 527336 537244 508189 502603 499831 590873 563970 591413
6272 591413 558788 535431 611852 655078 673579 651137 703837 689515 741266 699959 690546 609479
$$ packed form
6356D43533M2903J1088J4354m5679r7442J5902r454k2335L8841K6951M281K711
6344D25654l1876o3208O4663k8883k0112m1304j5701M4497M5803p3163l6179P974
6332B78165R9161m2175n7052Q576L5085K6126L9684l9812q232K1017l6369P5349
6320C99523o7181k8761J7451K6744l1271m2683j2449Q2235R4522j8999q666M7181
6308D57646j5224L610l8630j8763O2860L7028m9756J00591Q0454n5116R5219p1590
6296E88329M6311l1750J0867l6467L593L4101O771K3870N5400l646q2624r603
6284F05152j6915n2590p3280L7754K7215R908k9055n586k772R1042k6903K7443
6272E91413l2625k3357P6421M3226J8501k2442N2700j4322N1751m1307r413q1067
$$ plain form
6260 609479 684047 717413 696879 725380 722209 722843 611021 592703 549465 569554 545846 492140
6248 492140 512220 578702 423651 420724 462063 470228 427154 405596 423636 430311 359529 364403
6236 364403 325449 347720 347885 289048 359810 367995 341226 308640 298810 353361 315896 331458
6224 331458 300123 276449 306516 343732 310371 256659 271232 322949 319438 257866 228984 266951
6212 266951 333478 386843 372036 368887 399489 311004 331865 284578 260503 320470 198297 157876
6200 157876 211153 183416 264906 262168 251751 284126 178117 212307 260418 189156 196180 231248
6188 231248 198954 143953 154524 154580 113860 150318 203067 211542 191127 196217 174732 189633 173462
6175 173462 173255 178303 175110 126519 126364 102670 118305 195718 229613 216119 206888 291516 276684
$$ packed form
6260F09479P4568L3366k0534K8501l171O34j11822j8318m3238K0089k3708n3706
6248D92140K0080O6482j55051k927M1339Q165m3074k1558J8040O675p0782M874
6236C64403l8954K2271J65n8837P0762Q185k6769l2586r830N4551l7465J5562
6224C31458l1335k3674L0067L7216l3361n3712J4573N1717l511o1572k8882L7967
6212B66951O6527N3365j4807l149L0602q8485K0861m7287k4075N9967j22173m0421
6200A57876N3277k7737Q1490k738j0417L2375j06009L4190M8111p1262P024L5068
6188B31248l2294n5001J0571N6m0720L6458N2749Q475k0415N090k1485J4901j6171
6175A73462k07N048l193m8591j55k3694J5635P7413L3895j3494r231Q4628j4832
$$ plain form
6162 276684 234422 169909 191172 215079 203377 150495 184986 224882 223015 183195 195634 222423
6150 222423 114502 118361 141465 105166 113664 152214 224851 240935 221023 120482 209536 245543
6138 245543 261279 307434 205005 213679 237726 193372 160163 163779 215781 148407 86130 203638
6126 203638 200286 145546 176519 263034 252709 310651 240859 198185 218557 177828 213415 256739
6114 256739 231049 133752 162003 177941 159582 134961 205173 210260 157121 170066 219298 285416
6102 285416 260552 152420 134278 156202 148677 97303 95190 138682 209274 282119 285981 253315
6090 253315 218535 242803 252645 278467 260964 318366 236502 179128 254547 264594 289190 293344
6078 293344 299014 360247 348223 280003 229052 310602 303399 351872 315063 277620 366473 343641
$$ packed form
6162B76684m2262o4513K1263K3907j1702n2882L4491L9896j867l9820J2439K6789
6150B22423j07921L859K3104l6299Q498L8550P2637J6084j9912j00541Q9054L6007
6138B45543J5736M6155j02429Q674K4047m4354l3209L616N2002o7374o2277J17508
6126B03638l352n4740L0973Q6515j0325N7942o9792m2674K0372m0729L5587M3324
6114B56739k5690r7297K8251J5938j8359k4621P0212N087n3139J2945M9232O6118
6102B85416k4864j08132j8142K1924p525n1374k113M3492P0592P2845L862l2666
6090B53315l4780K4268R842K5822j7503N7402q1864n7374P5419J0047K4596M154
6078B93344N670O1233j2024o8220n0951Q1550p203M8473l6809l7443Q8853k2832
$$ plain form
6066 343641 338358 303776 354296 332777 325924 350745 320368 278718 359112 295120 276172 317879
6054 317879 336292 422033 471892 439629 425414 350592 398809 409449 447578 402994 468604 492232
6042 492232 510892 517328 522503 588712 626838 587355 602849 600578 624448 725906 736900 748171
6030 748171 807435 749610 870313 898960 872480 962994 994804 1000873 1073434 1120898 1120928 1184359
6018 1184359 1252440 1281316 1355289 1440767 1528835 1541815 1498425 1576358 1590874 1597795 1608258 1668673
6006 1668673 1641562 1652196 1572175 1574889 1477208 1585732 1567371 1564872 1603948 1669614 1729093 1734992
5994 1734992 1852967 1784265 1823127 1941799 2077032 2096984 2118599 2223878 2412244 2478986
5984 2478986 2541861 2781447 3008681 3330177 3583005 3957714 4422616 4951852 5577417 6230332
$$ packed form
6066C43641n283l4582N0520k1519o853K4821l0377m1650Q0394o3992j8948M1707
6054C17879J8413Q5741M9859l2263j4215p4822M8217J0640L8129m4584O5610K3628
6042D92232J8660O436N175O6209L8126l9483J5494k271K3870J01458J0994J1271
6030G48171N9264n7825J20703K8647k6480R0514L1810O069P2561M7464L0O3431
6018A184359O8081K8876P3973Q5478Q8068J2980m3390P7933J4516O921J0463O0415
6006A668673k7111J0634q0021K714r7681J08524j8361k499L9076O5666N9479N899
5994A734992J17975o8702L8862J18672J35233J9952K1615J05279J88366O6742
5984B478986O2875K39586K27234L21496K52828L74709M64902N29236O25565O52915
$$ plain form
5974 6230332 7008721 7589405 7824218 7866003 7763229 7701551 7474143 6938402 6276798 5542463
5964 5542463 4911709 4542556 4266984 3866913 3554679 3407582 3202823 3165624 3079978 2968761
5954 2968761 2914391 2869008 2848946 2900610 2959487 2947767 2898955 2866841 2921616 2995583 3057599
5943 3057599 3151671 3343912 3487461 3610942 4026879 4420224 4855397 5435091 6104399 6604313
5933 6604313 6832672 6803987 6862606 6984582 6843116 6342237 5767874 5101369 4520239 4062516
5923 4062516 3693046 3462204 3191878 3017936 2902980 2832405 2736353 2544619 2434029 2387936
5913 2387936 2346845 2316083 2311528 2319163 2280009 2273852 2252633 2234016 2218166 2195826 2258468 2203738
5901 2203738 2210471 2281636 2331234 2404355 2365332 2394140 2418677 2382604 2355778 2334834 2337406 2340715
$$ packed form
5974F230332P78389N80684K34813M1785j02774o1678k27408n35741o61604p34335
5964E542463o30754l69153k75572m00071l12234j47097k04759l7199q5646j11217
5954B968761n4370m5383k0062N1664N8877j1720m8812l2114N4775P3967O2016
5943C057599R4072J92241J43549J23481M15937L93345M35173N79694O69308M99914
5933F604313K28359k8685N8619J21976j41466n00879n74363o66505n81130m57723
5923D062516l69470k30842k70326j73942j14956p0575r6052j91734j10590m6093
5913B387936m1091l0762m555P635l9154o157k1219j8617j5850k2340O2642n4730
5901B203738O733P1165M9598P3121l9023K8808K4537l6073k6826k0944K572L309
$$ plain form
5889 2340715 2362698 2243280 2306076 2335398 2334954 2393054 2407073 2448339 2458837 2569891 2602286
5878 2602286 2617986 2735243 2860822 2902638 3024652 3150948 3258457 3333190 3426342 3616368
5868 3616368 3694928 3791647 3962652 4063054 4292613 4554006 4963942 5387233 5963583 6650549
5858 6650549 7312829 7711071 7754149 7588651 7550073 7549377 7156701 6604829 5995195 5426069
5848 5426069 4996025 4700815 4460920 4296972 4215216 4029745 3976020 3856962 3764607 3751486
5838 3751486 3675410 3565013 3502943 3415412 3404174 3355755 3305069 3250179 3303883 3278105 3329853
5827 3329853 3409895 3429340 3467302 3401517 3429334 3414083 3405939 3386268 3350876 3297660 3376414 3377631
5815 3377631 3345111 3403625 3486728 3539914 3584935 3706146 3834443 3955460 4074412 4188344
$$ packed form
5889B340715K1983j19418O2796K9322m44N8100J4019M1266J0498J11054L2395
5878B602286J5700J17257J25579M1816J22014J26296J07509P4733R3152J90026
5868C616368P8560R6719J71005J00402K29559K61393M09936M23291N76350O86966
5858F650549O62280L98242M3078j65498l8578o96l92676n51872o09634n69126
5848E426069m30044k95210k39895j63948q1756j85471n3725j19058r2355j3121
5838C751486p6076j10397o2070q7531j1238m8419n0686n4890N3704k5778N1748
5827C329853Q0042J9445L7962o5785K7817j5251q144j9671l5392n3216P8754J217
5815C377631l2520N8514Q3103N3186M5021J21211J28297J21017J18952J13932
$$ plain form
5805 4188344 4258390 4510870 4698538 4950123 5334372 5829535 6474265 7058798 7385364 7510976
5795 7510976 7429341 7430009 7366852 7137399 6756582 6251262 5676514 5362493 5096934 4864151
5785 4864151 4601817 4409271 4279051 4165213 4123190 4119333 4078060 4053529 4070779 4108338 4142755
5774 4142755 4171514 4259048 4290065 4333433 4397882 4341800 4251902 4265373 4215316 4148396 4127312
5763 4127312 4128575 4071912 4030187 4007021 4062390 4200614 4329370 4449765 4566800 4637307 4852358
5752 4852358 4978929 5042803 5079054 5181219 5192812 5156724 5198288 5218936 5293302 5408710 5510620
5741 5510620 5622478 5755911 5955832 6096811 6329696 6514003 6727895 6986770 7285040 7781352
5731 7781352 8257291 8731130 9370598 10090534 11012853 12073627 13278784 14740154 16574935
$$ packed form
5805D188344P0046K52480J87668K51585L84249M95163O44730N84533L26566J25612
5795G510976q1635O68o3157k29453l80817n05320n74748l14021k65559k32783
5785D864151k62334j92546j30220j13838m2023l857m1273k4531J7250L7559L4417
5774D142755K8759Q7534L1017M3368O4449n6082q9898J3471n0057o6920k1084
5763D127312J263n6663m1725k3166N5369J38224J28756J20395J17035P0507K15051
5752D852358J26571O3874L6251J02165J1593l6088M1564K0648P4366J15408J01910
5741E510620J11858J33433J99921J40979K32885J84307K13892K58875K98270M96312
5731G781352M75939M73839O39468P19936R22319J060774J205157J461370J834781
$$ plain form
5722 16574935 18491002 20595757 22581852 24053640 24415125 23649686 21959935 19787527
5714 19787527 17649897 15683537 13983178 12561995 11361380 10337627 9453008 8683751
5706 8683751 8034554 7577891 7010808 6613112 6338634 6035959 5803662 5618341 5399459 5206358
5696 5206358 5027136 4807515 4657821 4391873 4083314 3889550 3752398 3509139 3375693 3155896
5686 3155896 3076105 2970934 2858753 2738024 2691952 2626677 2600912 2572953 2549445 2584088 2496926
5675 2496926 2496895 2536182 2537423 2541973 2580895 2576661 2466767 2262104 2143193 2116774 1991522 1913284
5663 1913284 1801583 1727408 1648928 1558378 1564716 1435632 1502577 1478173 1426228 1392464 1384553
5652 1384553 1322515 1258676 1194313 1113875 1122392 1134095 1056416 1029801 1066594 1017901 971523 972141
$$ packed form
5722A6574935J916067K104755J986095J471788L61485p65439j689751k172408
5714A9787527k137630j966360j700359j421183j200615j023753q84619p69257
5706H683751o49197m56663n67083l97696k74478l02675k32297j85321k18882j93101
5696E206358j79222k19621j49694k65948l08559j93764j37152k43259j33446k19797
5686C155896p9791j05171j12181j20729m6072o5275k5765k7959k3508L4643q7162
5675B496926l1L9287J241M550L8922m234j09894k04663j18911k6419j25252p8238
5663A913284j11701p4175p8480r0550O338j29084O6945k4404n1945l3764p911
5652A384553o2038o3839o4363q0438Q517J1703p7679k6615L6793m8693m6378O18
$$ plain form
5640 972141 924389 878002 835643 843484 828135 769183 824004 826490 805028 789999 736107 765778
5628 765778 751225 668781 665973 642524 683918 648294 642277 639589 631344 569061 546457 541632 530082
5615 530082 579031 530935 519869 536297 534863 494786 498864 542885 500723 450007 504587 462747
5603 462747 534676 587725 522843 540665 506638 493761 498443 522599 490120 432948 405756 451821
5591 451821 524371 598884 570413 581961 583996 671114 691158 676798 585073 520372 564310 479900
5579 479900 502680 510163 532791 553380 585049 530354 515258 485518 460987 477827 416560 438171
5567 438171 369720 326560 364059 446324 475113 397269 377731 412389 412257 372596 390515 372937
5555 372937 384598 417135 312371 332812 412446 403708 413584 426133 443582 528508 520299 547732
$$ packed form
5640I72141m7752m6387m2359P841j5349n8952N4821K486k1462j5029n3892K9671
5628G65778j4553q2444k808k3449M1394l5624o017k688q245o2283k2604m825j1550
5615E30082M8949m8096j1066J6428j434m0077M078M4021m2162n0716N4580m1840
5603D62747P1929N3049o4882J7822l4027j2877M682K4156l2479n7172k7192M6065
5591D51821P2550P4513k8471J1548K035Q7118K0044j4360r1725o4701M3938q4410
5579D79900K2780P483K2628K0589L1669n4695j5096k9740k4531J6840o1267K1611
5567D38171o8451m3160L7499Q2265K8789p7844j9538L4658j32l9661J7919j7578
5555C72937J1661L2537j04764K0441P9634q738R876J2549J7449Q4926q209K7433
$$ plain form
5543 547732 518659 524345 484181 433086 422553 457793 389847 385156 364169 372814 446549 482487
5531 482487 476311 429385 393373 409307 312798 316944 344355 435466 358887 392263 365877 310864
5519 310864 383299 366710 321488 329311 347317 402675 391845 363705 408051 385079 335859 415502
5507 415502 396631 415327 376385 304892 321435 403341 397364 369157 419694 394431 383759 462659
5495 462659 501482 472147 484196 539716 520102 470449 487153 485756 606800 587825 641705 627116
5483 627116 702173 663015 701092 670125 698349 628923 626532 598063 575277 558191 471499 523240
5471 523240 515254 482568 525915 569640 549197 506079 615039 551866 574977 662021 621546 584027
5459 584027 614145 687868 678295 628427 684478 712345 715480 751522 712515 719811 740173 798226
$$ packed form
5543E47732k9073N686m0164n1095j0533L5240o7946m691k0987Q645P3735L5938
5531D82487o176m6926l6012J5934r6509M146K7411R1111p6579L3376k6386n5013
5519C10864P2435j6589m5222P823J8006N5358j0830k8140M4346k2972m9220P9643
5507D15502j8871J8696l8942p1493J6543Q1906n977k8207N0537k5263j0672P8900
5495D62659L8823k9335J2049N5520j9614m9653J6704j397J21044j8975N3880j4589
5483F27116P5057l9158L8077l0967K8224o9426k391k8469k2786j7086q6692N1741
5471E23240p986l2686M3347M3725k0443m3118J08960o3173K3111Q7044m0475l7519
5459E84027L0118P3723r573m9868N6051K7867L135L6042l9007P296K0362N8053
$$ plain form
5447 798226 831587 831265 907491 964544 955849 972238 1031479 1026950 1110214 1149240 1117341 1149777
5435 1149777 1195562 1194808 1291567 1332088 1399458 1355947 1372831 1327391 1389494 1425159 1306517 1199237
5423 1199237 1204879 1174302 1075656 1096390 1058184 1066853 1008866 1075507 1020199 969029 965178 896858
5411 896858 858009 911333 917092 918318 975399 941843 953075 949703 971918 1008752 986195 1029455
5399 1029455 1085892 1132087 1099517 1154172 1247291 1267919 1336021 1406200 1445572 1478748 1517318
5388 1517318 1567729 1647790 1726125 1738174 1686465 1692844 1728807 1785393 1740706 1733581 1744191 1775093
5376 1775093 1727987 1658850 1562763 1494990 1358323 1335821 1296859 1203223 1188246 1222890 1092225
5365 1092225 1047134 1097149 1020255 971248 992611 1012191 992365 960255 941718 1037151 971354
$$ packed form
5447G98226L3361l22P6226N7053q695J6389N9241m529Q3264L9026l1899L2436
5435A149777M5785p54R6759M0521O7370m3511J6884m5440O2103L5665j18642j07280
5423A199237N642l0577r8646K0734l8206Q669n7987O6641n5308n1170l851o8320
5411H96858l8849N3324N759J226N7081l3556J1232l372K2215L6834k2557M3260
5399A029455N6437M6195l2570N4655R3119K0628O8102P0179L9372L3176L8570
5388A517318N0411Q0061P8335J2049n1709O379L5963N6586m4687p125J0610L0902
5376A775093m7106o9137r6087o7773j36667k2502l8962r3636j4977L4644j30665
5365A092225m5091N0015p6894m9007K1363J9580j9826l2110j8537R5433o5797
$$ plain form
5354 971354 952989 977044 961013 866272 880787 878099 939396 978283 983750 961861 953274 1003952
5342 1003952 1067198 1005168 1012510 957213 980796 1067746 1032010 1115186 1096341 999728 1068023 1051132
5330 1051132 1021370 1070457 1120974 1150299 1170610 1201868 1179847 1184780 1111689 1173433 1176704 1111181
5318 1111181 1151746 1259750 1233488 1169285 1261278 1304056 1401639 1401852 1450601 1560610 1579770
5307 1579770 1726738 1787113 1739327 1727594 1672121 1707498 1699152 1730803 1675197 1751363 1784572
5296 1784572 1798463 1700920 1667928 1800011 1851282 1830381 1858914 1792484 1815527 1810044 1853930
5285 1853930 1853698 1869134 1821945 1775510 1796380 1810998 1919762 1998156 2028979 2025763 1929684 1908243
5273 1908243 1881254 1869511 1887186 1830978 1827377 1820334 1829996 1847460 1820283 1846674 1940515 1949586
$$ packed form
5354I71354j8365K4055j6031r4741J4515k688O1297L8887N467k1889q587N0678
5342A003952O3246o2030P342n5297K3583Q6950l5736Q3176j8845r6613O8295j6891
5330A051132k9762M9087N0517K9325K0311L1258k2021M933p3091O1744L271o5523
5318A111181M0565J08004k6262o4203R1993M2778R7583K13M8749J10009J9160
5307A579770J46968O0375m7786j1733n5473L5377q346L1651n5606P6166L3209
5296A784572J3891r7543l2992J32083N1271k0901K8533o6430K3043n483M3886
5285A853930k32J5436m7189m6435K0870J4618J08764P8394L0823l216r6079k1441
5273A908243k6989j1743J7675n6208l601p043R662J7464k7177K6391R3841R071
$$ plain form
5261 1949586 1945555 1941193 1968766 2013058 2026591 2073889 2112337 2142187 2162088 2195185 2379532 2431625
5249 2431625 2417980 2509228 2608351 2722456 2828334 2985287 3218838 3407962 3588159 3847691
5239 3847691 4203769 4636514 5095573 5678908 6282143 6653374 6738143 6442524 5931413 5393980
5229 5393980 4967255 4607885 4237071 3969989 3780773 3627550 3472492 3318669 3303999 3254870
5219 3254870 3191505 3190204 3180551 3086007 3034101 3030277 3089845 2946767 2949131 2944206 2971676 2939549
5207 2939549 2926928 2948166 2871738 2901247 2867032 2805335 2754181 2729603 2704397 2618578 2556644
5196 2556644 2525082 2507063 2450524 2446526 2477208 2468984 2511115 2508704 2518293 2502911 2503091 2508112 2585677
5183 2585677 2628870 2606936 2636880 2593236 2646134 2700696 2674906 2763807 2799872 2850152 2895809
$$ packed form
5261A949586m031m362K7573M4292J3533M7298L8448K9850J9901L3097J84347N2093
5249B431625j3645R1248R9123J14105J05878J56953K33551J89124J80197K59532
5239C847691L56078M32745M59059N83335O03235L71231Q4769k95619n11111n37433
5229E393980m26725l59370l70814k67082j89216j53223j55058j53823j4670m9129
5219C254870o3365j301r653r4544n1906l824N9568j43078K364m925K7470l2127
5207B939549j2621K1238p6428K9509l4215o1697n1154k4578k5206q5819o1934
5196B556644l1562j8019n6539l998L0682q224M2131k411R589j5382J80N021P7565
5183B585677M3193k1934K9944m3644N2898N4562k5790Q8901L6065N0280M5657
$$ plain form
5172 2895809 2900972 2936677 2916451 2893257 2857952 2850682 2907543 2958516 3077329 3177159 3185956 3249914
5160 3249914 3341472 3417236 3361982 3450201 3420091 3367231 3284282 3274609 3272003 3245151 3260744 3307192
5148 3307192 3331006 3396415 3446011 3541341 3597947 3610438 3627517 3583803 3640826 3657484 3752645
5137 3752645 3773498 3736582 3793414 3797970 3821913 3890364 4080758 4163787 4228742 4395321 4499607
5126 4499607 4543378 4703299 4832254 4916191 5007823 5085811 5223492 5306432 5390548 5526592 5665650
5115 5665650 5789649 5843758 6005355 6149023 6318173 6497506 6611374 6854478 7046995 7274948
5105 7274948 7433008 7693821 7987608 8310314 8658814 8982117 9265620 9569592 9935057 10245685
5095 10245685 10682460 11027609 11618050 12099141 12528415 12978450 13418197 14082118 14685804
$$ packed form
5172B895809N163L5705k0226k3194l5305p270N6861N0973J18813R9830Q797O3958
5160C249914R1558P5764n5254Q8219l0110n2860q2949r673k606k6852J5593M6448
5148C307192K3814O5409M9596R5330N6606J2491J7079m3714N7023J6658R5161
5137C752645K0853l6916N6832M556K3943O8451J90394Q3029O4955J66579J04286
5126D499607M3771J59921J28955Q3937R1632P7988J37681Q2940Q4116J36044J39058
5115E665650J23999N4109J61597J43668J69150J79333J13868K43104J92517K27953
5105G274948J58060K60813K93787L22706L48500L23303K83503L03972L65465L10628
5095A0245685M36775L45149N90441M81091M29274M50035M39747O63921O03686
$$ plain form
5086 14685804 15311733 16004289 16650967 17313923 18160620 18963997 19807140 20703311 21617042
5077 21617042 22735207 23870346 24988828 26164170 27512289 28812678 30144844 31645891
5069 31645891 33143113 34835192 36717482 38764617 40986601 43536394 46439182 49747125
5061 49747125 53512371 57901344 63151844 69785444 78162285 88387109 100499056 113615343
5053 113615343 121836526 121963447 116805488 110662050 107421956 107812633 111293128 117309498
5045 117309498 125585313 131805669 134834163 137219200 141754253 149566135 157478678 159726138
5037 159726138 154919493 146705523 139652431 136482398 137396696 140425949 139979585 136401861
5029 136401861 132006372 129801452 131252782 136073781 143373059 151308822 152241782 143260156
$$ packed form
5086A4685804O25929O92556O46678O62956Q46697Q03377Q43143Q96171R13731
5077B1617042J118165J135139J118482J175342J348119J300389J332166J501047
5069C1645891J497222J692079J882290K047135K221984K549793K902788L307943
5061D9747125L765246M388973N250500O633600Q376841J0224824J2111947J3116287
5053A13615343Q221183J26921n157959o143438l240094L90677L480495O016370
5045A17309498Q275815O220356L028494K385037M535053P811882P912543K247460
5037A59726138m806645q213970p053092l170033R14298L029253m46364l577724
5029A36401861m395489k204920J451330M820999P299278P935763R32960q981626
$$ plain form
5021 143260156 128543117 113281798 101361232 92420854 85255771 79075427 73721269 69514437
5013 69514437 66539444 64567944 63366379 62596062 61913753 60486110 57792820 54276983
5005 54276983 50551371 46918928 43709249 40979370 38638948 36708360 35097899 33664906
4997 33664906 32601073 31498313 30507658 29649832 28879791 28371481 27928276 27575488 27118262
4988 27118262 26641062 25966582 25159778 24327153 23399874 22698923 22097211 21668695 21320590
4979 21320590 20932923 20696762 20529315 20413352 20325010 20307581 20252902 20387919 20574481 20791498
4969 20791498 20974372 21296484 21775725 22237301 22901749 23551144 24434568 25423906 26737540
4960 26737540 28287785 30081851 31789399 33215084 34063222 34547887 35015675 35512813 35933378
$$ packed form
5021A43260156j4717039j5261319j1920566q940378p165083o180344n354158m206832
5013F9514437k974993j971500j201565p70317o82309j427643k693290l515837
5005E4276983l725612l632443l209679k729879k340422j930588j610461j432993
4997C3664906j063833j102760r90655q57826p70041n08310m43205l52788m57226
4988B7118262m77200o74480q06804q32625r27279p00951o01712m28516l48105
4979B1320590l87667k36161j67447j15963q8342j7429n4679J35017J86562K17017
4969B0791498J82874L22112M79241M61576O64448O49395Q83424R89338J313634
4960B6737540J550245J794066J707548J425685Q48138M84665M67788M97138M20565
$$ plain form
4951 35933378 36298505 36721268 37466306 38312403 39025653 39907281 41206649 42635619 44006903
4942 44006903 44916488 45201862 45096258 44931768 44584401 44025787 43162455 42002991 40803062
4933 40803062 39921551 39513578 39396049 39422903 39640502 40170595 40648518 40803926 40797285 40831025
4923 40831025 40978305 40688765 39440671 37328708 34670002 31881951 29290717 27123169
4915 27123169 25346925 23732183 22550208 21596408 20724000 20031581 19589057 19336797 19230322
4906 19230322 19331675 19457797 19596336 19561078 19172573 18483396 17433623 16330984 15355352
4897 15355352 14383254 13676977 13106185 12513315 12073187 11561732 11063098 10604380 10213190
4888 10213190 9901856 9642267 9345336 9216551 8991882 8828339 8660085 8468369 8351414
$$ packed form
4951C5933378L65127M22763P45038Q46097P13250Q81628J299368J428970J371284
4942D4006903R09585K85374j05604j64490l47367n58614q63332j159464j199929
4933D0803062q81511m07973j17529K6854K17599N30093M77923J55408o641L3740
4923D0831025J47280k89540j248094k111963k658706k788051k591234k167548
4915B7123169j776244j614742j181975r53800q72408o92419m42524k52260j06475
4906A9230322J01353J26122J38539l5258l88505o89177j049773j102639r75632
4897A5355352r72098p06277n70792n92870m40128n11455m98634m58718l91190
4888A0213190l11334k59589k96931j28785k24669j63543j68254j91716j16955
$$ plain form
4879 8351414 8238618 8162433 7931986 7829314 7662686 7513575 7445351 7320259 7241041 7085165
4869 7085165 6993778 6902350 6872646 6834306 6849902 6790652 6777652 6643846 6591417 6561726 6531372
4858 6531372 6442905 6411002 6311474 6314112 6284078 6292516 6419019 6374792 6301852 6298232 6347813 6452509
4846 6452509 6427504 6426996 6426966 6514401 6543808 6547859 6613287 6624013 6623759 6562728 6601201 6567313 6594129
4833 6594129 6439737 6484450 6526190 6518971 6554642 6561802 6547748 6529769 6523327 6541697 6563569 6532330
4821 6532330 6523783 6572681 6542308 6604855 6599858 6578283 6625720 6659417 6610805 6648117 6537827 6525226
4809 6525226 6551724 6566502 6540461 6476685 6474418 6518865 6501975 6566135 6601548 6660765 6790295
4798 6790295 6874257 6906274 6886022 6971758 7038391 7036551 7172195 7236893 7247706 7258296 7295381
$$ packed form
4879H351414j12796p6185k30447j02672j66628j49111o8224j25092p9218j55876
4869G085165r1387r1428k9704l8340J5596n9250j3000j33806n2429k9691l0354
4858F531372q8467l1903r9528K638l0034Q438J26503m4227p2940l620M9581J04696
4846F452509k5005n08l0Q7435K9407M051O5428J0726k54o1031L8473l3888K6816
4833F594129j54392M4713M1740p219L5671P160j4054j7979o442J8370K1872l1239
4821F532330q547M8898l0373O2547m997k1575M7437L3697m8612L7312j10290j2601
4809F525226K6498J4778k6041o3776k267M4447j6890O4160L5413N9217J29530
4798F790295Q3962L2017k0252Q5736O6633j840J35644O4698J0813J0590L7085
$$ plain form
4787 7295381 7330724 7227953 7201508 7316918 7323521 7322240 7271655 7140518 7073238 7174665 7201966
4776 7201966 7397288 7502249 7565544 7587546 7601133 7552639 7630383 7715335 7719205 7748634 7740198
4765 7740198 7674337 7642521 7481383 7531655 7507222 7498055 7522118 7623826 7743708 7887468 7879639
4754 7879639 7903346 7969527 7897917 7870841 7919372 7958321 7975880 8001034 8114903 8321672 8467730
4743 8467730 8693928 8839736 8957289 9023270 9152049 9376890 9579031 9810187 10069046 10272166
4733 10272166 10393168 10478599 10505028 10656211 10853765 11149149 11518535 11914375 12335252 12607918
4723 12607918 12780780 12776202 12842231 13023161 13196502 13429705 13681742 13768803 13851856 13820063
4713 13820063 13813465 13983023 14173214 14486418 14858608 15403972 15909409 16437376 16909238 17150659
$$ packed form
4787G295381L5343j02771k6445J15410O603j281n0585j31137o7280J01427K7301
4776G201966J95322J04961O3295K2002J3587m8494P7744Q4952L870K9429q436
4765G740198o5861l1816j61138N0272k4433r167K4063J01708J19882J43760p829
4754G879639K3707O6181p1610k7076M8531L8949J7559K5154J13869K06769J46058
4743H467730K26198J45808J17553O5981J28779K24841K02141K31156K58859K03120
4733A0272166J21002Q5431K6429J51183J97554K95384L69386L95840M20877K72666
4723A2607918J72862m578O6029J80930J73341K33203K52037Q7061Q3053l1793
4713A3820063o598J69558J90191L13204L72190N45364N05437N27967M71862K41421
$$ plain form
4703 17150659 17438807 17755660 18086501 18428142 18923581 19403354 19939510 20501700 20982046
4694 20982046 21458759 21925598 22289179 22694193 23014890 23323483 23747802 24315843 24904074
4685 24904074 25662967 26429387 27363440 28266739 29267431 30481256 31787655 33054432 34550904
4676 34550904 36227196 38094373 39947275 41921398 43650224 45185037 46647396 48307736
4668 48307736 50120379 52268595 54654862 57378923 60185987 63182736 66401749 70291030
4660 70291030 74659274 79780536 85880861 93276174 102285574 113418229 126414807 140626436
4652 140626436 149968053 149929546 143488486 135595814 130888090 130389428 133269614 139141722
4644 139141722 145601539 148440901 148798584 149361093 153039328 160267525 169593114 176056754
$$ packed form
4703A7150659K88148L16853L30841L41641M95439M79773N36156N62190M80346
4694B0982046M76713M66839L63581M05014L20697L08593M24319N68041N88231
4685B4904074P58893P66420R34053R03299J000692J213825J306399J266777J496472
4676C4550904J676292J867177J852902J974123J728826J534813J462359J660340
4668D8307736J812643K148216K386267K724061K807064K996749L219013L889281
4660G0291030M368244N121262O100325P395313R009400J1132655J2996578J4211629
4652A40626436R341617l8507o441060p892672m707724m98662K880186N872108
4644A39141722O459817K839362L57683N62509L678235P228197R325589O463640
$$ plain form
4636 176056754 176293245 171416898 165885982 162788488 163105905 162494482 157548473 150595669
4628 150595669 144322637 141452789 142197038 145980139 151831944 158580079 160439309 154444957
4620 154444957 143818103 132646085 124038759 117849313 112627095 107430262 102347763 97644845
4612 97644845 93916152 91065181 88449491 85898321 83470994 81034922 78497461 76351897
4604 76351897 74778385 73969531 73456517 72831063 71763741 70258532 68223018 65518040 62735822
4595 62735822 60236276 58396592 57267307 56557601 56348577 56401983 56803429 57113570 57420336
4586 57420336 57648484 57656167 57458447 56920093 55911217 54299313 52181361 49743547 47366997
4577 47366997 45087652 42761021 40585376 38645767 37053099 35609994 34456331 33415378
$$ packed form
4636A76056754K36491m876347n530916l097494L17417o11423m946009o952804
4628A50595669o273032k869848P44249L783101N851805O748135J859230n994352
4620A54444957j0626854j1172018q607326o189446n222218n196833n082499m702918
4612I7644845l728693k850971k615690k551170k427327k436072k537461k145564
4604G6351897j573512q08854n13014o25454j067322j505209k035514k704978k782218
4595F2735822k499546j839684j129285p09706k09024N3406M01446L10141L06766
4586E7420336K28148P683j97720n38354j008876j611904k117952k437814k376550
4577D7366997k279345k326631k175645j939609j592668j443105j153663j040953
$$ plain form
4569 33415378 32486951 31702069 31159435 30940098 30767304 30724603 30583023 30342340 30032536 29741940
4559 29741940 29485564 29355837 29382228 29387775 29579479 29871476 30352810 30865480 31511109 32081970
4549 32081970 32633739 33166833 33610624 34043472 34550938 35242858 35770496 36559173 37393124
4540 37393124 38312017 39311453 40414730 41683655 43285235 45090996 47098587 49536564
4532 49536564 52135776 54602846 56698776 58172153 59041599 59586562 59829838 59772720 59529772
4523 59529772 59154904 58972470 58726804 58832592 59311809 60501541 62239745 64244923 65675518
4514 65675518 66041117 65783792 65533539 65450068 65500404 64997134 63837396 62086112 59881914
4505 59881914 57682115 55751398 54205102 53074976 51955808 50482764 48335907 45661276
$$ packed form
4569C3415378r28427p84882n42634k19337j72794m2701j41580k40683l09804k90596
4559B9741940k56376j29727K6391N547J91704K91997M81334N12670O45629N70861
4549C2081970N51769N33094M43791M32848N07466O91920N27638P88677Q33951
4540C7393124R18893R99436J103277J268925J601580J805761K007591K437977
4532D9536564K599212K467070K095930J473377Q69446N44963K43276n7118k42948
4523E9529772l74868j82434k45666J05788M79217J189732J738204K005178J430595
4514F5675518L65599k57325k50253q3471N0336n03270j159738j751284k204198
4505E9881914k199799j930717j546296j130126j119168j473044k146857k674631
$$ plain form
4497 45661276 42994089 40840657 39145810 37463774 35604923 33870214 32319760 31220444
4489 31220444 30484930 29956833 29689837 29503711 28858353 27684291 26116442 24617848 23154281
4480 23154281 21943662 20979217 20012069 19141671 18433716 17764537 17251600 16760650 16407113
4471 16407113 16048395 15698965 15362342 14931163 14465312 14063756 13633186 13125425 12724723
4462 12724723 12460668 12235849 11953447 11795213 11605217 11361707 11161912 11011803 10695010
4453 10695010 10425629 10200373 10008433 9822525 9510829 9395952 9203105 8989549 8795455
4444 8795455 8618426 8495834 8409936 8292906 8145404 8004768 7846691 7723028 7550635 7431746
4434 7431746 7389167 7356354 7287059 7201595 7039307 7003543 6914099 6756987 6600841 6642829 6628435
$$ packed form
4497D5661276k667187k153432j694847j682036j858851j734709j550454j099316
4489C1220444p35514n28097k66996j86126o45358j174062j567849j498594j463567
4480B3154281j210619r64445r67148q70398p07955o69179n12937m90950l53537
4471A6407113l58718l49430l36623m31179m65851m01556m30570n07761m00702
4462A2724723k64055k24819k82402j58234j89996k43510j99795j50109l16793
4453A0695010k69381k25256j91940j85908l11696j14877j92847k13556j94094
4444H795455j77029j22592q5898j17030j47502j40636j58077j23663j72393j18889
4434G431746m2579l2813o9295q5464j62288l5764q9444j57112j56146M1988j4394
$$ plain form
4423 6628435 6565820 6551214 6431197 6344606 6372817 6394410 6322743 6304613 6341171 6307713 6292981
4412 6292981 6229516 6252934 6252204 6237157 6190145 6205631 6106412 6025623 5939515 5946391 5896645 5907906
4400 5907906 5985240 6055293 6058705 6189392 6309070 6341870 6478869 6604725 6710769 6772438 6957000
4389 6957000 7230905 7564938 8049572 8388641 8349930 7999812 7602522 7256441 7067322 6822680
4379 6822680 6716660 6686911 6622070 6432821 6322612 6296788 6300031 6242616 6280199 6182659 6148552
4368 6148552 6137449 6270758 6185934 6208554 6220401 6308401 6412045 6555572 6585633 6756254 6936079
4357 6936079 7082620 7216745 7436159 7624242 7784456 7801980 7844503 7686381 7547205 7337252
4347 7337252 7134257 6981339 6932968 6747332 6503914 6352673 6284409 6259827 6201933 6213927
$$ packed form
4423F628435o2615j4606j20017q6591K8211K1593p1667j8130L6558l3458j4732
4412F292981o3465K3418p30j5047m7012J5486r9219q0789q6108O876m9746J1261
4400E907906P7334P0053L412J30687J19678L2800J36999J25856J06044O1669J84562
4389F957000K73905L34033M84634L39069l8711l50118l97290l46081j89119k44642
4379F822680j06020k9749o4841j89249j10209k5824L243n7415L7583r7540l4107
4368F148552j1103J33309q4824K2620J1847Q8000J03644J43527L0061J70621J79825
4357F936079J46541J34125K19414J88083J60214J7524M2523j58122j39176k09953
4347G337252k02995j52918m8371j85636k43418j51241o8264k4582n7894J1994
$$ plain form
4337 6213927 6219174 6209444 6251999 6172059 6007838 5913738 5875771 5800525 5780197 5678693 5683655 5697410
4325 5697410 5756717 5751354 5761557 5856746 5954379 5914426 6002430 5984557 6012860 6084463 6060527 6045199
4313 6045199 5980001 5965747 6056844 6019558 5966133 5920956 5888101 5952856 5953780 5957063 5960726 5975711
4301 5975711 5991847 6095724 5981389 6009412 6031913 6065236 6094380 6217204 6292475 6411124 6495014
4290 6495014 6622853 6762894 7039018 7129420 7217578 7229569 7274618 7236103 7051372 6746102
4280 6746102 6512053 6286205 6187307 6099480 6191641 6238878 6383207 6567085 6697217 6672927
4270 6672927 6617816 6523452 6385481 6170922 6026567 5861335 5801515 5651800 5643189 5758130
4260 5758130 5948285 6067450 6183942 6224791 6501095 6675280 6834769 6820767 6923930 6934796
$$ packed form
4337F213927N247r730M2555p9940j64221r4100l7967p5246k0328j01504M962J3755
4325E697410N9307n363J0203R5189R7633l9953Q8004j7873K8303P1603k3936j5328
4313F045199o5198j4254R1097l7286n3425m5177l2855O4755R24L283L663J4985
4301E975711J6136J03877j14335K8023K2501L3323K9144J22824P5271J18649Q3890
4290F495014J27839J40041K76124R0402Q8158J1991M5049l8515j84731l05270
4280F746102k34049k25848r8898q7827R2161M7237J44329J83878J30132k4290
4270F672927n5111r4364j37971k14559j44355j65232n9820j49715q611J14941
4260E758130J90155J19165J16492M0849K76304J74185J59489j4002J03163J0866
$$ plain form
4250 6934796 6971558 6904774 6996168 6846632 6842567 6857957 7046994 7088589 7418468 7669644 7931382
4239 7931382 8077336 8313042 8452470 8704968 8905463 9246545 9489810 9788119 9951806 10271852
4229 10271852 10579990 11051175 11315130 11587583 11989232 12570207 13071209 13563518 13820831
4220 13820831 14089549 14175753 14388852 14605247 14919254 15255234 15657723 15964609 16389418 16572613
4210 16572613 16877565 17148710 17469852 17817305 18437153 19155703 20069053 20920583 22070846
4201 22070846 23264388 24806800 26328967 27867294 28763153 29312750 29902167 30632993 31393750
4192 31393750 32395887 33653820 34983039 36166774 37438888 38679344 39847064 40829017
4184 40829017 41632628 42600955 43830205 45466905 47490861 49329997 50967996 52687247
$$ packed form
4250F934796L6762o6784R1394j49536m065J5390J89037M1595L29879K51176K61738
4239G931382J45954K35706J39428K52498K00495L41082K43265K98309J63687L20046
4229A0271852L08138M71185K63955K72453M01649N80975N01002M92309K57313
4220A3820831K68718Q6204K13099K16395L14007L35980M02489L06886M24809J83195
4210A6572613L04952K71145L21142L47453O19848P18550R13350Q51530J150263
4201B2070846J193542J542412J522167J538327Q95859N49597N89417P30826P60757
4192C1393750J002137J257933J329219J183735J272114J240456J167720R81953
4184D0829017Q03611R68327J229250J636700K023956J839136J637999J719251
$$ plain form
4176 52687247 54654338 57170272 60418151 63964412 67402265 70712041 73707226 76888344
4168 76888344 80010946 83512498 87318572 91797783 97178157 104117608 111884960 121097547
4160 121097547 131519210 144813430 160500974 179899817 204217986 238505220 284642286
4153 284642286 344657252 417328646 505069002 529487285 479589116 395713903 314869429
4146 314869429 259881041 221034950 192107250 168114356 149290310 133856564 122481238
4139 122481238 111630559 101865004 92101377 84464379 77972437 72981786 68341760 64710328
4131 64710328 61206531 58541910 55963361 53842438 51735202 50435408 49018621 48227968
4123 48227968 47292281 47082569 46855566 46723490 46014910 45389265 44317326 43386608 42485978
$$ packed form
4176E2687247J967091K515934L247879L546261L437853L309776K995185L181118
4168G6888344L122602L501552L806074M479211N380374O939451P767352R212587
4160A21097547J0421663J3294220J5687544J9398843K4318169L4287234M6137066
4153B84642286O0014966P2671394Q7740356K4418283m9898169q3875213q0844474
4146C14869429n4988388l8846091k8927700k3992894j8824046j5433746j1375326
4139A22481238j0850679r765555r763627p636998o491942m990651m640026l631432
4131F4710328l503797k664621k578549k120923k107236j299794j416787p90653
4123D8227968r35687k09712k27003j32076p08580o25645j071939r30718r00630
$$ plain form
4114 42485978 42250319 42132990 42599084 43120462 44192503 45517342 47425757 49648850 52405454
4105 52405454 56236749 61925907 69663157 79666753 92424833 105132281 105043083 94661665
4097 94661665 80249337 68372970 60039943 54044012 49289991 45315776 41980640 39464346
4089 39464346 37318411 35650938 34297493 33093782 31748740 30634468 29612202 28681840
4081 28681840 27821111 27191942 26731413 26518605 26371867 26443453 26393310 26303490 26355440 26325851
4071 26325851 26523374 26858382 27521000 28554192 29836694 31577838 33603788 35770121 37914896
4062 37914896 38639032 37833747 36199391 34575989 33247437 32115322 31244666 30510476 30027243
4053 30027243 29544088 29050225 28605050 28352426 28085425 27858262 27856623 28046437 28343227 28874905
$$ packed form
4114D2485978k35659j17329M66094N21378J072041J324839J908415K223093K756604
4105E2405454L831295N689158P737250J0003596J2758080J2707448q9198j0381418
4097I4661665j4412328j1876367q333027n995931m754021l974215l335136k516294
4089C9464346k145935j667473j353445j203711j345042j114272j022266r30362
4081B8681840q60729o29169m60529k12808j46738P1586n0143q9820N1950k9589
4071B6325851J97523L35008O62618J033192J282502J741144K025950K166333K144775
4062C7914896P24136q05285j634356j623402j328552j132115q70656p34190m83233
4053C0027243m83155m93863m45175k52624k67001k27163j639J89814K96790N31678
$$ plain form
4043 28874905 29420667 30219819 31107609 32019981 32933944 33977391 35354125 36697365 38303481
4034 38303481 39985294 41888808 44169259 46430175 48634323 50603203 51944567 52596727
4026 52596727 52489625 51903350 51210662 50787926 50661906 50880898 51332581 51665608 51981259
4017 51981259 52520617 52582804 52389824 52004764 51856280 51973785 52491514 53084112 53778052 54204597
4007 54204597 54697977 54993752 55242976 55328879 55715199 56344593 57649136 59473669 62762812
3998 62762812 67534164 74347256 82710505 93748752 103233619 104367158 100594531 95889941
3990 95889941 94815609 95692601 90871476 81325676 70398531 61431087 54952967 50031942
3982 50031942 45986547 42581004 39931273 37805656 36087864 34758221 33518524 32409758
$$ packed form
4043B8874905N45762P99152Q87790R12372R13963J043447J376734J343240J606116
4034C8303481J681813J903514K280451K260916K204148J968880J341364O52160
4026E2596727j07102n86275o92688m22736j26020K18992M51683L33027L15651
4017E1981259N39358O2187j92980l85060j48484J17505N17729N92598O93940M26545
4007E4204597M93380K95775K49224Q5903L86320O29394J304543J824533L289143
3998F2762812M771352O813092Q363249J1038247R484867J133539l772627m704590
3990I5889941j074332Q76992m821125r545800j0927145q967444o478120m921025
3982E0031942m045395l405543k649731k125617j717792j329643j239697j108766
$$ plain form
3974 32409758 31371728 30357716 29468017 28847467 28244991 27831049 27580320 27378718 27298555
3965 27298555 27328580 27101475 26622013 25982583 25450854 24942675 24747378 24578092 24631977 24843486
3955 24843486 25198814 25675190 26240658 26896316 27454581 27763639 27893608 27781135 27538971
3946 27538971 27223966 27093099 27023105 27057721 27291821 27610573 28071385 28670563 29166786 29560067
3936 29560067 29774370 29855853 29694945 29582358 29276263 28876247 28609159 28400553 28304220 28186140
3926 28186140 28144338 28215000 28390203 28581884 28838385 29150169 29341975 29503977 29886315 30228090
3916 30228090 30838572 31825630 33215184 35140703 37150850 39260124 40950389 40550662 38223901
3907 38223901 34980887 31823462 29161571 27030406 25319340 23824628 22504583 21412296
$$ packed form
3974C2409758j038030j014012q89699o20550o02476m13942k50729k01602q0163
3965B7298555L0025k27105m79462o39430n31729n08179j95297j69286N3885K11509
3955B4843486L55328M76376N65468O55658N58265L09058J29969j12473k42164
3946B7538971l15005j30867o9994L4616K34100L18752M60812N99178M96223L93281
3936B9560067K14303Q1483j60908j12587l06095m00016k67088k08606r6333j18080
3926B8186140m1802P0662J75203J91681K56501L11784J91806J62002L82338L41775
3916C0228090O10482R87058J389554J925519K010147K109274J690265l99727k326761
3907C8223901l243014l157425k661891k131165j711066j494712j320045j092287
$$ plain form
3899 21412296 20219096 19192662 18291766 17516900 16794899 16150830 15542928 14979197 14532435
3890 14532435 14085649 13645501 13318279 12943846 12551827 12249870 12021842 11731290 11542386
3881 11542386 11309340 11098249 10844841 10571187 10420728 10182663 9916676 9745981 9504221
3872 9504221 9323818 9196358 9057189 9038734 8951766 8849328 8854006 8809150 8891610 8941828 8930333
3861 8930333 8922228 8965770 8911235 8871357 8815039 8838335 8884891 9020357 9101472 9241283 9311131
3850 9311131 9459729 9684244 9779646 9962615 10139580 10214523 10355774 10514237 10746008 10974768
3840 10974768 11154041 11394864 11758878 11985329 12261854 12597344 12913587 13236892 13577317
3831 13577317 13953177 14399992 14847122 15349500 15803365 16312811 16817254 17362931 17998703
$$ packed form
3899B1412296j193200j026434r00896p74866p22001o44069o07902n63731m46762
3890A4532435m46786m40148l27222l74433l92019l01957k28028k90552j88904
3881A1542386k33046k11091k53408k73654j50459k38065k65987j70695k41760
3872I504221j80403j27460j39169j8455q6968j02438M678m4856Q2460N0218j1495
3861H930333q105M3542n4535l9878n6318K3296M6556J35466Q1115J39811O9848
3850I311131J48598K24515R5402J82969J76965P4943J41251J58463K31771K28760
3840A0974768J79273K40823L64014K26451K76525L35490L16243L23305L40425
3831A3577317L75860M46815M47130N02378M53865N09446N04443N45677O35772
$$ plain form
3822 17998703 18767108 19591785 20381020 21282743 22278383 23380329 24740853 26231767 28052488
3813 28052488 30033833 31940733 33249606 34267284 35121549 36272985 37921053 40093005
3805 40093005 42734944 46047196 50207137 55008541 60117015 65068919 68129560 67710406
3797 67710406 64107489 59199162 54647318 51081181 48425388 46484389 45090932 44284331
3789 44284331 43897943 43881641 44373756 45329351 46926991 49224527 52094417 55361004 58408987
3780 58408987 60113921 59652355 57208991 53751560 50017932 46690144 43919801 41479332
3772 41479332 39291700 37493627 35922423 34684149 33842859 33339663 33120107 33409823 33904022
3763 33904022 34555199 34971539 34785357 33774307 32207496 30477621 28977559 27738882 26707661
$$ packed form
3822A7998703P68405Q24677P89235R01723R95640J101946J360524J490914J820721
3813B8052488J981345J906900J308873J017678Q54265J151436J648068K171952
3805D0093005K641939L312252M159941M801404N108474M951904L060641m19154
3797F7710406l602917m908327m551844l566137k655793j940999j393457q06601
3789D4284331l86388j6302M92115R55595J597640K297536K869890L266587L047983
3780E8408987J704934m61566k443364l457431l733628l327788k770343k440469
3772D1479332k187632j798073j571204j238274q41290n03196k19556K89716M94199
3763C3904022O51177M16340j86182j011050j566811j729875j500062j238677j031221
$$ plain form
3754 26707661 25701796 24970199 24213398 23469734 22788490 22158469 21563697 21021422 20530293
3745 20530293 20105101 19824780 19662920 19404325 19198791 19062715 19027715 19109408 19271851 19502627
3735 19502627 19929111 20317644 20943629 21800414 22997741 24461110 25948367 27187803 27901742
3726 27901742 27865664 27143172 26138118 25286727 24488145 23622371 22732706 21862532 20935086
3717 20935086 20181733 19527495 18992831 18561165 18236818 18049201 17825327 17732719 17698392 17753938
3707 17753938 17798114 18004192 18331856 18676440 19080914 19569312 20102250 20680568 21390429 22362044
3697 22362044 23295842 24274985 25169287 25895999 26413491 26778083 27066198 27160654 27416917 27619309
3687 27619309 28110049 28909282 30033425 31582445 33406450 35815212 38804302 42483319
$$ packed form
3754B6707661j005865p31597p56801p43664o81244o30021n94772n42275m91129
3745B0530293m25192k80321j61860k58595k05534j36076l5000Q1693J62443K30776
3735A9502627M26484L88533O25985Q56785J197327J463369J487257J239436P13939
3726B7901742l6078p22492j005054q51391p98582q65774q89665q70174r27446
3717B0935086p53353o54238n34664m31666l24347j87617k23874r2608l4327N5546
3707A7753938M4176K06078L27664L44584M04474M88398N32938N78318P09861R71615
3697B2362044R33798R79143Q94302P26712N17492L64592K88115R4456K56263K02392
3687B7619309M90740P99233J124143J549020J824005K408762K989090L679017
$$ plain form
3679 42483319 47384156 53567864 60926559 68942857 76400863 79569432 76449677 68895352
3671 68895352 60162472 52661811 46819394 42389967 38927266 36088432 33772831 31706756
3663 31706756 29624449 27634967 25581164 23714332 22008694 20523234 19198093 18025798
3655 18025798 16968393 15996586 15151311 14394745 13825533 13177076 12506027 11995602 11466402
3646 11466402 11017041 10550692 10063172 9643858 9312580 8950155 8625995 8439187 8224107
3637 8224107 8041556 7887178 7832265 7764537 7843040 7787588 7691306 7708222 7579991 7405061 7263274
3626 7263274 7175353 7043503 6953433 6808286 6608795 6430350 6349779 6183522 6128863 5982461
3616 5982461 5985329 5937805 5911385 5831264 5744302 5746763 5684730 5640095 5608171 5542654 5623861 5645205
$$ packed form
3679D2483319M900837O183708P358695Q016298P458006L168569l119755p554325
3671F8895352q732880p500661n842417m429427l462701k838834k315601k066075
3663C1706756k082307j989482k053803j866832j705638j485460j325141j172295
3655A8025798j057405r71807q45275p56566n69212o48457o71049n10425n29200
3646A1466402m49361m66349m87520m19314l31278l62425l24160j86808k15080
3637H224107j82551j54378n4913o7728P8503n5452r6282J6916j28231j74930j41787
3626G263274q7921j31850r0070j45147j99491j78445q0571j66257n4659j46402
3616E982461K868m7524k6420q0121q6962K461o2033m4635l1924o5517Q1207K1344
$$ plain form
3604 5645205 5709956 5668820 5659694 5793197 5915613 6019426 6188192 6310653 6444653 6521138
3594 6521138 6544305 6462479 6526557 6554777 6601034 6771181 6965729 7077360 7291859 7417770
3584 7417770 7407735 7404184 7347572 7326642 7291404 7322932 7367115 7436531 7631764 7702049 7891880
3573 7891880 8201820 8516966 8840560 9092067 9352828 9506804 9730434 9913563 10185274 10522431
3563 10522431 10790173 11217198 11545826 12062548 12636906 13029575 13551306 14140212 14909611
3554 14909611 15953789 17143760 18531775 19966262 21381514 22775607 24153029 26243541
3546 26243541 29034456 33011088 37879391 44846691 47314183 44390593 38888163 33240255
3538 33240255 29516426 26729742 24642118 23065065 21920608 21029465 20377403 19660386 18848814
$$ packed form
3604E645205O4751m1136r126J33503J22416J03813J68766J22461J34000P6485
3594F521138K3167q1826O4078K8220M6257J70147J94548J11631K14499J25911
3584G417770j0035l551n6612k0930l5238L1528M4183O9416J95233P0285J89831
3573G891880L09940L15146L23594K51507K60761J53976K23630J83129K71711L37157
3563A0522431K67742M27025L28628N16722N74358L92669N21731N88906P69399
3554A4909611J044178J189971J388015J434487J415252J394093J377422K090512
3546B6243541K790915L976632M868303O967300K467492k923590n502430n647908
3538C3240255l723829k786684k087624j577053j144457q91143o52062p17017q11572
$$ plain form
3529 18848814 17908779 17128447 16520017 16240145 16038942 15851038 15499233 15093273 14476650
3520 14476650 13911276 13449664 13112033 12977939 13082141 13050034 13127456 13207044 13419360 13432253
3510 13432253 13442706 13398092 13453542 13429905 13377328 13200557 12871103 12369189 12029925 11803608
3500 11803608 11573413 11242964 10857829 10261785 9652159 9114760 8623221 8217145 7859735
3491 7859735 7659183 7460798 7275423 7239315 7144044 7117249 7093445 7070043 7010093 6888813 6837686
3480 6837686 6820675 6852864 6919220 7030883 7129904 7262947 7317417 7213458 6969822 6599496
3470 6599496 6216000 5887061 5653953 5445325 5264607 5190101 5147478 5069882 5133038 5148814
3460 5148814 5174965 5055768 4907192 4726775 4611320 4497041 4425502 4272892 4241699 4089536
$$ packed form
3529A8848814r40035p80332o08430k79872k01203j87904l51805m05960o16623
3520A4476650n65374m61612l37631j34094J04202l2107P7422P9588K12316J2893
3510A3432253J0453m4614N5450k3637n2577j76771l29454n01914l39264k26317
3500A1803608k30195l30449l85135n96044o09626n37399m91539m06076l57410
3491G859735k00552j98385j85375l6108r5271k6795k3804k3402n9950j21280n1127
3480F837686j7011L2189O6356J11663R9021J33043N4470j03959k43636l70326
3470F599496l83496l28939k33108k08628j80718p4506m2623p7596O3156J5776
3460E148814K6151j19197j48576j80417j15455j14279p1539j52610l1193j52163
$$ plain form
3450 4089536 3860587 3833890 3645053 3553381 3466134 3354552 3146672 3004918 2957449 2867226
3440 2867226 2713940 2634470 2594727 2561403 2586562 2600742 2585093 2660365 2648578 2765664 2802518
3429 2802518 2898285 2820104 2714902 2616621 2543612 2505130 2398270 2258678 2137828 2093216 2015301
3418 2015301 1976455 1972643 1855208 1856614 1804554 1770557 1704494 1583950 1570281 1598440 1477584
3407 1477584 1411590 1424688 1503873 1466784 1364485 1349977 1417141 1441717 1481909 1462280 1424804
3396 1424804 1377739 1295280 1296743 1269824 1257479 1184138 1158928 1104308 1136479 1152107 1129131 1051813
3384 1051813 1065701 1033763 944217 1016835 1017176 1052175 952896 963219 1050055 1039995 996973 942202
3372 942202 1042078 992733 943802 947424 869264 912698 943873 919579 940745 873546 782474 817266
$$ packed form
3450D089536k28949k6697j88837r1672q7247j11582k07880j41754m7469r0223
3440B867226j53286p9470l9743l3324K5159J4180j5649P5272j1787J17086L6854
3429B802518R5767p8181j05202r8281p3009l8482j06860j39592j20850m4612p7915
3418B015301l8846l812j17435J406n2060l3997o6063j20544j3669K8159j20856
3407A477584o5994J3098P9185l7089j02299j4508O7164K4576M0192j9629l7476
3396A424804m7065q2459J463k6919j2345p3341k5210n4620L2171J5628k2976p7318
3384A051813J3888l1938q9546P2618L41L4999r9279J0323Q6836j0060m3022n4771
3372I42202R9876m9345m8931L622p8160M3434L1175k4294K1166o7199r1072L4792
$$ plain form
3360 817266 842348 908093 864649 869014 868942 857688 802402 767004 852545 924390 883167 897874
3348 897874 912525 839536 800569 830839 865297 875522 855233 857810 889474 887757 883862 881372
3336 881372 887141 877310 928037 904189 927292 980966 990165 980561 1091343 1117831 1094496 1031197
3324 1031197 962735 942838 939499 916613 739435 841332 819490 831614 787213 764646 793094
3313 793094 736888 768204 746415 703369 640012 656018 641743 674919 719354 662452 618704 585911
3301 585911 577534 592261 624052 626242 627164 613631 545123 504469 516942 482485 441743 439864 505881
3288 505881 518760 483690 531037 521311 466018 440874 494404 446792 416947 463629 460597 425541
3276 425541 501903 466118 409541 361803 397145 418281 397887 366318 492356 468014 457992
$$ packed form
3360H17266K5082O5745m3444M365p2j1254n5286l5398Q5541P1845m1223J4707
3348H97874J4651p2989l8967L0270L4458J0225k0289K577L1664j717l895k490
3336H81372N769r831N0727k3848K3103N3674R199r604J10782K6488k3335o3299
3324A031197o8462j9897l339k2886j77178J01897k1842J2124m4401k2567K8448
3313G93094n6206L1316k1789m3046o3357J6006j4275L3176M4435n6902m3748l2793
3301E85911q377J4727L1791K190R22j3533o8508m0654J2473l4457m0742j879O6017
3288E05881J2879l5070M7347r726n5293k5144N3530m7612k9845M6682l032l5056
3276D25541P6362l5785n6577m7738L5342K1136k0394l1569J26038k4342j0022
$$ plain form
3265 457992 397216 389515 415349 387733 451613 501171 409090 363633 284952 329294 367027 396386
3253 396386 366183 366564 384568 389280 449372 489595 361263 419851 416956 343564 377643 387333
3241 387333 334733 319244 368335 425094 348863 416454 378289 385164 386092 446733 410352 351231
3229 351231 363925 337581 365812 459144 504948 447690 485108 409671 435420 533661 529289 399864
3217 399864 483653 445717 519049 448557 463749 452977 504183 502193 478847 495401 534799 450872
3205 450872 464093 372036 317855 430523 498618 394287 409210 431006 396508 398901 463075
3194 463075 516803 484568 524154 473494 435209 421616 422791 440029 455593 429936 407064 425168
3182 425168 453908 512517 447496 432078 500940 491592 555641 542091 618164 521262 475466 557939
$$ packed form
3265D57992o0776p701K5834k7616O3880M9558r2081m5457p8681M4342L7733K9359
3253C96386l0203L81J8004M712O0092M0223j28332N8588k895p3392L4079R690
3241C87333n2600j5489M9091N6759p6231O7591l8165O875R28O0641l6381n9121
3229C51231J2694k6344K8231R3332M5804n7258L7418p5437K5749R8241m372j29425
3217C99864Q3789l7936P3332p0492J5192j0772N1206j990k3346J6554L9398q3927
3205D50872J3221r2057n4181J12668O8095j04331J4923K1796l4498K393O4174
3194D63075N3728l2235L9586n0660l8285j3593J175J7238J5564k5657k2872J8104
3182D25168K8740N8609o5021j5418O8862r348O4049j3550P6073r6902m5796Q2473
$$ plain form
3170 557939 618807 572445 545980 566663 528437 538400 567871 641183 631687 673615 653725 600552
3158 600552 616766 594877 568658 575628 610090 648403 559461 573943 539916 528486 472777 433314
3146 433314 416993 457103 445977 370363 369884 377205 431686 386087 376044 339240 374281 371273
3134 371273 376742 512844 528254 420409 512494 497845 440758 551401 492171 512876 385087
3123 385087 314865 459835 438460 438847 403406 417059 394624 405716 465935 406336 415295 453945
3111 453945 418488 416016 445967 440726 413650 402069 411241 449751 452907 423887 422018 349148 357735
3098 357735 386533 392807 361261 285653 374594 410008 419742 436068 362803 355344 420869 426947
3086 426947 384415 390533 407516 384397 306078 347116 352646 324829 251560 370406 405734 403080
$$ packed form
3170E57939O0868m6362k6465K0683l8226R963K9471P3312r496M1928j9890n3173
3158F00552J6214k1889k6219O970L4462L8313q8942J4482l4027j1430n5709l9463
3146D33314j6321M0110j1126p5614m79P321N4481m5599j0043l6804L5041l008
3134C71273N469J36102J5410j07845R2085j4649n7087J10643n9230K0705j27789
3123C85087p0222J44970k1375L87l5441J3653k2435J1092O0219n9599Q959L8650
3111D53945l5457k472K9951n241k7076j1581R172L8510L156k9020j869p2870Q587
3098C57735K8798O274l1546p5608Q8941L5414R734J6326p3265p459O5525O078
3086D26947m2532O118J6983k3119p8319M1038N530k7817p3269J18846L5328k654
$$ plain form
3074 403080 425340 393849 368315 426438 406477 452105 391496 359092 376483 343126 342390 349057
3062 349057 358817 478956 449670 363818 324156 343282 496136 438223 459504 458869 425069 461060
3050 461060 478972 432032 448902 464177 450350 454167 452308 479804 497320 515783 475995 491326
3038 491326 517279 466058 457614 442772 493800 468202 476862 469151 520060 503925 568103 553006
3026 553006 512089 527884 482658 570769 511751 504626 547301 549251 570333 594470 595884 602898
3014 602898 648683 657614 659760 671403 711483 613662 655460 662204 687773 603245 656739 749020
3002 749020 742986 768864 860606 832951 854852 799828 817269 835355 896393 948761 922578 960941
2990 960941 917404 956228 1055577 946641 942678 996308 1066133 1144652 1130635 1186393 1239677 1216704
$$ packed form
3074D03080K2260l1491k5534N8123j9961M5628o0609l2404J7391l3357p36O667
3062C49057R760J20139k9286q5852l9662J9126J52854n7913K1281o35l3800L5991
3050D61060J7912m6940J6870J5275j3827L817j859K7496J7516J8463l9788J5331
3038D91326K5953n1221q444j4842N1028k5598Q660p711N0909j6135O4178j5097
3026E53006m0917J5795m5226Q8111n9018p125M2675J950K1082K4137J414P014
3014F02898M5785Q931K146J1643M0080r7821M1798O744K5569q4528N3494R2281
3002G49020o034K5878R1742k7655K1901n5024J7441J8086O1038N2368k6183L8363
2990I60941m3537L8824R9349j08936l963N3630O9825P8519j4017N5758N3284k2973
$$ plain form
2978 1216704 1232454 1311311 1324408 1401352 1428283 1445099 1470880 1499247 1479086 1536570 1578756
2967 1578756 1649724 1700462 1741100 1778696 1819255 1930425 1918162 1923634 1995062 2041871 2082880
2956 2082880 2240320 2238933 2290739 2426863 2442604 2504817 2608951 2736428 2801778 2887453 2924416
2945 2924416 2965092 3066912 3167456 3217102 3335546 3505400 3655727 3845185 4015064 4213609
2935 4213609 4408532 4553935 4816237 5081557 5362621 5761656 6068822 6366276 6638838 6822927
2925 6822927 6699375 6641777 6468871 6192468 5956792 5695941 5452023 5255108 5056312 4806529
2915 4806529 4640688 4535076 4429530 4328703 4176674 4084835 4038962 3957441 3965562 4027039 4165434
2904 4165434 4266929 4430781 4353623 4121286 3827032 3584721 3406487 3278863 3157973 3182376
$$ packed form
2978A216704J5750P8857J3097P6944K6931J6816K5781K8367k0161N7484M2186
2967A578756P0968N0738M0638L7596M0559J11170j2263N472P1428M6809M1009
2956B082880J57440j387N1806J36124J5741O2213J04134J27477O5350Q5675L6963
2945B924416M0676J01820J00544M9646J18444J69854J50327J89458J69879J98545
2935D213609J94923J45403K62302K65320K81064L99035L07166K97454K72562J84089
2925F822927j23552n7598j72906k76403k35676k60851k43918j96915j98796k49783
2915D806529j65841j05612j05546j00827j52029r1839m5873q1521Q121O1477J38395
2904D165434J01495J63852p7158k32337k94254k42311j78234j27624j20890K4403
$$ plain form
2894 3182376 3111671 3056482 2964013 2955324 2950558 2937493 2879060 2899161 2878019 2917463 2946826 3227006
2882 3227006 3505965 3733486 4241666 4426447 4147332 3798468 3273085 2983673 2768021 2596149
2872 2596149 2508193 2357685 2239380 2104091 2051747 1997464 1954456 1992346 1903944 1864844 1835158
2861 1835158 1763671 1882835 1966243 2152099 2314131 2457533 2529089 2487489 2232638 1929938
2851 1929938 1797637 1711650 1550733 1518676 1441347 1319913 1211919 1191174 1190657 1121932 1075843
2840 1075843 1091029 1017151 1022311 1056986 1013235 934777 878304 893097 923520 939956 835848
2829 835848 844024 858138 862781 814723 765880 748268 733229 707184 753148 680555 636791 717906
2817 717906 732352 707419 653373 680577 707017 668281 565464 527443 662564 690288 667496
$$ packed form
2894C182376p0705n5189r2469q689m766j3065n8433K0101k1142L9444K9363K80180
2882C227006K78959K27521N08180J84781k79115l48864n25383k89412k15652j71872
2872B596149q7956j50508j18305j35289n2344n4283m3008L7890q8402l9100k9686
2861A835158p1487J19164Q3408J85856J62032J43402P1556m1600k54851l02700
2851A929938j32301q5987j60917l2057p7329j21434j07994k0745n17o8725m6089
2840A075843J5186p3878N160L4675m3751p8458n6473J4793L0423J6436j04108
2829H35848Q176J4114M643m8058m8843j7612j5039k6045M5964p2593m3764Q1115
2817G17906J4446k4933n4046K7204K6440l8736j02817l8021J35121K7724k2792
$$ plain form
2806 667496 605148 645465 676372 692836 633704 625396 637688 619646 545572 551680 503097 529756
2794 529756 569546 490895 564365 486921 473415 475894 514574 500232 521781 538452 479957 434823
2782 434823 467474 469089 488646 378913 448923 467077 452658 404832 384460 405617 417164 408173
2770 408173 332590 371272 422173 381086 397472 349484 371218 316109 321842 356833 433172 470796
2758 470796 429224 336760 340560 293166 341830 337216 310789 362440 334798 354901 414709 407966
2746 407966 421037 369083 403571 383289 338254 376772 492717 453961 407527 398711 327951 395217
2734 395217 387239 470969 452993 502210 482605 519277 475555 434026 482334 518054 509250 532995
2722 532995 489304 525129 531488 539311 548327 484302 545202 685207 664751 628141 630843 608257
$$ packed form
2806F67496o2348M0317L0907J6464n9132q308J2292j8042p4074O108m8583K6659
2794E29756L9790p8651P3470p7444j3506K479L8680j4342K1549J6671n8495m5134
2782D34823L2651J615J9557j09733P0010J8154j4419m7826k0372K1157J1547q991
2770D08173p5583L8682N0901m1087J6386m7988K1734n5109N733L4991P6339L7624
2758D70796m1572r2464L800m7394M8664m614k6427N1651k7642K0103N9808o743
2746D07966J3071n1954L4488k0282m5035L8518J15945l8756m6434q816p0760O7266
2734C95217p978Q3730j7976M9217j9605L6672m3722m1529M8308L5720q804K3745
2722E32995m3691L5825O359P823R016o4025O0900J40005k0456l6610K702k2586
$$ plain form
2710 608257 657503 670457 691671 758367 675938 755928 694629 737288 806051 774568 764403 781025
2698 781025 912378 968082 1039327 1054298 1074254 1043467 1091447 1195470 1197401 1209180 1185527
2687 1185527 1235716 1234295 1305566 1401806 1331421 1276769 1300928 1326327 1437802 1450003 1463539
2676 1463539 1552270 1638939 1737598 1750662 1741647 1827878 2046538 2072367 2015840 1909783 1921450
2665 1921450 1867310 1848250 1826754 1827173 1792833 1787592 1708231 1660495 1695900 1824363 1942351 1901407
2653 1901407 1863914 1933713 2002814 2058715 1989562 1967827 1926362 1883792 1813817 1764958 1719356
2642 1719356 1712096 1584474 1546140 1531573 1494164 1521757 1517643 1448193 1343346 1347912 1320308 1304266
2630 1304266 1252718 1336680 1279804 1216873 1066419 997559 895726 932052 919300 833022 788081
$$ packed form
2710F08257M9246J2954K1214O6696q2429P9990o1299M2659O8763l1483j0165J6622
2698G81025J31353N5704P1245J4971J9956l0787M7980J04023J931J1779k3653
2687A185527N0189j421P1271R6240p0385n4652K4159K5399J11475J2201J3536
2676A463539Q8731Q6669R8659J3064r015Q6231K18660K5829n6527j06057J1667
2665A921450n4140j9060k1496M19l4340n241p9361m7736L5405J28463J17988m0944
2653A901407l7493O9799O9101N5901o9153k1735m1465m2570o9975m8859m5602
2642A719356p260j27622l8334j4567l7409K7593m114o9450j04847M566k7604j6042
2630A304266n1548Q3962n6876o2931j50454o8860j01833L6326j2752q6278m4941
$$ plain form
2619 788081 719269 656256 575335 678140 645012 607364 591666 594986 571295 503923 498212 382221
2607 382221 420924 422864 404219 382650 396325 361638 342980 400244 411578 361868 369661 327247
2595 327247 292951 271439 302160 320603 283285 262884 299093 313386 307030 193740 167855 147532
2583 147532 167904 221596 175163 128857 128015 209931 143497 63172 114753 124785 102724 134413
2571 134413 131800 141864 178215 115718 82166 88761 95174 133101 140558 136722 109101 84991 61630
2558 61630 117297 125253 28444 34994 96868 135812 156569 133133 21876 -2418 69611 83421
2546 83421 61561 59605 -20650 -66736 -31023 84503 91141 66768 -32439 3821 34606 -73311
2534 -73311 59017 8514 -32726 17235 -19489 -32160 -681 -44232 -34068 -29499 58191 -36504
$$ packed form
2619G88081o8812o3013q0921J02805l3128l7648j5698L320k3691o7372n711j15991
2607C82221L8703J940j8645k1569J3675l4687j8658N7264J1334m9710P793m2414
2595C27247l4296k1512L0721J8443l7318k0401L6209J4293o356j13290k5885k0323
2583A47532K0372N3692m6433m6306q42Q1916o6434q0325N1581J0032k2061L1689
2571A34413k613J0064L6351o2497l3552O595O413L7927P457l836k7621k4110k3361
2558F1630N5667P956r6809O550O1874L8944K0757k3436j11257k4294P2029J3810
2546H3421k1860j956q0255m6086L5713J15526O638k4373r9207L6260L0785j07917
2534g3311J32328n0503m1240M9961l6724j2671L1479m3551J0164M569Q7690r4695
$$ plain form
2522 -36504 -97715 -35346 -96684 -72585 -79104 -55517 -56763 -44623 -133287 -127304 -48183 -27094
2510 -27094 -59820 -49011 -13198 -50723 -38607 -17766 -20968 -67903 -65310 -54231 -54073 -53989 -54468 -36120
2496 -36120 -37829 -53854 -44024 -2754 -27668 -34690 15765 -43078 -35358 -100799 -90083 -41356 -14459
2483 -14459 -22864 22676 -40447 -38862 -56338 -43615 -83721 -26571 -108691 -109961 -83510 -77557 -68496
2470 -68496 -92410 -103181 -37442 -17411 -63387 -21227 13376 17513 -62083 -71475 50 27304
2458 27304 -44621 -135143 -152889 -107387 -52311 -10796 35218 18860 -62818 -84776 -83037 10421
2446 10421 46669 -20292 -54651 -110770 -127943 -40639 -1134 -1224 -31494 -52220 -88437 -89586 -134350
2433 -134350 -91193 -61133 -12214 -55514 -15202 -17339 -41059 -80810 -71867 -60859 12269 -25815
$$ packed form
2522c6504o1211O2369o1338K4099o519K3587j246J2140q8664N983P9121K1089
2510b7094l2726J0809L5813l7525J2116K0841l202m6935K593J1079J58Q4m79J8348
2496c6120j709j6025R830M1270k4914p022N0455n8843P720o5441J0716M8727K6897
2483a4459q405M5540o3123J585j7476J2723m0106N7150q2120j270K6451N953R061
2470f8496k3914j0771O5739K0031m5976M2160L4603M137p9596r392P1525K7254
2458B7304p1925r0522j7746M5502N5076M1515M6014j6358q1678k1958J739R3458
2446A0421L6248o6961l4359n6119j7173Q7304L9505r0l0270k0726l6217j149m4764
2433a34350M3157L0060M8919m3300M0312k137k3720l9751Q943J1008P3128l8084
$$ plain form
2421 -25815 -113373 -29434 -45474 -34269 -15591 -96922 -141681 -40653 -15304 -52892 -109213 -41333
2409 -41333 -100329 -92559 -38496 -138600 -103702 -41359 -43152 -54947 -51323 -53495 -109345 -28279
2397 -28279 -76044 -54264 -61734 -30332 -69807 -67625 -1038 -46343 -36876 -52575 -57736 -94370 -26772
2384 -26772 -42389 6634 6666 -47127 -62239 -41517 -87276 -140943 -84000 -29324 -23212 -37061 -60620
2371 -60620 -63346 -17380 -116353 -197258 -131114 -128868 -77443 -103632 -35332 9632 -42240 -3371
2359 -3371 -27884 -20873 -42552 -87228 -102419 -156859 -104140 -156971 -123767 -117284 -104907 -34327
2347 -34327 -90835 -147215 -62681 -43028 -86730 -159595 -92240 -31749 -4735 50240 -33441 -99117
2335 -99117 -91315 -131593 -135793 -179657 -147660 -14292 -49565 -62964 -121367 -72632 -68637 -47304
$$ packed form
2421b5815q7558Q3939j6040J1205J8678q1331m4759J01028K5349l7588n6321O7880
2409d1333n8996P770N4063j00104L4898O2343j793j1795L624k172n5850Q1066
2397b8279m7765K1780p470L1402l9475K182O6587m5305R467j5699n161l6634O7598
2384b6772j5617M9023L2n3793j5112K0722m5759n3667N6943N4676O112j3849k3559
2371f0620k726M5966r8973q0905O6144K246N1425k6189O8300M4964n1872L8869
2359c371k4513P011k1679m4676j5191n4440N2719n2831L3204O483J2377P0580
2347c4327n6508n6380Q4534J9653m3702p2865O7355O0491K7014N4975q3681o5676
2335i9117P802m0278m200m3864L1997J33368l5273j3399n8403M8735L995K1333
$$ plain form
2323 -47304 -4044 -12219 6913 -41243 -91462 -65170 -84511 -54506 -43347 -47091 -36891 -89508
2311 -89508 -76373 -109225 -112865 -76154 -39368 -6234 -30087 -32666 10154 5025 -35366 -4307
2299 -4307 -6185 -15039 -72745 -115008 -43160 -49104 62833 52990 -22708 -56767 -64579 -20825 31134
2286 31134 -73685 -65974 -66062 -72774 526 -36494 -66892 -48268 -54401 -53512 -71751 -98613 -95792
2273 -95792 -75264 -63320 46954 22750 -24193 -60276 -22026 -65562 -67339 -110747 -176545 -89009
2261 -89009 -38080 -117948 -83365 -94544 -131193 -43264 -93463 32194 -31494 -76674 -84154 -44996
2249 -44996 -39216 2820 -45573 -79666 -96466 -69173 -60693 -30307 -60058 -76064 -95513 -75031
2237 -75031 -88738 20301 14295 -59297 -46248 -50318 -9335 -76656 -93069 -38334 -48764 -12465
$$ packed form
2323d7304M3260q175J9132m8156n0219K6292j9341L0005J1159l744J0200n2617
2311h9508J3135l2852l640L6711L6786L3134k3853k579M2820n129m0391L1059
2299d307j878q854n7706m2263P1848n944J11937r843p5698l4059p812M3754N1959
2286C1134j04819P711q8o712P3300l7020l0398J8624o133Q89j8239k6862K821
2273i5792K0528J1944J10274k4204m6943l6083L8250m3536j777m3408o5798Q7536
2261h9009N0929p9868L4583j1179l6649Q7929n0199J25657o3688m5180p480L9158
2249d4996N780M2036m8393l4093j6800K7293Q480L0386k9751j6006j9449K0482
2237g5031j3707J09039o006p3592J3049m070M0983o7321j6413N4735j0430L6299
$$ plain form
2225 -12465 -66010 -47969 17141 1822 59439 -17352 -25843 -11267 -21529 -62560 -91344 28158
2213 28158 1751 -36565 -15710 6784 -4162 -26531 -19595 -61406 -27979 26610 -35813 10958
2201 10958 18936 -74595 -46938 16407 78490 103699 26573 14943 15151 -6446 -19785 -31434
2189 -31434 -25625 1511 -20427 -16793 -31474 -42148 4149 45653 35492 -133 1694 -95377
2177 -95377 -5493 68617 108526 54487 -71293 35568 28911 66009 47541 20449 -48662 -23745
2165 -23745 -55751 -42527 30667 -56134 9058 13455 38767 25882 9952 6413 48944 75135
2153 75135 76715 85271 69536 55643 3686 74136 103487 90385 78606 86139 118765 165778
2141 165778 141227 80574 102915 150818 151800 108491 151420 167156 214985 272034 300767 235011
$$ packed form
2225a2465n3545J8041O5110j5319N7617p6791q491J4576j0262m1031k8784J19502
2213B8158k6407l8316K0855K2494j0946k2369O936m1811L3427N4589o2423M6771
2201A0958P978r3531K7657O3345O2083K5209p7126j1630K08k1597j3339j1649
2189c1434N809K7136k1938L634j4681j0674M6297M1504j0161l5625J827r7071
2177i5377Q9884P4110L9909n4039j25780J06861o657L7098j8468k7092o9111K4917
2165b3745l2006J3224P3194q6801O5192M397K5312j2885j5930l539M2531K6191
2153G5135J580Q556j5735j3893n1957P0450K9351j3102j1779P533L2626M7013
2141A65778k4551o0653K2341M7903R82m3309M2929J5736M7829N7049K8733o5756
$$ plain form
2129 235011 239053 206096 212079 262430 276034 246670 329922 383613 397628 419752 433659 372385
2117 372385 423648 445761 496887 494388 455411 461142 491034 574466 579596 607397 679932 810222
2105 810222 764941 785997 879408 837934 870847 898626 921892 1106381 1146140 1186268 1252987
2094 1252987 1297108 1367849 1486962 1563147 1742799 1820176 1918165 2047615 2205421 2384563
2084 2384563 2556239 2744800 3024509 3239288 3562693 3897539 4242677 4764598 5424399 6465259
2074 6465259 7810918 9533295 11814046 14387722 14480243 12487413 9828958 7727312 6401375
2065 6401375 5405658 4668887 4049022 3549328 3185113 2985660 2688253 2387795 2148726 1907876
2055 1907876 1676743 1577042 1437913 1314855 1119815 986954 910677 876304 866692 807891 742980
$$ packed form
2129B35011M042l2957N983N0351J3604k9364Q3252N3691J4015K2124J3907o1274
2117C72385N1263K2113N1126k499l8977N731K9892Q3432N130K7801P2535J30290
2105H10222m5281K1056R3411m1474L2913K7779K3266J84489L9759M0128O6719
2094A252987M4121P0741J19113P6185J79652P7377R7989J29450J57806J79142
2084B384563J71676J88561K79709K14779L23405L34846L45138N21921O59801J040860
2074F465259J345659J722377K280751K573676R2521j992830k658455k101646j325937
2065F401375r95717p36771o19865m99694l64215j99453k97407l00458k39069k40850
2055A907876k31133r9701j39129j23058j95040j32861p6277l4373r612n8801o4911
$$ plain form
2044 742980 721584 652363 613234 603136 503483 502047 502139 458184 435573 363528 373422 400293 324735
2031 324735 280691 302740 326445 324948 263439 265954 291872 236073 226371 240925 271741 267057
2019 267057 270243 187742 207436 132182 144789 146234 49926 112281 113959 208484 170269 155448
2007 155448 103495 55282 119042 124389 142428 115218 98121 72675 50191 130741 43850 107747
1995 107747 76452 -1306 -38332 -74373 -3704 34197 85344 70510 41823 -12202 -17899 41404
1983 41404 56402 37278 -38723 -12886 76114 51191 -19853 -25495 34005 109388 10180 -73639
1971 -73639 -1770 -67859 -67045 -29968 -69652 -50022 -2298 70854 -38753 -3762 17723 23929
1959 23929 -37012 -13196 -28932 -66389 -112531 -71662 -39277 -92994 -47854 -48762 -35664 -56954
$$ packed form
2044G42980k1396o9221l9129j0098r9653j436R2m3955k2611p2045R894K6871p5558
2031C24735m4044K2049K3705j497o1509K515K5918n5799r702J4554L0816m684
2019B67057L186q2501J9694p5254J2607J445r6308O2355J678R4525l8215j4821
2007A55448n1953m8213O3760N347J8039k7210j7097k5446k2484Q0550q6891O3897
1995A07747l1295p7758l7026l6041P0669L7901N1147j4834k8687n4025n697N9303
1983D1404J4998j9124p6001K5837Q9000k4923p1044n642N9500P5383r9208q3819
1971g3639P1869o6089Q14L7077l9684J9630M7724P3152j09607L4991K1485O206
1959B3929o0941K3816j5736l7457m6142M0869L2385n3717M5140r08J3098k1290
$$ plain form
1947 -56954 -48905 -72498 -22551 -22795 -28530 14492 14023 -15486 44538 26732 -622 8493 -52749
1934 -52749 -27635 -97839 -78313 2505 -14287 19836 31353 -71859 -30323 67849 24466 -58821
1922 -58821 -53564 -66371 -3983 -75086 -91735 -67049 -32087 49203 -1775 -23387 -59826 -34232
1910 -34232 -18828 -62274 -71951 8777 65234 69451 55722 15036 -33992 21756 -59888 -99779
1898 -99779 -21416 -94723 -90569 -61548 -5443 -7172 5656 71048 35648 -14304 -61195 -79632
1886 -79632 -82648 -49134 -101062 -99981 -58835 -76969 -56145 -42654 -79171 -67065 -15652 -24422
1874 -24422 -8602 -12005 -32215 20050 -26439 66584 48884 -11049 -30067 -62362 -90858 13699
1862 13699 27704 -55616 -59831 -46417 -11983 23653 46715 31622 59812 36641 10945 -25259
$$ packed form
1947e6954Q049k3593M9947k44n735M3022m69k9509O0024j7806k7354R115o1242
1934e2749K5114p0204J9526Q0818j6792L4123J1517j03212M1536R8172m3383q3287
1922e8821N257j2807O2388p1103j6649K4686L4962Q1290n0978k1612l6439K5594
1910c4232J5404m3446r677Q0728N6457M217j3729m0686m9028N5748q1644l9891
1898i9779P8363p3307M154K9021N6105j729J2828O5392l5400m9952m6891j8437
1886g9632l016L3514n1928J081M1146j8134K0824J3491l6517J2106N1413q770
1874b4422J5820l403k0210N2265m6489R3023j7700n9933j9018l2295k8496J04557
1862A3699J4005q3320m215J3414L4434L5636K3062j5093K8190k3171k5696l6204
$$ plain form
1850 -25259 -82224 -45739 20268 8477 -76822 -21617 -74003 -114985 -55483 -46595 -27329 -26064
1838 -26064 -38265 -47991 -37845 -32909 -89119 -63988 -85788 -108975 -109670 -138821 -120053 -119533 -67252
1825 -67252 -106988 -73874 -26315 -124351 -63164 -43663 -72145 -145002 -95751 -44376 -59434 -48564
1813 -48564 -44151 -100833 -138467 -98934 -54268 -65190 4872 31816 -20986 -40022 -40868 5546
1801 5546 -14676 2359 -67773 -84774 -68077 -78493 -42407 -27712 -66889 20559 -56643 -46595
1789 -46595 -4736 29146 41573 50508 -74715 -112074 -49852 -43856 -104617 -20890 -35148 -98784
1777 -98784 -35157 -116345 -101834 -118846 -36038 -34936 -40666 -29991 -28030 -29257 -106222 -51531 -87218
1764 -87218 -108954 -103887 -59051 -120254 -112899 -64020 -25257 16431 -18971 12901 7871 -10037
$$ packed form
1850b5259n6965L6485O6007j1791q5299N5205n2386m0982N9502Q888J9266J265
1838b6064j2201r726J0146M936n6210K5131k1800k3187o95k9151J8768N20N2281
1825f7252l9736L3114M7559r8036O1187J9501k8482p2857M9251N1375j5058J0870
1813d8564M413n6682l7634L9533M4666j0922P0062K6944n2802j9036q46M6414
1801E546k0222J7035p0132j7001J6697j0416L6086J4695l9177Q7448p7202J0048
1789d6595M1859L3882J2427Q935j25223l7359O2222N996o0761Q3727j4258o3636
1777i8784O3627q1188J4511j7012Q2808J102n730J0675J961j227p6965N4691l5687
1764h7218k1736N067M4836o1203P355M8879L8763M1688l5402L1872n030j7908
$$ plain form
1752 -10037 -38020 -1607 -718 -26200 -52981 -45373 -85859 -64924 -34141 -90935 -103124 -121439
1740 -121439 -122684 -95390 -28765 -20762 2344 69275 11487 -17887 -61365 -36315 -50482 34550
1728 34550 28108 -48886 -100781 -59150 -56051 -100194 -36447 -41108 -84999 -92594 -88911 -109579 -100630
1715 -100630 -28368 -17462 15494 -7829 -24123 -81878 -35290 -46030 -55603 -54725 -46885 -50426 -98327
1702 -98327 -64337 -74236 -66030 14629 -21378 -92606 -100408 -31165 2306 -4191 -52247 -71136 -66530
1689 -66530 -109849 -13459 -71826 -86944 -105193 -54188 -17711 -45393 -90560 -18423 -35117 -58105
1677 -58105 -31619 -27492 31950 -29527 -102484 -61867 -43420 -65213 -78317 2487 -21980 -59659
1665 -59659 -82973 -55018 -85629 -92665 -117674 -132426 -130458 -122114 -27303 16985 -51797 -67323
$$ packed form
1752a0037k7983L6413Q89k5482k6781P608m0486K0935L0783n6794j2189j8315
1740a21439j245K7294O6625Q003K3106O6931n7788k9374m3478K5050j4167Q5032
1728C4550o442p6994n1895M1631L099m4143O3747m661m3891p595L683k0668Q949
1715a00630P2262J0906L2956k3323j6294n7755M6588j0740r573Q78P840l541m7901
1702i8327L3990r899Q206Q0659l6007p1228p802O9243L3471o497m8056j8889M606
1689f6530m3319R6390n8367j5118j8249N1005L6477k7682m5167P2137j6694k2988
1677e8105K6486M127N9442o1477p2957M0617J8447k1793j3104Q0804k4467l7679
1665e9659k3314K7955l0611p036k5009j4752J968Q344R4811M4288o8782j5526
$$ plain form
1653 -67323 -32857 57569 8946 -9700 -26211 -39331 -40662 -38337 -25496 6577 -45582 -59841
1641 -59841 -102128 -67001 -49905 -46357 -51369 -112943 -94650 -105698 -72952 -98146 -6673 -37931
1629 -37931 -42457 -57477 -48630 -46111 -91874 -35036 -31731 -25566 -70810 -65213 -8014 33549 -4943
1616 -4943 -8057 -61692 -42882 32700 -21708 -48626 -8426 -27109 13138 -42301 -70290 -13727
1604 -13727 -95081 -67958 -16388 102648 96895 29504 -39587 -18232 1754 3318 2399 -83895
1592 -83895 -71206 4688 -38712 -82314 -36165 3278 29350 13048 -59914 21890 -21534 -89956
1580 -89956 -74310 -12371 -12725 -24847 -12315 -2249 -49284 -67099 -33721 -25169 -75039 -61134
1568 -61134 -55939 -47250 -16264 -30520 -11884 -27311 9348 26890 -24068 14554 -47308 -52326
$$ packed form
1653f7323L4466R0426m8623j8646j6511j3120j331K325J2841L2073n2159j4259
1641e9841m2287L5127J7096L548n012o1574J8293j1048L2746k5194R1473l1258
1629c7931m526j5020Q847K519m5763N6838L305O165m5244N597N7199M1563l8492
1616d943l114n3635J8810P5582n4408k6918M0200j8683M0247n5439k7989N6563
1604a3727q1354K7123N1570J19036n753o7391o9091K1355J9986J564r19q6294
1592h3895J2689P5894m3400m3602M6149L9443K6072j6302p2962Q1804m3424o8422
1580h9956J5646O1939l54j2122J2532J0066m7035j7815L3378Q552m9870J3905
1568f1134N195Q689L0986j4256J8636j5427L6659J7542n0958L8622o1862n018
$$ plain form
1556 -52326 20063 -31145 -93912 -16121 -66333 40373 4187 -33725 -13172 -3139 -75019 -76910
1544 -76910 -59059 -49629 -7778 -71389 -85380 -113404 -90648 -13467 -2086 -136430 -86935 -33081
1532 -33081 -13250 -12537 -30222 -86067 -39712 28457 -29830 -12646 -61115 -30807 -18135 -70563
1520 -70563 -43043 -17135 5754 27157 12689 -27071 -60800 17275 72630 -113371 -71746 -70714
1508 -70714 -25806 -38850 -4127 41354 43010 -47303 -4557 53381 17912 -31464 -37994 -95358
1496 -95358 -136539 -64915 -100105 -100246 -13936 51277 36918 51227 10449 34398 38109 24501
1484 24501 4614 -31999 -147658 -57803 -19087 -60158 -38376 -77248 -21243 -114383 -53999 -926
1472 -926 85764 60325 -25972 -3117 10696 -10042 -153702 -117332 -56697 -14026 -23273 -57884
$$ packed form
1556e2326P2389n1208o2767P7791n0212J06706l6186l7912K0553J0033p1880j891
1544g6910J7851R430M1851o3611j3991k8024K2756P7181J1381j34344M9495N3854
1532c3081J9831P13j7685n5845M6355O8169n8287J7184m8469L0308J2672n2428
1520g0563K7520K5908K2889K1403j4468l9760l3729P8075N5355j86001M1625J032
1508g0714M4908j3044L4723M5481J656r0313M2746N7938l5469m9376o530n7364
1496i5358m1181P1624l5190j41Q6310O5213j4359J4309m0778K3949L711j3608
1484B4501j9887l6613j15659Q9855L8716m1071K1782l8872N6005r3140O0384N3073
1472i26Q6690k5439q6297K2855J3813k0738j43660L6370O0635M2671r247l4611
$$ plain form
1460 -57884 -93762 -25474 -26460 -16114 -38802 -45587 13018 -5976 -79131 -59662 -14881 -34555
1448 -34555 -37674 -12143 18382 23881 -4667 42871 -4897 -90044 -55268 -95842 -55563 -8109
1436 -8109 -33607 -51333 -36975 -82608 -15784 23743 -35239 -116558 -40496 25911 -26830 -3110
1424 -3110 10598 -20924 -16862 -3 -33198 2327 14292 26891 7155 -61876 -66971 -86519
1412 -86519 -48893 -59143 -32034 5325 59025 27935 -10030 -27542 -39503 -84570 -47807 -41060
1400 -41060 -6674 -10718 -84643 -21519 -79692 -59855 44658 -22948 -6461 23418 28902 -16818
1388 -16818 -33136 20804 -36345 -41357 24622 21212 -53377 -37677 13685 -64574 -69492 -37125
1376 -37125 12496 -57989 -47733 -54156 -42867 28643 -26477 -8018 8641 54680 -37591 -47019
$$ packed form
1460e7884l5878O8288r86J0346k2688o785N8605j8994p3155J9469M4781j9674
1448c4555l119K5531L0525N499k8548M7538m7768q5147L4776m0574M0279M7454
1436h109k5498j7726J4358m5633O6824L9527n8982q1319P6062O6407n2741K3720
1424c110J3708l1522M062J6859l3195L5525J1965J2599j9736o9031n095j9548
1412h6519L7626j0250K7109L7359N3700l1090l7965j7512j1961m5067L6763O747
1400d1060L4386m044p3925O3124n8173J9837J04513o7606J6487K9879N484m5720
1388a6818j6318N3940n7149n012O5979l410p4589J5700N1362p8259m918L2367
1376c7125M9621p0485J0256o423J1289P1510n5120J8459J6659M6039r2271r428
$$ plain form
1364 -47019 -12729 -5730 -37643 -43764 -8652 -75436 -151145 -68010 54946 -8308 -77849 -35109
1352 -35109 -13052 33188 8929 -33431 -34296 -37112 -12974 28754 -4710 15012 -13492 52952
1340 52952 65201 79129 33413 -62167 -9907 -4594 -21454 14433 24188 -37208 -53037 -43172
1328 -43172 -66942 -4698 45535 -4195 16031 5929 55242 27367 -11842 84733 83148 38338
1316 38338 44491 53369 -20377 -7836 66156 6405 -15276 18502 16335 14535 18206 -38235 1877
1303 1877 -21970 -45259 3415 34871 3914 33023 52817 -13086 -13288 7972 -30796 7334
1291 7334 -20529 -62505 -44776 -27500 10080 -29087 -63458 -5703 61483 -15548 -11610 -59460
1279 -59460 -47678 29376 31545 877 37830 110769 95033 -7769 31086 16536 -61279 -12787
$$ packed form
1364d7019L4290O999l1913o121L5112o6784p5709Q3135J22956o3254o9541M2740
1352c5109K2057M6240k4259m2360q65k816K4138M1728l3464J9722k8504O6444
1340E2952J2249J3928m5716r5580N2260N313j6860L5887R755o1396j5829R865
1328d3172k3770O2244N0233m9730K0226j0102M9313k7875l9209R6575j585m4810
1316C8338O153Q878p3746J2541P3992n9751k1681L3778k167j800L671n6441M0112
1303A877k3847k3289M8674L1456l0957K9109J9794o5903k02K1260l8768L8130
1291G334k7863m1976J7729J7276L7580l9167l4371N7755O7186p7031L938m7850
1279e9460J1782P7054K169l0668L6953P2939j5736j02802L8855j4550p7815M8492
$$ plain form
1267 -12787 12197 -1665 -50457 -10285 85130 9354 -2121 -54865 7493 -15945 52760 -4047
1255 -4047 -76159 -9437 -72689 -130878 -50261 -3715 221 33065 59194 46791 45380 10741
1243 10741 -54760 -46860 -95900 58567 109741 69162 58543 56980 41008 -24445 -88552 -24740
1231 -24740 27651 21285 -58779 -37175 39124 35398 39335 89316 21553 -18674 14579 3016
1219 3016 10372 7172 47779 22487 -79082 -106832 -43903 -95085 -70851 -23330 33996 -52529
1207 -52529 -15670 17833 15311 29155 -104575 906 43223 65230 6163 59661 -1879 9522
1195 9522 -4087 -9344 7987 -29477 -24799 -13986 11736 -45030 -1932 70742 -13731 -82978
1183 -82978 -33611 25570 -25311 -65780 5255 9802 27690 -10977 94880 108275 53513 54106
$$ packed form
1267a2787K4984j3862m8792M0172R5415p5776j1475n2744O2358k3438O8705n6807
1255d047p2112O6722o3252n8189Q0617M6546L936L2844K6129j2403j411l4639
1243A0741o5501P900m9040J54467N1174m0579j0619j563j5972o5453o4107O3812
1231b4740N2391o366q0064K1604P6299l726L937M9981o7763m0227L3253j1563
1219C016P356l200M0607k5292j01569k7750O2929n1182K4234M7521N7326q6525
1207e2529L6859L3503k522J3844j33730J05481M2317K2007n9067N3498o1540J1401
1195I522j3609n257J7331l7464M678J0813K5722n6766M3098P2674q4473o9247
1183h2978M9367N9181n0881m0469P1035M547J7888l8667J05857J3395n4762N93
$$ plain form
1171 54106 14614 41115 -83006 -44093 -52042 -88659 -87479 -94945 -1299 12907 45947 97177
1159 97177 30467 14337 56248 66764 43240 -25363 -2714 1794 9107 77482 -1368 -88624
1147 -88624 -44206 53824 36940 58714 33671 32101 20459 -30001 6639 26119 50106 -22559
1135 -22559 1952 -20989 45300 17793 42673 -10962 -98078 -18337 26717 -2440 10243 2185
1123 2185 -28557 44538 21858 30683 41756 67367 5524 21101 11964 56136 -7218 23485
1111 23485 -31887 -54098 11828 -10982 -16048 3400 32715 58452 79463 -16779 -40206 -47528
1099 -47528 -68706 -45242 -15423 -18723 -32601 -45400 -41660 -6130 19450 31295 -23226 -31879
1087 -31879 -4468 -45942 3559 19365 38308 17663 30295 29466 46401 45017 -3866 -40314
$$ packed form
1171E4106l9492K6501j24121L8913p949l6617J180p466R3646J4206L3040N1230
1159I7177o6710j6130M1911J0516k3524o8603K2649M508P313O8375p8850q7256
1147h8624M4418R8030j6884K1774k5043j570j1642n0460L6640J9480K3987p2665
1135b2559K4511k2941O6289k7507K4880n3635q7116P9741M5054k9157J2683q058
1123B185l0742P3095k2680Q825J1073K5611o1843J5577r137M4172o3354L0703
1111B3485n5372k2211O5926k2810n066J9448K9315K5737K1011r6242k3427p322
1099d7528k1178K3464K9819l300j3878j2799L740L5530K5580J1845n4521q653
1087c1879K7411m1474M9501J5806J8943k0645J2632q29J6935j384m8883l6448
$$ plain form
1075 -40314 -23138 -40197 -122343 -142280 -10746 -59448 -40374 72071 75863 47234 73586 -39736
1063 -39736 -49017 53387 79791 48433 -34542 29800 70192 -18926 -3618 16458 -33273 -12203
1051 -12203 10300 56 33979 -3156 -28472 15470 9155 59186 28829 49193 26578 10176
1039 10176 -30147 -3944 26544 14093 28558 7093 3190 -24786 -17269 36822 40908 -52065
1027 -52065 -35278 -76193 -87456 -117558 -76321 26158 -97453 -54925 -39916 -1220 21649
1016 21649 12589 41946 -21658 38966 35854 42133 52673 -17255 -103804 -50721 -66859 -18544
1004 -18544 1272 -37908 -8186 29649 85433 56156 66079 36382 -8645 -6383 2086 57742
992 57742 -48386 -80179 -23809 -36727 5846 -9968 -34201 11857 -14743 -67003 10345 54667
$$ packed form
1075d0314J7176j7059q2146j9937J31534m8702J9074J12445L792k8629K6352j13322
1063c9736r281J02404K6404l1358q2975O4342M0392q9118J5308K0076m9731K1070
1051a2203K2503j0244L3923l7135k5316M3942o315N0031l0357K0364k2615j6402
1039A0176m0323K6203L0488j2451J4465k1465l903k7976P517N4091M086r2973
1027e2065J6787m0915j1263l0102M1237J02479j23611M2528J5009L8696K2869
1016B1649r060K9357o3604O0624l112O279J0540o9928q6549N3083j6138M8315
1004a8544J9816l9180K9722L7835N5784k9277R923k9697m5027K262Q469N5656
992E7742j06128l1793N6370j2918M2573j5814k4233M6058k6600n2260P7348M4322
$$ plain form
980 54667 59318 11440 -32188 14299 133413 67173 36949 48380 -39721 -9028 48674 -20783
$$ packed form
980E4667M651m7878m3628M6487J19114o6240l0224J1431q8101L0693N7702o9457
$$ [...]
##END NTUPLES=NMR SPECTRUM
##END=
