##TITLE=1H_EC-3331(II-1)
 CDCl3
 8 sc, 
 13.9.2024
##JCAMPDX= 6.0         $$ Bruker NMR JCAMP-DX V2.0
##DATA TYPE= NMR SPECTRUM
##DATA CLASS= NTUPLES
##ORIGIN= UXNMR, Bruker Analytische Messtechnik GmbH
##OWNER= root
$$ XWIN-NMR		Version 3.5
$$ Fri Sep 13 14:11:46 2024 Russian Standard Time (UT+4h)  she@DPX200
##.OBSERVE FREQUENCY= 200.1318
##.OBSERVE NUCLEUS= ^1H
##.ACQUISITION MODE= SIMULTANEOUS
##.ACQUISITION SCHEME= undefined
##.AVERAGES= 8
##.DIGITISER RES= 18
##SPECTROMETER/DATA SYSTEM= spect
##.PULSE SEQUENCE= zg30
##.SOLVENT NAME= CDCl3
##.SHIFT REFERENCE= (INTERNAL, CDCl3, 0, 20.9797)
##AUDIT TRAIL= $$ (NUMBER, WHEN, WHO, WHERE, WHAT)
$$ ##TITLE= Audit trail, XWIN-NMR		Version 3.5
$$ ##JCAMPDX= 5.01
$$ ##ORIGIN= Bruker BioSpin GmbH
$$ ##OWNER= she
$$ F:/spectra/data/she/nmr/H-F/1/pdata/1/auditp.txt
$$ ##AUDIT TRAIL=  $$ (NUMBER, WHEN, WHO, WHERE, WHAT)
(   1,<2024-09-13 14:10:29.18 +0400>,<she>,<DPX200>,
      <created by zg, POWCHK disabled, PULCHK disabled
       configuration hash MD5:
       00 E9 B6 7A A2 85 ED C7 34 08 36 98 17 FE 4E 26
       data hash MD5: 16K
       F9 F3 0A 70 55 77 8B DB DE 8B 97 27 EE 72 3A 2C>)
(   2,<2024-09-13 14:10:31.39 +0400>,<she>,<DPX200>,
      <Start of raw data processing
       efp BC_mod = 2 LB = 0.24 FT_mod = 6 PKNL = 1 PHC0 = -26157.53 PHC1 = 10.78748 SI = 16K 
       data hash MD5: 16K
       8E DD 01 D4 EB B9 E1 D3 CE 31 F9 31 21 DB 3F 96>)
(   3,<2024-09-13 14:10:52.95 +0400>,<she>,<DPX200>,
      <pk PHC0 = -0.1583761 PHC1 = 0 
       data hash MD5: 16K
       36 A8 7F 2D B0 76 B0 08 C9 11 CB 19 BD 55 BF 72>)
(   4,<2024-09-13 14:10:56.23 +0400>,<she>,<DPX200>,
      <abs ABSG = 5 
       data hash MD5: 16K
       B8 09 C2 89 3A CD 64 A5 54 51 22 28 0C C9 F3 04>)
$$ ##END=
$$ 
$$ hash MD5
$$ 24 6A 60 76 09 10 E9 6A CA 20 6D A8 72 3C B4 28
##$RELAX= 
##$RELAX= 
##$RELAX= 
##$RELAX= 
##$RELAX= 
##$RELAX= 
$$ Bruker specific parameters
$$ --------------------------
##$DU= <F:/spectra>
##$EXPNO= 1
##$NAME= <H-F>
##$PROCNO= 1
##$TYPE= <nmr>
##$USER= <she>
##$AMP= (0..31)
100 100 100 100 100 100 100 100 100 100 100 100 100 100 100 100 100 100 
100 100 100 100 100 100 100 100 100 100 100 100 100 100 
##$AQSEQ= 0
##$AQ_mod= 1
##$AUNM= <au_zg>
##$AUTOPOS= <>
##$BF1= 200.13
##$BF2= 200.13
##$BF3= 200.13
##$BF4= 200.13
##$BF5= 200.13
##$BF6= 200.13
##$BF7= 200.13
##$BF8= 200.13
##$BYTORDA= 1
##$CFDGTYP= 0
##$CFRGTYP= 5
##$CHEMSTR= <none>
##$CNST= (0..31)
1 1 145 1 1 1 1 1 1 1 1 1 1 1 1 1 1 1 1 1 1 1 1 1 1 1 1 1 1 1 1 1 
##$CPDPRG= <>
##$CPDPRG1= <>
##$CPDPRG2= <>
##$CPDPRG3= <>
##$CPDPRG4= <mlev>
##$CPDPRG5= <mlev>
##$CPDPRG6= <mlev>
##$CPDPRG7= <mlev>
##$CPDPRG8= <mlev>
##$CPDPRGB= <>
##$CPDPRGT= <>
##$D= (0..31)
0 1.2 0 0 0 0 0 0 0 0.06 0 0.03 0 0 0 0 0.0002 0 0 0 0 0 0 0 0 0 0 0 0 
0 0 0 
##$DATE= 1726222228
##$DBL= (0..7)
120 120 120 120 120 120 120 120 
##$DBP= (0..7)
150 150 150 150 150 150 150 150 
##$DBP07= 0
##$DBPNAM0= <>
##$DBPNAM1= <>
##$DBPNAM2= <>
##$DBPNAM3= <>
##$DBPNAM4= <>
$$ [...]
##$SUBNAM3= <"">
##$SUBNAM4= <"">
##$SUBNAM5= <"">
##$SUBNAM6= <"">
##$SUBNAM7= <"">
##$SUBNAM8= <"">
##$SUBNAM9= <"">
##$SW= 24.0689170037331
##$SWIBOX= (0..15)
0 0 2 0 0 0 0 0 0 0 0 0 0 0 0 0 
##$SW_h= 4816.95568400771
##$TD= 16384
##$TD0= 1
##$TE= 0
##$TE2= 300
##$TE3= 300
##$TEG= 300
##$TL= (0..7)
0 120 120 120 120 120 120 120 
##$TP= (0..7)
150 150 150 150 150 150 150 150 
##$TP07= 0
##$TPNAME0= <>
##$TPNAME1= <>
##$TPNAME2= <>
##$TPNAME3= <>
##$TPNAME4= <>
##$TPNAME5= <>
##$TPNAME6= <>
##$TPNAME7= <>
##$TPOAL= (0..7)
0.5 0.5 0.5 0.5 0.5 0.5 0.5 0.5 
##$TPOFFS= (0..7)
0 0 0 0 0 0 0 0 
##$TUNHIN= 0
##$TUNHOUT= 0
##$TUNXOUT= 0
##$USERA1= <user>
##$USERA2= <user>
##$USERA3= <user>
##$USERA4= <user>
##$USERA5= <user>
##$V9= 5
##$VALIST= <valist>
##$VCLIST= <CCCCCCCCCCCCCCC>
##$VD= 0
##$VDLIST= <DDDDDDDDDDDDDDD>
##$VPLIST= <PPPPPPPPPPPPPPP>
##$VTLIST= <TTTTTTTTTTTTTTT>
##$WBST= 1024
##$WBSW= 4
##$XGAIN= (0..3)
0 0 0 0 
##$XL= 0
##$YL= 0
##$YMAX_a= 394708
##$YMIN_a= -564193
##$ZGOPTNS= <>
##$ZL1= 120
##$ZL2= 120
##$ZL3= 120
##$ZL4= 120
##$ABSF1= 20.97381
##$ABSF2= -3.095322
##$ABSG= 5
##$ABSL= 3
##$ALPHA= 0
##$AQORDER= 0
##$ASSFAC= 0
##$ASSFACI= 0
##$ASSFACX= 0
##$ASSWID= 0
##$AUNMP= <proc_1d>
##$AZFE= 0.1
##$AZFW= 0.1
##$BCFW= 0
##$BC_mod= 2
##$BYTORDP= 0
##$COROFFS= 0
##$CY= -3
##$DATMOD= 1
##$DC= 0
##$DFILT= <>
##$DTYPP= 0
##$F1P= 0
##$F2P= 0
##$FCOR= 1
##$FTSIZE= 16384
##$FT_mod= 6
##$GAMMA= 0
##$GB= 0
##$INTBC= 1
##$INTSCL= 3.70164e-10
##$ISEN= 128
##$LB= 0.24
##$LEV0= 0
##$LPBIN= 0
##$MAXI= 10000
##$MC2= 0
##$MEAN= 0
##$ME_mod= 0
##$MI= 1.114404
##$NCOEF= 0
##$NC_proc= -6
##$NLEV= 6
##$NOISF1= 3.799351
##$NOISF2= 2.8
##$NSP= 0
##$NTH_PI= 0
##$NZP= 0
##$OFFSET= 20.97969
##$PC= 1
##$PHC0= -26157.69
##$PHC1= 10.78748
##$PH_mod= 1
##$PKNL= yes
##$PPARMOD= 0
##$PSCAL= 0
##$PSIGN= 0
##$REVERSE= no
##$SF= 200.130009811088
##$SI= 16384
##$SIGF1= 3
##$SIGF2= 2
##$SINO= 5.538805
##$SIOLD= 16384
##$SREGLST= <1H.CDCl3>
##$SSB= 0
##$STSI= 16384
##$STSR= 0
##$SW_p= 4816.95568400771
##$SYMM= 0
##$S_DEV= 0
##$TDeff= 16384
##$TDoff= 0
##$TI= <>
##$TILT= no
##$TM1= 0
##$TM2= 0
##$TOPLEV= 0
##$USERP1= <user>
##$USERP2= <user>
##$USERP3= <user>
##$USERP4= <user>
##$USERP5= <user>
##$WDW= 1
##$XDIM= 16384
##$YMAX_p= 529587993
##$YMIN_p= -692207
$$ End of Bruker specific parameters
$$ ---------------------------------
##NTUPLES= NMR SPECTRUM
##VAR_NAME=  FREQUENCY,     SPECTRUM/REAL,   SPECTRUM/IMAG
##SYMBOL=    X,             R,               I
##VAR_TYPE=  INDEPENDENT,   DEPENDENT,       DEPENDENT
##VAR_FORM=  AFFN,          ASDF,            ASDF
##VAR_DIM=   16384,         16384,           16384
##UNITS=     HZ,            ARBITRARY UNITS, ARBITRARY UNITS
##FACTOR=    0.29402158847633, 1,            1
##FIRST=     4198.66567595688, 0,            0
##LAST=      -618.290008050829, 0,           0
##MIN=       -618.290008050829, -692207,     0
##MAX=       4198.66567595688, 529587993,    0
$$ Real data points
##PAGE= N=1
##DATA TABLE= (X++(R..R)), XYDATA
$$ [...]
6200A03919k6527j249o3939M5940R5347Q824q3838j1669k7537o0070K8233J5321
6188B2755K8453j978J32127j09671L3105n276j67461J02423j5966N9807M2379
6177A20697r7117m2824M1721J4615o2645O2174P1137r4157j8226M6952l8747K4723
6165B8303L02j1905k9935J5789K5397j1757K7836m0498P0422K7031r0605N5743
6153F6123Q4539j02032p2206J07647l1952O3015p7378M0408r1577N3099J539r1821
6141e0596L1929J04146n955p3749p9709K925M2652P1314k3470o6362R5931M2421
6129I1477j25526k5366J35935O2318q920k8588j5497j2324l6698m8301Q2070q730
6117F1850P385L0282l1597L3409L3745o1003K835J1407j28144l294R5676J5793
$$ y = [103919, 77392, 76143, 12204, 58144, 153491, 162315, 78477, 66808, 39271, -20799, 7434, 22755, 51208, 49230, 181357, 71686, 104791, 99515, -67946, 34477, 18511, 78318, 120697, 23580, -19244, 22477, 37092, -25553, 36621, 107758, 13601, -4625, 42327, 3580, 28303, 28605, 16700, -13235, 2554, 27951, 16194, 44030, 3532, 73954, 100985, 10380, 66123, 150662, 48630, -23576, 84071, 52119, 115134, 37756, 78164, -13413, 39686, 41225, -50596, -18667, 85479, 79524, 5775, -73934, -71009, -28357, 42957, 19487, -46875, 49056, 91477, -34049, -59415, 76520, 138838, 129918, 101330, 85833, 73509, 36811, -11490, 70580, 61850, 69235, 99517, 67920, 101329, 135074, 74071, 76906, 88313, -39831, -43125, 52551, 68344]
6105F8344j1844J9552m8565K7632J4571p6148R7005j6809L0668n9970P7247O9435
6093A91118j02057p5466l7799J26732r603n2832M6270j14555k179L2592O3095
6082F5316J427p4181Q5671O7353r6765N1132m5769k7942M8978K4417J906N3847
6070A55390r8264l4452N9376l0442K7482N180k0835n7885K5759L7213l0663o7088
6058b9229Q8286m0586n2616L0494l6952K7711M6088O4355j14990r551M0984o4450
6046e0456k6055m1742L0932N2715J19185j7381m0426l7976P0157j33514K8497
6035d6064k17j6079J13128p7413J8862q6311O0055L8699K0007L6934q6230n3229
6023g7858J36461j8021P842j33247M7135J862p7762L0652J46981J0343j9743j2365
$$ y = [68344, 56500, 76052, 27487, 55119, 69690, -6458, 90547, 73738, 104406, 44436, 121683, 191118, 89061, 13595, -24204, 102528, 92925, 40093, 86363, -28192, -30371, 2221, 65316, 66743, -7438, 78233, 145586, 48821, 99953, 54184, 26242, 75220, 99637, 101543, 155390, 57126, 22674, 82050, 51608, 79090, 84270, 63435, 5550, 31309, 68522, 37859, -29229, 59057, 18471, -34145, -3651, -40603, -12892, 33196, 97551, -17439, -26990, 13994, -50456, -76511, -118253, -87321, -34606, 84579, 67198, 26772, -11204, 58953, -74561, -46064, -46281, -62360, 50768, -26645, -7783, -94094, -34039, 4660, 24667, 61601, -24629, -77858, 58603, 40582, 48424, -84823, -37688, -35826, -113588, -82936, 64045, 74388, 54645, 42280]
6011D2280p9666P210j09253J48869L7792k8316l1325m0154M1616n8534j1676P4523
5999f634N0159l8078o9719J3827K9048K1877K4950J4275p3244M4192P9205j24277
5987c4419q1067N9866j0585K9808L9559O7174j9237n9811J966o2208P6299n3256
5975d5911o260Q8169k4012n6944m0957M1429j1945M2239k4647K5883j13477R6211
5963c0222O3440l1682p1786l677O3756n975J3873m6927l6794J40091o2754m4264
5951e2921P9711m1287N4934l0780l2166k0245P6756j25546J7738J9852J07468
5940E3514p7540p958R484j2362N4513J6980j10601m1145Q2795o7721j0208R7946
5928a2303r9923l7028J33338n5594K4449P3658m3828J1007n2517k4961N5841J9222
$$ y = [42280, -37386, -30176, -139429, 9440, 47232, 18916, -12409, -52563, -10947, -69481, -81157, -6634, 43525, 5447, -64272, -50445, -21397, 480, 25430, 39705, -33539, 10653, 89858, -34419, -115486, -55620, -66205, -36397, 3162, 70336, 51099, -8712, -6746, -68954, 7345, -45911, -52171, 35998, 11986, -44958, -85915, -44486, -56431, -14192, -38839, -12956, -126433, -30222, 33218, 1536, -70250, -73927, -10171, -16146, -2273, -49200, -85994, 54097, -8657, -52921, 26790, -14497, 40437, 9657, -22509, -42754, 34002, -91544, -73806, -53954, 53514, -24026, -31984, -22500, -34862, 19651, 36631, -73970, -115115, -32320, -100041, -110249, -12303, -112226, -149254, -15916, -71510, -47061, 26597, -17231, -6224, -58741, -83702, -27861, -8639]
5916h639m6784Q7614m9850o5812J50110r5545k2297P0576k0187o1446j2250J8141
5904e6369K3805L2723n0560j9278k1867p2312J26473l9154J2095J7818n7000K9229
5892g4397J42443r3507r1858J1616M1262n0994R3664O4478O624m7360n0027r5224
5880a43280J26465q5159m2247Q8293m4293p104l5523M9792j35066J02176J08331
5869a7615m9426k3753O9601o5399q0430J76012k9885o3987J10961p1764L084J0636
5857c1965q6032M9420J8168J2768P6390k7301r8476J59870R166o0287o5303J377
5845d2205M2719J07803m5493n3689R653p2219M0686K1904k6762j1376Q972l8643
5833e8650M5831k5811n3600O8287K3943j5267N3632p3566R922L5233j57849J26984
$$ y = [-8639, -55423, 32191, -17659, -83471, 66639, -28906, -51203, 19373, -814, -62260, -74510, -56369, -32564, 159, -50401, -69679, -91546, -163858, -37385, -76539, -64444, -46626, -103626, -74397, 68046, -25461, -117319, -105703, -64441, -115435, -21771, 42707, 49331, 1971, -48056, -143280, -16815, -101974, -144221, -55928, -100221, -107325, -142848, -93056, -228122, -125946, -17615, -67041, -90794, -21193, -86592, -167022, 8990, -20895, -84882, 26079, -45685, -42601, -31965, -117997, -68577, -50409, -37641, 38749, 11448, -87028, 72842, 82008, 21721, -43582, -42205, 514, 108317, 62824, 9135, 18788, -53431, -12745, 9159, -17603, -28979, -20007, -58650, -12819, -38630, -92230, -23943, 0, -15267, 38365, -35201, -25279, 9954, -147895, -20911]
5821b0911N0126k977O5045j21438m7463N9721O262j3683n3360n3476L3608O8720
5809b9826N3861O18Q8236q5069j55795j4776L618R1078J5476j13897J70532q2094
5797e8038j7064P5367q276n7462l215j2718J65337j12700k4932M974K4044J628
5785b3055m4434n454J10547j2165l2532k1685j7050n946j5050J9996j2256p3274
5773a32358K37501o7825q0974o1256K552K2827K1564Q7900q5077N5562k5710M9192
5761B3898m3519j0137l0862K4487R440n7947q9528J44857M8854m0222k0837L2047
5749i469k6595J6063l7149J10745j05397q996M6345L1177l6475r6928Q7675O6116
5737C7112n5716q6206O6446P8504j7665n4484n5658K0513J5777m951K6458j3918
$$ y = [-20911, 29215, 26238, 91283, -30155, -77618, -17897, -11635, -25318, -78678, -132154, -98546, -29826, 24035, 24653, 112889, 27820, -127975, -142751, -139133, -48055, -32579, -146476, 24056, -58038, -75102, 265, -8011, -65473, -68688, -81406, 83931, -28769, -53701, -48727, -24683, -23055, -67489, -72943, 37604, 25439, -7093, -28778, -45828, -51774, -66824, -46828, -59084, -132358, 105143, 37318, -43656, -104912, -102360, -79533, -57969, 29931, -55146, 416, -25294, 23898, -19621, -29758, -60620, -36133, -26693, -84640, -174168, -29311, 19543, -20679, -41516, -9469, -36064, -20001, -57150, 53595, -51802, -60798, -14453, 16724, -19751, -116679, -29004, 37112, -18604, -104810, -38364, 40140, 22475, -32009, -87667, -67154, -51377, -56328, -29870, -43788]
5725d3788K5467l9086j2381N4312J14582L976o8194O3406q6446k0503P8801m1712
5713B8434o7245o6154l9100J21276m536p7177P4822N2602P334j0442q3565m0315
5701a04066j4752L5216Q9976m0246q6098J7304P751N4881J7078j9383J05527k9219
5689C3969r1094L3474K1201O2843n829r3936N827k8587O781n9268J2281L1008
5677g1330J05931J5360j8037O0205n4589p9490N4086k2321l6550k6126R4628l9058
5665a7291j1805R4485k78n7176J4696K4733n1297N4321q5904J01868L540o0564
5653I328J3504m0173q6816J29596j064p8442N626p0031M7785j4957j0170O6484
5641b9330n9257Q8398J5639j56685j6276J38499J8726j398O720L301r9518J34786
$$ y = [-43788, -18321, -57407, -69788, -15476, 99106, 103082, 34888, 98294, 11848, -8655, 70146, 28434, -38811, -104965, -144065, -22789, -27325, -104502, -29680, 22922, 30256, 19814, -63751, -104066, -118818, -83602, 6374, -33872, -119970, -102666, -94915, -40034, -22956, -42339, 63188, 33969, -57125, -23651, -2450, 60393, 54564, -39372, -33545, -62132, -55351, -114619, -102338, -71330, 34601, 49961, 31924, 92129, 37540, -41950, 12136, -10185, -46735, -72861, 21767, -17291, -29096, 65389, 65111, 7935, 22631, 47364, -3933, 50388, -35516, 66352, 69892, 9328, 22832, -17341, -104157, 25439, 24375, -54067, -48441, -118472, -70687, -85644, -95814, -29330, -88587, -189, 15450, -141235, -157511, -19012, -286, -1684, 5036, 8337, -91181, 43605]
5629D3605K166n3711p3036P4450M4412l8772Q1510K3996R676k1882j5356K581
5617G9639J4058p2999k4644R963L6369q317J0846m1045L4232M8801j2774o422
5605F7707q2476N6911R073o942j4040l2014P6463l8086K7236j6362j506P2652
5593A18616J0994N7277J825k7858k121j41546O5129l0421k234j3853n4872M6365
5581B7301m4924q3058O39J45662P621l7585P4197l5627j03311m2095P4367j213
5569a8026Q4537k023r7880l9701M6214P559j6806m144L6795j9244R1026m6821
5557B1486l5300J01570p8240J2747k7886m5769m0592R9917P1761j45128m7695
5546a13129O3824J17374l0170o6910L155K1323K4887L2209j747l3384j25015M9200
$$ y = [43605, 45771, -7940, -80976, -6526, 37886, -886, 80624, 104620, 114296, 92414, 77058, 79639, 93697, 20698, -3946, 6017, 42386, 34069, 44915, 3870, 38102, 86903, 74129, 67707, -14769, 42142, 51215, 44273, 30233, -1781, 74682, 36596, 63832, 47470, 45964, 118616, 129610, 186887, 188712, 160854, 158733, 17187, 82316, 51895, 49661, 35808, -19064, 27301, -17623, -100681, -100042, 45620, 53241, 15656, 89853, 54226, -49085, -91180, -16813, -18026, 66511, 64488, -33392, -73093, -26879, -19320, -36126, -40270, -3475, -22719, 68307, 21486, -13814, 87756, 9516, 22263, -5623, -51392, -91984, 7933, 79694, -65434, -113129, -49305, 68069, 37899, -29011, -25856, -4533, 20354, 52563, 50816, 17432, -107583, -58383]
5534e8383J25063L1034q7352J970J01741j9807J894q1752n117M9135r0870J9225
5522a3219j6198m3377O3394P139j9518p5271P8262J7379n9531n71q2607R8278
5510d5840o0869J7724L3577J3539J7783m8511J18971p5180M9010R748N4388P4359
5498A58699j76350R507l9748l9568M6543K0969o8839m9631m2549K0507N8989Q9320
5486a2151l2497R8520N3106j70550l4781l4634P769J78007P4467l9187N9937q257
5474A39749r6797j63675K4420P1799J1051l5216K5132k6853P9222L052o9528K9929
5462g715K7674o1570n7454N3903m5107K2993J44622m5412K546m7865m6821N8585
5450a621O0326l3689k3447P178n3245L2600l7882k7670J6557o827O7592n468k0095
$$ y = [-58383, 66680, 97714, 10362, 12332, 114073, 94266, 96160, 14408, 9291, 58426, -32444, -13219, -29417, -72794, -9400, -2261, -21779, -97050, -18788, -1409, -60940, -61511, -144118, -45840, -106709, -88985, -55408, -41869, -24086, -72597, 46374, -28806, 20204, 29952, 84340, 158699, -17651, -8144, -47892, -87460, -40917, -19948, -88787, -138418, -180967, -160460, -101471, -12151, -44648, 53872, 106978, -63572, -98353, -132987, -125218, 52789, 127256, 88069, 148006, 139749, 42952, -120723, -96303, -24504, -13453, -48669, -23537, -50390, 28832, 31884, -37644, -7715, 19959, -41611, -99065, -45162, -90269, -67276, 77346, 31934, 34480, -13385, -60206, -1621, 58705, 25016, 1569, 8747, -44498, -11898, -49780, -77450, -60893, -67720, -128, -5596, -25691]
5437b5691m6684M4005o5383L6723N2373P4854J12317q8775j47845n2929m5581
5426a52616N7621M7130k6261M5486m0743j5880R7188k7106P5089r1324p1818J120
5414a02114j3957R3832R988p5051K5790O6852N4682m9848O2892k727q9809l8752
5402e8222j0863O6801L9876m1252J04926J5545q7758k86l5134Q9489p529o5752
5390I841q2716l2592J2275J47634l780k8947J4005l1788j06348J02872n364m8416
5378e3324M9567l1511J5030q0481K0681L3318K1200l9776O3041q065K1172j1025
5366a73q3886N3426k0239K5153N745k6166o1755P6209M5227K3382k4851m0293
5354b8221L4836N0779L9222k04N161k1707M9347r2010m6379J35388o4266o4348
$$ y = [-25691, -72375, -28370, -93753, -57030, -4657, 70197, 182514, 93739, -54106, -107035, -152616, -94995, -47865, -74126, -28640, -69383, -85263, 11925, -15181, 59908, -31416, -103234, -102114, -116071, -22239, -12251, -87302, -61512, 5340, 60022, 10174, 73066, 70339, -19470, -58222, -69085, -2284, 37592, -3660, 101266, 116811, 29053, 28767, -6367, 83122, 75593, 9841, -72875, -105467, -93192, 54442, 50662, 21715, 35720, 3932, -102416, 456, -4908, -53324, -3757, -35268, -20238, -100719, -80038, -46720, -25520, -65296, -2255, -10320, 10852, -173, -84059, -30633, -50872, -25719, -19974, -46140, -107895, -31686, 13541, 36923, 12072, -28221, 6615, 57394, 96616, 96412, 101573, 79866, 129213, 37203, -9176, 126212, 61946, -2402]
5342b402P0779k9232j29006J8649M9701R269N4845m60o1752j1018n8734R6239
5330F878J4509k0916l6974N7057J1067j3564m8950M939m4253L815L9011l0828
5318e8209p0837J21192j1500J3279J8335p0529R968K7018M5569M9433L3425k190
5306A04954k2915n5130l870m334m5485R0428o3012n95P8887J7636j7906J0610
5294H9268l267n9340O442r6482N1413J07292m3726j4661k7520K4570N1212n2427
5282C2774q5567k7751N4454J4661O1327m110k892j0467Q3132j5176p0485m3666
5270a3766P6435j8832j9957K7273k9983K5470J5040j8117k6818j6564Q6484p3560
5258A3105k0443L7247M3922r42o0202N7990k4524m8141O5096r4334J03397k623
$$ y = [-2402, 68377, 39145, -89861, -71212, -21511, -12242, 42603, 42143, -19609, -30627, -89361, 6878, 21387, 471, -36503, 20554, 31621, 18057, -30893, -25954, -70207, -66392, -27381, -58209, -129046, -7854, -19354, -6075, 12260, -58269, -48301, -21283, 24286, 73719, 107144, 104954, 82039, 26909, 23039, 18705, -26780, 63648, 636, 41, 78928, 96564, 78658, 89268, 86001, 26661, 33103, -63379, -11966, 95326, 51600, 36939, 9419, 33989, 85201, 32774, -52793, -80544, -26090, -11429, 49898, 45788, 42896, 32429, 115561, 100385, 29900, -13766, 62669, 43837, 23880, 51153, 21170, 46640, 61680, 43563, 16745, 181, 86665, 13105, -7338, 29909, 73831, 72889, 12687, 70677, 46153, -1988, 63108, -31226, 72171, 69548]
5246F9548M3387n7312k5917p938m4308J51724n9866P0083O2114k04480k0516P443
5234a6038m3616O3810J36393J7911K959o221m5861N7371l4119o2564O5159O2728
5222A97912r5528Q5969k7656J2082m3676n2732J08073n8424J2232l6237O162M0960
5210A49137n006K7535P1559J8148J3988n6555l3725P1737m0700O731p6449N1612
5198A98012j73713N9622J04972q91O1174l4216j1382k199L7424o7718P3317k0199
5186B24203k1294n5485M6163m2154O8179M9320j46591n1433L8464k2000P0211
5175A57583n672m097M7945P3859o151n0932j8051L3312K8914J4087l1791j8979
5163B20027L6304j05569L4994O9825M3831m2566P9555j01270Q3716M265r7283
$$ y = [69548, 112935, 55623, 29706, 21768, -22540, 129184, 69318, 139401, 201515, -2965, -23481, -16038, -59654, 4156, 140549, 158460, 161419, 155198, 109337, 166708, 132589, 70025, 135184, 197912, 102384, 188353, 160697, 172779, 129103, 76371, 184444, 126020, 138252, 102015, 108177, 149137, 144131, 171666, 243225, 261373, 275361, 218806, 185081, 256818, 216118, 222849, 146400, 198012, 24299, 83921, 188893, 188002, 249176, 214960, 203578, 201379, 238803, 171085, 244402, 224203, 202909, 147424, 193587, 151433, 219612, 268932, 122341, 70908, 109372, 87372, 157583, 151911, 147814, 195759, 269618, 263467, 212535, 194484, 227796, 256710, 270797, 239006, 220027, 256331, 150762, 185756, 255581, 299412, 256846, 336401, 235131, 318847, 323112, 225829]
5152B25829O0448J53603j27601n5337P2128J8390J16765n1433O6732j07461N6622
5141D28685l3243J6603q471Q8143q0326N8995J00987q5408O7619n8248J4444K3490
5129E33270K0642L6318J08728k5473M1784L8368m7205j10418j6606M5357k8457
5118E96308j2219J13959l5013K8478J4335K8394K7755O7J4086k2890K8803P8294
5106H60357N9996O8303P097n9491n896K0512o2565M0765J0950K2574j6565j09450
5094H36587n3573N7254j05598J0027N2000N8900j545K8589K4001N6697j23779
5083H39560j19496J15652Q4668P7496p1664Q08m0454J9153r8172k8757Q7177n1965
5071H14006j19500J4209K7530j38641q499J67367q4955N2665j4450l7280N3575
$$ y = [225829, 286277, 439880, 312279, 256942, 329070, 347460, 464225, 412792, 479524, 372063, 428685, 395442, 412045, 403574, 491717, 411391, 470386, 571373, 485965, 553584, 495336, 509780, 533270, 553912, 590230, 698958, 673485, 715269, 753637, 706432, 596014, 579408, 624765, 596308, 584089, 698048, 663035, 691513, 705848, 734242, 761997, 762064, 776150, 753260, 782063, 860357, 920353, 988656, 995753, 936262, 930366, 950878, 888313, 929078, 940028, 962602, 946037, 836587, 783014, 840268, 734670, 744697, 796697, 855597, 854052, 882641, 906642, 963339, 839560, 720064, 835716, 920384, 997880, 926216, 927024, 886570, 905723, 807551, 778794, 865971, 814006, 694506, 708715, 736245, 597604, 589105, 756472, 671517, 724182, 709732, 672452, 726027]
5060G26027n6139P4061o6469n5827J5050K9307L2688L1423n4526M2334L3457o816
5048G44570K9402l8654R7097p7252j1945j06120J65585J024n485R5645J32502
5037A026369J8176q5751K7455j5882K8323n8500M727R452P203K3265o5305J08545
5025A028077O572j26813J21486n5072O8338j2701N4957k3718k5522J1671J12216
5014A159491J66888k7104l7186j04812J957M6439O4314l2862P8512k9099J9293
5003A305831J22777n806n6754N8153o3704n4005Q5607N7352M0356M6295N4184
4992A590286L4428O2545J0918M3585L7346R727L8067j27320P1789N5476M0556
4981A867403N9538p4662m0735o2881J24776P1693J08642R4500P5756r2440r889
$$ y = [726027, 669888, 743949, 677480, 621653, 636703, 666010, 698698, 730121, 675595, 717929, 751386, 744570, 773972, 735318, 832415, 755163, 743218, 637098, 802683, 803707, 798222, 893867, 1026369, 1044545, 958794, 986249, 970367, 998690, 940190, 944917, 954369, 961572, 984837, 919532, 1028077, 1034649, 907836, 1029322, 974250, 1042588, 1029887, 1084844, 1061126, 1035604, 1047275, 1159491, 1326379, 1299275, 1262089, 1157277, 1159234, 1205673, 1269987, 1237125, 1315637, 1286538, 1305831, 1428608, 1422802, 1366048, 1424201, 1360497, 1306492, 1392099, 1449451, 1489807, 1536102, 1590286, 1624714, 1687259, 1698177, 1741762, 1779108, 1788835, 1826902, 1699582, 1771371, 1826847, 1867403, 1926941, 1852279, 1811544, 1748663, 1873439, 1945132, 2053774, 2148274, 2224030, 2131590, 2121701]
4970B121701j4585O3195R5994J24221R7479J33683M7870J09322j7259R6124J10604
4959B968349R6324M5355R8244J08155N5732Q8106J19430J60582K54374J13089
4949D107740J23766K74696J84919K35042J32193L33070K24320L00186L01286L37341
4939F554559J43944L35656L87322J81878J94857L53961J29842L70045K90955K05307
4929I148326K45474M28906N31301M09070M19816N60825O15846N59140P25169Q15863
4919A4459736P36744P08450P42472P40096O85073O79153O29550P55131R18623
4910B1055028Q78095J157724J303100J441994J693919J864297K134783K591298
4902C4120238L005582L320938L672017L649359K917834J875302N90361m21588
$$ y = [2121701, 2107116, 2170311, 2266305, 2390526, 2488005, 2621688, 2669558, 2778880, 2761621, 2857745, 2968349, 3064673, 3110028, 3208272, 3316427, 3372159, 3460265, 3579695, 3740277, 3994651, 4107740, 4231506, 4506202, 4691121, 4926163, 5058356, 5391426, 5615746, 5915932, 6217218, 6554559, 6698503, 7034159, 7421481, 7603359, 7798216, 8152177, 8282019, 8652064, 8943019, 9148326, 9393800, 9822706, 10354007, 10763077, 11182893, 11743718, 12359564, 12918704, 13643873, 14459736, 15196480, 15904930, 16647402, 17387498, 18072571, 18751724, 19381274, 20136405, 21055028, 21933123, 23090847, 24393947, 25835941, 27529860, 29394157, 31528940, 34120238, 37125820, 40446758, 44118775, 47768134, 50685968, 52561270, 53151631, 52730043]
4894E2730043j272202j640369j290078q74016l10080L74250Q23652J400930J886324
4885E1828454K493718L077160L696754M515098N599084O578545P539530P596746
4877I2925089O934731M768684J056426k940629n985221p246736p019265o164406
4869G6328673m863448l747229k791214j768346j090608l92518L46841J074124
4861F3096275J743838K766204L799181M613974M950955M628887K860771O53699
4853H9113784j962476m230919n571732o170763o204530n786853m983604m229753
4845D9973154l477972k832267k372673k105250j782392j559121j168915q20749
4837C3853815l64752P1816K25622L34554J05666k56570q52229j479373j859533
$$ y = [52730043, 51457841, 49817472, 48527394, 47653378, 47343298, 47717548, 48541200, 49942130, 51828454, 54322172, 57399332, 61096086, 65611184, 71210268, 77788813, 85328343, 92925089, 99859820, 104628504, 105684930, 102744301, 96759080, 89512344, 82493079, 76328673, 71465225, 67717996, 64926782, 63158436, 62067828, 61675310, 62022151, 63096275, 64840113, 67606317, 71405498, 76019472, 80970427, 85599314, 88460085, 89113784, 87151308, 82920389, 77348657, 71177894, 64973364, 59186511, 54202907, 49973154, 46495182, 43662915, 41290242, 39184992, 37402600, 35843479, 34674564, 33853815, 33489063, 33560879, 33786501, 34121055, 34226721, 33970151, 33117922, 31638549, 29779016]
4828B9779016k000153j893209j748181j449051j266867j148470j049964r75680
4820A8247441j003330r14398p61185p17735p26910o30315o15110n33564m98449
4811A1846445n07693m61471m34321l38523l53825k65327k22243k14185k73814
4802H775043j09141k49518j55831k8454j68062m3347j11462n4448M3566j96025
4792G702321j88114o8113j74957j33829j39415J8974p5194j16442l4288r6891
4782F694052j21913M7086m5982R426l2478q2386O6098R0521J22285N9209P5196
4771F881114Q1691k9625j0401K3366R4881J32694R7495J40682Q5648O5398J10713
4760G673656J7115J45856K29661K21852K57641K38835M01780K58662K78063L82540
$$ y = [29779016, 27778863, 25885654, 24137473, 22688422, 21421555, 20273085, 19223121, 18247441, 17244111, 16329713, 15568528, 14850793, 14123883, 13493568, 12878458, 12344894, 11846445, 11338752, 10877281, 10442960, 10104437, 9750612, 9485285, 9263042, 9048857, 8775043, 8665902, 8416384, 8260553, 8232099, 8064037, 8020690, 7909228, 7854780, 7898346, 7702321, 7514207, 7446094, 7271137, 7137308, 6997893, 7016867, 6941673, 6825231, 6790943, 6694052, 6572139, 6619225, 6573243, 6582669, 6550191, 6467805, 6533903, 6624424, 6746709, 6805918, 6881114, 6962805, 6933180, 6922779, 6946145, 7041026, 7173720, 7271215, 7411897, 7497545, 7562943, 7673656, 7690771, 7836627, 8066288, 8288140, 8545781, 8784616, 9186396, 9445058, 9723121, 10105661]
4750A0105661M11737L74301L95192K61973K97964J77322K59566J85631L09569
4741A2778916L34806M04433M76978N70990P15444O53790P10394P00926O19492
4732A7966169M86169O07715O52643P10918N03590N72768L79936M36634M64058
4723B2780600N40408O98674Q67590J081934J270650J467778J734968K189989K289812
4714C4922403K658507K757598K851663K690709K388010J802256J242314J042995
4706E2356455R47858J333525K120670L007963L950722M909832N399927M877614
4698G8904566L049528O44227j444415k322266k150551j097314j5648P35110O87072
4689G6990309K59178l17077j015291p63824j60691P76694J956514L698750N611081
$$ y = [10105661, 10517398, 10891699, 11286891, 11548864, 11846828, 12024150, 12283716, 12469347, 12778916, 13113722, 13518155, 13995133, 14566123, 15281567, 15935357, 16645751, 17346677, 17966169, 18452338, 19060053, 19712696, 20423614, 20927204, 21499972, 21879908, 22316542, 22780600, 23321008, 24019682, 24887272, 25969206, 27239856, 28707634, 30442602, 32632591, 34922403, 37580910, 40338508, 43190171, 45880880, 48268890, 50071146, 51313460, 52356455, 53304313, 54637838, 56758508, 59766471, 63717193, 68627025, 74026952, 78904566, 81954094, 82598321, 81153906, 78831640, 76681089, 75583775, 75568127, 76303237, 76990309, 77249487, 76932410, 75917119, 75153295, 74992604, 75769298, 77725812, 81424562, 87035643]
4680H7035643P332077P956276N730966J331898l022290o317755p686991p478027
4672H4881797o642514n548475m432804l639601l033862k665818k418979k120175
4664E4379569j860815j197220n70201J51504R15903J527469K022459J447005K42647
4655E7058320j215446k735154l671693m065354l687003l263793k688713k161326
4647C3569838j572082j444828r12834m66790l61909j19258k59055n85339p54446
4638B7093297r73639r56829n63721m22809j13153N0278m4712P9126o0290q5560
4628B4001988J22174l2597j09860J958l50418n88487o39060o27952n35077l75863
4618B0866806l54536n10283m98571l36360j48335Q8820J63881L07860L15016J50609
$$ y = [87035643, 94367720, 102323996, 108054962, 109386860, 106364570, 100046815, 92359824, 84881797, 78239283, 72690808, 68258004, 64618403, 61584541, 58918723, 56499744, 54379569, 52518754, 51321534, 50751333, 50902837, 51818740, 53346209, 55368668, 56815673, 57058320, 55842874, 53107720, 49436027, 45370673, 41683670, 38419877, 35731164, 33569838, 31997756, 30552928, 29640094, 29173304, 28811395, 28692137, 28433082, 27847743, 27093297, 26119658, 25162829, 24599108, 24176299, 24063146, 24113424, 24068712, 24147838, 24087548, 24001988, 24124162, 24091565, 23981705, 23983663, 23633245, 23044758, 22405698, 21777746, 21242669, 20866806, 20512270, 20001987, 19503416, 19167056, 19018721, 19107541, 19271422, 19579282, 19894298, 20044907]
4608B0044907l49053q94443r87108r99899p06157n67140n58788l82601j77694
4599A4422024k28809j33859j84263o9728k34255j40219l4510J54692J46572L41214
4589A4038859L55611K42144K94641M11958L27667M74992N58754N78453N60719
4580A7843798O91819O87050N92404N71200M46185L03695P7481L21315M22765N47358
4570B2505070O22393P27897R39671R48973J001772J221928J304135J507094J473243
4561C2252176J556355J664789J806934K107653K323459K712572L199065L808284
4553E1431287M366734M678063L971052K184958p4445j957890k285083k111761
4545F0202915j293012m45503L34097O61249J009814J580878K427746L396758M731870
$$ y = [20044907, 19695854, 18801411, 17814303, 16814404, 16108247, 15541107, 14982319, 14599718, 14422024, 14193215, 14059356, 13875093, 13805365, 13571110, 13430891, 13396381, 13551073, 13697645, 14038859, 14394470, 14636614, 14931255, 15343213, 15670880, 16145872, 16704626, 17283079, 17843798, 18535617, 19222667, 19815071, 20386271, 20832456, 21136151, 21213632, 21534947, 21957712, 22505070, 23127463, 23855360, 24795031, 25744004, 26745776, 27967704, 29271839, 30778933, 32252176, 33808531, 35473320, 37280254, 39387907, 41711366, 44423938, 47623003, 51431287, 55798021, 60476084, 64447136, 66632094, 66557649, 64599759, 62314676, 60202915, 58909903, 58464400, 58798497, 59459746, 60469560, 62050438, 64478184, 67874942, 72606812]
4536G2606812N874863O582701O199558L725515Q15988k102177m382101n704517
4528H3616642o509743n948863m877617l552274k681197j790427r21232p47412
4520E6587877l61337K25105J156113J961066K210974J612126j87977k781860m738556
4511E5683531n610849n226336m589639l882074l269429k767299k389443k068046
4503B5880416j955184j513576j340540j404119j173988j227883j101518q51283
4495A5312325q17025p76657o43234o68958m97135n11824m16850l36418l36503
4486A0307721l77895l71561l66118l95547l04271k20909k73171k53887k09301
4477G535061k40035j46736k25069k74720j65527n5714k35999j25368k11401j67157
$$ y = [72606812, 78481675, 85064376, 91263934, 94989449, 95805437, 93703260, 89321159, 83616642, 77106899, 71158036, 66280419, 62728145, 60046948, 58256521, 57335289, 56587877, 56226540, 56451645, 57607758, 59568824, 61779798, 63391924, 63203947, 60422087, 55683531, 50072682, 44846346, 40256707, 36374633, 33105204, 30337905, 27948462, 25880416, 23925232, 22411656, 21071116, 19666997, 18493009, 17265126, 16163608, 15312325, 14495300, 13718643, 13075409, 12406451, 11909316, 11397492, 10980642, 10644224, 10307721, 9929826, 9558265, 9192147, 8796600, 8492329, 8271420, 7998249, 7744362, 7535061, 7295026, 7148290, 6923221, 6648501, 6482974, 6427260, 6191261, 6065893, 5854492, 5687335]
4467E687335r3082j33617j01557m1461j39240M9216j24531j12519Q9207j37053
4457D942698K1985o0366m5026m5818j96042o1506j6984j31913l9711p592N6200
4446D415925j08574J3862L401K7789O8178L3006M8581R489P2532R3355K77680
4435D955224J21160j07705J15019q0083j63003j33460k25312J0884j58260q8837
4425D245627N3454j1670j09030p4852J04876K658l4818J46762J16009J35421J76801
4414D751238J84648K13798K36901J95934J50921j80036j11387k13677l48976k20914
4404D658450k52961j34832j38522j32840j83042j5215j71045n4998N6812r7968
4394C533839p5041J23565K7773m0532p9616J51822J33391m3565l9972q1866N6164
$$ y = [5687335, 5594253, 5460636, 5359079, 5317618, 5178378, 5227594, 5103063, 4990544, 5079751, 4942698, 4964683, 4904317, 4859291, 4813473, 4617431, 4555925, 4538941, 4407028, 4367317, 4359725, 4415925, 4307351, 4321213, 4324614, 4352403, 4420581, 4453587, 4502168, 4511657, 4584189, 4677544, 4955224, 5076384, 4968679, 5083698, 5003615, 4840612, 4707152, 4481840, 4492724, 4334464, 4245627, 4299081, 4287411, 4178381, 4103529, 4208405, 4211063, 4176245, 4323007, 4439016, 4574437, 4751238, 4935886, 5149684, 5386585, 5582519, 5733440, 5553404, 5442017, 5228340, 4879364, 4658450, 4405489, 4270657, 4132135, 3999295, 3816253, 3801038, 3629993, 3574995, 3631807, 3533839, 3458798, 3582363, 3610136, 3569604, 3489988, 3641810, 3775201, 3731636, 3691664, 3609798, 3665962]
4383C665962j68499j53861j10367j23287k01808J3436k2966j45674m5517j01505
4373B605914j41639L57J6449q2403k2566l759Q5538m920p9856J00813P2038m4254
4361B501712Q8808R1241R3198J64861Q7261J60621J97280K66156L39370L32828
4351D323336L82336J11527l5839j87675k91096k08680k52804j46258o664n3762
4341C634421L86J08232j405J37130N0013K17115K03259K70284L72865L92671O19139
4330F004110O83677J073741J184376J068146N62458q8111q69884j058014r60303
4321G600196q55039n28635l42016m32548k34671j77228j45683M646j04167J13052
4311D897907J30765K03940L35573K68316M91694O62706R02908J135911J170224
$$ y = [3665962, 3497463, 3343602, 3233235, 3109948, 2908140, 2921576, 2898610, 2752936, 2707419, 2605914, 2464275, 2464632, 2481081, 2398678, 2376112, 2372353, 2457891, 2452971, 2373115, 2473928, 2545966, 2501712, 2590520, 2681761, 2774959, 2939820, 3027081, 3187702, 3384982, 3651138, 3990508, 4323336, 4705672, 4817199, 4781360, 4593685, 4302589, 4093909, 3841105, 3694847, 3688183, 3634421, 3634807, 3743039, 3741634, 3878764, 3928777, 4145892, 4349151, 4619435, 4992300, 5384971, 6004110, 6687787, 7761528, 8945904, 10014050, 10576508, 10488397, 9618513, 8560499, 7600196, 6745157, 6216522, 5874506, 5441958, 5207287, 5030059, 4884376, 4889022, 4784855, 4897907, 5028672, 5232612, 5568185, 5836501, 6328195, 6990901, 7893809, 9029720, 10199944]
4302A0199944P58449m9290q99657j129509j067098r09867o50982m56620m92038
4293E303332l13295k30485k77522j81399k20429l8041j99410j02719m3381M1765
4283C738416J43171J08383L13651M06714K35703K37100J2874j77536l88989k35257
4273D394230k18709k48574p5075p6172k39081j07589k56591k15529p8856k37526
4263B640528k08113r1685q6706q0337j31606R725Q6485o0762q635K8017N7809
4252B154720K9848J02713N9681J24815K06821Q1319J35687R3093p0383j16324
4242B801990q5360j94934l0725o5509j23911m127j80377q2050j28649j48390P1053
4231A829011j7279j42157P2245j1335O4302L7857O0954Q430J47311L5188Q7761
$$ y = [10199944, 10958393, 10909103, 10009446, 8879937, 7812839, 6902972, 6251990, 5795370, 5303332, 4990037, 4759552, 4482030, 4300631, 4080202, 4042161, 3842751, 3740032, 3696651, 3738416, 3881587, 3989970, 4303621, 4710335, 4946038, 5183138, 5196012, 5018476, 4629487, 4394230, 4175521, 3926947, 3851872, 3775700, 3536619, 3429030, 3172439, 2956910, 2878054, 2640528, 2432415, 2340730, 2254024, 2173687, 2042081, 2051806, 2138291, 2077529, 2068894, 2096911, 2154720, 2184568, 2287281, 2346962, 2471777, 2678598, 2759917, 2895604, 2988697, 2918314, 2801990, 2716630, 2521696, 2490971, 2425462, 2301551, 2297424, 2117047, 2034997, 1906348, 1757958, 1829011, 1811732, 1669575, 1741820, 1730485, 1794787, 1832644, 1893598, 1902028, 2049339, 2084527, 2172288]
4220B172288J46300N6550j24992l3013k8286j21729l116P98j98714p4979k7504
4209A763603j73987N8432j25146J06682K733j44111J17315j3628P953j03558j5971
4198A480317l6514J39718N1806O2542l6122j4695r8879N1803J4300o6847q0842
4187A466587o363O0851O5915m0009j22584N842p3853l387j04815O773n6584J15715
4175A314088p8933m0196O3725k9089k9143R1021O9229M7083J08226n9903l3100
4164A423008l8684M8210K9237j32182K5592r1541o3771k5697l1801L0319M2906
4153A215596L4171m1828o6435J29262o2057j1999R6071O5155Q837K150r8648l2155
4141A238120L9901J4250M3647Q6494o5627M7366P3623J16307k1839L3662J11398
$$ y = [2172288, 2318588, 2375138, 2250146, 2217133, 2188847, 2067118, 2064002, 2064800, 1866086, 1791107, 1763603, 1589616, 1648048, 1522902, 1629584, 1632317, 1488206, 1605521, 1591893, 1599846, 1496288, 1480317, 1443803, 1583521, 1635327, 1697869, 1661747, 1647052, 1548173, 1599976, 1614276, 1547429, 1466587, 1460224, 1521075, 1586990, 1546981, 1424397, 1430239, 1356386, 1352999, 1248184, 1254957, 1198373, 1314088, 1235155, 1194959, 1258684, 1229595, 1200452, 1291473, 1360702, 1407785, 1516011, 1456108, 1423008, 1384324, 1432534, 1461771, 1329589, 1355181, 1263640, 1199869, 1174172, 1142371, 1172690, 1215596, 1249767, 1207939, 1141504, 1270766, 1208709, 1196710, 1292781, 1357936, 1366773, 1368923, 1270275, 1238120, 1278021, 1292271, 1335918, 1422412, 1356785, 1404151, 1477774, 1594081, 1572242, 1605904, 1717302]
4130A717302R9336P8253m0566L5570Q4173P0849J24644L4637J35526J10310m6904
4119B403130q3750m8756o1544j491o204M0362M4759M5258J16245J1210J7379L9717
4107B516315L8432q4080M4413r0528R9602r4746p7463M9282J27785P9384n7670
4096B550726l8140J12071J70836J9902J53379K9293J48180K7741n6308J37556
4086C255236L5203K5185J19887o472P9496J18256P5779J52853J53120J17570M035
4075D130148K11958K55050J95361K99056K86623L44882M07429M68884N26505N74855
4065G700751Q60709J187145J496457J790999K156954J023917n61855j545812j971594
4056A2137671j590291j119730q20162p27579m71394l24789k95598k00373k32048
$$ y = [1717302, 1816638, 1894891, 1854325, 1889895, 1974068, 2044917, 2169561, 2204198, 2339724, 2450034, 2403130, 2319380, 2270624, 2209080, 2207589, 2201385, 2241747, 2286506, 2331764, 2448009, 2459219, 2476598, 2516315, 2554747, 2470667, 2515080, 2424552, 2524154, 2429408, 2351945, 2401227, 2529012, 2608396, 2550726, 2512586, 2624657, 2795493, 2815395, 2968774, 2998067, 3146247, 3173988, 3117680, 3255236, 3290439, 3315624, 3435511, 3429039, 3508535, 3626791, 3702570, 3855423, 4008543, 4126113, 4130148, 4342106, 4597156, 4792517, 5091573, 5378196, 5723078, 6130507, 6599391, 7125896, 7700751, 8561460, 9748605, 11245062, 13036061, 15193015, 16216932, 15655077, 14109265, 12137671, 10547380, 9427650, 8607488, 7879909, 7408515, 7083726, 6788128, 6587755, 6355707]
4047F355707k06739l8660j20362k10449o4576q916P6030L5775J03411J04106J29834
4036F155161L28311P1114J22819K43453J71385L68193K38800L64012L30299K67045
4026H660592M04981L50230L84016K76840K29776L57007N98344N76590P37107R18644
4016A3494127Q11423R59099J023045J170635J324704J726688K273813K860198
4008B5643732L478967M400349K528798j40103j956597k764024k253488j419671
4000B7517963r77801o46444k51925m5668M30560N77196O61387R20986J107964
3991B9294218J260001J632910J876391K409205K703210L189934L668116M385677
3983E0419662M778686N042816M244052K191507k51461k165480k825251k417697
$$ y = [6355707, 6148968, 6110308, 5989946, 5779497, 5714921, 5706005, 5782035, 5817810, 5921221, 6025327, 6155161, 6483472, 6554586, 6677405, 6920858, 7092243, 7460436, 7699236, 8063248, 8393547, 8660592, 9065573, 9415803, 9799819, 10076659, 10306435, 10663442, 11261786, 11838376, 12575483, 13494127, 14305550, 15264649, 16287694, 17458329, 18783033, 20509721, 22783534, 25643732, 29122699, 33523048, 36051846, 35911743, 33955146, 31191122, 28937634, 27517963, 26540162, 25893718, 25641793, 25596125, 26026685, 26603881, 27265268, 28186254, 29294218, 30554219, 32187129, 34063520, 36472725, 39175935, 42365869, 46033985, 50419662, 55198348, 60241164, 64485216, 66676723, 66425262, 64259782, 61434531, 59016834]
3975E9016834j632390p24247Q4564M45581R53115J602376K514024L467974M453535
3966G0181366N300555N815287N119787L681174J453049j558219m561749o445028
3958G8986222o833197o233666m864768l716042k648752k041654j465339j066566
3950E0116238n03083J02307R30104J615828K033267J671618n8907k431294m077699
3941D9398379m761628m621612m106350l493587k927383k542717k169639j758381
3933B3017082j580174j494866j275347j337665r91345q05129p56005o90265n32399
3924A3553887n66249n02049m31149m18424m30556k94316l10991j87068j55986
3915A0257099l33562j32543r9509j2327j62113l2272j54229N5758J68400Q9459
$$ y = [59016834, 57384444, 56660197, 56744761, 57190342, 58143457, 59745833, 62259857, 65727831, 70181366, 75481921, 81297208, 86416995, 90098169, 91551218, 89992999, 85431250, 78986222, 72153025, 65919359, 61054591, 57338549, 54689797, 52648143, 51182804, 50116238, 49613155, 49715462, 50645566, 52261394, 54294661, 55966279, 55907372, 53476078, 49398379, 44636751, 40015139, 35908789, 32415202, 29487819, 26945102, 24775463, 23017082, 21436908, 19942042, 18666695, 17329030, 16337685, 15532556, 14776551, 14086286, 13553887, 12987638, 12485589, 12054440, 11636016, 11205460, 10911144, 10600153, 10413085, 10257099, 9923537, 9790994, 9691485, 9679158, 9517045, 9484773, 9330544, 9386302, 9554702, 9644161]
3905I644161J74568K45471K35291M67348L12159L87197P55194P92232P11622O56834
3895A4382077M20988r6635k60902m24593l77204k52473P9955K21489L41883K43345
3885A4277930J83393K18891K96700K76405K90931L13537J74779k41067n37648
3876A5253851o28296l85371m11573n32940l97366m55633m48642l03418j05529
3867A1585083r3920R6532K18365K16396j35149n02235q37101r72685q48143p51516
3857G975627o91258o12558n41191m25950l26672k98730j47994k17349j79047k78487
3847D256391k01662j52530k24836j43572j50218n4687j46200j60735o0313q0120
3837B881518j35476m1870J7465r7313j07270q5023J4135r5902m395m4948m4641
$$ y = [9644161, 9818729, 10064200, 10299491, 10766839, 11078998, 11466195, 12221389, 13013621, 13725243, 14382077, 14803065, 14706430, 14445528, 14020935, 13643731, 13391258, 13471213, 13692702, 14034585, 14277930, 14461323, 14680214, 14976914, 15253319, 15544250, 15857787, 16032566, 15791499, 15253851, 14625555, 14240184, 13828611, 13295671, 12898305, 12442672, 11994030, 11690612, 11585083, 11491163, 11587695, 11806060, 12022456, 11887307, 11385072, 10547971, 9575286, 8727143, 7975627, 7284369, 6671811, 6130620, 5704670, 5377998, 5079268, 4931274, 4713925, 4534878, 4256391, 4054729, 3902199, 3677363, 3533791, 3383573, 3328886, 3182686, 3021951, 2961638, 2881518, 2746042, 2704172, 2721637, 2624324, 2517054, 2432031, 2446166, 2350264, 2345869, 2300921, 2256280]
3826B256280n8789p5577K0827M9931l2011j79829n1232P9462n7073n4992K4685
3815A921682j13291p4214p4632Q3389j6526l3671l4115J0392M4804p4425k0019
3804A619374k5138k1789l8363m2554M2657o1732j24678l668J27058L2816m8400
3793A455583Q869R6875j9730o5695J1546M9078J069m1687J735K3542m2658J9152
3781A497679P3133k7928J41192m5088j04950n5993P1447q4385J15738Q4520Q4093
3770A749458j0345j09975K8678O2714n4558M9574O5449Q3007O4479o2236J1327
3759A877572P4185l26m3141M8366K3759Q7458Q734j4089l6919J2890n1015p3205
3747A914269Q3253r219K8994L5960M6559n358O9478K78575K6414M945k2580J6416
$$ y = [2256280, 2197491, 2121914, 2142741, 2192672, 2160661, 1980832, 1929600, 2009062, 1951989, 1896997, 1921682, 1808391, 1734177, 1659545, 1742934, 1726408, 1692737, 1658622, 1669014, 1713818, 1639393, 1619374, 1594236, 1572447, 1534084, 1491530, 1534187, 1472455, 1347777, 1344109, 1471167, 1503983, 1455583, 1464452, 1561327, 1541597, 1475902, 1487448, 1536526, 1537595, 1495908, 1497643, 1521185, 1478527, 1497679, 1570812, 1542884, 1684076, 1638988, 1534038, 1478045, 1549492, 1465107, 1580845, 1665365, 1749458, 1739113, 1629138, 1657816, 1720530, 1665972, 1715546, 1780995, 1864002, 1928481, 1866245, 1877572, 1951757, 1951431, 1908290, 1956656, 1980415, 2067873, 2076607, 2062518, 2025599, 2038489, 1987474, 1914269, 1997522, 1988303, 2017297, 2053257, 2099816, 2094458, 2163936, 2442511, 2468925, 2473870, 2451290, 2467706]
3735B467706L6150m822n6543q2427j7910K3284m359o9157j9938l0782j2125R4264
3723B323341M2395k2424Q2565O9663M2599J05881j77015l1435j5058K9758l0582
3712B419688j02315q8174o1556R1250j0566k6850m7470k3996J7927j13246k8137
3701B026555j3715o8185K6018o3636k3022L7161k8262L0437j44819l5939r222
3690A733371p434l1082m1223J24843J7107J9735r3968l753L0777K1235n0718m6791
3678A672099R4588k10471M8392J02415r9007K2222M8888K3052j840L486L4839
3667A738663j4686m4643J0933P1004j4870N7962O0382j9046J5853P9733l7439
3656A903846j9631j7208M3168O808M828O7418j22950J60919O5571q5079N2596
$$ y = [2467706, 2503856, 2499034, 2442491, 2360064, 2342154, 2365438, 2361079, 2291922, 2271984, 2241202, 2229077, 2323341, 2365736, 2343312, 2425877, 2495540, 2538139, 2644020, 2467005, 2435570, 2420512, 2450270, 2419688, 2317373, 2229199, 2167643, 2258893, 2248327, 2221477, 2174007, 2150011, 2167938, 2054692, 2026555, 2012840, 1944655, 1970673, 1907037, 1884015, 1921176, 1892914, 1923351, 1778532, 1742593, 1733371, 1725937, 1694855, 1653632, 1778475, 1795582, 1815317, 1721349, 1717596, 1748373, 1769608, 1718890, 1672099, 1766687, 1556216, 1604608, 1707023, 1608016, 1630238, 1679126, 1702178, 1700338, 1703824, 1738663, 1723977, 1679334, 1690267, 1761271, 1746401, 1804363, 1864745, 1845699, 1861552, 1941285, 1903846, 1884215, 1867007, 1910175, 1916983, 1921811, 1989229, 1866279, 2027198, 2092769, 2007690, 2060286]
3645B060286J755K3215O2067K5437n3620j5860M2105K3733l937J9111M0826N3645
3633B278763O2666j0432L7583o2427k3369J27368K8613J4100N8121j9833l1940
3622B459213n6330P8253K8713l7018J8052p3144J52254Q072J1756J40870L4514
3611B765205k2107o325J25042j11382J28469J29658o3641O1543N312M7674J44613
3600C204061m329J02476K7985N5543J5051L3034J77266L9044M8836J08390m473
3589C802884P6465J83649P0797J76101J44549J55198J89748J21024J74535K11475
3579E306425K89060K93161L08998K28100J4478J00265J50187J64629K10026L27893
3569G393222K97298L83670O68196O94378R02371M23978q1491l30322l17569r0042
$$ y = [2060286, 2062041, 2085256, 2147323, 2172760, 2119140, 2103280, 2145385, 2169118, 2165181, 2184292, 2225118, 2278763, 2341429, 2330997, 2368580, 2306153, 2282784, 2410152, 2438765, 2452865, 2510986, 2491153, 2459213, 2402883, 2481136, 2509849, 2472831, 2490883, 2417739, 2569993, 2578065, 2589821, 2730691, 2765205, 2743098, 2736773, 2861815, 2750433, 2878902, 3008560, 2944919, 3006462, 3011774, 3059448, 3204061, 3199732, 3302208, 3330193, 3385736, 3400787, 3433821, 3611087, 3650131, 3698967, 3807357, 3802884, 3879349, 4062998, 4133795, 4309896, 4454445, 4609643, 4799391, 4920415, 5094950, 5306425, 5595485, 5888646, 6197644, 6425744, 6440222, 6540487, 6690674, 6855303, 7065329, 7393222, 7690520, 8074190, 8742386, 9436764, 10339135, 10763113, 10681622, 10351300, 10033731, 9943689]
3559I943689J35562J88779K93034L33411L78080K24824K01027K19974L09655L32003
3549A2560038M35643M72440N24478N99587N10760P16727O92053P66518P74262
3540A8052506Q22311Q60927Q93271J025743J072286J028749J121686J177353J295147
3531B7349979J423318J515919J486682J614921J670115J746518J904889J922893
3523D0635234K113662K273450K377044K538886K696561K904213L035120L109272
3515F1683442L133156L343316L434702L657610L645663L722455L945510L954281
3507I0520135M065213M083004L974768L978448L836470L663130L443251L147502
3499A20711921L056844K933209K612311K404732K128195J831045J394899R77122
$$ y = [9943689, 10079251, 10268030, 10561064, 10894475, 11272555, 11497379, 11698406, 11918380, 12228035, 12560038, 12995681, 13468121, 13992599, 14592186, 15102946, 15819673, 16511726, 17278244, 18052506, 18874817, 19735744, 20629015, 21654758, 22727044, 23755793, 24877479, 26054832, 27349979, 28773297, 30289216, 31775898, 33390819, 35060934, 36807452, 38712341, 40635234, 42748896, 45022346, 47399390, 49938276, 52634837, 55539050, 58574170, 61683442, 64816598, 68159914, 71594616, 75252226, 78897889, 82620344, 86565854, 90520135, 94585348, 98668352, 102643120, 106621568, 110458038, 114121168, 117564419, 120711921, 123768765, 126701974, 129314285, 131719017, 133847212, 135678257, 137073156, 138050278]
3491A38050278L69466l46274o95276j029279j298211j591069j899805k222314
3483A29337516k576798k982428l371824l734497l912334m107601m171250m353562
3475A00127222m157461m244938m280121m135245m295586m103116m197178m076712
3467F6636865l925351l686999l483651l417761l145493k926431k664022k669288
3459D0717869k534371k144340k229952j943345j879358j629893j466381j450314
3451B5439915j243577j237785j039279j012497r13802q01681q17520o55690p08016
3442A7010068o11714m93946m19531n43975m16543m82040k79335j99815l73944
3433A3189225k72801l17500j54166j80401l48398k26131k02676k15504j96085
$$ y = [138050278, 138419744, 138073470, 137378194, 136348915, 135050704, 133459635, 131559830, 129337516, 126760718, 123778290, 120406466, 116671969, 112759635, 108652034, 104480784, 100127222, 95969761, 91724823, 87444702, 83309457, 79013871, 74910755, 70713577, 66636865, 62711514, 59024515, 55540864, 52123103, 48977610, 46051179, 43387157, 40717869, 38183498, 36039158, 33809206, 31865861, 29986503, 28356610, 26890229, 25439915, 24196338, 22958553, 21919274, 20906777, 19992975, 19191294, 18373774, 17718084, 17010068, 16398354, 15904408, 15484877, 14940902, 14524359, 14042319, 13762984, 13563169, 13189225, 12916424, 12598924, 12444758, 12264357, 11915959, 11689828, 11487152, 11271648, 11075563]
3424A1075563j12812m8566k08570j45627r9197o8629j9838n4954j99124j16907
3414A0001339m7233N0827j00248o4309o6964j6625r082k6112K6207K1892l3830
3403I735862k2430q5570k430l7835j63467l7225m4041j95652j52350j5608k50905
3392H728349j53663r9047j02093n6396j46805j21974j92426n6620r0541q7758
3382G621026n1660q4896q9439j8058p6648q7469q1745o1965R299q2495j8370k4119
3370F953461J94826n7588l5649P1571j52644J66881j51273l8188o4479P0005M8982
3359G005905j3932O1380k9398j6221J15077N6284J25728J20508o727o503n2P9371
3347G491420O380J05246N5288O9812J57379m190P6506K24417P269l6581Q3795
$$ y = [11075563, 10962751, 10914185, 10705615, 10559988, 10460791, 10392162, 10372324, 10317370, 10118246, 10001339, 9954106, 10004933, 9904685, 9840376, 9773412, 9756787, 9747705, 9721593, 9747800, 9769692, 9735862, 9713432, 9627862, 9625432, 9587597, 9424130, 9386905, 9342864, 9147212, 8994862, 8979254, 8728349, 8574686, 8475639, 8373546, 8317150, 8170345, 8048371, 7855945, 7799325, 7708784, 7621026, 7569366, 7484470, 7395031, 7376973, 7300325, 7212856, 7131111, 7069146, 7078445, 6995950, 6977580, 6953461, 7148287, 7090699, 7055050, 7126621, 6973977, 7140858, 6989585, 6951397, 6886918, 6956923, 7005905, 6991973, 7053353, 7023955, 7007734, 7122811, 7179095, 7304823, 7425331, 7418604, 7412101, 7412049, 7491420, 7497800, 7603046, 7658334, 7728146, 7885525, 7881335, 7957841, 8182258, 8189527, 8152946, 8236741]
3336H236741K29898J14324Q127M7003K8434R7787K31463M9955J73642J37705J19777
3325I474856K10403J10035J17939M2961J78721J15597J88553N4009J58332J80336
3315A0831742J0641J72040J31334K78000K27595J36368J79606J28395J87991K29059
3305A2512771J70665L01165J77537J65092K80013K07981K61312M17161K33056
3296A4726753L29933M14478L43594M29656M38672L80988L86263N40832M83946
3287A8475115N43317N60339N14577N79555N73391O43664P38334P89098P94888
3278B4212278R82280Q59776J134336J032943J157256J118997J134947J416144
3270C3048957J498462J576421J735870J904712J933054K023400K094910K081571
$$ y = [8236741, 8466639, 8580963, 8589090, 8636093, 8664527, 8762314, 8993777, 9043732, 9217374, 9355079, 9474856, 9685259, 9795294, 9913233, 9956194, 10134915, 10250512, 10439065, 10493074, 10651406, 10831742, 10842383, 11014423, 11145757, 11423757, 11651352, 11787720, 11967326, 12095721, 12283712, 12512771, 12683436, 12984601, 13162138, 13327230, 13607243, 13815224, 14076536, 14493697, 14726753, 15056686, 15471164, 15814758, 16244414, 16683086, 17064074, 17450337, 17991169, 18475115, 19018432, 19578771, 20093348, 20672903, 21246294, 21889958, 22628292, 23417390, 24212278, 25194558, 26054334, 27188670, 28221613, 29378869, 30497866, 31632813, 33048957, 34547419, 36123840, 37859710, 39764422, 41697476, 43720876, 45815786, 47897357]
3262D7897357K107086J939700J872807K068448K063127K097759K229085K047578
3254F4322947K148320K173736J951884J967063J903237J912267K009502K178845
3246H0567801K495144K745528L054571L191827L252623L129959K828092K544631
3238A03810176K307954K062140K157574K536862K793542L306240L793498M247035
3230A27015021M500420M967062M950230M923415N304764N783306O178956O706195
3222A70329369P146459P611624P849506Q228795Q532843Q994555R115040R559448
3214B37367639R948135R942536R961778R757411R409335Q924870Q754159Q436402
3206C12502265Q290649Q284202Q469533Q503333Q636688R114864R696953J0371337
$$ y = [47897357, 50004443, 51944143, 53816950, 55885398, 57948525, 60046284, 62275369, 64322947, 66471267, 68645003, 70596887, 72563950, 74467187, 76379454, 78388956, 80567801, 83062945, 85808473, 88863044, 92054871, 95307494, 98437453, 101265545, 103810176, 106118130, 108180270, 110337844, 112874706, 115668248, 118974488, 122767986, 127015021, 131515441, 136482503, 141432733, 146356148, 151660912, 157444218, 163623174, 170329369, 177475828, 185087452, 192936958, 201165753, 209698596, 218693151, 227808191, 237367639, 247315774, 257258310, 267220088, 276977499, 286386834, 295311704, 304065863, 312502265, 320792914, 329077116, 337546649, 346049982, 354686670, 363801534, 373498487, 383869824]
3198C83869824J0814705J1885090J3196818J4400640J5891858J6947822J7322964
3191D84329721J6430911J3860656R888592N023867N4246m068865o603250p898025
3183E11017853q135268q014097q087449r144405j1491221j5024326j9323280k3164698
3175D08633109k5853743k6606498k5662793k3366535k0245271j6921368j3724772
3168B56252129j1168931r293451p842264p064058o726612o815330o633489o291150
3160A94416844n798328n014773m210265l609118l361099l233938l728295m442513
3152A61018515n208087n779801o089312o084464n881970n278294m669969m361486
3144A17665132l767085l194258k907486k710642k346985k202486k170646k145118
$$ y = [383869824, 394684529, 406569619, 419766437, 434167077, 450058935, 467006757, 484329721, 500760632, 514621288, 524509880, 529533747, 529587993, 525519128, 518915878, 511017853, 502882585, 494868488, 486781039, 477636634, 466145413, 451121087, 431797807, 408633109, 382779366, 356172868, 330510075, 307143540, 286898269, 269976901, 256252129, 245083198, 235789747, 227947483, 220883425, 214156813, 207341483, 200707994, 194416844, 188618516, 183603743, 179393478, 175784360, 172423261, 169189323, 165461028, 161018515, 155810428, 150030627, 143941315, 137856851, 131974881, 126696587, 122026618, 117665132, 113898047, 110703789, 107796303, 105085661, 102738676, 100536190, 98365544, 96220426]
3136I6220426k036306j799698j818935j635905j386672j255875j219272j118951
3128H3948812j061741j011622j087538j098065j115634j095772j129902j295614
3120G5052924j271898j442962j525230j415889j574095j595349j659167j709624
3112F2858710j839265j701578j698649j768241j681410j665856j648877j578678
3104D9276156j649812j490043j369172j502816j369134j208155j163273j319457
3096C8204294j035185j019815j127253r89395r48444r04922q55840q37442p41889
3087B9744109p60498q05544p55860o38943o97338o43195o55550n54214n83395
3078B3649572n88294m67922m97198n07272m83825k66447l10393n65831k99006
$$ y = [96220426, 94184120, 92384422, 90565487, 88929582, 87542910, 86287035, 85067763, 83948812, 82887071, 81875449, 80787911, 79689846, 78574212, 77478440, 76348538, 75052924, 73781026, 72338064, 70812834, 69396945, 67822850, 66227501, 64568334, 62858710, 61019445, 59317867, 57619218, 55850977, 54169567, 52503711, 50854834, 49276156, 47626344, 46136301, 44767129, 43264313, 41895179, 40687024, 39523751, 38204294, 37169109, 36149294, 35022041, 34032646, 33084202, 32179280, 31323440, 30485998, 29744109, 28983611, 28178067, 27422207, 26783264, 26085926, 25442731, 24787181, 24232967, 23649572, 23061278, 22593356, 22096158, 21588886, 21105061, 20838614, 20528221, 19962390, 19663384]
3069A9663384m31728l65953m38617l06946k06095k46145l74201k38305k88707
3060A6766687k30838j73595j78516j72505n6525j52154k95722j45556p524j15785
3050A5237967k20193L1210j0853p4317j03745k56617j72529k36279j79985j12301
3040A3902358j41663L804j53469j89558j06526K429k909O1368q6754j6779k5712
3029A3246589J10467N8407R5780l730Q4384L9544K04659Q7986m1271l2157M5118
3018A3895776J41505O5155k7346r3771J35756L977k8378J99511J78613J39085
3008A4609883R3947J96472K12733J93115K43699J89045K53726K12217K61414L46490
2998A6812741K92881L61673L21080L23139L57352L31828J94091J89963L63528
$$ y = [19663384, 19231656, 18865703, 18427086, 18120140, 17914045, 17667900, 17293699, 17055394, 16766687, 16535849, 16362254, 16183738, 16011233, 15954708, 15802554, 15506832, 15361276, 15353752, 15237967, 15017774, 15048984, 15038131, 14963814, 14860069, 14603452, 14430923, 14194644, 14014659, 13902358, 13760695, 13764499, 13611030, 13421472, 13314946, 13317375, 13314466, 13375834, 13289080, 13272301, 13246589, 13357056, 13415463, 13511243, 13507513, 13591897, 13631441, 13836100, 13924086, 13882815, 13850658, 13895776, 14037281, 14102436, 14075090, 13981319, 14117075, 14121052, 14092674, 14292185, 14470798, 14609883, 14703830, 14900302, 15113035, 15306150, 15549849, 15738894, 15992620, 16204837, 16466251, 16812741, 17105622, 17467295, 17788375, 18111514, 18468866, 18800694, 18994785, 19184748, 19548276]
2989A9548276K33877K69677L04315M25617M42598L75716M43177M44867N38270
2980B3026390N62282O03276O62959O50441P85696R10136P44483Q13540J015291
2971B9774494J182959J297766J108622J328210J565049J713031J785077J949658
2963D1704866K241881K315339K360142K087802J800105J184259L61370m90798
2955E3564966j430139j956506k042684j958909j716169j483424j374891j038906
2947D0563338q95836p54426q14443p46860p44855m84234j88392Q6815M66979P24813
2937C7212899P46293N23453k12469j135913j462305j429254j029462r48105r59446
2928C1305691q89270n20683m82154l76082j62096J47324L06521M90978O74523
$$ y = [19548276, 19782153, 20051830, 20356145, 20781762, 21224360, 21600076, 22043253, 22488120, 23026390, 23588672, 24191948, 24854907, 25505348, 26291044, 27201180, 27945663, 28759203, 29774494, 30957453, 32255219, 33363841, 34692051, 36257100, 37970131, 39755208, 41704866, 43946747, 46262086, 48622228, 50710030, 52510135, 53694394, 54055764, 53564966, 52134827, 50178321, 48135637, 46176728, 44460559, 42977135, 41602244, 40563338, 39667502, 38913076, 38098633, 37351773, 36606918, 36122684, 35934292, 36021107, 36488086, 37212899, 37959192, 38482645, 38270176, 37134263, 35671958, 34242704, 33213242, 32265137, 31305691, 30416421, 29895738, 29413584, 29037502, 28875406, 29022730, 29329251, 29820229, 30494752]
2919C0494752R88335J468148J805425K343775K032530J515073J563053Q64834
2911D3075925m58527j893491k353843k437713j995832j398938j056478q18554
2903C0662549n15481j82958K92665Q18221J490659J729965N93600l47690o65608
2894C3875922j006613j402068j668133j141481k92489O2210L99728K2686n46186
2885B8303576j124420j166037j070195q91382o14413j42984L56710Q87250O14521
2876B5152626q21393j916457k209641j736060j228058j017343p64101o72625m95520
2867A4291428n35944m06910j33092j89402k68991l16139m27397n34446m52929
2858A1026178l32623m07538k73095k29634j12325k37765k85633j16768j81766
$$ y = [30494752, 31483087, 32951235, 34756660, 37100435, 39132965, 40648038, 42211091, 43075925, 42617398, 40723907, 38370064, 35932351, 33936519, 32537581, 31481103, 30662549, 30147068, 29964110, 30256775, 31074996, 32565655, 34295620, 34889220, 34541530, 33875922, 32869309, 31467241, 29799108, 28657627, 28365138, 28427348, 28827076, 28849762, 28303576, 27179156, 26013119, 24942924, 24051542, 23437129, 23294145, 23650855, 24538105, 25152626, 24331233, 22414776, 20205135, 18469075, 17241017, 16223674, 15459573, 14786948, 14291428, 13755484, 13348574, 13215482, 13026080, 12757089, 12440950, 12013553, 11479107, 11026178, 10693555, 10286017, 10012922, 9783288, 9670963, 9433198, 9147565, 9030797, 8849031]
2849H849031j50369p2889j14271j3841m2941K434j34761o4469j64453k54894j22272
2838G716305r2727k6940j32964l605l6013n7672o5353j44270p8724j49380n5499
2827F873158k14825n2233j57401j57544J8454k25592q9672p3936j63079l1923
2817E725407L3545j05981k33694q7827R9385k4524n5339j22169m7556p4944k4528
2806E081775q1922k15444O2524r617j20635N9068q5221O234R6253j10555k14655
2795D467805O5994m1553l1164j21751M3335k7888m7552M0934L2532j682j8031
2784D360979m9095J26934j9481K6596J203P6934j8589o6909K05842l0612q105
2773D605697O2942O8928l0180K5028J56890J34037J49728Q2393J61456K88221
$$ y = [8849031, 8698662, 8625773, 8511502, 8497661, 8454720, 8457154, 8322393, 8257924, 8093471, 7838577, 7716305, 7623578, 7596638, 7463674, 7460069, 7424056, 7366384, 7301031, 7156761, 7078037, 6928657, 6873158, 6658333, 6606100, 6448699, 6291155, 6309609, 6084017, 5994345, 5920409, 5757330, 5725407, 5758952, 5652971, 5419277, 5331450, 5430835, 5406311, 5350972, 5228803, 5181247, 5106303, 5081775, 4999853, 4784409, 4846933, 4837316, 4716681, 4775749, 4690528, 4696762, 4793015, 4682460, 4467805, 4533799, 4492246, 4461082, 4339331, 4382666, 4354778, 4307226, 4348160, 4380692, 4379010, 4360979, 4311884, 4438818, 4419337, 4445933, 4447136, 4524070, 4505481, 4438572, 4644414, 4613802, 4605697, 4668639, 4737567, 4707387, 4732415, 4889305, 5023342, 5173070, 5255463, 5416919, 5705140]
2763E705140J46089J74692J10050N3523p4711j7118Q9254j10683K5720J30343
2753F232299Q2405K24508R5574J70174m3829o9876p5561J44041J30976M7825L28565
2742G267101J90550K22962K76401L10911L94621M20834K71769Q3050R5810P6382
2732I610391o516K35514K27854K17854L42286M51594M81514K34497M9144Q9189
2722A1933321o5852Q3324J33745M9261O8237J60291J54394L41044K55736K89528
2712A3403029M22623L09389M74261M45572M23888N24108O73903N57016O54475
2703A7888264N51944M73521L41848J4053l82559o04405n38964m21051m04128j80943
2693A6737580j09211J51106J57722P4733K93274L89795L32621L28491L62138L30081
$$ y = [5705140, 5851229, 6025921, 6135971, 6189494, 6114783, 6097665, 6186919, 6076236, 6101956, 6232299, 6314704, 6539212, 6634786, 6804960, 6761131, 6691255, 6615694, 6759735, 6890711, 6938536, 7267101, 7457651, 7680613, 7957014, 8267925, 8662546, 9083380, 9355149, 9438199, 9534009, 9610391, 9603875, 9839389, 10067243, 10285097, 10627383, 11078977, 11560491, 11794988, 11844132, 11933321, 11867469, 11950793, 12084538, 12133799, 12202036, 12362327, 12516721, 12857765, 13113501, 13403029, 13825652, 14135041, 14609302, 15054874, 15478762, 16002870, 16676773, 17233789, 17888264, 18440208, 18913729, 19255577, 19269630, 18887071, 18282666, 17743702, 17322651, 16918523, 16737580, 16628369, 16779475, 16937197, 17011930, 17305204, 17694999, 18027620, 18356111, 18718249, 19048330]
2683A9048330J94563J35917J04668k26864l17006l29082m64418n63965n88831
2674A6993312m59507m88105m20908k26876K4479q831j2727M9245K02483M00051
2664A6052616L00019L07123k27950o85395q43296r34246r67013q15536p01810
2655A1484512o72644o20750m95751n16106m63916m33295l37229k45662l78800
2646G320359k66667k41092j90113k28670j43896k16518k57512k09127j43772k81369
2636E141623j52660k13615j49389m2666j38342k40157j41649k6209k36750k02843
2626C597343m2699O3264j30907j51127j61105K3015m9436q8826q1368j2401o1455
2615B904298j98169K526N8718l1108j09801R859n4856j09768j07239j01596j4679
$$ y = [19048330, 19242893, 19378810, 19483478, 19256614, 18939608, 18610526, 18146108, 17582143, 16993312, 16533805, 16045700, 15624792, 15397916, 15422395, 15413564, 15400837, 15450082, 15652565, 16052616, 16352635, 16659758, 16431808, 15746413, 14903117, 13968871, 13001858, 12186322, 11484512, 10811868, 10191118, 9695367, 9179261, 8715345, 8282050, 7944821, 7699159, 7320359, 7053692, 6812600, 6622487, 6393817, 6249921, 6033403, 5775891, 5566764, 5422992, 5141623, 4988963, 4775348, 4625959, 4583293, 4444951, 4204794, 4063145, 4036936, 3800186, 3597343, 3554644, 3617908, 3487001, 3335874, 3174769, 3197784, 3148348, 3059522, 2978154, 2965753, 2904298, 2706129, 2708655, 2767373, 2736265, 2626464, 2636323, 2581467, 2471699, 2364460, 2262864, 2248185]
2604B248185l2670J6886o2838j45545l5869p2455q880Q5232j34127p2729j16360
2593A668830q1226R6453j56336m4400O0626J6119l7249j8529N3032k1958q9047
2582A446315q2103o2191l7874m4447m6669k7009k8252N6601l0483n885K1369j27765
2570A031607n0745J1759M4766k2364r1437N6810m3075m1926j7200K6018p1497
2559H32716Q9573q4039q0103j3688O6642O794l4343K3421m4720k0738q8197L1629
2547F84947M4041O9483p6935J996k9966l9052P7229n4595n5436k6514j1522L6070
2535F19746O8473j49353m4266J9881L2483J8119m3299j01467J25067L1546n8780
2524E18150P8968L1959M7j37742J5456j2306l0618M9120K9795j04616j7808L5538
$$ y = [2248185, 2215515, 2232401, 2169563, 2024018, 1988149, 1915694, 1906814, 1992046, 1857919, 1785190, 1668830, 1587604, 1684057, 1527721, 1483321, 1543947, 1560066, 1522817, 1504288, 1557320, 1535362, 1446315, 1364212, 1302021, 1264147, 1219700, 1173031, 1146022, 1117770, 1174371, 1143888, 1138003, 1159372, 1031607, 980862, 992621, 1037387, 1015023, 923586, 980396, 937321, 895395, 878195, 904213, 832716, 922289, 838250, 758147, 744459, 811101, 817895, 783552, 806973, 762253, 741515, 653318, 684947, 728988, 798471, 721536, 723532, 693566, 654514, 731743, 677148, 621712, 595198, 583676, 619746, 688219, 538866, 494600, 514481, 546964, 565083, 521784, 420317, 545384, 576930, 518150, 597118, 629077, 629124, 491382, 506838, 494532, 463914, 513034, 542829, 438213, 420405, 455943]
2512D55943N3928J8079r1675l1098J2287j24543O6710R077J37814L7153p7153
2501D66522M6813o9667j1358J00127j8035l9657k3872n8531K3561J0204l0249
2490C95858L1218m062N8890m9445n1557N121j01225P5096Q1605q4918l483k4205
2478C28893n7887L6999p116o8608J12508K0404j09403J12005O316p6752n5091
2467B42268N6022M6325J2221j4211Q182j18418J3907J0500o57Q125k4113L1830
2455B71981l1211m7074M7562j8888J01171O750m2424J4242j24691R3582J4398
2444B85398r9572l503N0961M4614q7050m581k4053l0418k6342O4452N0228L528
2432B23662j08770r638R3212m7063O6049M0398j6818k5563J9392j9950j20684
$$ y = [455943, 509871, 527950, 436275, 405177, 417464, 292921, 359631, 368708, 506522, 543675, 466522, 513335, 443668, 432310, 532437, 514402, 474745, 450873, 392342, 415903, 426107, 395858, 427076, 423014, 481904, 432459, 380902, 386023, 284798, 359894, 441499, 356581, 353098, 328893, 271006, 308005, 300889, 232281, 344789, 365193, 255790, 367795, 374111, 297359, 242268, 298290, 344615, 356836, 342625, 350807, 232389, 246296, 256796, 256139, 264264, 240151, 271981, 240770, 193696, 241258, 222370, 323541, 330291, 287867, 302109, 177418, 271000, 285398, 185826, 182323, 233284, 277898, 190848, 186267, 162214, 131796, 105454, 169906, 220134, 223662, 114892, 105254, 198466, 151403, 217452, 257850, 241032, 215469, 234861, 214911, 94227]
2421I4227N5544O1321j5575o5345j695J3598n0987J05720k507L4399j46113J4944
2409I7531Q8556k6863N191N5354N9639o7327q5729j0787n0088J24139n7782M7303
2397A79137N525k0356l1339m2195m0455j4631O4945K3567j40874J44050k5602
2386A01772p828J4042j20792N0621M5987J03814p011n8228j01233O7386O3716
2375A52246m4261q2116m5853N8073R0157l9965K4410m7456j8358P053M7842j367
2363A00405M0740k2053q7976J07993k5161m1912K7008P5553j04494o958J3831
2352G6976k5542p9750N8468p0796l2064J79720l3219n793J6277k2703j5269Q506
2340E4811m5968M2531k9398j0071j7128L2547k7287k2692j07317R9702j9485J62761
$$ y = [94227, 149771, 211092, 195517, 130172, 128477, 142075, 91088, 196808, 194301, 228700, 82587, 97531, 186087, 159224, 164415, 219769, 279408, 212081, 126352, 115565, 65477, 189616, 131834, 179137, 184662, 164306, 132967, 90772, 50317, 35686, 100631, 124198, -16676, 127374, 101772, 93944, 107986, -12806, 37815, 83802, 187616, 180605, 122377, 21144, 88530, 152246, 107985, 25869, -19984, 38089, 128246, 88281, 112691, 65235, 46877, 53930, 101772, 100405, 141145, 119092, 31116, 139109, 113948, 72036, 99044, 174597, 70103, 63145, 76976, 51434, -28316, 30152, -40644, -72708, 107012, 73793, 68000, 84277, 61574, 46305, 54811, 8843, 51374, 21976, 11905, -5223, 27324, 37, -22655, -129972, -30270, -49755, 113006]
2328A13006j06424J9763k6110m694j9551Q5637k9754N4182O3187j13015n0429
2317a4202j3790R6242j0379r783m0406L7668k3157K8339n4220L3756J00663p5010
2305E5721p8590J10415J3645l2386M7254p4381P043p7237P2597N3834r5310p6964
2293g4359J11379K9639N435N3739r3752r3198O1916K6311j6451J50011j67665
2282f995J15406j74218J8030Q585m2298M6148j9044l347J7152O4294l8210m1123
2270e5620J4470k8805L0835m817N743M4625m1220J9994j263J8463l4913o9452
2258a01960j3412M3684M0001o481j236J31056J823n8371j61582L1565K4853J48342
2246G8282k6652j01139N9713q9623N4733q448m3148R5224k3377o8817K4257q5241
$$ y = [113006, 6582, 26345, 235, -4459, -24010, 61627, 31873, 86055, 149242, 36227, -14202, -27992, 68250, 57871, 48088, 7682, 45350, 22193, 50532, -3688, 30068, 130731, 55721, -22869, 87546, 101191, 68805, 116059, 41678, 48721, -28516, 44081, 97915, 2605, -74359, 37020, 66659, 72094, 125833, 32081, -61117, 799, 27110, 10659, 160670, -6995, 108411, -65807, -47777, -39192, -81490, -35342, -54386, -57733, -40581, 23713, -14497, -55620, -41150, -69955, -39120, -43937, -38194, 6431, -34789, -14795, -16058, 2405, -32508, -101960, -115372, -71688, -31687, -38168, -39404, 91652, 93475, 35104, -126478, -94913, -70060, 78282, 51630, -49509, 10204, -79419, -24686, -33134, -76282, 18942, -4435, -73252, -48995, -134236]
2234a34236J08146J2050M2621l0989n7834O3480J05665j83804N7109P7935l1702
2223B8441P1006n3057J3909o9108R186k5569j5185l9057j4431R0377O8379J411
2211F6302q8583j7189L078L6335J16J6730O6178o6659j11171L5397p490J6595
2199e0361L9311n3251Q6379J3014k1699P1684j94018J16825M6842j19811J47272
2188H2187k3228p6960M3771q625P0392j47164O2270N0536j4649L8114J381r0151
2176a2126M8639M3593r852Q2797L623K7286l9167M5252o6660l4273J5366L2400
2164A36878R15M3412O2823m479K4763J31689M4870K8622j17110O2706k6641J18968
2152E07416k4700L8124k3660K5368L4092K7390L8574K6703r112R3213J42001q0476
$$ y = [-134236, -26090, -14040, 28581, -2408, -60242, 3238, 108903, -74901, -17792, 60143, 28441, 99447, 46390, 60299, -8809, 377, -25192, -40377, -79434, -93865, -3488, 64891, 66302, -22281, -39470, -36392, -57, 59, 16789, 82967, 16308, -94863, -59466, -66956, -50361, -11050, -64301, 22078, 35092, 13393, 85077, -108941, 7884, 54726, -65085, 82187, 58959, -18001, 25770, 17145, 87537, -59627, 2643, 53179, 38530, 76644, 78025, -12126, 36513, 80106, 70254, 153051, 156674, 183960, 144793, 190045, 123385, 89112, 104478, 136878, 137793, 181205, 244028, 239549, 264312, 396001, 440871, 469493, 352383, 415089, 388448, 507416, 482716, 520840, 497180, 522548, 556640, 584030, 622604, 649307, 640195, 733408, 875409, 794933]
2140G94933J2132j5389J44581K7836J16587j0733J5659J6773J28747m5124J67032
2129A353034K9112J90360J16747J64791J56944J497J21101Q1280K55800P1870
2119B542536J07028K24224K12929L34810L65323L63119L15012L82895O22584P78347
2109F248807Q69289J192581J486961K058840K819727L527142L301394r13920l621668
2100A6969153l662413k488786j632652j388784r51630q43430n46130m39784l45468
2091D670076k88826m69684l46792m74777k59970k36356k87475j78965k30104j48446
2081A748681l9398q8163q6760j69154n0863r4730k5592j06821q2145m7346P5718
2070A033427p9616j23692M7938q2393o0498j44368J4278K935L4395l5428m4611
$$ y = [794933, 807065, 791676, 936257, 964093, 1080680, 1069947, 1085606, 1102379, 1231126, 1186002, 1353034, 1382146, 1572506, 1689253, 1854044, 2010988, 2012485, 2133586, 2214866, 2470666, 2542536, 2649564, 2873788, 3086717, 3421527, 3786850, 4149969, 4464981, 4847876, 5470460, 6248807, 7118096, 8310677, 9797638, 11856478, 14676205, 18203347, 21504741, 20590821, 16969153, 13306740, 10817954, 9185302, 7796518, 6844888, 6001458, 5455328, 5015544, 4670076, 4381250, 3911566, 3564774, 3089997, 2830027, 2593671, 2306196, 2127231, 1897127, 1748681, 1709283, 1621120, 1534360, 1365206, 1314343, 1219613, 1194021, 1087200, 1005055, 957709, 1033427, 953811, 830119, 878057, 795664, 735166, 590798, 605076, 608011, 642406, 606978, 562367]
2059E62367m7541j5128j9506L3207j19702j01862N4257O0911q074p6120Q616k5003
2047C06422m2193j2643o6507j467N4984l4668l2329m3890K3272J2301J4961M171
2035A82414k4083n0388R5696k3256K1719O5329j15123K216q0106O4559k8741M3580
2023A53816m0956p8465J7836N7023j26505P9983R383n509j6820j6978K2612n7131
2011a711j9284K2123m0498K4296R5164o8250m1475J09314o1615N3639m5552m494
1999B1657p5736P8238q8890p215o1589M9437M7449K0709L04l0665M8045p4357
1987g2613P647L4347L498M1569M4825n6343m4162l0020P0062J0458n477r401p6271
1974h1881J07150l8160o6988J12122j34528l9203O4920O3608r9899k084K8491
$$ y = [562367, 514826, 499698, 480192, 513399, 393697, 291835, 346092, 407003, 398929, 322809, 331425, 306422, 264229, 251586, 185079, 183612, 238596, 203928, 171599, 127709, 150981, 163282, 178243, 182414, 158331, 107943, 203639, 180383, 202102, 267431, 152308, 154524, 74418, 138977, 110236, 153816, 112860, 34395, 52231, 109254, -17251, 62732, 72115, 66606, 49786, 32808, 55420, -1711, -20995, 1128, -39370, -15074, 80090, 11840, -29635, 79679, 18064, 71703, 26151, 21657, -54079, 24159, -64731, -71946, -133535, -84098, -36649, -15940, -15636, -46301, 1744, -72613, -64966, -30619, -27121, 14448, 59273, 2930, -41232, -71252, -1190, 9268, 3791, -5610, -81881, 25269, -12891, -79879, 32243, -102285, -141488, -76568, -12960, -112859, -114943, -86452]
1963h6452L0202m045j0828N0739m873o6709O5155q3878m9437J19492r4506J0978
1951a24162O2017m8051M5275N589n1876q249j5327P270L4849O2766o0080n8575
1939a48554L2576l6744J2346k2954Q3023j1764L3629J9972j7684J5574k2305r5390
1927a58275l0645R213Q2222N6482L4189p3257N2007n4926l0057L212L5525M2646
1915c1664p7978O9853P6600J2172j20747l6989L5066O7854j22402j17719O9372
1904a76582Q1518l8742Q551R5150M4358K4137K6429n6957o4881J6220m3071L5894
1892d7976p5256L1247K0451O9865m7580n4527o338k7668L1958J7342p010m3202
1880a38694P9694L5348j4197n6186M9025k1398J6440o0692J9105L9785j32123
$$ y = [-86452, -56250, -60295, -71123, -20384, -25257, -91966, -26811, -110689, -160126, -40634, -135140, -124162, -62145, -110196, -64921, -59332, -111208, -119457, -134784, -127514, -92665, -29899, -89979, -148554, -115978, -152722, -140376, -163330, -80307, -92071, -58442, -38470, -56154, -40580, -62885, -158275, -188920, -179707, -97485, -41003, -6814, -80071, -28064, -82990, -113047, -109835, -74310, -31664, -109642, -39789, 36811, 48983, -71764, -108753, -73687, -5833, -128235, -245954, -176582, -95064, -133806, -125255, -30105, 14253, 38390, 64819, 7862, -57019, -40799, -83870, -47976, -123232, -91985, -71534, -1669, -49249, -103776, -110114, -137782, -105824, -88482, -95492, -138694, -59000, -23652, -37849, -94035, -45010, -66408, -49968, -110660, -91555, -51770, -183893]
1869a83893Q6763m9667l795N1775o0252M59O830R469L0991J5880L3148l7282L4101
1856f5473L5799k1948R379n0504n2856M2769L5816M6356n7103l5821J05082j53204
1844a61708l2156O8993k7232K9743Q34L9917o6479l2926k4139O4983j2090J03902
1832d8358j71047R1114N7832p2338M6148o775N474R8902m0188r3136O8600r3303
1820a57075l5309n31K2278p200P8852K9581N4944p3507l5140j3214K6296k9646
1808a39671J3401M3885L4231M4986n0061k910L003k7209R290q396r329P8398N922
1795d460o7730N2977q3704j2457k372n843j9779P9235N7585J8806j98783J01174
1783h5351M0n3753N5403j0827L2496N778j6731M4261L737l3057j259K4413l0118
$$ y = [-183893, -97130, -146797, -150592, -98817, -159069, -158610, -151780, -142311, -111320, -95440, -62292, -99574, -65473, -29674, -51622, -42243, -92747, -145603, -102834, -67018, -20662, -77765, -113586, -8504, -161708, -193864, -124871, -152103, -122360, -121526, -81609, -148088, -181014, -205153, -140170, -152260, -48358, -219405, -128291, -70459, -142797, -96649, -103424, -97950, 952, -39236, -132372, -63772, -157075, -192384, -192915, -170637, -177837, -98985, -69404, -14460, -87967, -123107, -136321, -110025, -139671, -126270, -82385, -48154, -3168, -53229, -56139, -53136, -80345, -71055, -79451, -88780, -10382, -4460, -72190, -19213, -102917, -115374, -117746, -123589, -143368, -64133, -6548, 12258, -186525, -85351, -85311, -139064, -83661, -94488, -61992, -56214, -72945, -28684, -24947, -58004, -59263, -34850, -64968]
1770f4968l6966l041m6733n8236K9444O1534r5349Q0661P5215p0369j4186k457
1758a45451J01008K7203n7792l9398o7519j05549J02740L4306O6497L6022K9104
1747a8829m6455q604m9820M8067n0908M5138o6520o2078J29213j5544p6055k6584
1735a98979P3560O0457m9680n0038N5878K6762Q5931o87o1520r691Q2322o8387
1723e4072K577l8305l6377P4158j01850N109N7120o3078P3105P7057o6916j9284
1711i0756m527m8785J66231K3k6672k6250M4643j30875K0363o4217J5328N4605
1699i0889N0201M0968k4523k2836m2705j2481j1748k6318l3954k8723J16936l8885
1687a24957m6323M4525k4701O8192O3577j29634J5548r2640O6888M8281Q1424
$$ y = [-64968, -101934, -104975, -151708, -209944, -180500, -118966, -214315, -133654, -58439, -128808, -142994, -145451, -44443, -17240, -75032, -114430, -181949, -287498, -184758, -150452, -83955, -47933, -18829, -65284, -73888, -123708, -75641, -126549, -81411, -147931, -210009, -80796, -96340, -172395, -198979, -125419, -64962, -114642, -164680, -108802, -82040, 3891, 3204, -58316, -68007, 14315, -54072, -51495, -89800, -126177, -52019, -153869, -148760, -91640, -154718, -81613, -4556, -71472, -90756, -95283, -144068, 22163, 22186, -4486, -30736, 13907, -116968, -96605, -160822, -145494, -90889, -40688, 280, -24243, -47079, -89784, -102265, -114013, -140331, -174285, -203008, -86072, -124957, -171280, -126755, -151456, -83264, -19687, -149321, -133773, -226413, -159525, -111244, -29820]
1676b9820R9196j60857l4078j4962K1381J06982m0368K5757m9919k8334O5282
1665c9740L7016n5215q0502p307O2627K102k3653M9379p2796P4753k2560m9467
1653a25363o4866J1900P4625n0827Q954m9140L226N8237M1253l7439j0172J6341
1641a23271J836L2994l1182r1090J7510J40588k9281k1517O031J1625n7302q907
1629a51966Q0101J7963J2953r5326N9314k540J0593L8976m0681n494q2075J05799
1617e2383j8466p1405o654Q1972k9592J9469q960J0698J498l9621J7816M2609
1605e3019L1651J8420R71k1396k2621K4427n3394O6865p7021n4195j0255P5683
1593g3884O9832k5631J3223o6527J4480j8886l3847j2655Q4751l020K5738l8616
$$ y = [-29820, 69376, -91481, -125559, -140521, -119140, -12158, -52526, -26769, -76688, -105022, -39740, -2724, -57939, -138441, -145748, -83121, -81019, -104672, -55293, -128089, -53336, -75896, -125363, -190229, -178329, -103704, -154531, -145577, -194717, -191491, -133254, -92001, -129440, -139612, -123271, -121435, -88441, -119623, -210713, -193203, -52615, -81896, -103413, -97382, -85757, -143059, -151966, -71865, -53902, -40949, -136275, -76961, -79501, -68908, -29932, -70613, -76107, -158182, -52383, -70849, -142254, -148908, -66936, -96528, -77059, -86019, -75321, -73823, -113444, -95628, -53019, -21368, -2948, -1977, -23373, -45994, -21567, -74961, -8096, -85117, -139312, -149567, -73884, -4052, -29683, -16460, -82987, -68507, -87393, -121240, -133895, -49144, -52164, -26426, -65042]
1581f5042j31761P0870q866J05208N6211k6048J8216j5021n6456J309r7552P206
1569a41726K7981Q900N7384j842j11126p5346J43011m0292J2423N548N1546l6260
1557i9799M7512N9054k5611j08800K9578k7099l8483K038J3462j0052K7382K3582
1545a07236p9414N8974L3822k2698l8344M5410J2691L0259p5977J33183n7910
1534f7240q438O4636o2878n8182R1897r845r1727Q8911K1901M6455r9794M1717
1522d2587K4728j46007j1065N8998N9659k8081k6512P3985L0410m9437N433j8829
1510f9305L5154r7800O0633J1585L8420M4573J4050j47073m592M9504J7136N4169
1498F454q6781K3417j09525K3092K2622P1024p8615O6807l4962J3615N5394j5625
$$ y = [-65042, -196803, -125933, -134799, -29591, 26620, 572, 18788, 3767, -52689, -51380, -148932, -141726, -113745, -104845, -47461, -49303, -160429, -235775, -92764, -133056, -120633, -115085, -63539, -99799, -52287, 6767, -18844, -127644, -98066, -125165, -163648, -161610, -148148, -158200, -130818, -107236, -186650, -127676, -93854, -116552, -154896, -109486, -96795, -66536, -142513, -9330, -67240, -75678, -11042, -73920, -132102, -40205, -50050, -141777, -52866, -30965, 15490, -84304, -42587, -17859, -163866, -174931, -115933, -56274, -84355, -110867, -36882, -6472, -55909, -50476, -69305, -34151, -131951, -71318, -59733, -21313, 23260, 37310, -109763, -114355, -64851, -47715, 6454, -80327, -56910, -166435, -143343, -120721, -49697, -128312, -61505, -96467, -82852, -27458, -43083]
1486d3083l028N402L2O1952r040L7627L3786j45327j05K7833l2160O6011j06712
1473a06812J12915O06n4870Q6545j46286j05117O0567N1480k9499L3540m3833
1462a40764Q2054L5630n5819J7268L4139N6274j37114k1993l1293O5704J20032
1451B4118n818Q295j09817K4584K9726m3900r001N3092p7555p7688N5343Q630
1439a19991J3575L1757r8948P9454J0276P0156m9040K3508R474N0358L3535p3788
1427a9674k7478j18777M5279q445J338O1348k2627K6166j8662m0959J29652o273
1415H88j13718L1198m844P412k3721N227M3751O7944j4311o1927j9531J1537j8155
1402h8250N9722n7464j18799J07476l352p6642Q7376Q1102p2852m9114j03688
$$ y = [-43083, -46111, -40709, -40677, 21275, 12235, 49862, 83648, -61679, -61784, -33951, -66111, -100, -106812, 6103, 6709, -48161, 38384, -107902, -213019, -152452, -100972, -130471, -96931, -140764, -58710, -23080, -78899, -61631, -27492, 28782, -108332, -130325, -161618, -95914, 24118, 18300, 26595, -83222, -58638, -28912, -72812, -81813, -28721, -106276, -183964, -128621, -119991, -106416, -74659, -173607, -94153, -83877, -13721, -62761, -39253, -29779, 20579, 54114, -19674, -47152, -165929, -120650, -129095, -127757, -66409, -89036, -62870, -81532, -122491, 7161, 888, -112830, -81632, -86476, -79064, -102785, -97558, -53807, 14137, -174, -62101, -81632, -70095, -88250, -28528, -85992, -204791, -97315, -100667, -177309, -89933, -8831, -81683, -130797, -234485]
1391b34485L3042N6683J19628j0986n2707M7076Q5665r4684j6655m9216J5964
1380a00675Q529L8826p0291R5392M037q5962N9828L1663m0052L3512J8875j10952
1368a17270O8474l8505K70J813J5231Q0429r8303R9335j4785q9717K8672j4113
1356g8469o357J7613m6476J00626k7847m9115O390Q2448M2247j0026M718o2369
1344b6617j5222R473M1171m403j35949Q6310J9462q0032k4392Q1742j0622n5685
1332a14764J43599q5962K0462o5361M0265O6961o073q8952N7160l8042k7795m711
1320a03213L8084m0482R4712m0258r4742K7048N7468M7457M4898j14198l4713
1309a17939k2426L1461N7694J00803o6452l3462L8722J4078m0254K8465r4944
$$ y = [-234485, -201443, -144760, -25132, -36118, -88825, -41749, 43916, -50768, -67423, -116639, -100675, -92146, -53320, -123611, -28219, -24182, -110144, -50316, -18653, -58705, -25193, -6318, -117270, -48796, -87301, -87031, -85218, -69987, 10442, -87861, 11474, -3311, -93028, -64356, -78469, -84826, -67213, -113689, -13063, -40910, -90025, -83635, -1187, 41060, 31034, 35752, -26617, -41839, -32366, 8805, 4402, -131547, -45237, -25775, -105807, -130199, -48457, -59079, -114764, 28835, -57127, -36665, -102026, -61761, 5200, -873, -89825, -32665, -70707, -98502, -103213, -65129, -105611, -10899, -51157, -145899, -118851, -61383, -13926, 30972, -83226, -117939, -140365, -108904, -51210, 49593, -16859, -50321, -11599, 2479, -37775, -9310, -104254]
1298a04254o0991J43295L7936m5553j3101n5744O8809k6972o797J06665o2574
1287a9281M353n937n2727J59401q1651K3103J4630j12979J2067M0640n2938n5148
1275a26467J60823m7689p6425N0769J4657l0690J05114N0225j00347l1305Q762
1264b2573j06491P1628P9569m7594j1973j00577J20720n7659j29240J61711M8239
1253E760K2017j64128K3397M2129N6068L6113j26050k2517J12706p360K3323j7644
1241a6186Q851r3367Q358N8411l7861J4368q584j186O0039M933k1006K2071q2099
1228h3258M3470N6725j19537j2431N8689j05927N4580J94405j23857j02989J8069
1217a22061N8005m0979Q1573k7405J4978p7318j1280J63775j05362K6981o6270
$$ y = [-104254, -165245, -21950, 15986, -29567, -42668, -98412, -29603, -56575, -63372, 43293, -19281, -14928, -20865, -73592, 85809, 4158, 27261, 41891, -71088, -59021, -18381, -71319, -126467, 34356, -13333, -89758, -38989, -24332, -55022, 50092, 100317, -30, -31335, -22573, -129064, -57436, 22133, -25461, -37434, -138011, -17291, -74950, -204190, -42479, 5760, 27777, -136351, -112954, -70825, -14757, 21356, -104694, -127211, -14505, -21865, 1458, -16186, -7335, -100702, -92344, -33933, -71794, -57426, -66010, -67196, -7157, -2224, -23230, -1159, -83258, -39788, 16937, -102600, -115031, -56342, -162269, -107689, 86716, -37141, -140130, -122061, -64056, -105035, -23462, -50867, -35889, -113207, -124487, 39288, -66074, -39093, -105363]
1206a05363o66J00570n363N2637p7379l9148L0885J17215j04680k7961q882j23264
1194a91399N4798P2073o7439Q8584O8069p3682O784K3768k3388l3512L5191M4693
1182D540p5496N6083K2965j5532K0245k6850j15238p369M0142Q7109K0944o2377
1170e0834j719M6098L4133o445k1264j6578m0229L5629Q6530L6953p3102p121
1158B2051j7142r4796p357J3929L9949k2426L1294M5897n477J6520j3448r4312
1146h5318P2296L6180K5034m4054l7599m87L474p3775P8304j4241q5837J35209
1134I186M6265n8659m5193K6493J4219m3839l7362O2489L3058k6250m9636M5870
1122b3359L5279j28210J00304o4153l2196J31023N171k4645n8080q9899O2598
$$ y = [-105363, -106029, -5459, -10822, 41815, -35564, -74712, -43827, 73388, -31292, -59253, -68135, -191399, -136601, -64528, -131967, -43383, 24686, -48996, -42212, -18444, -41832, -75344, -40153, 4540, -70956, -14873, 8092, -7440, 12805, -14045, -129283, -136652, -96510, -9401, 11543, -50834, -52553, -6455, 27678, 21233, -31, -16609, -56838, -21209, 65321, 102274, 29172, 22051, 4909, -89887, -97244, -83315, -43366, -65792, -34498, 11399, 5922, 22442, 8994, -85318, -13022, 23158, 48192, 4138, -33461, -33948, -30474, -104249, -25945, -40186, -126023, 9186, 55451, -3208, -48401, -21908, -7689, -51528, -88890, -26401, 6657, -19593, -69229, -23359, 11920, -116290, -15986, -80139, -112335, 18688, 23859, -786, -58866, -148765, -86167]
1111h6167P8052L3471L3613J0734n922j04832O984L8829l1786Q2395l4947o1715
1099d1291O9870q0567K567O6710L2314j5861p5965N3796q1218J20430m4670j03537
1087i7422L5477N4680o5481L1577p1173K3148N8040P7172l069j06489k0186O3991
1075a9735P539N2957j4988k9736o0177K5758n8250k2835M1339M1766Q3019N6867
1063A03524k8689n5873j0428m4369p9070k662L8587R5141p8117r613L0101J12638
1051G1170k5783o5699P4549p9356J3433J8894L1229j26846J48166n5772K7511
1040C1496m0026K657J22986n5592l3959k0325K8704j9601m4843J8638L4027M0846
1028F5008m9164L1320j00178K5012m7507J0009K6613k4630J8025j2693l0274L9909
$$ y = [-86167, -8115, 25356, 58969, 69703, 63781, -41051, -34067, 4762, -27024, 55371, 20424, -41291, 28579, -51988, -49421, 17289, 49603, 33742, -42223, 11573, -69645, 50785, 6115, -97422, -61945, -7265, -72746, -41169, -112342, -89194, -31154, 46018, 42949, -63540, -83726, -19735, -12196, 40761, 25773, -3963, -64140, -38382, -96632, -119467, -78128, -36362, 46657, 103524, 74835, 18962, 8534, -35835, -114905, -117567, -78980, 16161, -61956, -71569, -41468, 71170, 45387, -20312, 54237, -25119, -11686, 7208, 38437, -88409, 59757, 3985, 31496, -8530, -5873, 117113, 61521, 27562, 7237, 35941, 16340, -28503, -9865, 24162, 65008, 15844, 47164, -53014, -28002, -75509, -65500, -38887, -63517, -45492, -58185, -88459, -48550]
1016d8550L0644L2127q6692N0279q1932J0920J32508p7672K105J7294L9927l475
1004A7483j0429n3939p372O9476M9407J6945q6564K2616K6671J13002Q968j38066
992B8198n7500L96M9488r2019J5487J2565l1597O1993r9256L6295o313j9373j2062
979a13698k499K4586K5150l567N8538q952L4447O162M209m5790j8757K459n8624
966i6336N7047K8787n288q394n0056L2765J3278M7133P9518j49623Q1351N9571
954H9753m6588K6237n517O277k4263q4274O5174R8883k8124p5897m716L20k5095
941g830l0759K3056J1681R2218k5765j4201n9415J27923j1166p9025M6667m0747
929C2637J09052L2003o0883n4003O5334p5933M7238K2259j7759k184p721n7168
$$ y = [-48550, -17906, 14221, -72471, -22192, -104124, -93204, 39304, -38368, -36263, -18969, 20958, 17483, 7054, -46885, -54257, 15219, 64626, 81571, -4993, 17623, 44294, 157296, 166264, 28198, -29302, -28906, 20582, -71437, -55950, -43385, -74982, -12989, -112245, -75950, -82263, -101636, -113698, -116197, -91611, -66461, -70028, -11490, -20442, 14005, 20167, 24376, -21414, -40171, -37712, -96336, -39289, -10502, -15790, -24184, -74240, -41475, -28197, 18936, 98454, -51169, 30182, 89753, 43165, 69402, 63885, 70162, 45899, -38375, 26799, 125682, 97558, 21661, 16945, 17265, -7830, -38589, -15533, -3852, 88366, 62601, 48400, -11015, 116908, 105742, 26717, 73384, 32637, 141689, 173692, 112809, 58806, 124140, 48207, 95445, 117704, 99945, 97761, 90040, 32872]
917C2872J1681K1230l6460M2069L9981K6838q5361j14202N4067J8509M2012P3769
905A27005o9332k2221o2802R9449M0411r6054n0613J38542k053n6644J0870O9139
893A25697n8388n6326J0071k057J01692K2288p7926J1592J6454q7526l5343N0061
881B0289J2970n8637p972K5519L8057l6954K880P5120k6568q0742q0924J71251
869E4289k4428p9403j5668m4177n5003J4221J27344k0293M7000M3960j23096P5912
857F58P4662m2657j8897m0434l157P6552j22514P8230M8026l7616o3981J06025
845E4897j33169N2438k625K3668J2425j3842J37143j42164Q2591l4714n2110K1976
833F514K0512L409Q9990m4462q0200O494M2743R832J5274o0822O386R3552m4999
$$ y = [32872, 44553, 65783, 29323, 71392, 111373, 138211, 52850, -61352, -7285, 11224, 53236, 127005, 57673, 35452, -27350, 72099, 112510, 16456, -34157, 104385, 102332, 45688, 56558, 125697, 67309, 10983, 21054, 18997, 120689, 142977, 65051, 76643, 93097, 5571, -29772, 20289, 33259, -25378, -33350, -7831, 30226, -6728, -3848, 71272, 44704, -36038, -116962, 54289, 29861, -49542, -65210, -109387, -164390, -150169, -22825, -43118, 3882, 47842, -75254, 658, 75320, 32663, 13766, -26668, -29825, 46727, -75787, 2443, 50469, 12853, -51128, 54897, -78272, -25834, -28459, -4791, 7634, -6208, 130935, -11229, 71362, 36648, -15462, 6514, 27026, 30435, 120425, 75963, -4237, 2257, 45000, 54832, 70106, 9284, 15670, 109222, 64223]
820F4223K5671n3366j9777o4194J09862M598n1401k968k4771M3796J0779J6405
808E8857j4451j08044j2454L9683N251l3364O9890k7293p6038N1129K7105O7859
796D8130j7429O4773o9376k562P764R1695j11921N0275K3587K7037k7103M548
784H9418L5285l6904l3210l2344n4665P3880o841M1552L5722j6529j06674P1903
772F0593K084r535l1078O3189l0970R6078j28843q5413m7886J06065M0679q0762
760d5799l4603J17860O5146n467j09738p6253Q1132M9772r335j30803Q2424Q9053
748G3389J1631j0687k9661K8000K2071j13474K0959L9520o7586q225L5134M4053
736D5124N7830q7810K7367n639p3594q823J16602O5533k5620j60557J27302m1661
$$ y = [64223, 89894, 36528, 16751, -47443, 62419, 67017, 15616, 12648, -12123, 31673, 42452, 58857, 44406, -63638, -76092, -36409, -31158, -64522, 5368, -21925, -97963, -46834, -19729, 48130, 30701, 95474, 26098, 23536, 31300, 122995, 11074, 61349, 84936, 111973, 84870, 89418, 124703, 87799, 54589, 22245, -32420, 41460, 34619, 76171, 111893, 95364, -11310, 60593, 62677, 53142, 22064, 85253, 54283, 150361, 21518, -63895, -111781, -5716, 34963, -45799, -80402, 37458, 102604, 97137, -12601, -88854, -7722, 42050, 32715, -98088, -15664, 73389, 85020, 74333, 44672, 72672, 94743, -18731, 2228, 41748, -25838, -34063, 1071, 45124, 102954, 15144, 42511, 36872, -36722, -45545, 71057, 136590, 110970, -49587, 77715, 36054]
724C6054N2468n5679J0078l0127k3882l3346Q0297R2549J8774m1303m1141j19367
712e4625L611M0842k1590J16290j7815P7999o516o9466n5186N8746M8823O543
700A27656r7467M2109J17888j54701k8848J00598m8503l7019o6080K1120j9718
689d2965K4741P4839o1409J37608j53734O3243M342M2968p9418K9651k2339k3353
677e826K3630j1736L4004M9269k08j01292O8856j8270n184j24344J89242l6468
665F1673M1303Q3518n1649q7078j38965Q6677N8782m350n0973l6567J5756J66907
653A45034o5241J66N5488r9566j0519M0837Q322K676j9713j3132J864L3499p9259
640D56K2600n1055J10249m552o3579j6682M4463N4718k5488M2855p8498L0975
$$ y = [36054, 88522, 32843, 42921, 12794, -11088, -44434, 35863, 128412, 147186, 105883, 64742, -54625, -51014, -10172, -31762, 84528, 66713, 144712, 138196, 68730, 13544, 72290, 121113, 127656, 30189, 72298, 190186, 35485, 6637, 107235, 58732, 21713, -44367, -23247, -42965, -18224, 56615, -4794, 132814, -20920, 42323, 46665, 89633, 10215, 39866, 17527, -5826, 17804, 6068, 40072, 89341, 89133, -12159, 56697, 38427, 33243, -91101, 98141, 61673, 102976, 186494, 134845, 47767, -91198, -4521, 54261, 49911, -1062, -37629, -21873, 145034, 79793, 79959, 135447, 35881, 25362, 66199, 74521, 77197, 57484, 44352, 46216, 79715, 456, 23056, -27999, 82250, 77698, 14119, -2563, 41900, 96618, 71130, 113985, 35487, 66462]
628F6462j3152l8997M6764M7401m7051P1021p7659L4915k5083q5338R6835k3727
616E2391m4932j9899K3836N0982J2388Q5642o5504l9334j8695M4836j6947k3806
604D0958M1254N2950n6097m8705J1448N5256o9883K0026o5220M7123j7136M5504
592E7478O2002n0538p2017l5137Q2826J26005m9837p5212q2755O9548K315K1984
580E6662M8855q1284K186R494O4166L6527o9552j02993Q2081M3477R68r938J05251
567A85900k6442n8947m8275N3224J8961l1027J2113m3306L052k6426Q427l5248
555A2006o0230J4538K1262Q0851p4291k7797J48920K5306k499J2065l4779M63
543A15815n1612k2832j3913O788L9687q0129n053J2030P0308M9620r2801J1488
$$ y = [66462, 53310, 14313, 61077, 108478, 61427, 132448, 54789, 89704, 64621, -20717, 76118, 52391, 7459, -12440, 11396, 62378, 74766, 160408, 94904, 55570, 36875, 81711, 64764, 40958, 82212, 135162, 79065, 30360, 41808, 97064, 27181, 47207, -18013, 29110, 11974, 57478, 119480, 68942, -3075, -38212, 44614, 170619, 120782, 45570, -37185, 32363, 34678, 56662, 105517, 24233, 26419, 35913, 100079, 136606, 67054, -35939, 46142, 89619, 90587, 80649, 185900, 159458, 100511, 52236, 105460, 124421, 93394, 105507, 62201, 65253, 38827, 47254, 12006, -48224, -33686, -12424, 68427, -5864, -33661, 115259, 140565, 138066, 150131, 115352, 115815, 64203, 41371, 27458, 34246, 73933, -6196, -11249, 781, 71089, 120709, 27908, 39396]
531C9396J19737L0640k9147l7555k0893L8709k7333j3847k568o0746j0158N2085
519G8320m714K5587O6789p1543r6732N9457m5975L3785J8416L9021l0349o602
507F5460R2246N2593j78907J04596m3188J8475j1558M1235M1314q5787k2875J00641
495A74245n3383q0960k0923J531J3148j7102K5835n9658J02486l3780J6417K6736
483I4592r0857L1112O2382O3061N1349j26705L4343j10404P118P7254j115J9687
471A11817M6990j25770L3498k2410Q200O726L4553n1372k3767K4208n5776p358
459b0461J3193K2093o885O5012o1356m1656k5384J7971O4812l0136J2906p912
447B197J26803M0383j24267O6836n884m690j6295m4353R111l5129Q635Q7544q5395
$$ y = [39396, 159133, 189773, 160626, 123071, 102178, 140887, 113554, 99707, 97139, 36393, 26235, 78320, 73606, 99193, 165982, 94439, -2293, 57164, 11189, 44974, 63390, 102411, 72062, 65460, 157706, 210299, 31392, 135988, 92800, 111275, 99717, 140952, 182266, 96479, 73604, 174245, 120862, 39902, 18979, 20510, 33658, 16556, 42391, -17267, 85219, 51439, 67856, 94592, 3735, 34847, 97229, 160290, 211639, 84934, 119277, 8873, 15991, 93245, 92130, 111817, 158807, 33037, 66535, 44125, 52325, 59051, 93604, 42232, 18465, 42673, -13103, -20461, -7268, 14825, 7940, 72952, 11596, -30060, -55444, -37473, 27339, -2797, 10109, 2197, 129000, 169383, 45116, 111952, 106068, 101378, 85083, 40730, 49841, 14712, 23347, 110891, 25496]
434B5496n6046N6949J2105m8469O1361O3351N1960J4861q155K1352j40723p374
422D6668L2310Q7243n0771P5977q1996j9075N6280j2656p4851l3601L2815O5787
410A24130o6097n0957J53318n0988M1727j7988l8869M4644M6444q7587J7137N4612
398A69526Q8459k7494j30643K6091Q8468l0699j42487M3050k3337k6189j1796
387B2949R0037P370j14475R2710n3440k253O0172N6710J1660l7645K28M3078p1694
374A05407n889m4803m4512n0950J05441J00538l1631l5860k7813P3349J2362j5953
362A39686o5344J6401J02425k2885M7361r9282r7204Q8325J9142J074K8295L358
350A61352l1260p421J8700K6269p0823P1063j1431r0243Q2781q856q836L0394
$$ y = [25496, -30550, 26399, 38504, -9965, 51396, 114747, 166707, 181568, 173413, 194765, 54042, 46668, 78978, 166221, 115450, 191427, 109431, 90356, 146636, 133980, 59129, 25528, 58343, 124130, 58033, 7076, 160394, 109406, 151133, 133145, 94276, 138920, 185364, 97777, 114914, 169526, 257985, 230491, 99848, 125939, 214407, 183708, 41221, 84271, 60934, 34745, 22949, 112986, 120356, 5881, 98591, 45151, 42898, 103070, 159780, 171440, 133795, 134023, 177101, 105407, 99518, 54715, 10203, -40747, 64694, 165232, 133601, 97741, 69928, 143277, 155639, 139686, 74342, 90743, 193168, 170283, 217644, 118362, 21158, 109483, 128625, 129699, 157994, 161352, 130092, 122671, 141371, 167640, 96817, 167880, 156449, 66206, 148987, 140131, 131295, 161689]
338A61689J4104l9534O412k5505m6339J02972N6932J607n1257j7356j2629L5778
326A86874j5204j5031l8106j73266J13611M3720M5564q9715P8175K8598j437n689
314A58094K462P9669p3229j09764J7735K1997M3730j4906o1717l5763O312L4464
302F9084j06807J29460M7734O8325l30p1838l9046J00948j0438K9307M5314p3818
290A87895m7558k0810k6669j6610l8940O3228r9578Q76O0209N6292j6240j2504
278H9591L5805L2303k1612n5175K9673K8978N811o4513o4819O2051j6496Q105
266F9702L1470N1450P5273j42650l2858N6521P5901o9270m7480M8339j3163k5499
254G7736j6065n6797J21938J05337n5817p7994O1153O3691l6595j12836J2615
$$ y = [161689, 175793, 136259, 142671, 117166, 70827, 173799, 230731, 232338, 181081, 163725, 151096, 186874, 171670, 156639, 118533, -54733, 58878, 102598, 148162, 58447, 136622, 165220, 163783, 158094, 160556, 240225, 166996, 57232, 74967, 96964, 140694, 125788, 64071, 28308, 34620, 69084, -37723, 91737, 139471, 207796, 207466, 135628, 96582, 197530, 187092, 216399, 261713, 187895, 140337, 119527, 92858, 76248, 37308, 100536, 958, 1834, 62043, 118335, 102095, 89591, 125396, 157699, 136087, 80912, 110585, 139563, 145374, 80861, 16042, 78093, 61597, 69702, 101172, 152622, 227895, 85245, 52387, 108908, 184809, 115539, 68059, 116398, 103235, 77736, 61671, 4874, 126812, 232149, 176332, 98338, 159491, 223182, 186587, 73751, 86366]
243H6366j5558J13689K1096p8747l41n6911P8179O716o5970o8510O0299J14565
231A94873K7586j08958l9988O6510m9354j2977J4266M2611r303o0737j0994P0817
219A24352Q8179m1096J16495j22690p9121N5052N333P7952M020j24719r8779O0312
207F5290L5986K2922j8683J9591L1158n4475Q5495k5601m0869J9072n2910j968
195H5008K702P3007o9203J8215O4258k5426J9392l7370L3170j2538r444k205N2501
182A92067j34510R5762m6184M4308Q378j17786J10449l8764j1020N10N0226J7688
170A71124J8683j04490K4040n4947n834N1124O1557l7507M1353o0285N5953M6416
158B07187q1711l2101M1186J5644L6931k4958J472k6344k8614L8827Q270r195
$$ y = [86366, 70808, 184497, 205593, 126846, 126505, 69594, 147773, 154489, 88519, 20009, 80308, 194873, 222459, 113501, 73513, 140023, 90669, 77692, 91958, 134569, 125266, 64529, 53535, 124352, 212531, 171435, 287930, 165240, 86119, 141171, 146504, 224456, 228476, 103757, 4978, 65290, 101276, 124198, 105515, 125106, 156264, 101789, 187284, 161683, 120814, 139886, 86976, 85008, 87710, 160717, 91514, 109729, 173987, 148561, 167953, 130583, 163753, 151215, 141771, 139566, 192067, 57557, 153319, 107135, 151443, 159821, 42035, 152484, 113720, 102700, 103210, 153436, 171124, 189807, 85317, 109357, 54410, 48576, 99700, 161257, 123750, 165103, 104818, 160771, 207187, 125476, 93375, 134561, 150205, 187136, 162178, 163650, 137306, 108692, 147519, 155789, 146594]
146A46594l5808K0846L9444j1109o9866P1435k8189L8300n7278O6634J9183r5401
134A04785J0178K7303o9715l4738J4574J9198L0152j0030q0893J05717j3808k8860
122G3863l3778M9654N4975o626L2254j721M5816l1838o1863k6281R6802K1257
110B12514k7936l303p7641L4115J7560p7164O1604O5929m8299j3481k251K8066
98A69713J8988k7985m3984j3323N2166j43570M9998N3590N6838m5983j19561O7649
86G4536O0493O861O5788p9719k5374M5526L3733o0948L86r309M6885o5942M4247
73A37163N4189n5581j6173K6052P729M3710n4072l7311K3557m508K8945L2800
61A86500j6160p3240P2684m7027j7418K5602N0633m8899J5069J7196l6283q3560
$$ y = [146594, 110786, 131632, 171076, 159967, 90101, 161536, 133347, 171647, 114369, 181003, 200186, 104785, 114963, 142266, 72551, 37813, 52387, 71585, 101737, 91707, 10814, 116531, 102723, 73863, 40085, 89739, 144714, 138088, 170342, 168621, 214437, 182599, 120736, 94455, 191257, 212514, 184578, 181275, 103634, 137749, 155309, 78145, 139749, 205678, 157379, 143898, 141647, 169713, 188701, 160716, 116732, 103409, 155575, 12005, 62003, 115593, 172431, 126448, 6887, 74536, 135029, 141890, 207678, 127959, 102585, 148111, 181844, 120896, 121282, 111973, 158858, 92916, 137163, 191352, 135771, 119598, 145650, 153379, 197089, 143017, 105706, 129263, 124755, 153700, 186500, 170340, 97100, 169784, 122757, 105339, 130941, 181574, 132675, 147744, 164940, 128657, 45097]
49D5097k1344P3173J0695M1857n1224p0117Q6967J2920L4664j0060k5268K5645
37A53005l6130k6462L1051N3052j04141l4089J6156K6673M0168O4911M806o9623
25A19377J0443p768j8390O3821P011k4757K0188k6200K1591j0355k4731K381k3563
12A09048M382j9062J4020L1775l6246M5487L8499r843J0127j7894l8003K63
0A32553
$$ y = [45097, 23753, 96926, 107621, 149478, 98254, 28137, 115104, 128024, 162688, 152628, 127360, 153005, 116875, 90413, 121464, 174516, 70375, 36286, 52442, 79115, 119283, 184194, 189000, 119377, 129820, 122052, 103662, 167483, 174494, 149737, 169925, 143725, 165316, 154961, 130230, 132611, 109048, 113430, 94368, 108388, 140163, 103917, 149404, 187903, 178060, 188187, 170293, 132290, 132553]
$$ Imaginary data points
##PAGE= N=2
##DATA TABLE= (X++(I..I)), XYDATA
16383b372768M0794L6218K5805L0711N9356p534K2522J3715K1310J04528K6906
16372a998437m9497P5957N6046j4948L6150Q4921P79K0343K6061j4577Q3810K9755
16360a663637K5776K7287O0780N6181k6449O9583P1604m9081N1453j3290L1972
16349a357821O2336J8202R1814J0247R6721N5202p0574J2051L0569M0025M6451
16338i64777P525R369N27J3068J7260J7782J26380M8568k3785O7997J3611k1286
16326f87761M5378J28672O3911k4202O8338p633o3095J19998o4412P4757M9446
$$ y = [-2372768, -2331974, -2295756, -2269951, -2239240, -2179884, -2187418, -2164896, -2151181, -2129871, -2025343, -1998437, -2047934, -1971977, -1915931, -1930879, -1894729, -1809808, -1809029, -1788686, -1762625, -1777202, -1693392, -1663637, -1637861, -1610574, -1549794, -1493613, -1520062, -1450479, -1378875, -1427956, -1376503, -1389793, -1357821, -1295485, -1277283, -1185469, -1175222, -1078501, -1023299, -1093873, -1081822, -1051253, -1011228, -964777, -957252, -947883, -947356, -934288, -917028, -899246, -772866, -724298, -748083, -680086, -666475, -687761, -642383, -513711, -449800, -474002, -405664, -413297, -476392, -356394, -420806, -346049, -296603]
$$ [...]
##END NTUPLES=NMR SPECTRUM
##END=
