##TITLE=1H_EC-3331(2))
 CDCl3
 8 sc, 
 6.9.2024
##JCAMPDX= 6.0         $$ Bruker NMR JCAMP-DX V2.0
##DATA TYPE= NMR SPECTRUM
##DATA CLASS= NTUPLES
##ORIGIN= UXNMR, Bruker Analytische Messtechnik GmbH
##OWNER= root
$$ XWIN-NMR		Version 3.5
$$ Fri Sep  6 14:40:47 2024 Russian Standard Time (UT+4h)  she@DPX200
##.OBSERVE FREQUENCY= 200.1318
##.OBSERVE NUCLEUS= ^1H
##.ACQUISITION MODE= SIMULTANEOUS
##.ACQUISITION SCHEME= undefined
##.AVERAGES= 8
##.DIGITISER RES= 18
##SPECTROMETER/DATA SYSTEM= spect
##.PULSE SEQUENCE= zg30
##.SOLVENT NAME= CDCl3
##.SHIFT REFERENCE= (INTERNAL, CDCl3, 0, 21.0017)
##AUDIT TRAIL= $$ (NUMBER, WHEN, WHO, WHERE, WHAT)
$$ ##TITLE= Audit trail, XWIN-NMR		Version 3.5
$$ ##JCAMPDX= 5.01
$$ ##ORIGIN= Bruker BioSpin GmbH
$$ ##OWNER= she
$$ F:/spectra/data/she/nmr/H-F/1/pdata/1/auditp.txt
$$ ##AUDIT TRAIL=  $$ (NUMBER, WHEN, WHO, WHERE, WHAT)
(   1,<2024-09-06 14:39:24.06 +0400>,<she>,<DPX200>,
      <created by zg, POWCHK disabled, PULCHK disabled
       configuration hash MD5:
       00 E9 B6 7A A2 85 ED C7 34 08 36 98 17 FE 4E 26
       data hash MD5: 16K
       DB F9 B7 E3 2E 82 F6 36 87 86 03 D4 31 7A 8B B9>)
(   2,<2024-09-06 14:39:26.25 +0400>,<she>,<DPX200>,
      <Start of raw data processing
       efp BC_mod = 2 LB = 0.24 FT_mod = 6 PKNL = 1 PHC0 = -26149.64 PHC1 = 9.98748 SI = 16K 
       data hash MD5: 16K
       D1 88 41 AD 8B C6 39 45 2C B2 D3 91 67 5B 44 5E>)
(   3,<2024-09-06 14:39:51.82 +0400>,<she>,<DPX200>,
      <pk PHC0 = -2.82123 PHC1 = 4 
       data hash MD5: 16K
       03 EB 76 15 4D 0D 50 E6 0F 8E 2F 8B E5 08 9F 0C>)
(   4,<2024-09-06 14:39:56.54 +0400>,<she>,<DPX200>,
      <abs ABSG = 5 
       data hash MD5: 16K
       F9 20 21 DC E4 23 BE E5 42 F1 6F 6E F1 21 69 3C>)
$$ ##END=
$$ 
$$ hash MD5
$$ B8 85 7F 19 99 B6 7F 76 B0 05 83 6E A3 08 D3 57
##$RELAX= 
##$RELAX= 
##$RELAX= 
##$RELAX= 
##$RELAX= 
##$RELAX= 
$$ Bruker specific parameters
$$ --------------------------
##$DU= <F:/spectra>
##$EXPNO= 1
##$NAME= <H-F>
##$PROCNO= 1
##$TYPE= <nmr>
##$USER= <she>
##$AMP= (0..31)
100 100 100 100 100 100 100 100 100 100 100 100 100 100 100 100 100 100 
100 100 100 100 100 100 100 100 100 100 100 100 100 100 
##$AQSEQ= 0
##$AQ_mod= 1
##$AUNM= <au_zg>
##$AUTOPOS= <>
##$BF1= 200.13
##$BF2= 200.13
##$BF3= 200.13
##$BF4= 200.13
##$BF5= 200.13
##$BF6= 200.13
##$BF7= 200.13
##$BF8= 200.13
##$BYTORDA= 1
##$CFDGTYP= 0
##$CFRGTYP= 5
##$CHEMSTR= <none>
##$CNST= (0..31)
1 1 145 1 1 1 1 1 1 1 1 1 1 1 1 1 1 1 1 1 1 1 1 1 1 1 1 1 1 1 1 1 
##$CPDPRG= <>
##$CPDPRG1= <>
##$CPDPRG2= <>
##$CPDPRG3= <>
##$CPDPRG4= <mlev>
##$CPDPRG5= <mlev>
##$CPDPRG6= <mlev>
##$CPDPRG7= <mlev>
##$CPDPRG8= <mlev>
##$CPDPRGB= <>
##$CPDPRGT= <>
##$D= (0..31)
0 1.2 0 0 0 0 0 0 0 0.06 0 0.03 0 0 0 0 0.0002 0 0 0 0 0 0 0 0 0 0 0 0 
0 0 0 
##$DATE= 1725619163
##$DBL= (0..7)
120 120 120 120 120 120 120 120 
##$DBP= (0..7)
150 150 150 150 150 150 150 150 
##$DBP07= 0
##$DBPNAM0= <>
##$DBPNAM1= <>
##$DBPNAM2= <>
##$DBPNAM3= <>
##$DBPNAM4= <>
##$DBPNAM5= <>
$$ [...]
##$SUBNAM3= <"">
##$SUBNAM4= <"">
##$SUBNAM5= <"">
##$SUBNAM6= <"">
##$SUBNAM7= <"">
##$SUBNAM8= <"">
##$SUBNAM9= <"">
##$SW= 24.0689170037331
##$SWIBOX= (0..15)
0 0 2 0 0 0 0 0 0 0 0 0 0 0 0 0 
##$SW_h= 4816.95568400771
##$TD= 16384
##$TD0= 1
##$TE= 0
##$TE2= 300
##$TE3= 300
##$TEG= 300
##$TL= (0..7)
0 120 120 120 120 120 120 120 
##$TP= (0..7)
150 150 150 150 150 150 150 150 
##$TP07= 0
##$TPNAME0= <>
##$TPNAME1= <>
##$TPNAME2= <>
##$TPNAME3= <>
##$TPNAME4= <>
##$TPNAME5= <>
##$TPNAME6= <>
##$TPNAME7= <>
##$TPOAL= (0..7)
0.5 0.5 0.5 0.5 0.5 0.5 0.5 0.5 
##$TPOFFS= (0..7)
0 0 0 0 0 0 0 0 
##$TUNHIN= 0
##$TUNHOUT= 0
##$TUNXOUT= 0
##$USERA1= <user>
##$USERA2= <user>
##$USERA3= <user>
##$USERA4= <user>
##$USERA5= <user>
##$V9= 5
##$VALIST= <valist>
##$VCLIST= <CCCCCCCCCCCCCCC>
##$VD= 0
##$VDLIST= <DDDDDDDDDDDDDDD>
##$VPLIST= <PPPPPPPPPPPPPPP>
##$VTLIST= <TTTTTTTTTTTTTTT>
##$WBST= 1024
##$WBSW= 4
##$XGAIN= (0..3)
0 0 0 0 
##$XL= 0
##$YL= 0
##$YMAX_a= 69506
##$YMIN_a= -66698
##$ZGOPTNS= <>
##$ZL1= 120
##$ZL2= 120
##$ZL3= 120
##$ZL4= 120
##$ABSF1= 20.98116
##$ABSF2= -3.087973
##$ABSG= 5
##$ABSL= 3
##$ALPHA= 0
##$AQORDER= 0
##$ASSFAC= 0
##$ASSFACI= 0
##$ASSFACX= 0
##$ASSWID= 0
##$AUNMP= <proc_1d>
##$AZFE= 0.1
##$AZFW= 0.1
##$BCFW= 0
##$BC_mod= 2
##$BYTORDP= 0
##$COROFFS= 0
##$CY= -3
##$DATMOD= 1
##$DC= 0
##$DFILT= <>
##$DTYPP= 0
##$F1P= 0
##$F2P= 0
##$FCOR= 1
##$FTSIZE= 16384
##$FT_mod= 6
##$GAMMA= 0
##$GB= 0
##$INTBC= 1
##$INTSCL= 3.70164e-10
##$ISEN= 128
##$LB= 0.24
##$LEV0= 0
##$LPBIN= 0
##$MAXI= 10000
##$MC2= 0
##$MEAN= 0
##$ME_mod= 0
##$MI= 1.114404
##$NCOEF= 0
##$NC_proc= -8
##$NLEV= 6
##$NOISF1= 3.799351
##$NOISF2= 2.8
##$NSP= 0
##$NTH_PI= 0
##$NZP= 0
##$OFFSET= 21.00173
##$PC= 1
##$PHC0= -26152.46
##$PHC1= 13.98748
##$PH_mod= 1
##$PKNL= yes
##$PPARMOD= 0
##$PSCAL= 0
##$PSIGN= 0
##$REVERSE= no
##$SF= 200.13000540084
##$SI= 16384
##$SIGF1= 3
##$SIGF2= 2
##$SINO= 5.538805
##$SIOLD= 16384
##$SREGLST= <1H.CDCl3>
##$SSB= 0
##$STSI= 16384
##$STSR= 0
##$SW_p= 4816.95568400771
##$SYMM= 0
##$S_DEV= 0
##$TDeff= 16384
##$TDoff= 0
##$TI= <>
##$TILT= no
##$TM1= 0
##$TM2= 0
##$TOPLEV= 0
##$USERP1= <user>
##$USERP2= <user>
##$USERP3= <user>
##$USERP4= <user>
##$USERP5= <user>
##$WDW= 1
##$XDIM= 16384
##$YMAX_p= 424580433
##$YMIN_p= -1403171
$$ End of Bruker specific parameters
$$ ---------------------------------
##NTUPLES= NMR SPECTRUM
##VAR_NAME=  FREQUENCY,     SPECTRUM/REAL,   SPECTRUM/IMAG
##SYMBOL=    X,             R,               I
##VAR_TYPE=  INDEPENDENT,   DEPENDENT,       DEPENDENT
##VAR_FORM=  AFFN,          ASDF,            ASDF
##VAR_DIM=   16384,         16384,           16384
##UNITS=     HZ,            ARBITRARY UNITS, ARBITRARY UNITS
##FACTOR=    0.29402158847633, 1,            1
##FIRST=     4203.07633136445, 0,            0
##LAST=      -613.879352643257, 0,           0
##MIN=       -613.879352643257, -1403171,    0
##MAX=       4203.07633136445, 424580433,    0
$$ Real data points
##PAGE= N=1
##DATA TABLE= (X++(R..R)), XYDATA
$$ [...]
6271B36009K6336j43099k01768o7401j3296J30027J82377p1887q5864k2583Q697
$$ 236009 262345 119246 -82522 -149923 -163219 -33192 149185 77298 -8566 -31149 -22452
6260b2452J88029k1070l1231k15476m5316K0396K740M2144P4553j33626o7071
$$ -22452 165577 144507 113276 -102200 -147516 -127120 -124380 -82236 -7683 -141309 -208380
6249b08380L90716O5861R1517k32857k39205M5318P6780p6887K4325N1337Q4513
$$ -208380 182336 248197 339714 106857 -132348 -87030 -10250 -87137 -62812 -11475 73038
6238G3038J11507R0757k08093j87712J29984L0189O1799l9747j02459M1999O2813
$$ 73038 184545 275302 67209 -120503 9481 39670 101469 61722 -40737 1262 64075
6227F4075k27462J38409J2264K1026O8288k4034M2546K3023j18223K108q4376
$$ 64075 -163387 -24978 -12714 8312 76600 52566 95112 118135 -88 2020 -82356
6216h2356J62192L6720J15237l5188r6861q7274P3919j55779J2256J59673J11401
$$ -82356 79836 116556 231793 196605 99744 12470 86389 -69390 -57134 102539 213940
6205B13940p5658n1799o0145j84638K81131j86518J61071k7246l9575j94525p9353
$$ 213940 138282 86483 26338 -158300 122831 -63687 97384 70138 30563 -163962 -243315
6194b43315J1669K55070M7228m4161r6723Q0677Q986J07999k07138k2922J30877
$$ -243315 -231646 23424 70652 26491 -70232 10445 19431 127430 -79708 -102630 28247
6183B8247j1343j13351m8493o885M7018J49484J59272j06894p7927j10128n9292
$$ 28247 16904 -96447 -144940 -151825 -104807 44677 203949 97055 19128 -91000 -150292
6172a50292K3548k4978j21917K21265N9690M8802j86027K37096K9745j02019n2879
$$ -150292 -126744 -151722 -273639 -52374 7316 56118 -129909 107187 136932 34913 -17966
6161a7966n1372k4491R6856l6862N4655j52713J06879O6006o989l0106j4555J27762
$$ -17966 -69338 -93829 3027 -33835 20820 -131893 -25014 40992 34003 3897 -10658 117104
6149A17104j11164J09249k92697K14436J56349k53618N8156J29296R1055j16852
$$ 117104 5940 115189 -177508 36928 193277 -60341 -2185 127111 218166 101314
6139A01314j12026m9845J14560J85169j06224m6653O7342l7709o1161q3908N8294
$$ 101314 -10712 -60557 54003 239172 132948 86295 153637 115928 54767 -29141 29153
6128B9153Q1819n9811J27781j36921O342m8543j3008N6152R5038P5444m9216j60734
$$ 29153 110972 51161 178942 42021 48363 -180 -13188 42964 138002 213446 164230 3496
6116C496J32687m3751j62439j88004P4328J14709P1980j1044Q5407Q0527j01943
$$ 3496 136183 92432 -70007 -258011 -183683 -68974 3006 -8038 77369 157896 55953
6105E5953r8515Q4025k7077j0518q5656J87310r8254j00262J66945N230r6704
$$ 55953 -42562 41463 14386 3868 -81788 105522 7268 -92994 73951 79181 -17523
6094a7523L4689Q0975J15973j98801k39408K41176J7128j14950J46002j7463j91262
$$ -17523 17166 98141 214114 15313 -224095 17081 34209 -80741 65261 47798 -143464
6083a43464o6630q888k092R2176j5270K8542j33395K17450Q7684j53536j7564
$$ -143464 -210094 -218982 -221074 -128898 -144168 -115626 -249021 -31571 56113 -97423 -114987
6072a14987K00749q4895L1018j19757l3490J56106k35548m1042K01597J2344K550
$$ -114987 85762 867 31885 -87872 -121362 34744 -200804 -241846 -40249 -27905 -25355
6061b5355M6439l5090m4308J34961j91810L9586J59256j22236R3597K5904p9792
$$ -25355 21084 -14006 -58314 76647 -115163 -75577 83679 -38557 55040 80944 1152
6050A152q3003J20479n7013K4810j9771J9359M6474k52211O2592J12133r1738
$$ 1152 -81851 38628 -18385 6425 -13346 6013 52487 -199724 -137132 -24999 -116737
6039a16737p2686J67927j0809L9468j2082L7995n790O5045m5637j71885J12705
$$ -116737 -189423 -21496 -32305 7163 -4919 33076 27286 92331 46694 -125191 -12486
6028a2486j16070J04854M3175j77286j3748M654L5573Q3240n2335Q227j7385K552
$$ -12486 -128556 -23702 19473 -157813 -171561 -166907 -131334 -48094 -100429 -92202 -109587 -107035
6016a07035j3319M9845M3019P8655J39113m3576j89852J30495p1857k92409J16415
$$ -107035 -120354 -70509 -27490 51165 190278 146702 -43150 87345 15488 -276921 -160506
6005a60506j16751R2209O6007p7402M2716J47676n6308K1147O1862j08407J70551
$$ -160506 -277257 -185048 -119041 -196443 -153727 -6051 -62359 -41212 20650 -87757 82794
5994H2794l6832K16557k93745N7272L5733L6678J3943p3560j9298k9851m1176
$$ 82794 45962 262519 -31226 26046 61779 98457 112400 38840 19542 -10309 -51485
5983e1485J83035j72645m7014n5058k01839J23557J57918J4408k3422m4726K3233
$$ -51485 131550 -41095 -88109 -143167 -345006 -221449 -63531 -49123 -72545 -117271 -94038
5972i4038J0469J1739M2030k5397q2087J7430J24315j30392Q2802j35900r5314
$$ -94038 -83569 -71830 -29800 -55197 -137284 -119854 4461 -125931 -43129 -179029 -274343
5961b74343J38358J16065k9853j45344J7708J60078n3243l0172J76819j86855
$$ -274343 -135985 -19920 -49773 -195117 -177409 -17331 -70574 -100746 76073 -110782
5951a10782M6668o7835J9083J41965L9781j10905m2468J50826j00860J9980j333
$$ -110782 -64114 -131949 -112866 29099 68880 -42025 -84493 66333 -34527 -14547 -15880
5940a5880J12100j01876j33392M9937Q8760J9985K6029n6952k17725J29061J39209
$$ -15880 96220 -5656 -139048 -89111 -351 19634 45663 -11289 -229014 -99953 39256
5929C9256k12798l9020J54872j96722J97137K6283J22966j20062l0191J40143
$$ 39256 -173542 -212562 -57690 -254412 -57275 -30992 91974 -28088 -58279 81864
5919H1864L3312p8619J16230M2736j05792L1679L371j13807J63180O4671m6960
$$ 81864 115176 36557 152787 195523 89731 121410 124781 10974 174154 238825 191865
5908A91865j40553p9116k8879Q427l8583J3962R1949O6625N553j07521L64202
$$ 191865 51312 -27804 -56683 -48256 -86839 -72877 19072 85697 91250 -16271 347931
5897C47931l44956j76104L8643P4550P012n2820j17439K15695N6639j42837L382
$$ 347931 2975 -173129 -134486 -59936 -52924 -105744 -223183 -7488 49151 -93686 -90304
5886i0304k141j94827P1185J47475R378n6091J700J65889J54493j89114l5957
$$ -90304 -92445 -287272 -216087 -68612 -59234 -115325 -113625 52264 206757 17643 -18314
5875a8314O7207j66089j73970J03524J06017J35441m5249j00351J68270m7318
$$ -18314 48893 -117196 -291166 -187642 -81625 53816 8567 -91784 76486 29168
5865B9168r7382J03019K51645j09224m3659Q4221q5502k19351L7557K92073r6463
$$ 29168 -68214 34805 286450 177226 133567 217788 132286 -87065 -49508 242565 146102
5854A46102j90691R6792r1493k6432K07003M749j6824j06194J0971p2411R2602
$$ 146102 -44589 52203 -39290 -65722 141281 146030 129206 23012 33983 -38428 54174
5843E4174j77795L9527N4276m2913P9166n3803L6461p0081n7532K05984J30548
$$ 54174 -123621 -84094 -29818 -72731 6435 -47368 -10907 -80988 -138520 67464 198012
5832A98012j77979q6854J55991k2832K01130j58086p9264J9927O9729j26760R8156
$$ 198012 20033 -66821 89170 66338 267468 109382 30118 50045 119774 -6986 91170
5821I1170n773q3797j9790j67617J8661R6917Q608j03003J82056j51918K46937
$$ 91170 85397 1600 -18190 -185807 -167146 -70229 -61621 -164624 17432 -134486 112451
5810A12451j67372k04085K03774r3772N534J0583j6413m208J256M4761p4854J38195
$$ 112451 -54921 -259006 -55232 -149004 -143470 -132887 -149300 -153508 -152252 -107491 -182345 -44150
5798d4150n5877j42330K21024l5818r0648o8375j9430r214J66739J99471l1848
$$ -44150 -100027 -242357 -21333 -57151 -147799 -216174 -235604 -244818 -78079 121392 89544
5787H9544m4013j00177l5464O2225j29875l7581p6459R9152N8406J15568J10508
$$ 89544 45531 -54646 -90110 -27885 -157760 -195341 -271800 -172648 -114242 1326 111834
5776A11834k37169l6280m1576K02670k8572Q9053n53L7492m6500O6901k18188
$$ 111834 -125335 -161615 -203191 -521 -29093 59960 59407 96899 50399 117300 -100888
5765a00888p8136Q5160L5245p9438M9663j27517J72682M8979j40487Q4794J64446
$$ -100888 -179024 -93864 -58619 -138057 -88394 -215911 -43229 5750 -134737 -49943 114503
5754A14503j55275k9573P6430j03219l6290j61710J25832J45395R7834k02959
$$ 114503 -40772 -70345 6085 -97134 -133424 -295134 -169302 -23907 73927 -129032
5744a29032p7108p0774J81307J04965L1341j0397p5179m251r4933L79056k03444
$$ -129032 -206140 -276914 -95607 9358 40699 30302 -44877 -49128 -144061 234995 31551
5733C1551j84788m2265O827K2720M9506N2790l544q8115m9777J82481l4846q3748
$$ 31551 -153237 -195502 -188675 -165955 -116449 -63659 -67203 -155318 -205095 -22614 -57460 -141208
5721a41208J53552L0241O6557r0390j46275Q8087J1578J03816j49830l0434l1550
$$ -141208 12344 42585 109142 18752 -127523 -39436 -27858 75958 -73872 -104306 -135856
5710a35856K3274j1340N9585M659J04280k49830M0847P9930J17799j62757q4364
$$ -135856 -112582 -123922 -64337 -59678 44602 -205228 -164381 -84451 33348 -129409 -213773
5699b13773J36285m3076p6248Q3646p7628O7112r2185Q6592j04957j43986L85101
$$ -213773 -77488 -120564 -196812 -113166 -190794 -123682 -215867 -129275 -234232 -378218 6883
5688F883n5406L21225l34943j0475J17675k4345m7112m5654J73318P7146L6174
$$ 6883 -48523 272702 -62241 -72716 44959 20614 -26498 -72152 101166 178312 214486
5677B14486k59655j82027L6114P6550q6520J3782J83779o79M5084P6346R020j08868
$$ 214486 -45169 -227196 -191082 -114532 -201052 -187270 -3491 -4170 40914 117260 126280 17412
5665A7412k01863J76422j2706J6176j8952K5785k7614M1674K12210l22878J62732
$$ 17412 -184451 -8029 -20735 -4559 -23511 2274 -25340 16334 228544 -94334 68398
5654F8398K9988j20866J52193J9181j23129M4680J0124k4037p4141j23896R5375
$$ 68398 98386 -22480 129713 148894 25765 70445 80569 56532 -17609 -141505 -46130
5643d6130j9317j96109J72928J93066j19727m11j82010N4399J11696n6713j89951
$$ -46130 -65447 -261556 -88628 104438 -15289 -15700 -197710 -143311 -31615 -88328 -278279
5632b78279l0712K88886J28454j09737N6096p7624P308l6414N7934L5686m2596
$$ -278279 -308991 -20105 108349 -1388 54708 -22916 -15608 -52022 5912 41598 -998
5621i98l9097k8219J69716o5171k0904M4198o1171q9912O5394M8338l7567J02243
$$ -998 -40095 -68314 101402 36231 15327 59525 -1646 -91558 -26164 22174 -15393 86850
5609H6850L4423J12870L0467K0951K06252k2353o5643K4696j21109Q8497j01308
$$ 86850 121273 234143 264610 285561 491813 469460 403817 428513 307404 395901 294593
5598B94593j21153k29085n5261J14834J10092j5370j33962j00756J70014l7007
$$ 294593 173440 -55645 -110906 3928 114020 98650 -35312 -136068 33946 -3061
5588c061k14394K23957J42847J6331j74124J76220j46160j4480q4400j15488J33726
$$ -3061 -217455 6502 149349 165680 -8444 167776 21616 7136 -77264 -192752 -59026
5577e9026J44171M568k28872J3211O6742N6882R9177j15202R6785O8169L4273
$$ -59026 85145 89713 -139159 -125948 -59206 -2324 96853 -18349 78436 146605 180878
5566A80878r7906M678j491O7666j96019j12085K58134J03944l5900q2861j34393
$$ 180878 82972 87650 86159 153825 -42194 -154279 103855 207799 171899 89038 -45355
5555d5355R9355j21521J72040L3576j0283q42q3429J27007j96863J25492J0951
$$ -45355 54000 -67521 104519 138095 127812 126970 43541 170548 -26315 99177 110128
5544A10128k8533j06381J4557r2445J34700j13737R8640J1950M8373k662J4722
$$ 110128 81595 -24786 -10229 -102674 32026 -81711 16929 28879 77252 74590 89312
5533H9312N0564P7226k31243j30588O5816J5458K03929j29695J1410K02087m9949
$$ 89312 139876 217102 -14141 -144729 -78913 -63455 140474 10779 22189 224276 174327
5522A74327j14366m1839k0264n187L1070J64941k67822J45752J59208k32433J60402
$$ 174327 59961 18122 -2142 -7329 23741 188682 -79140 66612 225820 -6613 153789
5511A53789J5735j02046o3446q4669Q2736J8031j10862l430P7729J2881k17237
$$ 153789 169524 67478 4032 -80637 2099 20130 -90732 -94162 -16433 -3552 -220789
5500b20789K911J25125j97691J20465K31369r9546M8947j23857m9176r0356K7672
$$ -220789 -217878 -92753 -290444 -169979 61390 -38156 10791 -113066 -162242 -252598 -224926
5489b24926J81787k826p87p7511J96258J8438M6957j13027j01295J16688j09178
$$ -224926 -43139 -45965 -46752 -124263 71995 90433 137390 24363 -76932 39756 -69422
5478f9422r1095K18864p9988M8364L9285j38381l0173P9143j61285q7700J42353
$$ -69422 -160517 58347 -21641 26723 66008 -72373 -102546 -23403 -184688 -272388 -130035
5467a30035K52783j27948J71338l8246j17138K24090k33094m1104n1116p6655
$$ -130035 122748 -5200 166138 127892 10754 234844 1750 -39354 -90470 -167125
5457a67125M0391J36346J08503j01195q7394m3138n3404N1520L1397J43251k71200
$$ -167125 -126734 9612 118115 16920 -70474 -113612 -167016 -115496 -84099 59152 -212048
5446b12048K07880O4193P6617M1889k82337m8505K30819o2962n2364k7193P9205
$$ -212048 -4168 60025 136642 178531 -103806 -152311 78508 15546 -36818 -64011 15194
5435A5194J47040p5075j25474j1319n1336J36127Q4019o1884J37437j84230o1837
$$ 15194 162234 87159 -38315 -49634 -100970 35157 119176 57292 194729 10499 -51338
5424e1338L5586m4409j36468J67769k6508j0181j89568J16055N9863o6295J80244
$$ -51338 -15752 -60161 -196629 -28860 -55368 -65549 -255117 -139062 -79199 -145494 34750
5413C4750N185k9798l6676K8113l1659n9906J05511n6266l0673J67551j18994
$$ 34750 39935 10137 -26539 1574 -30085 -89991 15520 -40746 -71419 96132 -22862
5402b2862N039J21631n6483r1891R4356l8853K3979J61649o6962j85814j90402
$$ -22862 -17823 103808 47325 -44566 49790 10937 34916 196565 129603 -56211 -246613
5391b46613J2976K8155N3431N653j61077J23072K56765J28241L0188j32220M534
$$ -246613 -233637 -205482 -152051 -146398 -307475 -184403 72362 200603 230791 98571 103105
5380A03105o9889j09096j90882J26038K20756j51759o7201O2351n3999K91779
$$ 103105 33216 -75880 -266762 -140724 80032 -71727 -138928 -76577 -130576 161203
5370A61203r331j89945J79804O3342p2049j3844j74904j1567J58147k02847J20108
$$ 161203 151872 -38073 141731 205073 133024 119180 -55724 -67291 90856 -111991 8117
5359H117N149N4986L4495k5095R0468k71103N3113J22106k14829J25070Q2481
$$ 8117 13266 68252 102747 77652 168120 -102983 -49870 72236 -142593 -17523 64958
5348F4958L915m2627p1267j6683p1516J42352j1677K7294o4169K0830J41338j90100
$$ 64958 68873 26246 -45021 -61704 -133220 9132 -2545 24749 -39420 -18590 122748 -67352
5336f7352K2706M8581j61628J09381K36434L4696j28925k12618j04161J18621
$$ -67352 -44646 3935 -157693 -48312 188122 222818 93893 -118725 -222886 -104265
5326a04265J29117Q3710j57795K3249J31664N143p5008n203J12938n0886n2133
$$ -104265 24852 108562 -49233 -25984 105680 110823 35815 30612 143550 92664 40531
5315D0531j60738M3025J14492o6616K8060r3222K268K10417j40698j25574K55927
$$ 40531 -120207 -77182 37310 -29306 -1246 -94468 -92200 118217 -22481 -148055 107872
5304A07872J73246k20828N2488L7150j12240P1512q6727o5061K82603j6791j26021
$$ 107872 281118 60290 112778 149928 37688 109200 22473 -42588 240015 223224 97203
5293I7203n1856r981K5081L8861L6151j07685j1883R5589j05715R5107K00664
$$ 97203 45347 35366 60447 99308 135459 27774 15891 111480 5765 100872 301536
5282C01536j52372k92004M4679j55860K1375J56073J38601J50881j20334J78836
$$ 301536 149164 -142840 -98161 -254021 -232646 -76573 62028 212909 92575 271411
5272B71411m0919p1836l9016K59962k70377o9593J2119j23829K29077j29868r3502
$$ 271411 230492 158656 119640 379602 109225 39632 51751 -72078 156999 27131 -66371
5261f6371J19939m462J2949j4122j88074n2160m5340K46739L0804K6748k86040
$$ -66371 53568 49106 62055 47933 -140141 -192301 -237641 9098 39902 66650 -219390
5250b19390J25820J24356R8899J4605j12362J13109m0273J0515j8764q2469l2068
$$ -219390 -93570 30786 129685 144290 31928 145037 104764 115279 96515 14046 -18022
5239a8022N853J87997k7892j21483q38O1414q913R9584K5245j38330n5564J23130
$$ -18022 -12169 175828 147936 26453 25615 87029 78116 177700 202945 64615 9051 132181
5227A32181k5160k35681J41811j68036J53340J15431j76797j24629N6789J29928
$$ 132181 107021 -128660 13151 -154885 -1545 113886 -62911 -187540 -130751 -823
5217h23J68372j79456O0831N1669J75140M7496j72827J41737m3491j9875r5325
$$ -823 167549 -11907 48924 100593 275733 323229 150402 292139 248648 228773 133448
5206A33448k4858m1993P9161k16727P9724P3415K56528M2116l48026J2828J49588
$$ 133448 108590 66597 145758 -70969 8755 82170 338698 380814 32788 45616 195204
5195A95204m713p8229J35038M7923k8254j68012M6862L7937M6785j13632m5460
$$ 195204 190491 112262 247300 295223 266969 98957 145819 183756 230541 116909 71449
5184G1449J85230l4423j5653R2359K01839k26417k48417K69692j32700P1180N6597
$$ 71449 256679 222256 206603 298962 500801 274384 25967 295659 162959 234139 290736
5173B90736n2960J85244q637j81740j36765J49807L8589q3209J10444O3584j2609
$$ 290736 237776 423020 414383 232643 95878 245685 284274 201065 311509 375093 362484
5162C62484J3743J2420j50337m0680J74659Q5825j48311r4965l7532p7964J7545
$$ 362484 376227 388647 238310 197630 372289 458114 309803 214838 177306 99342 116887
5151A16887J59962j10921N3561J03516M9969j55173J98590L5952j78483j41688
$$ 116887 276849 165928 219489 323005 372974 217801 416391 452343 273860 132172
5141A32172J62743M4344o0988J77401m6184k06528O2340m1091K05887Q220j10929
$$ 132172 294915 339259 278271 455672 409488 202960 265300 224209 430096 438316 327387
5130C27387P9166k41710K76801j10751j20231J39690o1062j33831J1437J29742
$$ 327387 406553 164843 441644 330893 210662 350352 289290 155459 166896 296638
5120B96638k41199K46435m9448j3547J24563j88147j04354j0529J37132J37882
$$ 296638 55439 301874 252426 238879 363442 175295 70941 60412 197544 335426
5110C35426k51871N4535J74560j02897j7023k63248K31990O9337R5316j17843
$$ 335426 83555 138090 312650 209753 192730 -70518 161472 230809 326125 208282
5100B08282k5361k4421j70829o5826J93798L7126J632j1677P9322J5544j21308
$$ 208282 182921 158500 -12329 -78155 115643 152769 154401 142724 222046 237590 116282
5089A16282j9268j5655J75349n5115L4666j67349j66676L3734K31721J23533l49190
$$ 116282 97014 81359 256708 201593 236259 68910 -97766 -64032 167689 291222 -57968
5078e7968K79275q0212J00126r8960K934J18133j07314n1296j12118J63307P8095
$$ -57968 221307 141095 241221 142261 145195 263328 156014 104718 -7400 155907 234002
5067B34002l2019O558m0280K17472P725j93402k9616o3212m2272J49866N4969
$$ 234002 201983 208541 168261 385733 393458 200056 170440 107228 64956 214822 269791
5056B69791j25537R423o1855O3212L5623p6246k3241R8520O2279l18724J67765
$$ 269791 144254 153677 91822 155034 190657 114411 91170 189690 251969 -66755 101010
5045A01010L1898o3638R6155J4060r73r5251m862l9436J16651O4959P2692l7646
$$ 101010 132908 69270 165425 179485 178512 83261 78399 38963 155614 220573 293265 255619
5033B55619L7645L7394j94064J58729R6512q4658J20420r248k04170O086R8775
$$ 255619 293264 330658 136594 295323 391835 307177 427597 418349 214179 220265 319040
5022C19040J0054J2817j37291N1718M3655N9650k7101K9Q5450p8900J8922q6143
$$ 319040 329094 341911 204620 256338 299993 359643 332542 332571 418021 339121 358043 271900
5010B71900j09111j10360J04642Q5978P5181O8217j44366r4874j3519K13646k056
$$ 271900 162789 52429 157071 243049 318230 386447 242081 147207 133688 347334 345278
4999C45278l6425m6545J94643r8470J29508l8796m5639L2419N4279M1353J7061
$$ 345278 308853 262308 456951 358481 487989 449193 403554 435973 490252 531605 548666
4988E48666j40340p7424L32478k14405J10363Q6114q5289m1220o2849K7316j57837
$$ 548666 408326 330902 663380 448975 559338 645452 560163 518943 456094 483410 325573
4977C25573R2801J38165M9104K5824j31309l0312K55260n600m687j0431L5953
$$ 325573 418374 556539 605643 631467 500158 469846 725106 719506 714819 704388 740341
4966G40341K7444L9614R5505n9377n1790q6111J58018k8341l1220K10055j71508
$$ 740341 767785 807399 902904 843527 791737 705626 863644 835303 804083 1014138 842630
4955H42630J41978R4175J63951J4732k05920J12093J22468n6181L0818M31721
$$ 842630 984608 1078783 1242734 1257466 1051546 1163639 1286107 1229926 1260744 1692465
4945A692465j9558J25094J14186J41455o5590K21397L3699R2447N5614j0121j18097
$$ 1692465 1672907 1798001 1912187 2053642 1988052 2209449 2243148 2335595 2391209 2381088 2262991
4934B262991j822M7011K25413J42840l9979K88196m3839K44896J30417J63787
$$ 2262991 2261169 2308180 2533593 2676433 2636454 2924650 2880811 3125707 3256124 3419911
4924C419911M81041J15653R2859K46739K9754O7636k2296J07683r2867K9482q1967
$$ 3419911 3900952 4016605 4109464 4356203 4385957 4453593 4431297 4538980 4446113 4475595 4393628
4913D393628L1810K33876J12718j10241J90119K78094M30741M52563K07016K97944
$$ 4393628 4425438 4659314 4772032 4661791 4851910 5130004 5560745 6013308 6220324 6518268
4903F518268Q48716P94961N18271M34241M53749q3039l18028k29113n76632l23355
$$ 6518268 7366984 8161945 8680216 9114457 9568206 9485167 9167139 8938026 8361394 8038039
4893H038039m3649m6566l02035k4515L82851J96762K63109N54926M92264O74086
$$ 8038039 7994390 7947824 7645789 7621274 8004125 8200887 8463996 9018922 9511186 10185272
4883A0185272P10534R52709R62692J259554J011659O04486k1447q44111j313060
$$ 10185272 10895806 11848515 12811207 14070761 15082420 15686906 15665459 14821348 13508288
4874A3508288j280809j302777j121657o09383o09949j42097k78913j682P3223
$$ 13508288 12227479 10924702 9803045 9193662 8583713 8441616 8162703 8161021 8234244
4865H234244J47410K40465L49980K68522K73870N75755M85130L33752J21406l39303
$$ 8234244 8381654 8622119 8972099 9240621 9514491 10090246 10575376 10909128 11030534 10691231
4855A0691231m54820j047096j102734p62788p19993p67521m33231m05662j83459
$$ 10691231 10236411 9189315 8086581 7323793 6603800 5836279 5403048 4997386 4813927
4846D813927k3823l57363k19492j05263q0979k70276k33319l54503k1157l05991
$$ 4813927 4790104 4432741 4213249 4107986 4027007 3756731 3523412 3168909 3147752 2841761
4836B841761L9804j46488j70408k46467q4517K940k11714p436r9999R8616O4725
$$ 2841761 2881565 2735077 2564669 2318202 2233685 2236625 2024911 2017475 1917476 2016092 2080817
4825B080817p7938k9095j47958j5405J369j19353j9304J6619j4315K2341q3796
$$ 2080817 2002879 1973784 1825826 1810421 1811790 1692437 1673133 1689752 1675437 1697778 1613982
4814A613982J628k9403j79461o4185J05878l6503m8318J78536j13278K45368r7219
$$ 1613982 1615610 1586207 1406746 1342561 1448439 1411936 1363618 1542154 1428876 1674244 1577025
4803A577025k59487J7200m6425K74578l12480l4754K0838L26505L2613k10943
$$ 1577025 1317538 1334738 1288313 1562891 1250411 1215657 1236495 1563000 1595613 1384670
4793A384670J40935k7967K2882k88725m8595O3386J11306O3426p0616j34060j05353
$$ 1384670 1525605 1497638 1520520 1231795 1183200 1246586 1357892 1421318 1350702 1216642 1111289
4782A111289R1301L2696J05548j9136j40180J66393K29929k6272m4269Q4114K2546
$$ 1111289 1202590 1235286 1340834 1321698 1181518 1347911 1577840 1551568 1507299 1591413 1613959
4771A613959k24526L6963J85614M9219p1511K04506J88037K2841p6488K4026J2234
$$ 1613959 1389433 1426396 1612010 1661229 1589718 1794224 1982261 2005102 1928614 1952640 1964874
4760A964874p6404l6526K34748J98445J22533M1912K01141J23511J19032J36545
$$ 1964874 1888470 1851944 2086692 2285137 2407670 2449582 2650723 2774234 2893266 3029811
4750C029811L4207J71667J48432j66679Q9281J14071m21636q3482L5237K14305
$$ 3029811 3064018 3235685 3384117 3217438 3306719 3420790 2999154 2915672 2950909 3165214
4740C165214k2605j1446K32554K21540J00601K19250J70103L66076K95049J58455
$$ 3165214 3142609 3131163 3363717 3585257 3685858 3905108 4075211 4441287 4736336 4894791
4730D894791Q7199J72579o0429J4823j44467O903Q0716j75679J5645k6980j4885
$$ 4894791 4981990 5154569 5094140 5108963 4964496 4971399 5052115 4876436 4892081 4865101 4850216
4719D850216j61686R3833M5612K94637k9087J72268K78382k6614L95159K79994
$$ 4850216 4688530 4782363 4827975 5122612 5093525 5265793 5544175 5517561 5912720 6192714
4709F192714K96441K34632M30562N65224P01101O13269Q99855J283473P94511
$$ 6192714 6489155 6723787 7154349 7719573 8420674 9033943 9933798 11217271 12011782
4700A2011782N03289N5649q66746o45247q98961p83540o26249l96021k78466l11728
$$ 12011782 12515071 12570720 11703974 11058727 10159766 9376226 8749977 8353956 8075490 7763762
4690G763762q2796J13964J81944K40765L91145M94221Q04259J086063J058971
$$ 7763762 7680966 7794930 7976874 8217639 8608784 9103005 9907264 10993327 12052298
4681A2052298J526384J262944O93729k57563q07645j125971j300804j232647j128700
$$ 12052298 13578682 14841626 15535355 15277792 14470147 13344176 12043372 10810725 9682025
4672I682025j021514o68632o93553m00698k91150k97912r1301k3479J38493O2830
$$ 9682025 8660511 7991879 7298326 6897628 6606478 6308566 6217265 6193786 6332279 6395109
4662F395109J11976J74300M16170L98075M01551j85826l53058o49859p47687l77637
$$ 6395109 6507085 6681385 7097555 7495630 7897181 7711355 7358297 6708438 5960751 5583114
4652E583114m24385n75351l32225l35402k04962k14953l5628k67961j0502p1939
$$ 5583114 5158729 4583378 4251153 3915751 3710789 3495836 3460208 3192247 3181745 3109806
4642C109806k24027J4434j89381N8657k1269r9826r2216J7701k02593j47800j3951
$$ 3109806 2885779 2900213 2710832 2769489 2748220 2648394 2556178 2573879 2371286 2223486 2209535
4631B209535M8364O1385K9277R0779k6617j30675j23918J66146k0830J19575k20186
$$ 2209535 2257899 2319284 2348561 2439340 2412723 2282048 2158130 2324276 2303446 2423021 2202835
4620B202835J88177l8j74540J04714l09982Q2132J1826k56841K21154n0388J47981
$$ 2202835 2391012 2390974 2216434 2321148 2011166 2093298 2105124 1848283 2069437 2019049 2167030
4609B167030j13912n3949R3400J69743M0742q0407P5432r0501L8186J45915Q6928
$$ 2167030 2053118 1999169 2092569 2262312 2303054 2222647 2298079 2207578 2245764 2391679 2478607
4598B478607j08218N0996M7738J74031n1636j7120j63645k7326J53203J12897
$$ 2478607 2370389 2421385 2469123 2643154 2591518 2574398 2410753 2383427 2536630 2649527
4588B649527J19202N7082J55919K37254j9157J06531M01459J68094J64467j70306
$$ 2649527 2768729 2825811 2981730 3218984 3199827 3306358 3707817 3875911 4040378 3870072
4578C870072K22811K47177Q6512j99579J10986J20613J88625r2249M8986L55414
$$ 3870072 4092883 4340060 4426572 4226993 4337979 4458592 4647217 4554968 4603954 4959368
4568D959368K23826P0095K02532M49665R7705L46670L50706K90682K84202O0148
$$ 4959368 5183194 5253289 5455821 5905486 6003191 6349861 6700567 6991249 7275451 7335599
4558G335599J74869K29569L75793K86680N35490O71843O64620P17397K10412q2820
$$ 7335599 7510468 7740037 8115830 8402510 8938000 9609843 10274463 10991860 11202272 11119452
4548A1119452k72104m37157k98971k48639j19195L20880P3517m6286J49893J50472
$$ 11119452 10847348 10410191 10111220 9862581 9743386 10064266 10137783 10091497 10241390 10391862
4538A0391862L48150Q49987R11403J021987R05702P22674P5355m12051r17708
$$ 10391862 10740012 11589999 12501402 13523389 14429091 15151765 15227120 14815069 13897361
4529A3897361j019423j086085r99770q07306p79999m69248k09223k51565P6017
$$ 13897361 12877938 11791853 10792083 9984777 9204778 8735530 8526307 8274742 8350759
4520H350759l1225j04059K48796N41053M09354N41853k2410n14671p96534j146408
$$ 8350759 8319534 8215475 8464271 9005324 9414678 9956531 9934121 9419450 8622916 7476508
4510G476508q26717o65676n61054m53585l82038n13803l82712l26285k01268k7909
$$ 7476508 6649791 5984115 5423061 4969476 4587438 4073635 3690923 3364638 3163370 3135461
4500C135461j99919j17289k48433k15909K11519q5163l78434k13706k4309J11693
$$ 3135461 2935542 2818253 2569820 2353911 2565430 2480267 2101833 1888127 1863818 1975511
4490A975511o9507j70027L1759J53234j39918J32595o4256m1348k85235L461o316
$$ 1975511 1906004 1735977 1767736 1920970 1781052 1913647 1849391 1808043 1522808 1526269 1519953
4479A519953j94014N2652K3174j90346r8849m954J47844k4877j50940p4571O4260
$$ 1519953 1325939 1378591 1401765 1211419 1112570 1107616 1255460 1230583 1079643 1005072 1069332
4468A069332j7800r7996J70413M8147M2788l12859N5362J60151J9389j41169o867
$$ 1069332 1051532 953536 1123949 1172096 1214884 902025 957387 1117538 1136927 995758 988891
4457I88891J09421j00243o5876J24539N4141m7781k59426j6513J89413K897j75564
$$ 988891 1098312 998069 932193 1056732 1110873 1063092 803666 787153 976566 979463 803899
4446H03899r591n4697J64097j33771Q7790O5842N1885K19646j64880J26575J25552
$$ 803899 794308 739611 903708 769937 857727 923569 975454 1195100 1030220 1156795 1282347
4435A282347j79399q0242q7035o0964O588R6097j64312N01j26272J43488J47124
$$ 1282347 1102948 1022706 935671 874707 881295 977392 813080 813581 687309 830797 977921
4424I77921n5190j1335o6933J25400k14417r2291j58888N8163Q7317J73020Q235
$$ 977921 922731 911396 844463 969863 755446 663155 504267 562430 649747 822767 831002
4413H31002l0678j94273J90M0551j65869q4824k5609J00600J63201J40841l8006
$$ 831002 800324 606051 606241 646792 480923 396099 370490 471090 634291 775132 737126
4402G37126J5094o3854m3850m156l5893r3180j47766J29156O0859j5208P3880
$$ 737126 752220 688366 644516 640360 604467 511287 363521 492677 553536 538328 612208
4391F12208o8786J85553p5419k26348j2430L1773j7045J29014L6366J24103j46293
$$ 612208 543422 728975 653556 427208 414778 446551 429506 558520 594886 718989 572696
4380E72696p5654P0204L0233o3367j77930j01580K49337J07882j35308J78045
$$ 572696 497042 567246 597479 534112 356182 254602 503939 611821 476513 654558
4370F54558p2031k7746J26009j09421o7492J22884L25929k8657L4877J04853m2529
$$ 654558 582527 554781 680790 571369 503877 626761 952690 924033 958910 1063763 1021234
4359A021234j24394J46255o7995l889k6810k62054L1524o1932J89892J89257o5178
$$ 1021234 896840 1043095 975100 971211 944401 682347 713871 651939 841831 1031088 965910
4348I65910j57523p8055K11306o7649o0442R5641N6406J30972J13405M38467P2713
$$ 965910 808387 730332 941638 873989 813547 909188 965594 1096566 1209971 1648438 1721151
4337A721151J80975J23966O7470k8812j69105j49751k58034N780J11967k39863
$$ 1721151 1902126 2026092 2093562 2064750 1895645 1745894 1487860 1493640 1605607 1365744
4327A365744k5417k52682p3023K4827R5219m0717p370N2044j26563M702J40000
$$ 1365744 1340327 1087645 1014622 1039449 1134668 1093951 1086581 1138625 1012062 1016764 1156764
4316A156764L3292J79387K28056L50052L04749q9767n3564n951k56930p8535k99022
$$ 1156764 1190056 1369443 1597499 1947551 2252300 2162533 2108969 2103018 1846088 1767553 1468531
4305A468531p5059P5603l78759M151r4299o6259N083L5701O5207j26645j63372
$$ 1468531 1393472 1469075 1090316 1094467 1000168 933909 938992 974693 1039900 913255 749883
4294G49883J7184J6434J28159j2600J85465K6910j59250Q0938N1739J99513q8111
$$ 749883 767067 783501 911660 899060 1084525 1111435 952185 1033123 1084862 1284375 1196264
4283A196264k73975l785r3942j9650L2393J90515j01769n2021J42445j08365m1548
$$ 1196264 922289 918504 824562 804912 837305 1027820 926051 874030 1016475 908110 866562
4272H66562j64013k89161O2129J60054J10758J21156m03425l5236P9129N4863
$$ 866562 702549 413388 475517 635571 746329 867485 464060 428824 507953 562816
4262E62816N389M5584k1314Q1907J64707Q8417j46279j60101K71798j59278Q3308
$$ 562816 568205 613789 592475 674382 839089 927506 781227 621126 892924 733646 816954
4251H16954K4599p8324J04000j02415m0628J25862j04009k24239M6840J95294
$$ 816954 841553 763229 867229 764814 724186 850048 746039 521800 568640 763934
4241G63934J20100k45752j9308K65523j17770O8884l5188p931J50487r9073J11651
$$ 763934 884034 638282 618974 884497 766727 835611 800423 792492 942979 843906 955557
4230I55557j17706o7267L1180m363j9234J907j553n0082M4187k7581n6967k1144
$$ 955557 837851 770584 801764 797401 778167 780074 778521 728439 772626 745045 688078 666934
4218F66934m9726j00384M8631p0618j44341K5716K13874N4084j20375j83274J09563
$$ 666934 617208 516824 565455 494837 350496 376212 590086 644170 523795 340521 450084
4207D50084q1877J55491J5242q7335Q826l0163j55074Q5708J30302o3131j5862
$$ 450084 368207 523698 538940 451605 460431 430268 275194 360902 491204 428073 412211
4196D12211j7922M5200O7653N5598j45637J89275p9272l37358J0683K58253J66402
$$ 412211 394289 439489 507142 562740 417103 606378 527106 189748 200431 458684 625086
4185F25086L6747m9713p9530r4375p2659j01352K11795j10878j66732J31150L5511
$$ 625086 661833 612120 532590 438215 365556 264204 475999 365121 198389 329539 365050
4174C65050l005J17923J4806J3428p7258j01097J56597k11860J05118J7281R7269
$$ 365050 362045 479968 494774 508202 430944 329847 486444 274584 379702 396983 494252
4163D94252R4702j79257j48690J28828J48062j4294M7126j05151J24087n6139
$$ 494252 588954 409697 261007 389835 537897 523603 570729 465578 589665 533526
4153E33526K19384o6551k54663K8792j72421K31977l3145O30K50697r3050N8165
$$ 533526 752910 686359 431696 460488 288067 520044 486899 487529 738226 645176 703341
4142G03341k590p7169Q5172r1012n1182K95196L4753j23126N9399n5589l07889
$$ 703341 700751 623582 708754 617742 566560 861756 896509 773383 832782 777193 469304
4131D69304L03896J31079r8481j10886J71474o3457j53031J69402j36360J57486
$$ 469304 773200 904279 805798 694912 866386 802929 649898 819300 682940 840426
4121H40426N3038J03721J09683N5132j05345J53770K57008L2783j41936J03350
$$ 840426 893464 997185 1106868 1162000 1056655 1210425 1467433 1500216 1358280 1461630
4111A461630q6351k25786k0466O8902j89830k00399R7612n2274J90041J20595
$$ 1461630 1375279 1149493 1129027 1197929 1008099 807700 905312 853038 1043079 1163674
4101A163674n08q3619k6895r2398J57531m9086j01611J71011Q7093J21442p3677
$$ 1163674 1163166 1079547 1052652 960254 1117785 1068699 967088 1138099 1225192 1346634 1272957
4090A272957J35471n4024K0424M4232J13548P0978Q4506P6684J68222M7568P6343
$$ 1272957 1408428 1354404 1374828 1419060 1532608 1603586 1688092 1764776 1932998 1980566 2056909
4079B056909L045p5275L26075K25183M82168K86197k6057M98609Q81667P07490
$$ 2056909 2059954 1984679 2310754 2535937 3018105 3304302 3278245 3776854 4658521 5366011
4069E366011R27442J270025J395648K17524o91765j439957j266100r16433o26873
$$ 5366011 6293453 7563478 8959126 9176650 8484885 7044928 5778828 4862395 4235522
4060D235522n02538m14248l32477k69448k98015P271k66418k8793m9332l23748
$$ 4235522 3732984 3318736 2986259 2716811 2418796 2426067 2159649 2130856 2081524 1757776
4050A757776J50581m988r9920j10480p1146J4986Q4920l7419J12820o307O6148
$$ 1757776 1908357 1903369 1803449 1692969 1621823 1636809 1721729 1684310 1797130 1790823 1856971
4039A856971J76845J65154j80938Q0004J43080o4459j2349J63338k1804m2139
$$ 1856971 2033816 2198970 2018032 2098036 2241116 2176657 2164308 2327646 2305842 2263703
4029B263703r3372J30848K56733K88415J69549j16973K49371K38183L48734O45549
$$ 2263703 2170331 2301179 2557912 2846327 3015876 2898903 3148274 3386457 3735191 4380740
4019D380740O37396R90621N30024M1963k63398m47017m69555n58033j33317k09624
$$ 4380740 5018136 6008757 6538781 6580744 6317346 5870329 5400774 4842741 4709424 4499800
4009D499800n2071L0469r8951K2253J29934K8884R2707J29556l9606K02359q4417
$$ 4499800 4447729 4478198 4379247 4401500 4531434 4560318 4653025 4782581 4742975 4945334 4860917
3998D860917q9988L9467J2119O1792L17659J98600K36926M36496K76451M16186
$$ 4860917 4770929 4810396 4822515 4884307 5201966 5400566 5637492 6073988 6350439 6766625
3988F766625N29261N10459P88154O72182P23614O81108P14408O44142K33398k55092
$$ 6766625 7295886 7806345 8594499 9266681 9990295 10671403 11385811 12029953 12263351 12008259
3978A2008259p30799p58428m78051l10460p2171r4908P3193J2140K18467K63324
$$ 12008259 11277460 10519032 10040981 9730521 9658350 9563442 9636635 9648775 9867242 10130566
3968A0130566P06721P80497J074567Q59319O46658R90811K63292m07477j037631
$$ 10130566 10837287 11617784 12692351 13551670 14198328 15189139 15452431 15044954 14007323
3959A4007323j226857j456480j139570q70315m73927o81297m18866j58551r8636
$$ 14007323 12780466 11323986 10184416 9314101 8840174 8158877 7740011 7581460 7482824
3950G482824n8299K12917J3092L01714N54919M19408N2119k53037p09934q51955
$$ 7482824 7424525 7637442 7650534 7952248 8507167 8926575 8978694 8725657 8015723 7163768
3940G163768r73066p23959m95039p06616l95640k07184j92556k56513j64141k22656
$$ 7163768 6190702 5466743 4971704 4265088 3869448 3662264 3469708 3213195 3049054 2826398
3930B826398k02261k00409p3303j6994k48140K5287P2941k04747j52042j52321
$$ 2826398 2624137 2423728 2350425 2333431 2085291 2110578 2183519 1978772 1826730 1674409
3920A674409r1524k16738m159J23975J5082N95q3277n6337N4011Q2185o2471k7070
$$ 1674409 1582885 1366147 1361988 1485963 1501045 1501640 1418363 1362026 1416037 1498222 1435751 1408681
3908A408681R7670j01890j38l5841k5804K73811k28575p6899p652q5250J73880
$$ 1408681 1506351 1404461 1404323 1368482 1342678 1616489 1387914 1311015 1303363 1218113 1391993
3897A391993R8701j13281l2848Q0567q3630j18728j57906J01082L1704J36033
$$ 1391993 1490694 1377413 1344565 1425132 1341502 1222774 1064868 1165950 1197654 1333687
3887A333687o054K4058N311n0432J87184n0131o2623n79r0344l5725j56762o7090
$$ 1333687 1327633 1351691 1357002 1306570 1493754 1443623 1381000 1380421 1290077 1254352 1097590 1030500
3875A030500M9925Q6314q7867K5469J21258j6529M6796o9080M0416j8359j4169
$$ 1030500 1080425 1166739 1078872 1104341 1225599 1209070 1255866 1186786 1227202 1208843 1194674
3864A194674q3381k41564j03508J59893k02980k1842J69216L6646J4608j02894
$$ 1194674 1111293 869729 766221 926114 723134 701292 870508 907154 921762 818868
3854H18868m4238j26148j94634J64499J11140L0909j59604J44876j58845j44972
$$ 818868 774630 648482 453848 618347 729487 760396 600792 745668 586823 441851
3844D41851P1507m4786J03290j23871M9933L5155P6501n860J68497o0823l3065
$$ 441851 513358 468572 571862 447991 497924 533079 609580 603720 772217 711394 678329
3833F78329M2711r2964j13745l3905N2235K3189m757K07129l01284m9179K28683
$$ 678329 721040 628076 514331 480426 532661 555850 551093 758222 456938 407759 636442
3822F36442n3493p7083p5742K15941j44362j44676J86422o8955q1103J32953p9001
$$ 636442 582949 505866 430124 646065 501703 357027 543449 474494 393391 526344 447343
3811D47343j83250M9873P3345K0864J95714k38543l8323J67572J23160R4134q0051
$$ 447343 264093 313966 387311 408175 603889 365346 327023 494595 617755 711889 631838
3800F31838o0722L469N247N5658J06892k09071q2952j03785r536R9137O3097q1460
$$ 631838 571116 574585 579832 635490 742382 533311 450359 346574 337038 436175 499272 417812
3788D17812K4463K65239j01637n8803K27903k67096K15365k04028J65874k87209
$$ 417812 442275 707514 605877 547074 774977 507881 723246 519218 685092 397883
3778C97883J10957M6256j1503J9j15199K57340q1968n5165m9719N435j36333J54593
$$ 397883 508840 555096 543593 543612 428413 685753 603785 548620 498901 504336 368003 522596
3766E22596m8402p305j18069R2643j71722J67472K7558n8860O7988P3733q6202
$$ 522596 474194 466889 348820 441463 269741 437213 464771 405911 473899 547632 461430
3755D61430R7982L3810o1057j36740J82510J37929J4800l1866Q5857j04594p713
$$ 461430 559412 593222 532165 395425 577935 715864 730664 698798 784655 680061 672348
3744F72348j73167J50027J71368q8111M4167J3532k09075N5658K06949r9663K01108
$$ 672348 499181 649208 820576 732465 776632 790164 581089 636747 843696 744033 945141
3733I45141r2936m34q703M90297k42693k43013L78395j11083p1344l6952J94062
$$ 945141 852205 851771 843068 1333365 1090672 847659 1226054 1114971 1043627 1006675 1200737
3722A200737N0k84470J18879J09322J30272j72627Q5356K17850p9625j73819M7584
$$ 1200737 1200787 916317 1035196 1144518 1274790 1102163 1187519 1405369 1325744 1151925 1199509
3711A199509J86550p2177j48603R2239j6954P0373j46130r1250J06448M0767j62124
$$ 1199509 1386059 1313882 1165279 1257518 1240564 1310937 1164807 1073557 1180005 1220772 1058648
3700A058648O0874Q6891m3268j6279q8882j0752K0823O2537r471J5924J2384j50637
$$ 1058648 1119522 1206413 1163145 1146866 1057984 1047232 1068055 1130592 1121121 1137045 1149429 998792
3688I98792L3125Q4672j4395K1906j34422J69050k12541K6741K45581k74391k2090
$$ 998792 1031917 1116589 1102194 1124100 989678 1158728 946187 972928 1218509 944118 922028
3677I22028K97521j03329j07605r8205R3667P7161m247l4782q062L3471k6634
$$ 922028 1219549 1116220 1008615 910410 1004077 1081238 1076991 1042209 1034147 1067618 1040984
3666A040984j61749J36270o735K59024j10446l4963O4423K27204j25932j01043
$$ 1040984 879235 1015505 1008770 1267794 1157348 1122385 1186808 1414012 1288080 1187037
3656A187037R5166m2652m5566P1501l4801j72289R3424j6456J01798O7655m143
$$ 1187037 1282203 1239551 1193985 1265486 1230685 1058396 1151820 1135364 1237162 1304817 1300674
3645A300674K8628k6426j03998K7816r6155J64502k2130R4085J68797P6670j76312
$$ 1300674 1329302 1302876 1198878 1226694 1130539 1295041 1272911 1366996 1535793 1612463 1436151
3634A436151j24909r1455J76984K35305K30348l0215j91870j99059J72610K50484
$$ 1436151 1311242 1219787 1396771 1632076 1862424 1832209 1640339 1441280 1613890 1864374
3624A864374k04672k07261J29353k0592j00581J49430J60702k9923j3218m0723
$$ 1864374 1659702 1452441 1581794 1561202 1460621 1610051 1770753 1740830 1727612 1686889
3614A686889N3398J62922j65303K06524P0504q8216P5111j3013J12535j35816
$$ 1686889 1740287 1903209 1737906 1944430 2014934 1926718 2001829 1988816 2101351 1965535
3604A965535J7083P327n0690N3550J4993J82624J12683j99564J84807N2741J08618
$$ 1965535 1982618 1989945 1939255 1992805 2007798 2190422 2303105 2103541 2288348 2341089 2449707
3593B449707j4796k61191O3446J72983J52800L18929j7358r9029n6220P3984K33136
$$ 2449707 2434911 2173720 2237166 2410149 2562949 2881878 2864520 2765491 2709271 2783255 3016391
3582C016391j01172j2848j0804K07924m7912O1048K13532q3544p4258J24948K40093
$$ 3016391 2915219 2902371 2891567 3099491 3051579 3112627 3326159 3242615 3168357 3293305 3533398
3571C533398O0191K0823L13361M0245J28251J39308j22717K00066J89957M4833
$$ 3533398 3593589 3614412 3927773 3968018 4096269 4235577 4112860 4312926 4502883 4547716
3561D547716K92324J30887J5868K67442J44936j6677K07514K97173K59777Q5371
$$ 4547716 4840040 4970927 4986795 5254237 5399173 5382496 5590010 5887183 6146960 6232331
3551F232331J39019N8968J45746K18356K62875N04802L65070J06105L49333M34288
$$ 6232331 6371350 6430318 6576064 6794420 7057295 7562097 7927167 8033272 8382605 8816893
3541H816893J57596N57031L26157K20620O50549N49609M40571M94795O44884O41737
$$ 8816893 8974489 9531520 9857677 10078297 10728846 11278455 11719026 12213821 12858705 13500442
3531A3500442N43563P63134R52969P38109O30210P75762J059068J343511J208658
$$ 13500442 14044005 14807139 15760108 16498217 17128427 17904189 18963257 20306768 21515426
3522B1515426J240061J319581J246819J563601J691880J768277K128769J973926
$$ 21515426 22755487 24075068 25321887 26885488 28577368 30345645 32474414 34448340
3514C4448340K286717K187685K409641K664117K834006K843542L080159L246037
$$ 34448340 36735057 38922742 41332383 43996500 46830506 49674048 52754207 56000244
3506E6000244K990057L378527L632143L553293L385211L727370L708750L738337
$$ 56000244 58990301 62368828 66000971 69554264 72939475 76666845 80375595 84113932
3498H4113932L768266L557445L169104L036710K764787K517294K434885J983540
$$ 84113932 87882198 91439643 94608747 97645457 100410244 102927538 105362423 107345963
3490A07345963J861467J765541J553190J049688P34879R1205k03676q84452j209971
$$ 107345963 109207430 110972971 112526161 113575849 114310728 114401933 114198257 113313805 112103834
3481A12103834j661545j883242j892417k184844k202075k520720k692383l371468
$$ 112103834 110442289 108559047 106666630 104481786 102279711 99758991 97066608 93695140
3473I3695140l528929l908191m026704l697708l823187l970013l682749l571714
$$ 93695140 90166211 86258020 82231316 78533608 74710421 70740408 67057659 63485945
3465F3485945l510960l517803l157769l401954l202692l050374l099132k834005
$$ 63485945 59974985 56457182 53299413 49897459 46694767 43644393 40545261 37711256
3457C7711256k314187k448497k187980k001711j882950j634843j709841j295278
$$ 37711256 35397069 32948572 30760592 28758881 26875931 25241088 23531247 22235969
3449B2235969j351330j270975j054082j055286p71324r04788n22866p26988m64395
$$ 22235969 20884639 19613664 18559582 17504296 16732972 15828184 15305318 14578330 14113935
3440A4113935q16047n88605m22034m22446k26951l30932l54392m06735l21367
$$ 14113935 13297888 12709283 12287249 11864803 11637852 11306920 10952528 10545793 10224426
3431A0224426l17640j56171j68318n7348k75107j08661l45168l5099j35005k17362
$$ 10224426 9906786 9750615 9582297 9524949 9249842 9141181 8796013 8760914 8625909 8408547
3421H408547j43541o7477q7922o2564N841L1670k47592j67336L7234l50863J18747
$$ 8408547 8265006 8197529 8109607 8047043 8052884 8084554 7836962 7669626 7706860 7355997 7474744
3410G474744J09456j09422J8099j98427o2709K6319q9131j76879R5809q3806j10296
$$ 7474744 7584200 7474778 7492877 7294450 7231741 7258060 7168929 6992050 7087859 7004053 6893757
3399F893757j33282j51699K2558J35275j57872J43644p3426o6197q3763L4164
$$ 6893757 6760475 6608776 6631334 6766609 6608737 6752381 6678955 6612758 6528995 6563159
3389F563159j85383J52792J71511j48704r2854Q0749P61j35739R204j70307l2449
$$ 6563159 6377776 6530568 6702079 6553375 6460521 6541270 6542031 6406292 6415496 6245189 6212740
3378F212740n2049J22331j52876k89477j71140K18784k02262j90517p7501L443
$$ 6212740 6160691 6283022 6130146 5840669 5669529 5888313 5686051 5495534 5418033 5421476
3368E421476R9422k59931l530o5558j45513k9614K02467M9077j34451j70152R1335
$$ 5421476 5520898 5260967 5257437 5191879 5046366 5016752 5219219 5268296 5133845 4963693 5055028
3357E055028J54027M9400K360J57918o6707K15020q6739L3630J52892j47864R6595
$$ 5055028 5209055 5258455 5260815 5418733 5352026 5567046 5480307 5513937 5666829 5518965 5615560
3346E615560O4073O9994R9260R7204j04342K06096J23877k72770k22419J34854
$$ 5615560 5679633 5749627 5848887 5946091 5841749 6047845 6171722 5898952 5676533 5811387
3336E811387l1424L1038J45979K21324k42207k6580L536P265L6182K8124K9294
$$ 5811387 5779963 5811001 5956980 6178304 5936097 5909517 5913053 5920318 5956500 5984624 6013918
3325F013918j12439K90380N3797j38931P1151K48186J31930j94096Q1501J54899
$$ 6013918 5901479 6191859 6245656 6106725 6177876 6426062 6557992 6363896 6445397 6600296
3315F600296O9865J68876M348N3752J84911Q2976L0964M0361P9416m3691J71912
$$ 6600296 6670161 6839037 6843385 6897137 7082048 7165024 7195988 7236349 7315765 7272074 7443986
3304G443986J56431K1285P751M10467J60958N7859K15389P3071K91418R4646K19079
$$ 7443986 7600417 7621702 7629453 8039920 8200878 8258737 8474126 8547197 8838615 8933261 9152340
3293I152340K90833J34886m555K56917L13938J96039J54668J45850R6524K39769
$$ 9152340 9443173 9578059 9573504 9830421 10144359 10340398 10495066 10640916 10737440 10977209
3283A0977209K91971L59762M20232K65276L49777K39735P8363L72665M29868M93874
$$ 10977209 11269180 11628942 12049174 12314450 12664227 12903962 12982325 13354990 13784858 14278732
3273A4278732M59315N56138L67286M51936P51357N15149N74028P02990R07006
$$ 14278732 14738047 15294185 15661471 16113407 16864764 17379913 17953941 18656931 19563937
3264A9563937O52821Q22036J035556Q82693J045983J412156J142027J194118J256993
$$ 19563937 20216758 21038794 22074350 22957043 24003026 25415182 26557209 27751327 29008320
3255B9008320J422658J695040J522714J670472J684188J660277J780753J268437
$$ 29008320 30430978 32126018 33648732 35319204 37003392 38663669 40444422 41712859
3247D1712859J028977J297705J266400J440249J508874J530150J223466J153352
$$ 41712859 42741836 44039541 45305941 46746190 48255064 49785214 51008680 52162032
3239E2162032R23027P04584P72361O93479O39575O53980R62220R70751J133690
$$ 52162032 53085059 53789643 54562004 55255483 55895058 56549038 57511258 58482009 59615699
3230E9615699J271060J464188J256972J684706J891954J868205K550169K648435
$$ 59615699 60886759 62350947 63607919 65292625 67184579 69052784 71602953 74251388
3222G4251388L089138L563484M020331M418403M722770N256308N631404O440963
$$ 74251388 77340526 80904010 84924341 89342744 94065514 99321822 104953226 111394189
3214A11394189O667352P198733P481491P873014Q088953Q345902Q238765Q261687
$$ 111394189 118061541 125260274 132741765 140614779 148703732 157049634 165288399 173550086
3206A73550086Q298648Q337943Q602989Q831812R249271R353714R646443R127936
$$ 173550086 181848734 190186677 198789666 207621478 216870749 226224463 235870906 244998842
3198B44998842Q901585Q572819Q084875P153371O652259O347137O153796N647265
$$ 244998842 253900427 262473246 270558121 277711492 284363751 290710888 296864684 302511949
3190C02511949N832756N857509N872079N552856N092713M227197L725593L306473
$$ 302511949 308344705 314202214 320074293 325627149 330719862 334947059 338672652 341979125
3182C41979125K780996K866295M162886N807569Q307947J0541672J1920487J2407128
$$ 341979125 344760121 347626416 351789302 357596871 365904818 376446490 388366977 400774105
3174D00774105J1072153Q719882M014293j196023o441394j0269972j1681094j1313620
$$ 400774105 411846258 420566140 424580433 423384410 416943016 406673044 394991950 383678330
3166C83678330j0176898q791086p751483p960891r987020j4030067j8607949k2281586
$$ 383678330 373501432 364710346 356958863 348997972 339010952 324980885 306372936 284091350
3158B84091350k4544040k4682195k3406083k0881505j7626249j4414057j2442877
$$ 284091350 259547310 234865115 211459032 190577527 172951278 158537221 146094344
3151A46094344j0124747q743951p823931o756783n706119m835024m112874l691438
$$ 146094344 135969597 127225646 119401715 112644932 106938813 102103789 97990915 94299477
3143I4299477l010614k990625k435996k613237k548016k292475k733140k392569
$$ 94299477 91288863 88298238 85862242 83249005 80700989 78408514 75675374 73282805
3135G3282805k642947k367146k266430j768222j977666j602108j622006j525443
$$ 73282805 70639858 68272712 66006282 64238060 62260394 60658286 59036280 57510837
3127E7510837j823237j441186j717954j575761j240305j391462r49356q26211
$$ 57510837 55687600 54246414 52528460 50952699 49712394 48320932 47371576 46545365
3119D6545365j050987o44090n57262o06024k48584N0018j22474j56186R2802K17737
$$ 46545365 45494378 44850288 44293026 43687002 43438418 43488436 43365962 43209776 43302578 43520315
3109D3520315M67142L89689P45086O15167O61140Q82057Q25944J003438J407698
$$ 43520315 43987457 44377146 45122232 45737399 46398539 47280596 48106540 49109978 50517676
3100E0517676J213701J481920J602721J914391K067864K553903K774338K849033
$$ 50517676 51731377 53213297 54816018 56730409 58798273 61352176 64126514 66975547
3092F6975547L405241M048210M196858M613908N282059N472130N500088N391587
$$ 66975547 70380788 74428998 78625856 83239764 88521823 93993953 99494041 104885628
3084A04885628N104383M279504L158366J647192k57715k063167l564200m953317
$$ 104885628 109990011 114269515 117427881 119075073 118817358 116754191 113189991 108236674
3076A08236674n933647o300143o487146o274651n797473n685388n256172m530803
$$ 108236674 102303027 96002884 89515738 83241087 77443614 71758226 66502054 61971251
3068F1971251m302322l786137l340092l226167k935010k600655k280298k132700
$$ 61971251 57668929 53882792 50542700 47316533 44381523 41780868 39500570 37367870
3060C7367870k080952j604618j628194j906716j296197j109118j457374r19851
$$ 37367870 35286918 33682300 32054106 30147390 28851193 27742075 26284701 25364850
3052B5364850p79551r84504j021282q45359o42867q16054m81200o03105q47048
$$ 25364850 24585299 23600795 22579513 21734154 21091287 20275233 19794033 19190928 18343880
3043A8343880p30600l23590p10770m89096m21591k81674l77691l66057m43020
$$ 18343880 17613280 17289690 16578920 16089824 15668233 15386559 15008868 14642811 14199791
3034A4199791n32171j24871l77831l02234l93784j44695l44520k66119R165l16815
$$ 14199791 13667620 13542749 13164918 12862684 12468900 12324205 11979685 11713566 11722731 11405916
3024A1405916j41643j50317j51263l35294j83401j56880j44640k29925j24384
$$ 11405916 11264273 11113956 10962693 10627399 10443998 10287118 10142478 9912553 9788169
3015I788169M4647j17533j19304k36144k18411m2607q580j30682l6281j96736
$$ 9788169 9832816 9715283 9595979 9359835 9141424 9098817 9090237 8959555 8923274 8726538
3005H726538p4416o8662k6591j36062j45886k2485L701K51037J12370j46379j23012
$$ 8726538 8652122 8583460 8556869 8420807 8274921 8252436 8256137 8507174 8619544 8473165 8350153
2994H350153r639O4530l7914K3295M1576J3454j62408K474K25956L1686R807R9662
$$ 8350153 8340514 8405044 8367130 8390425 8432001 8445455 8283047 8285521 8511477 8543163 8552970 8652632
2982H652632M49368K3060j53752J16379M6275Q6128R7012K67399n5604P6648J00740
$$ 8652632 9102000 9125060 8971308 9087687 9133962 9220090 9317102 9584501 9528897 9605545 9706285
2971I706285J25854J36576P7692N3525J27302O5026M00445J51299L8821K81675
$$ 9706285 9832139 9968715 10046407 10099932 10227234 10292260 10692705 10844004 10882825 11164500
2961A1164500J45091L31081J60525K41229L74283M73017M63536M66172J48329
$$ 11164500 11309591 11640672 11801197 12042426 12416709 12889726 13353262 13819434 13967763
2952A3967763O35519P26848L77803N27739O48167P82016N60247L45033L75143
$$ 13967763 14603282 15330130 15707933 16235672 16883839 17665855 18226102 18571135 18946278
2943A8946278j20847k01520k92745n99727q70539r16201p55961p22412n68932
$$ 18946278 18825431 18623911 18331166 17731439 16860900 15944699 15188738 14466326 13897394
2934A3897394n53272m56556m83829j96339j25671k39630k35002J9506k94953n7305
$$ 13897394 13344122 12887566 12403737 12207398 12081727 11842097 11607095 11626601 11331648 11274343
2924A1274343J58257K05653K78573K5647K62599K52917J32877J55054k78064k75229
$$ 11274343 11432600 11638253 11916826 11942473 12205072 12457989 12590866 12745920 12467856 12192627
2914A2192627m29297o51858p04672n08300n66194m36575j72097l79378O9017r3539
$$ 12192627 11763330 11111472 10406800 9898500 9332306 8895731 8723634 8344256 8413273 8319734
2904H319734J51674j60624J54172J24305P4902L13959j81651m33754l01743j34512
$$ 8319734 8471408 8310784 8464956 8589261 8664163 8978122 8796471 8362717 8060974 7926462
2894G926462p634J71348J6381j83727o32369j43029m83235m50278j36541l42870
$$ 7926462 7918828 8090176 8106557 7922830 7290461 7147432 6664197 6213919 6077378 5734508
2884E734508l70160j63744j748N602j14735k42970j04311j5769j42119j33162
$$ 5734508 5364348 5200604 5198856 5204458 5089723 4846753 4742442 4726673 4584554 4451392
2874D451392J90679J81295P1368j00420j10672l32361l73730j17529r1498l3556
$$ 4451392 4642071 4823366 4894734 4794314 4683642 4351281 3977551 3860022 3768524 3734968
2864C734968o8625k02992J24175k22564P737o4379j1298j86429P3141L4463l07272
$$ 3734968 3666343 3463351 3587526 3364962 3372699 3308320 3297022 3110593 3183734 3218197 2910925
2853B910925O0882j29943k2099m8126l023j76762Q6089j7233j73123k15323M6682
$$ 2910925 2971807 2841864 2819765 2771639 2768616 2591854 2677943 2660710 2487587 2272264 2318946
2842B318946l4404P3230k5858J35971k18584j46068L26670k0022k33306j0279
$$ 2318946 2284542 2357772 2331914 2467885 2249301 2103233 2429903 2409881 2176575 2166296
2832B166296J6101l3266J8562k8645j30305l4382m3148l2703M0621k6431j8984
$$ 2166296 2182397 2149131 2167693 2139048 2008743 1974361 1931213 1898510 1939131 1912700 1893716
2821A893716k032J6873r7649J15270K55637j25682n75136J59792N3822M5695l5078
$$ 1893716 1891684 1908557 1810908 1926178 2181815 2056133 1480997 1640789 1694611 1740306 1705228
2810A705228j17485p1058p091L8600J14049j03645l0997k8864N6843j48829J66681
$$ 1705228 1587743 1516685 1509594 1548194 1662243 1558598 1527601 1498737 1555580 1406751 1573432
2799A573432k8379r045K58405q6430r6420P3156p4352l665r0995O2886P3746j14582
$$ 1573432 1545053 1536008 1794413 1707983 1611563 1684719 1610367 1606702 1515707 1578593 1652339 1537757
2787A537757M089j862l8649P9191R4801j7568j89248M0045o4726J28531k6222
$$ 1537757 1541846 1539984 1501335 1580526 1675327 1657759 1468511 1508556 1443830 1572361 1546139
2776A546139o0928j79896L6682Q23q839J32423j3806J75098j01076j43534J23138
$$ 1546139 1485211 1305315 1341997 1342820 1333981 1466404 1452598 1627696 1526620 1383086 1506224
2765A506224P5518r8657K20416n6883p9761n1436N6738n188L57744j78795O1036
$$ 1506224 1581742 1483085 1703501 1646618 1566857 1515421 1572159 1566971 1924715 1745920 1806956
2754A806956j28548J51127j96368K08965l8405j68943J38139O5856l8151l1867
$$ 1806956 1678408 1829535 1633167 1842132 1803727 1634784 1772923 1838779 1800628 1768761
2744A768761P6965k78215J66590O9784o2467K23078Q0124j92022L0431J83253
$$ 1768761 1845726 1567511 1734101 1803885 1741418 1964496 2044620 1852598 1883029 2066282
2734B066282J32024K0058j68088L22748J10332k17332K63298J68066q672j53271
$$ 2066282 2198306 2218364 2050276 2373024 2483356 2266024 2529322 2697388 2688716 2535445
2724B535445p2634J67436n5527n1030K7048N7543J74832O1957j33172K78164r4624
$$ 2535445 2462811 2630247 2574720 2523690 2550738 2608281 2783113 2845070 2711898 2990062 2895438
2713B895438L9895R8179J84496K25024P9921M6297l0904J07740L5002P5457j36496
$$ 2895438 2935333 3033512 3218008 3443032 3522953 3569250 3538346 3646086 3681088 3756545 3620049
2702C620049j05155J50023K02377K09639R0463J12583O8713J13775J10767m289
$$ 3620049 3514894 3664917 3867294 4076933 4167396 4279979 4348692 4462467 4573234 4568945
2692D568945J08175J52656M64363J28680O9416l14373r9824p9857r3982p2501
$$ 4568945 4677120 4829776 5294139 5422819 5492235 5177862 5078038 4998181 4904199 4831698
2682D831698r7775j28077P5968j85153o0865J80830J06191n1610m2848J65365
$$ 4831698 4733923 4605846 4681814 4496661 4435796 4616626 4722817 4671207 4628359 4793724
2672D793724J98900P7487J60694L25814J2584j86074k13890p4186j46507k3136
$$ 4793724 4992624 5070111 5230805 5556619 5569203 5383129 5169239 5095053 4948546 4925410
2662D925410l72464l29018P6476j66489j66853j97693K45471j2170m2096J88841
$$ 4925410 4552946 4223928 4300404 4133915 3967062 3769369 4014840 4002670 3960574 4149415
2652D149415p1842j31290M2929q1959O170P2744j57715l73543l02370m3475j78093
$$ 4149415 4077573 3946283 3989212 3907253 3913423 3986167 3828452 3454909 3152539 3109064 2930971
2641B930971j33524j89551r4765j37802j92212J19301j58131j02312j8499j30235
$$ 2930971 2797447 2607896 2513131 2375329 2183117 2302418 2144287 2041975 2023476 1893241
2631A893241j63890p1525j5327o2587o1537j44775j227j01495k4150r768R8420
$$ 1893241 1729351 1657826 1642499 1579912 1518375 1373600 1372373 1270878 1246728 1236960 1335380
2620A335380n6897P3017m4775O4276n5126j09941k36083o1719k47784J96887J26537
$$ 1335380 1278483 1351500 1306725 1371001 1315875 1205934 969851 908132 660348 857235 983772
2609I83772j84906j32389j68716L22793J0715J23884l3375L3042j07431p7738
$$ 983772 798866 666477 497761 820554 831269 955153 921778 954820 847389 769651
2599G69651j6093L4734j65160J39010J5264j98763J9091o6792K3820J0596j66481
$$ 769651 753558 788292 623132 762142 777406 578643 597734 530942 554762 565358 398877
2588C98877k0753J72468j21876K41762q8577n8272k5976K1314j33713P5582R3668
$$ 398877 378124 550592 428716 670478 581901 523629 497653 518967 385254 460836 554504
2577E54504m5120R3980O3957k8110j37831r9320k5479j88889m5480L90089j75685
$$ 554504 509384 603364 667321 639211 501380 402060 376581 187692 142212 532301 356616
2566C56616J02322j95962j21360J13300J24519m8619o2075J23302J15525P0576
$$ 356616 458938 262976 141616 254916 379435 330816 268741 392043 507568 578144
2556E78144j82198r8444J58348k27397j03845M4382j5131m7364J94128J25868
$$ 578144 395946 297502 455850 228453 124608 168990 153859 106495 300623 426491
2546D26491j24212o6465J00260n1069J02545j91305O8079p7170m86K08397p770
$$ 426491 302279 235814 336074 285005 387550 196245 264324 187154 186668 395065 387295
2535C87295p8146p3465q039r3412P0179p9873K51578M3588j28800q1185K00131
$$ 387295 309149 235684 227645 134233 204412 124539 376117 419705 290905 209720 409851
2524D09851k59759q199p2469K60220N7960k6808r0321k66394N301M0680J79345
$$ 409851 150092 141893 69424 329644 387604 360796 270475 4081 9382 50062 229407
2513B29407j67290q8434J03232J46977K1232q3831o310R0635k8474p2025P2787
$$ 229407 62117 -26317 76915 223892 245124 161293 154983 245618 217144 145119 217906
2502B17906j8741n1518P1004P9949m3238k10285j41182p3418L14263M6787j51069
$$ 217906 199165 147647 218651 298600 255362 45077 -96105 -169523 144740 191527 40458
2491D0458N5159K13555j103j95569J04580j11864k2985J86913N9235l6707J37592
$$ 40458 95617 309172 308069 112500 217080 105216 82231 269144 328379 291672 429264
2480D29264j41376k61028N6769j03587j16651R6319J41287K261j33495M6859j47885
$$ 429264 287888 26860 83629 -19958 -136609 -40290 100997 103258 -30237 16622 -131263
2469a31263J44775n7888n0250J82325J08413j2262K8992j18778j4550J52623K938
$$ -131263 13512 -44376 -94626 87699 196112 183850 212842 94064 79514 232137 235075
2458B35075m8701r6614l170J30359j85525j20528J03308R2624J39539q0302o1006
$$ 235075 186374 89760 86590 216949 31424 -89104 14204 106828 246367 166065 105059
2447A05059j40296J02135n9126K0213P8587q3479Q7603L1016J0243q6197J49237
$$ 105059 -35237 66898 7772 27985 106572 23093 110696 141712 151955 65758 214995
2436B14995j16054Q0135O801q3110k04215J30248m5403j9108O7737q704o8097
$$ 214995 98941 179076 185877 102767 -101448 28800 -16603 -35711 32026 23322 -44775
2425d4775j17152L79704j35733J38344M4804k5304k50556L7556J98666j96657
$$ -44775 -161927 217777 82044 220388 265192 239888 -10668 26888 225554 28897
2415B8897l29129J70393P9132J93487l9257q8760j2480O7887J5459k32837l1715
$$ 28897 -300232 -129839 -50707 142780 103523 14763 2283 70170 85629 -147208 -178923
2404a78923K43126l56l0006J23004r696J09908k56098l2928M0788j87259O5578
$$ -178923 64203 63847 33841 156845 147149 257057 959 -31969 8819 -178440 -112862
2393a12862J89036j41289M5449O3042j5848n9556M8764j59004K74051j15669K5755
$$ -112862 76174 -65115 -19666 43376 27528 -32028 16736 -142268 131783 16114 41869
2382D1869k4911L5916M1760r7889J20910k08507J37578J63193j34983j5300K38173
$$ 41869 16958 52874 94634 -3255 117655 -90852 46726 209919 74936 59636 297809
2371B97809k79487N3981R9831p8321J7754O011M4176J48234j44517k52975n0425
$$ 297809 18322 72303 172134 93813 111567 117578 161754 309988 165471 -87504 -137929
2360a37929J41009j2054k9849J90641r0168o0132J2403l7590J31560j41195j30580
$$ -137929 3080 -8974 -38823 151818 61650 1518 13921 -23669 107891 -33304 -163884
2349a63884p3792l8847J66748L6466O8914n382J23778J42792j41289J69923j60553
$$ -163884 -237676 -276523 -109775 -73309 -4395 -9777 114001 256793 115504 285427 124874
2338A24874j77854j22337J14886J3296M1119J71607l2775k67006O2568q5527N202
$$ 124874 -52980 -175317 -60431 -47135 -6016 165591 132816 -134190 -71622 -157149 -151947
2327a51947M08748l4412n0803q9788j25308q049Q0430L8016J9753k5973q3983
$$ -151947 256801 222389 171586 81798 -43510 -51559 28871 66887 86640 60667 -23316
2316b3316L2864J72209J14851j03296J00634k27990j00898J49020r2667Q043r1838
$$ -23316 9548 181757 296608 193312 293946 65956 -34942 114078 21411 29454 -62384
2305f2384n5846J49630R0431j634o5563P6188R8954j19001K5817j36966m271P3638
$$ -62384 -118230 31400 121831 120197 54634 130822 229776 110775 136592 -374 -4645 68993
2293F8993n6513K77558Q0400q3518P223k1747j79431K2944N387j3274P0585q2928
$$ 68993 12480 290038 370438 286920 294143 272396 92965 115909 121296 108022 178607 95679
2281I5679J4559j30774P5479N7711j75598J05121Q0152J68690k31803p7353P8646
$$ 95679 110238 -20536 54943 112654 -62944 42177 122329 291019 59216 -18137 60509
2270F0509N3234j19209p1577R4492O1698r7301P0998J99681j64517j3674J12176
$$ 60509 113743 -5466 -77043 17449 79147 -18154 52844 252525 88008 74334 186510
2259A86510j28861k04931J96565J59060j83550j17992J67488j65897R6821J34000
$$ 186510 57649 -147282 49283 208343 24793 -93199 74289 -91608 5213 139213
2249A39213J37777j95271J07881k98826J39169K15474P8187j00510j03778m7065
$$ 139213 276990 81719 189600 -109226 29943 245417 323604 223094 119316 72251
2239G2251K27194o4137j8687o1979j84068J22551j19084J63152o9029r6005J25680
$$ 72251 299445 235308 216621 154642 -29426 93125 -25959 137193 68164 -27841 97839
2228I7839N3164M1322n5181L9410q4316j87306J25139J48477n5390m4357J1879
$$ 97839 151003 192325 137144 176554 92238 -95068 30071 178548 123158 78801 90680
2217I0680J54962j00632K2080l4222k9823q3203q627J93335n3433k72776J21682
$$ 90680 245642 145010 167090 132868 103045 19842 11215 204550 151117 -121659 23
2206B3k3593M4255K0277N9592Q7835k11408J99336J7059j75674M9601k4894N4421
$$ 23 -23570 20685 40962 100554 188389 -23019 176317 193376 17702 67303 42409 96830
2194I6830N7597L223L1327l1793P8279j54921j19261J94666k6296J04652J32600
$$ 96830 154427 157650 188977 157184 235463 80542 -38719 155947 129651 234303 366903
2183C66903o0618Q2449k01996j3260m1618K29767j23603r1667P1812O4548J07347
$$ 366903 306285 388734 186738 173478 131860 361627 238024 146357 218169 282717 390064
2172C90064j66816q8970J48311J16099L0113o0574Q7061j85752N0420l3895L8360
$$ 390064 223248 134278 282589 398688 428801 368227 455288 269536 319956 286061 324421
2161C24421P3279J28543o512j81493n8915K16577Q9895J9690N1926j08091L5566
$$ 324421 397700 526243 519731 338238 279323 495900 585795 605485 657411 549320 584886
2150E84886M9758O8792Q7206j43419Q1814K09845J58142j81868J47380J71093
$$ 584886 634644 703436 790642 647223 729037 938882 1097024 915156 1062536 1233629
2140A233629n9862N483J45611J88190M1497q359r1167J56940J46534m935J66606
$$ 1233629 1173767 1179250 1324861 1513051 1554548 1546189 1455022 1611962 1758496 1753561 1920167
2129A920167K21256J3366n9783l0373J16536N8728N10037K1551J85225J86141
$$ 1920167 2141423 2154789 2095006 2064633 2181169 2239897 2749934 2771485 2956710 3142851
2119C142851K43447J94026J20687K89392J85950K57328J74755K79673N91489K33037
$$ 3142851 3386298 3580324 3701011 3990403 4176353 4433681 4608436 4888109 5479598 5712635
2109E712635P3505M47284M20700M51566K80840N98692O77329Q13454J153110J033609
$$ 5712635 5786140 6233424 6654124 7105690 7386530 7985222 8662551 9476005 10629115 11662724
2099A1662724P52025J223751J328319J906283K148582L114493M086727N937678
$$ 11662724 12414749 13638500 14966819 16873102 19021684 22136177 26222904 32160582
2091C2160582P222196J0662659M873892n170669r227719q888362n781680m336778
$$ 32160582 39382778 50045437 54919329 49748660 40520941 31632579 25850899 21514121
2083B1514121l166890k525543j988701j479349q65986j159707q97440j151357
$$ 21514121 18347231 15821688 13832987 12353638 11487652 10327945 9430505 8279148
2075H279148p87174p52487l70315o34094n81333l25128j27890l62524j92930l49576
$$ 8279148 7491974 6739487 6369172 5735078 5153745 4828617 4700727 4338203 4145273 3795697
2065C795697k72577k58304k75940o17o0907k50801k70647r8260J16918k30452
$$ 3795697 3523120 3264816 2988876 2988259 2927352 2676551 2405904 2307644 2424562 2194110
2055B194110J133k7446j02045o3867O3132n4034k75072r9161j23079j1345N1074
$$ 2194110 2195243 2167797 2065752 2001885 2065017 2010983 1735911 1636750 1513671 1502326 1553400
2044A553400j27348N984j04884j5739J8718j70775j09981l1548k66410K08921
$$ 1553400 1426052 1432036 1327152 1311413 1330131 1159356 1049375 1017827 751417 960338
2034I60338J45653k0098j61141k4141N0083M8484J00431j41862j19971n4196J37026
$$ 960338 1105991 1085893 924752 900611 950694 999178 1099609 957747 837776 783580 920606
2023I20606j34918k4702k00675K7483J04681N0093k40484J40853o9666r7656o1069
$$ 920606 785688 760986 560311 587794 692475 742568 502084 642937 573271 475615 414546
2012D14546L7794l9465M3356k1111n0305N8553J31607o1340r2635j0323O5345
$$ 414546 452340 412875 456231 435120 384815 443368 574975 513635 421000 410677 476022
2001D76022O9902k50365Q1758J231Q6301p4304J902N9353Q6028k56571K2868p4398
$$ 476022 545924 295559 377317 378548 464849 390545 392447 451800 537828 281257 304125 229727
1989B29727j07480N297O2349j31358P7123J59958k1951j49901j1498M2437J4352
$$ 229727 122247 127544 189893 58535 135658 295616 273665 123764 112266 154703 169055
1978A69055l2341j73623K25825K5262N7056J1995j31840r3543l7833j6068L5428
$$ 169055 136714 -36909 188916 214178 271234 283229 151389 57846 20013 3945 39373
1967C9373K59032l6909O8989j94892n3593P8561j38425P1411N1146r752q0571
$$ 39373 298405 261496 330485 135593 82000 160561 22136 93547 144693 134941 54370
1956E4370j20523k7388K13012q9801K7655q4987J08887q3777m073m4779k5416
$$ 54370 -66153 -93541 119471 29670 57325 -27662 81225 -2552 -6625 -51404 -76820
1945g6820J19736n8748P4142K27969j55711J06220j03504j57120l192J8492l076
$$ -76820 42916 -15832 58310 286279 130568 236788 133284 -23836 -27028 -8536 -11612
1934a1612K3281K0419R5792k23348L8162K38611j41623j42610J08768L1932Q1039
$$ -11612 11669 32088 127880 -95468 -57306 181305 39682 -102928 5840 37772 118811
1923A18811Q241j37969q6788J47796k7394j32053J66026p6525M1508J65727p223
$$ 118811 127052 -10917 -97705 50091 22697 -109356 56670 -19855 21653 187380 180157
1912A80157J67739k22723k29732J28644j96219K39257P9772j01767n2552o9851
$$ 180157 347896 125173 -104559 24085 -172134 67123 146895 45128 -7424 -77275
1902g7275J58153J33935j72284J34881J19226j60946j43688q744K8091O8205m188
$$ -77275 80878 214813 42529 177410 296636 135690 -7998 -16742 11349 79554 75366
1891G5366Q5759L0149o9064J05337K209j01618K47953J00492k49361k9390j23670
$$ 75366 161125 191274 122210 227547 229756 128138 376091 476583 227222 197832 74162
1880G4162q2118K65394k8708j74130N2057j6928o3666j9775Q8844J20109m3450
$$ 74162 -7956 257438 228730 54600 106657 89729 26063 6288 95132 215241 171791
1869A71791q0655k68877m9553J62101k2600K4643J08536j72269K89500j8972k67567
$$ 171791 91136 -177741 -227294 -65193 -87793 -63150 45386 -126883 162617 143645 -123922
1858a23922o92K82471o6810Q6349j77042l0698J9508J62791p1484P4820P5504
$$ -123922 -124614 157857 91047 177396 354 -30344 -10836 151955 80471 155291 230795
1847B30795l9186j45609k98149J97041Q7788q1916q1925R5397o5547L9228l6453
$$ 230795 191609 46000 -252149 -55108 32680 -49236 -131161 -35764 -101311 -62083 -98536
1836i8536k6364J25002k820j18423R0012l8152N3494j25089J14907j7188J52942
$$ -98536 -124900 102 -2718 -121141 -31129 -69281 -15787 -140876 -25969 -43157 109785
1825A09785l01967O7653R6559N0136j25451R4942J9003k69942J47047Q5709m0546
$$ 109785 -192182 -124529 -27970 22166 -103285 -8343 10660 -259282 -112235 -26526 -67072
1814f7072K03844o159J09885j0935j11051n3937j107p5392j21962K34198K1562
$$ -67072 136772 130613 240498 229563 118512 64575 63468 -11924 -133886 100312 121874
1803A21874o1855M294M4797q9069M3490J13798p9015j65262L3159k6133J59811
$$ 121874 60019 64313 109110 20041 63531 177329 98314 -66948 -33789 -59922 99889
1792I9889J01950k59306j89063N0927N523J25124J42341n6179Q9749q0316j72470
$$ 99889 201839 -57467 -246530 -195603 -190080 -64956 77385 21206 110955 30639 -141831
1781a41831Q0181J0739R952l7549r4450J69541N499j06767K53567k76021j1601
$$ -141831 -61650 -50911 -40959 -78508 -172958 -3417 2082 -104685 148882 -127139 -138740
1770a38740J8439K8888J2553r5478J03237j05821n6823J85358J22858j38525J55758
$$ -138740 -120301 -91413 -78860 -174338 -71101 -176922 -233745 -48387 74471 -64054 91704
1759I1704o0973L2025l8389j96700J81337j29817r43P1546O0345J33435j99944
$$ 91704 30731 62756 24367 -172333 9004 -120813 -121756 -50210 10135 143570 -56374
1748e6374P0207K7221J3723R6509k93810q291j3887J13251J79631j94870O3016
$$ -56374 13833 41054 54777 151286 -142524 -150815 -164702 -51451 128180 -66690 -3674
1737c674r5806k1281p5134J41966J09120J09681j66480p0591j52194j14021Q6924
$$ -3674 -99480 -120761 -195895 -53929 55191 164872 -1608 -72199 -224393 -338414 -251490
1726b51490N5101Q649M5203J5931j08753L11454j44274N8768k3095j5845j80993
$$ -251490 -196389 -187740 -142537 -126606 -235359 76095 -68179 -9411 -32506 -48351 -229344
1715b29344J66779J2589l1953J09865j87033R668p3747J47578M1900n3281K20992
$$ -229344 -62565 -49976 -81929 27936 -159097 -149429 -223176 -75598 -33698 -86979 134013
1704A34013k66045R0697J4844Q9342m7288k48831R4182K7168L4653j09119P8984
$$ 134013 -132032 -41335 -26491 62851 15563 -233268 -139086 -111918 -77265 -186384 -107400
1693a07400K31162j53416k06319O8324K17259J22282n6625j25083J7788j7088
$$ -107400 123762 -29654 -235973 -167649 49610 171892 115267 -9816 7972 -9116
1683i116k6477J3684R2616J6411p1955P8751j37846j31965j5435n5484J95491
$$ -9116 -35593 -21909 70707 87118 15163 93914 -43932 -175897 -191332 -246816 -51325
1672e1325o1205J41592j53456J01784J51818j96976K14025j65985j31656N7048
$$ -51325 -112530 29062 -124394 -22610 129208 -67768 146257 -19728 -151384 -94336
1662i4336J0570M970K22497k28058O925q2704O8577M5198O4821o059k07348k855
$$ -94336 -83766 -78796 143701 -84357 -77432 -160136 -91559 -46361 18460 12401 -194947 -197802
1650a97802K77565k5593k21766K4725J70193j5888J8800N1657o9172K3636k43843
$$ -197802 79763 54170 -167596 -142871 27322 11434 30234 81891 12719 36355 -207488
1639b07488O0611J14791J26557J3258k89862R2146n3277K1286J00871o8932j32411
$$ -207488 -146877 -32086 94471 107729 -182133 -89987 -143264 -121978 -21107 -90039 -222450
1628b22450J2907J93653j30012q7066J84790J8876Q2607K17715k01481j16248
$$ -222450 -209543 -15890 -145902 -232968 -48178 -29302 53305 271020 69539 -46709
1618d6709n7635K02672r5711J32462r6956n0111m8893o6124K94386j13023J8798
$$ -46709 -104344 98328 2617 135079 38123 -11988 -60881 -127005 167381 54358 73156
1607G3156m8324j23914o256K44052k23369M2268j12177P5711J1213m5535J2390
$$ 73156 24832 -99082 -105338 138714 -84655 -42387 -154564 -78853 -67640 -113175 -100785
1596a00785l4766K7856j61684K72939j00031O1886J41877m6480j89124j67115
$$ -100785 -135551 -107695 -269379 3560 -96471 -34585 107292 60812 -128312 -295427
1586b95427J03368R4726K3506J48236n2363K5300J13919r8532j47164Q7101n3652
$$ -295427 -192059 -97333 -73827 74409 22046 47346 161265 62733 -84431 2670 -50982
1575e0982j38202J59010n1849J6361J754n7012J10691n2986J59473j07507K4369
$$ -50982 -189184 -30174 -82023 -65662 -63908 -120920 -10229 -63215 96258 -11249 13120
1564A3120p0566k12070N9879J23398K22437k17955j24266K60533r5209m1986J54161
$$ 13120 -57446 -269516 -209637 -86239 136198 -81757 -206023 54510 -40699 -82685 71476
1553G1476k62897j06059l3759K71655l3815j57159J40623J47581q7330J40762
$$ 71476 -191421 -297480 -331239 -59584 -93399 -250558 -109935 37646 -49684 91078
1543I1078j08990K5029j97766j382q572o3038K07103J41829j69932j63965K0573
$$ 91078 -17912 7117 -190649 -192031 -200603 -263641 -56538 85291 -84641 -248606 -228033
1532b28033K34350k31874J97461M7402r3909K12408j32925p188j40335N352O9311
$$ -228033 6317 -225557 -28096 19306 -74603 137805 4880 -2308 -142643 -137291 -67980
1521f7980O4559p6374M5212R154q5980J17823L263N6815J32928l07426J80138
$$ -67980 -3421 -79795 -34583 -25429 -111409 6414 9677 66492 199420 -108006 72132
1510G2132k58952J0071r1172J59247O7119n7153J14949J2827o1177L3149J41162
$$ 72132 -186820 -176749 -267921 -108674 -41555 -98708 16241 29068 -32109 1040 142202
1499A42202n9208N5435M1091o3935o7320k5033O0434j92918J19362J8790p7839
$$ 142202 82994 138429 179520 115585 48265 23232 83666 -109252 10110 28900 -48939
1488d8939J15438q9131l9786J0634L1420j65443Q5264K17941j01638L7124k1690
$$ -48939 66499 -22632 -62418 -51784 -20364 -185807 -100543 117398 15760 52884 31194
1477C1194j35928Q6066N1794K7875M557M5288j17066k9942Q3510J03432k85268
$$ 31194 -104734 -18668 33126 61001 65558 110846 -6220 -36162 47348 150780 -134488
1466a34488P9474Q5806J9250j52281J4787J05423m4925m7503P9614Q5792r4643
$$ -134488 -55014 30792 50042 -102239 -87452 17971 -26954 -74457 5157 90949 -3694
1455c694J16028j70163J50166j12293q9791r7971K35175o3816p6354M3555j18152
$$ -3694 112334 -57829 92337 -19956 -109747 -207718 27457 -36359 -112713 -69158 -187310
1444a87310J01349o8283k2144m3117j0776K5131N9582J12807J05132j30264j96466
$$ -187310 -85961 -154244 -176388 -219505 -230281 -205150 -145568 -32761 72371 -57893 -254359
1433b54359L0408K6727J9689J72043o2900M4761j58132J81856Q4359j98092J10521
$$ -254359 -223951 -197224 -177535 -5492 -68392 -23631 -181763 93 84452 -113640 -3119
1422c119j40245J13473p0889J57308k0878L0188j4049O5642K1119j63777o3643
$$ -3119 -143364 -29891 -100780 56528 35650 65838 51789 117431 138550 -25227 -88870
1411h8870j0286j9976K92441j10308p9162Q2346j05152k50209K6738K38780L0958
$$ -88870 -99156 -119132 173309 63001 -16161 66185 -38967 -289176 -262438 -23658 7300
1400G300j5871R018J45983j92823J02228O933K7706M6542j41641J97062j16750
$$ 7300 -8571 447 146430 -46393 55835 62768 90474 137016 -4625 192437 75687
1389G5687j75666J04684j0146k2948k3056J05513n6072o8954m0928J00025R3068
$$ 75687 -99979 4705 -5441 -28389 -51445 54068 -2004 -70958 -111886 -11861 81207
1378H1207n5786j14248K01912k5590l6877j18163n7923J48445R685O0762J9095
$$ 81207 25421 -88827 113085 87495 50618 -67545 -125468 22977 32662 93424 112519
1367A12519j30595r4126j77219J66099j41706K81453J44540r6899j04886q3479
$$ 112519 -18076 -112202 -289421 -123322 -265028 16425 160965 64066 -40820 -124299
1357a24299Q0988J91169q7874N30l9162p491p7696J9738J9391l1504K11918m2478
$$ -124299 -43311 147858 59984 60514 21352 13861 -63835 -44097 -24706 -56210 155708 113230
1345A13230j02435L4936j63819K93747j71143n1063L753p206J02746j78062K47600
$$ 113230 10795 45731 -118088 175659 4516 -46547 -42794 -50000 52746 -125316 122284
1334A22284j73844P5009J4858n1744J9348N3037j57873K07802J8023j00885J5387
$$ 122284 -51560 23449 38307 -13437 5911 58948 -98925 108877 126900 26015 41402
1323D1402k9425j30601k6793k6020J04181l4808K87746l3633q7034j24372p1864
$$ 41402 11977 -118624 -145417 -171437 -67256 -102064 185682 152049 65015 -59357 -131221
1312a31221l7495K70659q9758j20244n9944j743J62696L8258j02700k31493L32064
$$ -131221 -168716 101943 12185 -108059 -168003 -169746 -7050 31208 -71492 -302985 29079
1301B9079N7157k00413N740M936j36963K66829j10636P3277j22628M1733O0808
$$ 29079 86236 -114177 -108437 -103501 -240464 26365 -84271 -10994 -133622 -91889 -31081
1290c1081J067o5856m9741J81661J74036j35363m9477J36037j00638l8050O038
$$ -31081 -30014 -95870 -145611 36050 210086 74723 25246 161283 60645 22595 28633
1279B8633J38933O6902k85859p9509K62747r1821r1825J57521j91518q3449j29904
$$ 28633 167566 234468 -51391 -130900 131847 40026 -51799 105722 -85796 -169245 -299149
1268b99149J53556J36519J3813m0210j11308J15761K8974j42798p3235j3813J41682
$$ -299149 -145593 -9074 4739 -35471 -146779 -31018 -2044 -144842 -218077 -231890 -90208
1257i0208K22261k33115n1836K0449K13861j032j07187j04155L5292j67917J0911
$$ -90208 132053 -101062 -152898 -132449 81412 80380 -26807 -130962 -95670 -263587 -252676
1246b52676K34204J17557k45483M1195O4765J0719O133m3223Q7436P626k1377
$$ -252676 -18472 99085 -146398 -105203 -40438 -29719 -23586 -66809 20627 28253 6876
1235F876K56793j63515r9985m5327k45030k4726M864J66327l1097J67069j5548
$$ 6876 263669 100154 169 -45158 -290188 -314914 -310050 -143723 -174820 -7751 -23299
1224b3299J42663L8520k38962k17358J30467J24116J11601N6097j83492K2100
$$ -23299 119364 157884 -81078 -298436 -167969 -43853 67748 123845 -59647 -37547
1214c7547L8414J12777j40569N358j23330j1075K05030p6355J22845m0857q7835
$$ -37547 867 113644 -26925 -21567 -144897 -155972 49058 -27297 95548 54691 -33144
1203c3144j0800P5315j89219J23242J24079l8745m6403n8376q5264K2418L1275
$$ -33144 -43944 31371 -157848 -34606 89473 50728 4325 -54051 -139315 -116897 -85622
1192h5622Q0535J362j35594M3528o0496J31236N3119M2593j26333N5004q069N1533
$$ -85622 -5087 -3725 -139319 -95791 -156287 -25051 28068 70661 -55672 -668 -8737 42796
1180D2796J16598m01942P9241J66947j85990J00682N7525k15843K28920K3636
$$ 42796 159394 -242548 -163307 3640 -182350 -81668 -24143 -239986 -11066 12570
1170A2570q6498j9852J72259m6341j97752J77390l8246n3771L5396j01013j2882
$$ 12570 -73928 -93780 78479 32138 -165614 11776 -26470 -80241 -44845 -145858 -158740
1159a58740q2321J32246P6993L6604O6790k17101L36308l1819j1645l13398J05401
$$ -158740 -241061 -108815 -31822 4782 71572 -145529 190779 158960 147315 -166083 -60682
1148f0682J83697o477m8727j52291o5475J02608J10441p0693p509O2709j10327
$$ -60682 123015 116538 67811 -84480 -149955 -47347 63094 -7599 -15108 47601 -62726
1137f2726J70756p6764n9774j0778m74K5834M6062j69082k4376N3784J6582P3081
$$ -62726 108030 31266 -28508 -39286 -39760 -13926 32136 -136946 -161322 -107538 -90956 -17875
1125a7875N6232p9289j40086J4816R4170K00243J4273R2186k08791J45697k7818
$$ -17875 38357 -40932 -181018 -166202 -72032 128211 142484 234670 25879 171576 143758
1114A43758o4561k4553P1503N3053j86842k2305K47982j93392k21200J01477K52290
$$ 143758 79197 54644 126147 179200 -7642 -29947 218035 24643 -196557 -95080 157210
1103A57210p7913o4451N7687j000k4825j74180p2610J75166l8623O7969J05900
$$ 157210 79297 14846 72533 71533 46708 -127472 -200082 -24916 -63539 4430 110330
1092A10330o4223L2545k6747J1547q2924q828J29096j81287N6765j0242K17843
$$ 110330 46107 78652 51905 63452 -19472 -28300 100796 -80491 -23726 -33968 183875
1081A83875j42067J40949M9139m6791k4765l2797K5137Q254O105k9567N3380j66203
$$ 183875 41808 182757 231896 185105 160340 127543 152680 160934 167039 137472 190852 24649
1069B4649J144M7568O1435o6274n8486j33934O0472K0747N2204p4342K9211K78046
$$ 24649 25793 73361 134796 68522 10036 -123898 -63426 -42679 9525 -64817 -35606 242440
1057B42440l39701j16779K50515o1711R9792O6839k8946K052l6060j31522m9497
$$ 242440 -97261 -214040 36475 -25236 74556 141395 112449 114501 78441 -53081 -102578
1046a02578K20599n9517j50577J2487J17742R764k85624M9537J21910K44827K4856
$$ -102578 118021 58504 -92073 -79586 38156 47920 -237704 -188167 -66257 178570 203426
1035B03426O1697l8428j12802Q5732j48692r692j7936l3922L7647j98545J11697
$$ 203426 265123 226695 113893 199625 50933 41241 23305 -10617 27030 -171515 -59818
1024e9818R1522K2713k03307m3001J09764k2544K65365m6870j06220K2702Q2197
$$ -59818 31704 54417 -148890 -191891 -82127 -104671 160694 113824 7604 30306 112503
1013A12503k55540J35728O1373J84393j49697j96379N0066q9330N8143R6780R5250
$$ 112503 -143037 -7309 54064 238457 88760 -107619 -57553 -146883 -88740 8040 103290
1002A03290k37821K08280l9973p6880J52467K8324k54943Q3628J58161k6225j08125
$$ 103290 -134531 73749 33776 -43104 109363 137687 -117256 -33628 124533 98308 -9817
991i817q969q1258K0453J17529j10167L48318l8498j41489n3160J2278J57124
$$ -9817 -18786 -100044 -79591 37938 -72229 276089 237591 96102 42942 55220 212344
980B12344l43017J2820O8088m024N5562r919J4751k0144k15990J44796j9280k4733
$$ 212344 -130673 -117853 -49765 -53789 1773 -8146 6605 -13539 -229529 -84733 -104013 -128746
968a28746J72385l0873m6822J0514m7567m3521J42787o4524K22635L7882j35180
$$ -128746 43639 12766 -34056 -23542 -71109 -114630 28157 -36367 186268 224150 88970
957H8970q9920m7929J31831J01963m465J3718k67499Q5029J38754j33871r5469
$$ 88970 -950 -48879 82952 184915 180450 194168 -73331 11698 150452 16581 -78888
946g8888n2222K54709p5164k01816r262K71259o2757j00068p2860O6798j00925
$$ -78888 -131110 123599 48435 -153381 -162643 108616 45859 -54209 -127069 -60271 -161196
935a61196j50505N5393Q8467J6182R9293R0052J2759J75294j91858k7729q0020
$$ -161196 -311701 -256308 -167841 -151659 -52366 37686 50445 225739 33881 6152 -73868
924g3868j21599P537K440Q7443j45330K06206O7924l32734J20566K7947Q158J27794
$$ -73868 -195467 -187930 -185490 -98047 -243377 -37171 30753 -301981 -181415 -153468 -145310 -17516
912a7516n2165K48835j55561p7964O7842k25739N3041K35661O7689r0654o9732
$$ -17516 -69681 179154 23593 -54371 13471 -212268 -159227 76434 144123 53469 -16263
901a6263L8255K864R614l8560K6542j62825k5646K33569k60301J41018J4564j5758
$$ -16263 21992 24856 34470 -4090 22452 -140373 -166019 67550 -192751 -51733 -37169 -52927
889e2927J43848j7782j91339L4558J14361m9483o9916K8393m2592K29381j76687
$$ -52927 90921 73139 -118200 -83642 30719 -18764 -88680 -60287 -102879 126502 -50185
878e0185k4859r3693J20066J4066k29093K54296J35287j61908o2452L30664j08307
$$ -50185 -75044 -168737 -48671 -34605 -263698 -9402 125885 -36023 -98475 232189 123882
867A23882j2419k30626n6224Q9891J27696n2881K7576j04559j12114j8069O6233
$$ 123882 111463 -119163 -175387 -85496 42200 -10681 16895 -87664 -199778 -217847 -151614
856a51614k2245O1912J07999J32121J36499n2953k07522j14533K34454j99806
$$ -151614 -173859 -111947 -3948 128173 264672 211719 4197 -110336 124118 -75688
846g5688k098Q6508j97964P6282J48363k88851Q0631J56461n9684O1998K4356
$$ -75688 -77786 8722 -189242 -112960 35403 -253448 -172817 -16356 -76040 -14042 10314
835A0314j0082J06453K22719r3101k63991J43266k7094k89461L08270P2549j41247
$$ 10314 232 106685 329404 236303 -27688 115578 88484 -200977 107293 179842 38595
824C8595p0609l2860r2458J59811K00440o9478J61904j79838j08452j2743Q8304
$$ 38595 -32014 -64874 -157332 2479 202919 133441 295345 115507 7055 -5688 82616
813H2616j20823J7366R6073j1335M4568j88179j45068J58233r7262P6441K85833
$$ 82616 -38207 -20841 75232 63897 108465 -79714 -224782 -66549 -163811 -87370 198463
802A98463R8594j98839Q9958L0414k09756J76097j66034j07521M1173J05436o6342
$$ 198463 297057 98218 188176 218590 8834 184931 18897 -88624 -47451 57985 -8357
791h357l5464N7210J48369q6212k6889P3094q7101j4055J42707n8519j456q1491
$$ -8357 -43821 13389 161758 75546 48657 121751 34650 20595 163302 104783 103327 21836
779B1836j67595O7091P2270O7785q3890O4119j5005j7033m5415K10161j50584
$$ 21836 -145759 -78668 -6398 61387 -22503 41616 26611 9578 -35837 174324 23740
768B3740J12997k67568Q7904R2140J12719j9705O7465k74034J3273Q7087q4165
$$ 23740 136737 -130831 -42927 49213 161932 142227 209692 -64342 -51069 36018 -48147
757d8147N4297j74503K63869j79428m2059j07745J47382L01598j40218k77200
$$ -48147 6150 -168353 95516 -83912 -125971 -233716 -86334 215264 75046 -202154
747b02154J56054k4166J14213N2039Q3260K1211j46857j03140L0139N1941J23962
$$ -202154 -46100 -70266 43947 95986 179246 200457 53600 -49540 -19401 32540 156502
736A56502n5057p0795N399L8629L4851k08552K7191K02484k69106N2831J41968
$$ 156502 101445 30650 36049 74678 109529 -99023 -71832 130652 -138454 -85623 56345
725E6345M6545O9521n6911j18061Q4235j03203K2963J49676r6326m0036M1780
$$ 56345 102890 172411 115500 -2561 81674 -21529 1434 151110 54784 14748 56528
714E6528j21925n4246N3041K0645J17477l6993q7543r6608l5669J23802l8954
$$ 56528 -65397 -119643 -66602 -45957 71520 34527 -53016 -149624 -185293 -61491 -100445
703a00445K844j033m2269L10467O2653k57286J59754j00501J3791K4720O7281
$$ -100445 -97601 -98634 -140903 169564 232217 -25069 134685 34184 47975 72695 139976
692A39976o7105L4999M4363k41724m3511J20035M8174j03418o6741J58424K74943
$$ 139976 72871 107870 152233 -89491 -133002 -12967 35207 -68211 -134952 23472 298415
681B98415j63290k13300N1204P3099K5760J15047k25508j1215j12717J4295J85570
$$ 298415 135125 -78175 -26971 46128 71888 186935 -38573 -49788 -162505 -148210 37360
670C7360L1301J9082L3534r024Q3016j49051j19848J93469q0149m1162j53640
$$ 37360 68661 87743 121277 112253 195269 46218 -73630 119839 39690 -1472 -155112
659a55112J25288N6965j09195J72766j05897m2560r9000J73506m9499k40988L3925
$$ -155112 -29824 27141 -82054 90712 -15185 -57745 -156745 16761 -32738 -273726 -239801
648b39801J22432J13828O5561l7385j66614J7071Q5646K04634j3992j07535j77000
$$ -239801 -117369 -3541 62020 24635 -141979 -124908 -39262 165372 151380 43845 -133155
637a33155q6231K26217l6204r8865k3757J83229J1461l5355J36504M1197k01653
$$ -133155 -219386 6831 -29373 -128238 -151995 31234 42695 7340 143844 185041 -16612
626a6612p7814Q8495R9629l59p4253J66466k98564J4990N9411J11931P1220l820
$$ -16612 -94426 -5931 93698 93339 19086 185552 -113012 -98022 -38611 73320 144540 140720
614A40720r3108K3078N2271K8389k08779k4509K0473J81700K4960j34743J07898
$$ 140720 47612 70690 122961 151350 -57429 -81938 -61465 120235 145195 10452 118350
603A18350j38465R9338q8756J09346j33768M2219p2012L4870P9144J30295j60043
$$ 118350 -20115 79223 -9533 99813 -33955 8264 -63748 -28878 50266 180561 20518
592B0518k20568k8116J62473J1311K61995j17540K2234N5504j65332K09161l1545
$$ 20518 -200050 -228166 -65693 -54382 207613 90073 112307 167811 2479 211640 180095
581A80095k22218q8535J71713k1513j38081P3640J06552L2763J3421m5704J42780
$$ 180095 -42123 -130658 41055 19542 -118539 -44899 61653 94416 107837 62133 204913
570B04913j35208k68594q8418K78648j67854J84166m7332l1405K8865N5476j5066
$$ 204913 69705 -198889 -287307 -8659 -176513 7653 -39679 -71084 -42219 13257 -1809
559a809r6225K24871k01129k6998J96746j03115J19860J94833m9024k63678k4191
$$ -1809 -98034 126837 -74292 -101290 95456 -7659 112201 307034 258010 -5668 -29859
548b9859q0247K5021r1153J52809K25041j95395N9106k5676K9220j46893R0429
$$ -29859 -110106 -85085 -176238 -23429 201612 6217 65323 39647 68867 -78026 12403
537A2403p6752L34790k00801k38730J16733J05813j2898j01146R3363J75152J30760
$$ 12403 -64349 270441 69640 -169090 -52357 53456 40558 -60588 32775 207927 338687
526C38687q1387l11727K8924K55485j08114j16164J747J18259k20708k2502o3026
$$ 338687 257300 -54427 -25503 229982 121868 5704 7451 125710 -94998 -117500 -180526
515a80526L401K24489k03019o6043J16378J30806Q0962J66280j62457j28781p6514
$$ -180526 -177125 47364 -155655 -221698 -105320 25486 106448 272728 110271 -18510 -95024
504i5024R4981J26485k88816P4573n5347L4523R1576r56j69699J48964P3280m3699
$$ -95024 -43 126442 -162374 -87801 -143148 -108625 -17049 -18005 -187704 -38740 34540 -9159
492i159j3660P1040J99048j90221k2359J28525j93863O4508J27725L3150j22358
$$ -9159 -22819 48221 247269 57048 34689 163214 -30649 33859 161584 194734 72376
481G2376p4238J05030m157L7786n0279r1323M7986j0493o8637j6246M9310n0659
$$ 72376 -1862 103168 99011 136797 86518 -4805 43181 32688 -35949 -52195 -2885 -53544
469e3544R4698l1686p227j13855R471K5907O2109J68064o4794J55780j16626j07083
$$ -53544 41154 9468 2241 -111614 -102143 -76236 -14127 153937 89143 244923 128297 21214
457B1214k4531L4754j82987Q0246J11255k3620j2638J66110j12885M9507J9546
$$ 21214 -3317 31437 -151550 -71304 39951 16331 3693 169803 56918 106425 125971
446A25971j84114o8406P0922j68777K15874J84383r8249j54925m7735J57882P0325
$$ 125971 -58143 -126549 -55627 -224404 -8530 175853 77604 -77321 -125056 32826 103151
435A03151N9179n2026K07345N0808k80322o1810K12235n4847N456j32241J95527
$$ 103151 162330 110304 317649 368457 88135 26325 238560 183713 189169 56928 252455
424B52455l7526k29251j12287L2365J43768l8049j6001p1224J6897p938J10344
$$ 252455 214929 -14322 -126609 -94244 49524 11475 -4526 -75750 -58853 -66791 43553
413D3553Q6600j30018r9937K35450N3465k2898o4954j45481j38360M4441J77450
$$ 43553 130153 135 -99802 135648 189113 166215 101261 -44220 -182580 -138139 39311
402C9311j91782P9097J05283J08262k46057J7618O6214K3531l6768K04132j73808
$$ 39311 -152471 -73374 31909 140171 -105886 -88268 -22054 1477 -35291 168841 -4967
391d967j14910r0748P1013Q4802R6361j26891J67902k1897j70451L9582j9247
$$ -4967 -119877 -210625 -139612 -54810 41551 -85340 82562 60665 -109786 -70204 -89451
380h9451Q3718J05372O8859k48059K14216N391l1896j51716j11108J17020J35716
$$ -89451 -5733 99639 168498 -79561 134655 140046 108150 -43566 -154674 -37654 98062
369I8062M5495J29645j11482J7060J67523l01021m7429P8964K9839K6q2724r3866
$$ 98062 143557 273202 161720 178780 346303 45282 -2147 76817 106656 106682 23958 -69908
357f9908P4872O6838m0411J36314j67801L5511j05338L895J44433l15269L7755
$$ -69908 4964 71802 31391 167705 -96 35415 -69923 -66028 78405 -236864 -199109
346a99109N5537J0184J07685J10664L5477P813K9271j48669N4796n6693N3297
$$ -199109 -143572 -133388 -25703 84961 120438 128251 157522 8853 63649 6956 60253
335F0253N6766K5665o8583K8917p0005L2050K2236l20799P6554J62938K4388r5575
$$ 60253 117019 142684 74101 103018 33013 65063 87299 -233500 -156946 5992 30380 -65195
323f5195J2066J45184m225O1408r4456n1916j34321J74930n0056p3987J42727
$$ -65195 -53129 92055 87830 149238 54782 2866 -131455 43475 -6581 -80568 62159
312F2159q2488R3129R782o9750j05531J64358n7534j22790M2932Q003K0939r3962
$$ 62159 -20329 72800 82582 12832 -92699 71659 14125 -108665 -65733 -57730 -36791 -130753
300a30753p2247J51930K6639L5287M1466o9014J43266o8809j08698q4765j0765
$$ -130753 -203000 -51070 -24431 10856 52322 -16692 126574 57765 -50933 -135698 -146463
289a46463l0825Q5639K86835k24699q5643J34433j23801M5806K73696j5341o2272
$$ -146463 -177288 -91649 195186 -29513 -115156 19277 -104524 -58718 214978 199637 137365
278A37365L546r4538L3608j03288N4787J0855J65946j23235k40037J15888m7278
$$ 137365 140911 46373 79981 -23307 31480 42335 208281 85046 -154991 -39103 -86381
267h6381n3453M1807N0303J97452J40965P7356l91266L3088q95k35060j5731J94002
$$ -86381 -139834 -98027 -47724 149728 290693 368049 -23217 9871 8976 -226084 -241815 -47813
255d7813j52990j6421R0423Q3616j9463L9L8515k1340r0688J34314J32990N4733
$$ -47813 -200803 -217224 -126801 -43185 -62648 -62609 -24094 -45434 -136122 -1808 131182 185915
243A85915j06188J8553k3611j608j53424j01143N5021L410r14j57031K49608K6451
$$ 185915 79727 98280 74669 73061 -80363 -181506 -126485 -123075 -123989 -281020 -31412 -4961
231d961Q9317O7678R434j42469j51206N4937J22042q7127M6095J02513j56393
$$ -4961 84356 152034 161468 18999 -132207 -77270 44772 -42355 3740 106253 -50140
220e0140m1813k8817J70532J2954N6766P1210j85071r175j01243J61976J6189
$$ -50140 -91953 -120770 49762 62716 119482 190692 5621 -3554 -104797 57179 73368
209G3368P9379j74809P1800P7085o3347j26869P0522p9486j9649k353K20345Q0851
$$ 73368 152747 -22062 49738 126823 63476 -63393 7129 -72357 -92006 -94359 125986 206837
197B06837j0252m8441R5933k11207J1636j69518L6726J66079N4782j44926J753
$$ 206837 196585 148144 244077 32870 44506 -125012 -88286 77793 132575 -12351 -10598
186a0598J38016j71330M248J68917j29615j87660J50149J32550l5821J3469P0932
$$ -10598 127418 -43912 -39664 129253 -362 -188022 -37873 94677 58856 72325 143257
175A43257n72r495p7407O8932K6335j63929M0391J26460k36766m7871J48654j5470
$$ 143257 142685 133190 55783 124715 151050 -12879 27512 153972 -82794 -130665 17989 2519
163B519M6470j3310k44102J49095P6321J02709o9683j5256n1707r6727k6210J09054
$$ 2519 48989 35679 -208423 -59328 16993 119702 50019 34763 -16944 -113671 -139881 -30827
151c0827l948p6796N0254M5929j4517Q0003J4643O5819m8949k6674j09854J33588
$$ -30827 -34775 -111571 -61317 -15388 -29905 50098 64741 130560 81611 54937 -54917 78671
139G8671l2196J50715p8673p3861j3966j44932O7654p5941K6350L5847J5175J18212
$$ 78671 46475 197190 118517 44656 30690 -114242 -46588 -122529 -96179 -60332 -45157 73055
127G3055l2853j16917K19158j82546L2620p3429J32566k53181O0565K6911n8259
$$ 73055 40202 -76715 142443 -40103 -7483 -80912 51654 -201527 -140962 -114051 -172310
116a72310J14240K34486n2737j14253J01496m9948N1987j40224L7176r3448N0306
$$ -172310 -58070 176416 123679 9426 110922 60974 112961 -27263 9913 -83535 -33229
105c3229r4626M583N2585K0372n2901n7548J15761J7009j9564L5207M4333k5084
$$ -33229 -127855 -123272 -70687 -50315 -103216 -160764 -45003 -27994 -47558 -12351 31982 6898
93F898j43906J40426n6577P6630J95053j45334p5046K8194Q7536m5198j69105
$$ 6898 -137008 3418 -53159 23471 218524 73190 -1856 26338 113874 68676 -100429
82a00429k912O2880j24322Q7692J92374J7792j8199Q686R547j39152j2033l1295
$$ -100429 -103341 -40461 -164783 -77091 115283 133075 114876 123562 133109 -6043 -18076 -49371
70d9371O1330j7003p9673J49282L1643J46897j94734j53432J57807m3112N6073
$$ -49371 11959 -5044 -84717 64565 96208 243105 48371 -105061 52746 9634 65707
59F5707j6833k5687o8265O8754N0524P3468j01853o3316K6091R7387q1834l4177
$$ 65707 48874 23187 -45078 23676 74200 147668 45815 -17501 8590 105977 24143 -10034
47a0034J12114N4517p2207J0084k10027K3307P2223k3353n927k9146P5400m9062
$$ -10034 102080 156597 84390 94474 -115553 -92246 -20023 -43376 -49303 -78449 -3049 -52111
35e2111l9572k1554J24478j35053l1316J10424k3972r56j30571J63774J40220
$$ -52111 -91683 -113237 11241 -123812 -155128 -44704 -68676 -69632 -200203 -36429 103791
24A03791k3197N940q1283m605J0725l416l7736M3169j11737k6805K0315M4067
$$ 103791 80594 86534 5251 646 11371 7955 -29781 13388 -98349 -125154 -104839 -60772
12f0772J17527O776L7274l7559n2008n9588J19196Q4127j42453P4386o0410j3131
$$ -60772 56755 63531 100805 63246 11238 -48350 70846 154973 12520 86906 26496 13365
0A3365
$$ 13365
$$ [...]
##END NTUPLES=NMR SPECTRUM
##END=
