##TITLE=1H_EC-3331(12)
 CDCl3
 8 sc, 
 9.9.2024
##JCAMPDX= 6.0         $$ Bruker NMR JCAMP-DX V2.0
##DATA TYPE= NMR SPECTRUM
##DATA CLASS= NTUPLES
##ORIGIN= UXNMR, Bruker Analytische Messtechnik GmbH
##OWNER= root
$$ XWIN-NMR		Version 3.5
$$ Mon Sep  9 13:54:11 2024 Russian Standard Time (UT+4h)  she@DPX200
##.OBSERVE FREQUENCY= 200.1318
##.OBSERVE NUCLEUS= ^1H
##.ACQUISITION MODE= SIMULTANEOUS
##.ACQUISITION SCHEME= undefined
##.AVERAGES= 8
##.DIGITISER RES= 18
##SPECTROMETER/DATA SYSTEM= spect
##.PULSE SEQUENCE= zg30
##.SOLVENT NAME= CDCl3
##.SHIFT REFERENCE= (INTERNAL, CDCl3, 0, 20.9826)
##AUDIT TRAIL= $$ (NUMBER, WHEN, WHO, WHERE, WHAT)
$$ ##TITLE= Audit trail, XWIN-NMR		Version 3.5
$$ ##JCAMPDX= 5.01
$$ ##ORIGIN= Bruker BioSpin GmbH
$$ ##OWNER= she
$$ F:/spectra/data/she/nmr/H-F/1/pdata/1/auditp.txt
$$ ##AUDIT TRAIL=  $$ (NUMBER, WHEN, WHO, WHERE, WHAT)
(   1,<2024-09-09 13:52:49.98 +0400>,<she>,<DPX200>,
      <created by zg, POWCHK disabled, PULCHK disabled
       configuration hash MD5:
       00 E9 B6 7A A2 85 ED C7 34 08 36 98 17 FE 4E 26
       data hash MD5: 16K
       77 4E B6 B4 2D 1D AF 9A 60 CF 18 52 DD 4B 57 AB>)
(   2,<2024-09-09 13:52:51.90 +0400>,<she>,<DPX200>,
      <Start of raw data processing
       efp BC_mod = 2 LB = 0.24 FT_mod = 6 PKNL = 1 PHC0 = -25994.14 PHC1 = 13.78748 SI = 16K 
       data hash MD5: 16K
       4D 00 F4 BC 63 3E 54 78 69 4F 10 03 13 66 E1 8A>)
(   3,<2024-09-09 13:53:10.17 +0400>,<she>,<DPX200>,
      <pk PHC0 = 1.996809 PHC1 = -1.8 
       data hash MD5: 16K
       A2 26 58 30 76 A3 3C 0A 58 C4 06 63 C5 CB 6E FC>)
(   4,<2024-09-09 13:53:18.09 +0400>,<she>,<DPX200>,
      <abs ABSG = 5 
       data hash MD5: 16K
       A6 AB 42 C5 6E E8 26 BA 68 F7 31 97 75 60 CA 14>)
$$ ##END=
$$ 
$$ hash MD5
$$ FB C3 9F 49 D3 7A 84 A5 5F 2C AA 5F 33 6A C7 DD
##$RELAX= 
##$RELAX= 
##$RELAX= 
##$RELAX= 
##$RELAX= 
##$RELAX= 
$$ Bruker specific parameters
$$ --------------------------
##$DU= <F:/spectra>
##$EXPNO= 1
##$NAME= <H-F>
##$PROCNO= 1
##$TYPE= <nmr>
##$USER= <she>
##$AMP= (0..31)
100 100 100 100 100 100 100 100 100 100 100 100 100 100 100 100 100 100 
100 100 100 100 100 100 100 100 100 100 100 100 100 100 
##$AQSEQ= 0
##$AQ_mod= 1
##$AUNM= <au_zg>
##$AUTOPOS= <>
##$BF1= 200.13
##$BF2= 200.13
##$BF3= 200.13
##$BF4= 200.13
##$BF5= 200.13
##$BF6= 200.13
##$BF7= 200.13
##$BF8= 200.13
##$BYTORDA= 1
##$CFDGTYP= 0
##$CFRGTYP= 5
##$CHEMSTR= <none>
##$CNST= (0..31)
1 1 145 1 1 1 1 1 1 1 1 1 1 1 1 1 1 1 1 1 1 1 1 1 1 1 1 1 1 1 1 1 
##$CPDPRG= <>
##$CPDPRG1= <>
##$CPDPRG2= <>
##$CPDPRG3= <>
##$CPDPRG4= <mlev>
##$CPDPRG5= <mlev>
##$CPDPRG6= <mlev>
##$CPDPRG7= <mlev>
##$CPDPRG8= <mlev>
##$CPDPRGB= <>
##$CPDPRGT= <>
##$D= (0..31)
0 1.2 0 0 0 0 0 0 0 0.06 0 0.03 0 0 0 0 0.0002 0 0 0 0 0 0 0 0 0 0 0 0 
0 0 0 
##$DATE= 1725875569
##$DBL= (0..7)
120 120 120 120 120 120 120 120 
##$DBP= (0..7)
150 150 150 150 150 150 150 150 
##$DBP07= 0
##$DBPNAM0= <>
##$DBPNAM1= <>
##$DBPNAM2= <>
##$DBPNAM3= <>
##$DBPNAM4= <>
$$ [...]
##$SUBNAM3= <"">
##$SUBNAM4= <"">
##$SUBNAM5= <"">
##$SUBNAM6= <"">
##$SUBNAM7= <"">
##$SUBNAM8= <"">
##$SUBNAM9= <"">
##$SW= 24.0689170037331
##$SWIBOX= (0..15)
0 0 2 0 0 0 0 0 0 0 0 0 0 0 0 0 
##$SW_h= 4816.95568400771
##$TD= 16384
##$TD0= 1
##$TE= 0
##$TE2= 300
##$TE3= 300
##$TEG= 300
##$TL= (0..7)
0 120 120 120 120 120 120 120 
##$TP= (0..7)
150 150 150 150 150 150 150 150 
##$TP07= 0
##$TPNAME0= <>
##$TPNAME1= <>
##$TPNAME2= <>
##$TPNAME3= <>
##$TPNAME4= <>
##$TPNAME5= <>
##$TPNAME6= <>
##$TPNAME7= <>
##$TPOAL= (0..7)
0.5 0.5 0.5 0.5 0.5 0.5 0.5 0.5 
##$TPOFFS= (0..7)
0 0 0 0 0 0 0 0 
##$TUNHIN= 0
##$TUNHOUT= 0
##$TUNXOUT= 0
##$USERA1= <user>
##$USERA2= <user>
##$USERA3= <user>
##$USERA4= <user>
##$USERA5= <user>
##$V9= 5
##$VALIST= <valist>
##$VCLIST= <CCCCCCCCCCCCCCC>
##$VD= 0
##$VDLIST= <DDDDDDDDDDDDDDD>
##$VPLIST= <PPPPPPPPPPPPPPP>
##$VTLIST= <TTTTTTTTTTTTTTT>
##$WBST= 1024
##$WBSW= 4
##$XGAIN= (0..3)
0 0 0 0 
##$XL= 0
##$YL= 0
##$YMAX_a= 343182
##$YMIN_a= -259424
##$ZGOPTNS= <>
##$ZL1= 120
##$ZL2= 120
##$ZL3= 120
##$ZL4= 120
##$ABSF1= 20.93416
##$ABSF2= -3.134972
##$ABSG= 5
##$ABSL= 3
##$ALPHA= 0
##$AQORDER= 0
##$ASSFAC= 0
##$ASSFACI= 0
##$ASSFACX= 0
##$ASSWID= 0
##$AUNMP= <proc_1d>
##$AZFE= 0.1
##$AZFW= 0.1
##$BCFW= 0
##$BC_mod= 2
##$BYTORDP= 0
##$COROFFS= 0
##$CY= -3
##$DATMOD= 1
##$DC= 0
##$DFILT= <>
##$DTYPP= 0
##$F1P= 0
##$F2P= 0
##$FCOR= 1
##$FTSIZE= 16384
##$FT_mod= 6
##$GAMMA= 0
##$GB= 0
##$INTBC= 1
##$INTSCL= 3.70164e-10
##$ISEN= 128
##$LB= 0.24
##$LEV0= 0
##$LPBIN= 0
##$MAXI= 10000
##$MC2= 0
##$MEAN= 0
##$ME_mod= 0
##$MI= 1.114404
##$NCOEF= 0
##$NC_proc= -6
##$NLEV= 6
##$NOISF1= 3.799351
##$NOISF2= 2.8
##$NSP= 0
##$NTH_PI= 0
##$NZP= 0
##$OFFSET= 20.98263
##$PC= 1
##$PHC0= -25992.14
##$PHC1= 11.98748
##$PH_mod= 1
##$PKNL= yes
##$PPARMOD= 0
##$PSCAL= 0
##$PSIGN= 0
##$REVERSE= no
##$SF= 200.130009224689
##$SI= 16384
##$SIGF1= 3
##$SIGF2= 2
##$SINO= 5.538805
##$SIOLD= 16384
##$SREGLST= <1H.CDCl3>
##$SSB= 0
##$STSI= 16384
##$STSR= 0
##$SW_p= 4816.95568400771
##$SYMM= 0
##$S_DEV= 0
##$TDeff= 16384
##$TDoff= 0
##$TI= <>
##$TILT= no
##$TM1= 0
##$TM2= 0
##$TOPLEV= 0
##$USERP1= <user>
##$USERP2= <user>
##$USERP3= <user>
##$USERP4= <user>
##$USERP5= <user>
##$WDW= 1
##$XDIM= 16384
##$YMAX_p= 271437649
##$YMIN_p= -563580
$$ End of Bruker specific parameters
$$ ---------------------------------
##NTUPLES= NMR SPECTRUM
##VAR_NAME=  FREQUENCY,     SPECTRUM/REAL,   SPECTRUM/IMAG
##SYMBOL=    X,             R,               I
##VAR_TYPE=  INDEPENDENT,   DEPENDENT,       DEPENDENT
##VAR_FORM=  AFFN,          ASDF,            ASDF
##VAR_DIM=   16384,         16384,           16384
##UNITS=     HZ,            ARBITRARY UNITS, ARBITRARY UNITS
##FACTOR=    0.29402158847633, 1,            1
##FIRST=     4199.25389062931, 0,            0
##LAST=      -617.701793378401, 0,           0
##MIN=       -617.701793378401, -563580,     0
##MAX=       4199.25389062931, 271437649,    0
$$ Real data points
##PAGE= N=1
##DATA TABLE= (X++(R..R)), XYDATA
$$ [...]
$$ plain form
6217 262385 233816 129768 259834 279282 383525 479274 406968 290014 327111 344022 356435
6206 356435 385696 361523 430687 384619 166880 269641 262055 381981 296292 248107 373587
6195 373587 323403 382717 245885 346626 166064 202034 266846 212560 258112 359198 411110
6184 411110 405645 288668 290314 350822 264750 290945 433895 389574 344510 301389 361836 224751
6172 224751 248410 382125 279002 379463 297034 317202 294931 300062 489374 597625 550484
6161 550484 614233 588645 469996 613525 673309 659029 671313 609955 570368 511630 487361
6150 487361 714386 624462 612089 564664 500220 419837 393051 614320 586488 427749 527791
6139 527791 442711 456525 453798 377804 369444 371170 411830 385316 317356 347180 393507 330455
$$ packed form
6217B62385k8569j04048J30066J9448J04243R5749p2306j16954L7097J6911J2413
6206C56435K9261k4173O9164m6068k17739J02761p586J19926q5689m8185J25480
6195C73587n0184N9314j36832J00741j80562L5970O4812n4286M5552J01086N1912
6184D11110n465j16977J646O0508q6072K6195J42950m4321m5064m3121O0447j37085
6172B24751K3659J33715j03123J00461q2429K0168k2271N131J89312J08251m7141
6161E50484O3749k5588j18649J43529N9784j4280J2284o1358l9587n8738k4269
6150D87361K27025q9924j2373m7425o4444q0383k6786K21269k7832j58739J00042
6139E27791q5080J3814k727p5994q360J726M0660k6514o7960K9824M6327o3052
$$ plain form
6127 330455 276498 496256 458017 492062 357152 436933 406650 341140 194564 348917 204613
6116 204613 208981 281451 138267 374770 334723 413945 284507 197199 333929 316012 260548
6105 260548 290542 248129 9759 110061 257969 243235 145749 2653 157951 370352
6095 370352 326282 188816 172686 290999 350443 140700 131905 126522 241358 178114 288015
6084 288015 291238 117456 180737 172291 246055 245975 117935 124444 147620 -4681 -22301 117046
6072 117046 236345 242739 135137 84865 -5427 35518 -56031 5181 131984 305688 234458
6061 234458 169024 39699 99112 78667 206214 102367 9416 -137720 122973 194926 170645
6050 170645 293237 386314 186223 189558 339464 251084 171071 119762 42871 -34803 -74889
$$ packed form
6127C30455n3957K19758l8239L4045j34910P9781l0283o5510j46576J54353j44304
6116B04613M368P2470j43184K36503m0047P9222j29438q7308J36730j7917n5464
6105B60548K9994m2413k38370J00302J47908j4734r7486j43096J55298K12401
6095C70352m4070j37466j6130J18313N9444k09743q795n383J14836o3244J09901
6084B88015L223j73782O3281q446P3764q0j28040O509K3176j52301j7620J39347
6072A17046J19299O394j07602n0272r0292M0945r1549O1212J26803J73704p1230
6061B34458o5434j29325N9413k0445J27547j03847r2951j47136K60693P1953k4281
6050A70645J22592R3077k00091L335J49906q8380q0013n1309p6891p7674m0086
$$ plain form
6039 -74889 -36792 190745 227283 219804 185101 138916 34872 166657 40922 31582 90825
6028 90825 139183 130396 98595 -27265 -8503 123854 -29386 58399 11261 -37205 66323
6017 66323 62612 142970 46610 -9426 77070 30416 84691 138673 108368 153114 160201 -21463
6005 -21463 -53646 9332 -35297 -18586 -115921 -167008 -204776 -41 44394 138459 123807 24388
5993 24388 -55937 8109 36233 3653 82747 116751 51472 -26737 -33213 -2425 -194500 26500
5981 26500 69124 -25507 -219664 -159316 34334 50167 63452 -70832 -47032 63195 123389
5970 123389 -113435 -110272 -85135 67512 17182 -68568 -170869 -125981 36602 17658 -63836
5959 -63836 104809 151557 73608 74176 42405 -52050 158925 222973 72974 41607 73213 180847
$$ packed form
6039g4889L8097K27537L6538p479l4703m6185j04044J31785j25735r340N9243
6028I0825M8358q787l1801j25860J8762J32357j53240Q7785m7138m8466J03528
6017F6323l711Q0358r6360n6036Q6496m6654N4275N3982l0305M4746P087j81664
6005b1463l2183O2978m4629J6711r7335n1087l7768K04735M4435R4065j4652r9419
5993B4388q0325O4046K8124l2580P9094L4004o5279p8209o476L0788j92075K21000
5981B6500M2624r4631j94157O0348J93650J5833J3285j34284K3800J10227O0194
5970A23389k36824L163K5137J52647n0330q5750j02301M4888J62583j8944q1494
5959f3836J68645M6748p7949N68l1771r4455K10975O4048j49999l1367L1606J07634
$$ plain form
5947 180847 -66338 -196356 -142438 -39746 -178942 -48220 81721 52158 -39358 -8285
5937 -8285 -29368 -69735 64922 99266 139710 20259 -131108 -83802 -4768 67319 61457 35554
5925 35554 -88776 -78943 40190 17343 -55627 -29278 66429 -22338 -36785 -18715 89644
5914 89644 -105958 -48229 60958 44216 18110 56794 69170 94261 31045 27747 -15280 -21902
5902 -21902 30910 -65901 -89379 -28659 38431 57092 104347 -193652 -150783 -195296 -62472
5891 -62472 -60228 -56686 158249 78442 -3269 -106035 -105947 -152289 9310 32833 -29854 63953
5879 63953 -18257 -88145 -43365 -8407 -151593 -59000 206920 83773 -41277 -40142 -34408
5868 -34408 -77996 -155271 15902 122466 61870 -34845 -24263 41510 24612 82586 108156
$$ packed form
5947A80847k47185j30018N3918J02692j39196J30722J29941k9563r1516L1073
5937h285k1083m0367J34657L4344M0444j19451j51367M7306P9034P2087n862k5903
5925C5554j24330R833J19133k2847p2970K6349R5707q8767j4447J8070J08359
5914H9644j95602N7729J09187j6742k6106L8684J2376K5091o3216l298m3027o622
5902b1902N2812r6811k3478O0720O7090J8661M7255k97999M2869m4513J32824
5891f2472K244L542K14935p9807q1711j02766Q8m6342J61599K3523o2687R3807
5879F3953q2210o9888M4780L4958j43186R2593K65920j23147j25050J135N734
5868c4408m3588p7275J71173J06564o0596r6715J0582O5773j6898N7974K5570
$$ plain form
5857 108156 71095 73417 35800 128692 66085 -26047 -77996 -98108 52958 27796 6029 -93972
5845 -93972 -37735 -116928 -103652 -129134 -173951 -19962 -3257 51589 -38025 15878 -34184 -30054
5833 -30054 86200 92300 -2908 -101100 -93783 -63093 -237472 -151378 -192424 -122137 41611 54757
5821 54757 91738 -16640 52378 119807 -80343 -107225 -5700 -247217 -185410 -47850 -88905
5810 -88905 49202 -39131 -7161 70365 -10948 -108657 -186983 -139419 -270101 -132864 -13000
5799 -13000 -36349 3061 -66934 121581 48835 122299 66782 -72865 -92962 -12333 15107
5788 15107 -203790 -128277 -76963 -27782 5207 64409 -22713 105703 94457 -100122 -1662
5777 -1662 91806 -101444 7314 40231 -20286 95360 18305 -77386 -70843 -197128 32488
$$ packed form
5857A08156l7061K322l7617R2892o2607r2132n1949k0112J51066k5162k1767j00001
5845i3972N6237p9193J3276k5482m4817J53989J6705N4846q9614N3903n0062M130
5833c0054J16254O100r5208r8192P317L0690j74379Q6094m1046P0287J63748J3146
5821E4757L6981j08378O9018O7429k00150k6882J01525k41517O1807J37560m1055
5810h8905J38107q8333L1970P7526q1313r7709p8326M7564j30682J37237J19864
5799a3000k3349L9410o9995J88515p2746P3464n5517j39647k0097Q0629K7440
5788A5107k18897P5513N1314M9181L2989N9202q7122J28416j1246j94579R8460
5777a662R3468j93250J08758L2917o0517J15646p7055r5691O543j26285K29616
$$ plain form
5766 32488 75414 -48910 -59627 -52616 -87181 -86525 -21877 75893 -137564 -185266 -20758 -77461
5754 -77461 -156716 -24363 85151 68962 155578 45455 -86550 -91753 -61595 -27819 117820
5743 117820 -87782 -42254 56632 172311 39702 -164161 -180341 4308 -37107 -59163 6497
5732 6497 -50641 -39646 -71748 38683 41321 -69243 -25960 -41984 -101246 26991 -25568 -113473
5720 -113473 -221008 -137920 -139265 -72327 -155173 -110955 -128339 -155588 -110007 1818 -30709
5709 -30709 -142488 -111186 -64554 -74742 48533 -131121 -133239 -35809 21486 -55637 -105365
5698 -105365 86155 39237 11189 35826 24224 172836 147886 116188 125320 -30775 -116180
5687 -116180 55690 159059 129150 193663 272969 267660 340389 287815 81703 114513 55262
$$ packed form
5766C2488M2926j24324j0717P011l4565O56O4648R7770k13457m7702J64508n6703
5754g7461p9255J32353J09514j6189Q6616j10123j32005n203L0158L3776J45639
5743A17820k05602M5528R8886J15679j32609k03863j6180J84649m1415k2056O5660
5732F497n7138J0995l2102J10431K638j10564M3283j6024n9262J28237n2559q7905
5720a13473j07535Q3088j345O6938q2846M4218j7384k7249M5581J11825l2527
5709c0709j11779L1302M6632j0188J23275j79654k118R7430N7295p7123m9728
5698a05365J91520m6918k8048K4637j1602J48612k4950l1698R132j56095q5405
5687a16180J71870J03369k9909O4513P9306n309P2729n2574k06112L2810n9251
$$ plain form
5676 55262 107406 299059 209700 81602 211813 78141 44758 -6264 70097 196516 206317
5665 206317 183572 226925 195638 165391 213678 68394 -10328 144874 71209 152100 2262
5654 2262 59883 -22695 75021 107085 28500 103775 99070 -82395 -114696 165313 218447 80445
5642 80445 47995 44806 67462 160742 144110 143437 213963 223401 317079 222544 125642 168012 181014
5629 181014 232975 305632 303526 196819 96837 123384 207619 185453 105474 124376 73670 90424
5617 90424 156024 67772 210395 111312 1640 162467 126291 204388 235531 364192 381712
5606 381712 412399 369880 376111 238659 146476 233357 124487 272027 225408 171359 206317
5595 206317 192034 210651 81325 42949 145875 224434 184059 110874 189346 227527 140020
$$ packed form
5676E5262N2144J91653q9359j28098J30211j33672l3383n1022P6361J26419R801
5665B06317k2745M3353l1287l0247M8287j45284p8722J55202p3665Q0891j49838
5654B262N7621q2578R7716L2064p8585P5275m705j81465l2301K80009N3134j38002
5642H0445l2450l189K2656R3280j6632o73P0526R438R3678r4535r6902M2370J3002
5629A81014N1961P2657k106j06707r9982K6547Q4235k2166p9979J8902n0706J6754
5617I0424O5600q8252J42623r9083j09672J60827l6176P8097L1143J28661J7520
5606C81712L0687m2519O231j37452r2183Q6881j08870J47540m6619n4049L4958
5595B06317j4283J8617j29326l8376J02926P8559m0375p3185P8472L8181q7507
$$ plain form
5584 140020 148474 218183 87948 23885 42080 101495 120965 140999 83497 30455 119053 147789
5572 147789 54619 210572 121650 188947 302240 174437 99142 24228 68279 169930 60517
5561 60517 -10071 78514 195992 124699 123894 45495 93730 140370 133572 135608 92498 33901
5549 33901 -34627 -56240 9350 158666 128085 36304 44222 158725 148853 75383 56707 180754
5537 180754 177738 85182 112696 188283 146322 66365 86932 120108 217826 156213 53993 -109831
5525 -109831 -27886 -178604 -174804 -57145 -130627 -27401 64948 112913 108965 51486 -8363
5514 -8363 23787 148815 65469 92041 142750 97371 -34990 -95096 -122226 -97963 -4048 -80079
5502 -80079 -247827 -87277 -8447 -45603 -54281 -15464 101627 -43806 -25301 72125 53769
$$ packed form
5584A40020Q454O9709j30235o4063J8195N9415J9470K0034n7502n3042Q8598K8736
5572A47789r3170J55953q8922O7297J13293j27803p5295p4914M4051J01651j09413
5561F0517p0588Q8585J17478p1293q05p8399M8235M6640o798K036m3110n8597
5549C3901o8528k1613O5590J49316l0581r1781P918J14503r872p3470j8676J24047
5537A80754l016r2556K7514P5587m1961p9957K0567L3176R7718o1613j02220j63824
5525a09831Q1945j50718L800J17659p3482J03226R2349M7965l948n7479n9849
5514h363L2150J25028q3346K6572N0709m5379j32361o0106k7130K4263R3915p6031
5502h0079j67748J60550P8830l7156q678L8817J17091j45433J8505R7426j8356
$$ plain form
5491 53769 55167 120006 -26263 -79584 110825 91165 79301 140117 155120 41356 1761
5480 1761 -31142 -32455 28158 -21346 4973 87945 49679 -26724 25963 158920 149995 89080
5468 89080 78365 -64095 60587 -81579 -95513 -78962 5126 118670 144163 107019 -95666
5457 -95666 -52146 -10201 105355 207221 65540 28782 -152862 -140227 -63015 24263 -64778
5446 -64778 -2306 22882 128720 62810 68965 58182 -138715 43803 28392 -46734 -7214
5435 -7214 27229 44726 146471 16827 -74334 44317 86774 108520 50957 -4623 -5887 -21108
5423 -21108 39897 17530 108788 15713 -5155 -39062 -39398 86271 40540 -78615 -177149 -104606
5411 -104606 -129650 15001 -56544 -69055 -14724 19264 41359 -101756 -21569 24477 29842
$$ packed form
5491E3769J398O4839j46269n3321J90409j9660j1864O0816J5003j13764l9595
5480A761l2903j313O0613m9504K6319Q2972l8266p6403N2687J32957q925o0915
5468H9080j0715j42460J24682j42166j3934J6551Q4088J13544K5493l7144k02685
5457i5666M3520M1945J15556J01866j41681l6758j81644J2635P7212Q7278q9041
5446f4778O2472K5188J05838o5910O155j0783j96897J82518j5411p5126L9520
5435g214L4443J7497J01745j29644r1161J18651M2457K1746n7563n5580j264j5221
5423b1108O1005k2367R1258r3075k0868l3907l36J25669m5731j19155r8534P2543
5411a04606k5044J44651p1545j2511N4331L3988K2095j43115Q0187M6046N365
$$ plain form
5400 29842 -44004 59768 47121 -33544 -28878 -35048 -39370 858 -102123 -269053 -69269 -211316
5388 -211316 -239536 -50189 -97376 -108461 -33154 -52947 -175996 -263903 -83886 -20798 86710
5377 86710 -22867 30559 106187 109741 157098 42265 105150 90571 37239 43462 -1379 -7009
5365 -7009 136606 143908 -47132 -3695 67749 32509 89928 17375 52541 99636 11894 -87854
5353 -87854 -147601 -118767 -27473 -122177 -80848 -112310 2138 82913 -76243 -35980 73662
5342 73662 37002 598 -113126 -117572 -76128 -93973 94245 129925 -29692 -10878 -79337
5331 -79337 -225796 -54702 -76 -21241 -41234 -26017 165358 56380 -2718 -37684 -19850
5320 -19850 30691 -25377 22176 42602 -80495 -45708 -102055 -121388 3903 10247 26768 -34209
$$ packed form
5400B9842p3846J03772j2647q0665M666o170m322M0228j02981j66930J99784j42047
5388b11316k8220J89347m7187j1085P5307j9793j23049q7907J80017O3088J07508
5377H6710j09577N3426P5628L554M7357j14833O2885j4579n3332O223m4841n630
5365g009J43615P302j91040M3437P1444l5240N7419p2553L5166M7095q7742r9748
5353h7854n9747K8834R1294r4704M1329l1462J14448Q0775j59156M0263J09642
5342G3662l6660l6404j13724m446M1444j7845J88218L5680j59617J8814o8459
5331g9337j46459J71094N4626k1165j9993J5217J91375j08978n9098l4966J7834
5320a9850N0541n6068M7553K0426j23097L4787n6347j9333J25291O344J6521o0977
$$ plain form
5308 -34209 -48244 62396 34792 90689 171525 129568 -11266 54869 102583 55673 180934
5297 180934 52301 -9218 59067 155790 63957 67649 159422 145265 115230 145824 214718 51969
5285 51969 126565 189565 27233 221907 209651 80438 32501 -3730 -544 75650 81509 33488
5273 33488 101249 25614 -135050 -73920 -119571 15029 142943 -15763 55943 -70171 74081
5262 74081 78347 108869 -64639 -66691 -48110 -79939 108936 117020 86815 81996 34839 141512
5250 141512 142545 161616 161996 109767 174375 6497 131397 173500 165257 46833 73503 104537
5238 104537 -39232 10780 179608 316014 93006 39935 111927 -30306 -15142 73163 170279
5227 170279 123681 195738 259226 124837 162107 143806 194614 218217 155805 134121 -18210
$$ packed form
5308c4209j4035J10640k7604N5897Q0836m1957j40834O6135M7714m6910J25261
5297A80934j28633o1519O8285R6723r1833L692R1773j4157l0035L0594O8894j62749
5285E1969P4596O3000j62332J94674j2256j29213m7937l6231L186P6194N859m8021
5273C3488O7761p5635j60664O1130m5651J34600J27914j58706P1706j26114J44252
5262G4081M266L0522j73508k052J8581l1829J88875Q084l0205m819m7157J06673
5250A41512J033J9071L80n2229O4608j67878J24900M2103q243j18424K6670L1034
5238A04537j43769N0012J68828J36406k23008n3071P1992j42233J5164Q8305R7116
5227A70279m6598P2057O3488j34389L7270j8301N0808K3603o2412k1684j52331
$$ plain form
5216 -18210 67192 304067 365536 269843 231411 240916 192391 188426 115583 135737 104193 76259
5204 76259 220782 278132 348838 117779 110854 145108 121832 102976 183340 152669 129680 83252
5192 83252 136769 65441 15700 138530 243884 339892 201607 194503 196275 261364 252723 251621
5180 251621 223463 200429 269627 421026 444403 349178 284785 246730 282624 351199 365216
5169 365216 304432 410594 517062 416859 532245 290792 398052 405073 418741 280069
5159 280069 376885 480279 332357 454742 537135 443642 324827 472695 538256 549875 579770
5148 579770 509797 381651 479585 403806 529412 498031 658007 763664 722003 607742 585462
5137 585462 649631 623574 576778 603900 644405 503183 474461 592185 523842 437506 539502
$$ packed form
5216a8210Q5402K36875O1469r5693l8432R505m8525l965p2843K0154l1544k7934
5204G6259J44523N7350P0706k31059o925L4254k3276j8856Q0364l0671k2989m6428
5192H3252N3517p1328m9741J22830J05354R6008j38285p104J772O5089q641j102
5180B51621k8158k3034O9198J51399K3377r5225o4393l8055L5894O8575J4017
5169C65216o0784J06162J06468j00203J15386k41453J07260P021J3668j38672
5159B80069R6816J03394j47922J22385Q2393r3493j18815J47868O5561J1619K9895
5148E79770o9973j28146R7934p5779J25606l1381J59976J05657m1661j14261k2280
5137E85462O4169k6057m6796K7122M0505j41222k8722J17724o8343q6336J01996
$$ plain form
5126 539502 541905 595676 559512 615265 563466 535448 597464 564066 581170 561971 480157 445293
5114 445293 522882 512580 519775 577329 644105 494172 547274 404201 433544 500457 488897
5103 488897 516135 431289 449725 544368 412082 391062 426404 609897 554823 630518 572895
5092 572895 657239 574567 685771 859573 753720 674607 552481 566051 527261 554562 532840
5081 532840 610164 633552 651305 540478 607849 585686 545219 573930 617503 616636 529187 514408
5069 514408 594355 589188 621782 484591 536365 536101 638451 505739 685575 614953 628188
5058 628188 775094 810160 855731 728793 814368 788834 806807 951168 779854 835607 852300
5047 852300 953306 871801 779085 880207 878122 914085 978062 1030368 1051195 1123119 1158095
$$ packed form
5126E39502K403N3771l6164N5753n1799k8018O2016l3398J7104j9199q1814l4864
5114D45293P7589j0302P195N7554O6776j49933N3102j43073K9343O6913j1560
5103D88897K7238q4846J8436R4643j32286k1020L5342J83493n5074P5695n7623
5092E72895Q4344q2672J11204J73802j05853p9113j22126J3570l8790K7301k1722
5081E32840P7324K3388J7753j10827O7371k2163m0467K8711M3573q67q7449j4779
5069E14408P9947n167L2594j37191N1774k64J02350j32712J79836p0622J3235
5058F28188J46906L5066M5571j26938Q5575k5534J7973J44361j71314N5753J6693
5047H52300J01006q1505r2716J01122k085L5963O3977N2306K0827P1924L4976
$$ plain form
5036 1158095 1032273 1051458 1163294 1161700 1297319 1139522 1134370 1157079 1148124 1312572 1331794
5025 1331794 1334842 1449017 1412276 1360498 1432575 1499085 1483012 1558169 1653346 1608549 1649891
5014 1649891 1604657 1638566 1771871 1738329 1752141 1659546 1748799 1554388 1671194 1835979 1883913
5003 1883913 1905248 1825090 1984238 1977318 1964909 2004319 2258122 2207429 2216346 2306084 2222668
4992 2222668 2342716 2389287 2356773 2478540 2532246 2753962 2774864 2669011 2908048 3254243
4982 3254243 3215574 3273851 3325468 3421570 3680740 3761528 3809559 3961208 4158481 4249487 4512706
4971 4512706 4721814 4750519 4940663 5304150 5530008 5589694 5806802 6373851 6753083 6927279
4961 6927279 7359261 7738493 8086761 8612517 9217967 9731160 10081055 10880753 11746159 12436495
$$ packed form
5036A158095j25822J9185J11836j594J35619j57797n152K2709q955J64448J9222
5025A331794L048J14175l6741n1778P2077O6510j6073P5157R5177m4797M1342
5014A649891m5234L3909J33305l3542J3812r2595Q9253j94411J16806J64785M7934
5003A883913K1335q0158J59148o920j2409L9410K53803n0693Q917Q9738q3416
4992B222668J20048M6571l2514J21767N3706K21716K0902j05853K39037L46195
4982C254243l8669N8277N1617R6102K59170Q0788M8031J51649J97273R1006K63219
4971D512706K09108K8705J90144L63487K25858N9686K17108N67049L79232J74196
4961F927279M31982L79232L48268N25756O05450N13193L49895P99698Q65406O90336
$$ plain form
4951 12436495 13047079 13846283 14733037 15419850 15923418 16134204 16311077 16289978 16181430 16158207
4941 16158207 16195020 16406013 16641375 17060440 17477900 18084381 18989591 19960421 21093486
4932 21093486 22288996 23593535 25254266 26830883 28239215 29226751 29843926 29677516 28920701
4923 28920701 27634593 26122308 25007979 24005663 23204035 22763100 22553359 22551186 22715300
4914 22715300 23086432 23627126 24228944 25220455 26355740 27526524 28799182 29882708 30140370
4905 30140370 29831883 28861018 27550513 26274325 24808388 23725559 22853038 22117013 21912172
4896 21912172 21812177 21853761 22072297 22292016 22800935 23401468 24242293 25161495 26207354 27155465
4886 27155465 27888261 28287196 27858905 26654785 25032174 23281224 21850979 20605055 19931606
$$ packed form
4951A2436495O10584P99204Q86754O86813N03568K10786J76873k1099j08548k3223
4941A6158207L6813K10993K35362M19065M17460O06481R05210R70830J133065
4932B1093486J195510J304539J660731J576617J408332R87536O17175j66410p56815
4923B8920701j286108j512285j114329j002316q01628m40935k09741k173J64114
4914B2715300L71132N40694O01818R91511J135285J170784J272658J083526K57662
4905C0140370l08487r70865j310505j276188j465937j082829q72521p36025k04841
4896B1912172r9995M1584K18536K19719N08919O00533Q40825R19202J045859R48111
4886B7155465P32796L98935m28291j204120j622611j750950j430245j245924o73449
$$ plain form
4877 19931606 19725953 19585743 19420422 19458565 19527382 19730206 20079294 20379916 20767880 21298012
4867 21298012 21978268 22632606 22744340 22397944 21429335 19942213 18520719 17388452 16399015
4858 16399015 15327822 14670710 14223270 13954512 13741367 13643079 13555628 13496875 13408952 13112207
4848 13112207 12857613 12612814 12002453 11587540 11038196 10439953 10007014 9438221 8877524
4839 8877524 8567849 8289454 8244645 8077785 7895263 7864848 7905305 8043718 7928699 7709424
4829 7709424 7607765 7470125 7162171 6951852 6696385 6329860 6144058 5996298 5790182 5601720
4819 5601720 5559807 5540467 5327561 5252183 5069880 5231254 5100374 4891526 4943629 4978695
4809 4978695 4967909 5056919 5178648 5106708 5248395 5147190 5147000 5038358 5166805 5226986 5203276
$$ packed form
4877A9931606k05653j40210j65321L8143O8817K02824L49088L00622L87964N30132
4867B1298012O80256O54338J11734l46396r68609j487122j421494j132267r89437
4858A6399015j071193o57112m47440k68758k13145r8288q7451n8753q7923k96745
4848A3112207k54594k44799o10361m14913n49344n98243m32939n68793n60697
4839H877524l09675k78395m4809j66860j82522l0415M0457J38413j15019k19275
4829G709424j01659j37640l07954k10319k55467l66525j85802j47760k06116j88462
4819E601720m1913j9340k12906p5378j82303J61374j30880k08848N2103L5066
4809D978695j0786Q9010J21729p1940J41687j01205j90j08642J28447O0181k3710
$$ plain form
4798 5203276 5214446 5294856 5403410 5526295 5527005 5615802 5715110 5766405 5864159 5830040 6014705
4787 6014705 6051268 6237098 6494941 6740655 7042018 7100634 7274019 7463901 7693234 7864095
4777 7864095 8048752 8375270 8827431 9159301 9481243 10010576 10461168 10907140 11308297 11864844
4767 11864844 12542332 13176254 13794072 14766859 15807035 16754162 17892891 19154373 20529064
4758 20529064 21726457 22831910 23412116 23419963 23126825 22812001 22402219 21687816 21251775
4749 21251775 21247002 21115196 21310466 21788561 22351494 23139626 23970609 25082575 26505109
4740 26505109 28100689 30074945 31955475 33534682 34047093 33368763 32183798 30433526
4732 30433526 28788150 27261564 25997969 25320019 24547689 24011129 23865764 23479064 23325709
$$ packed form
4798E203276J1170Q0410J08554J22885P10Q8797R9308N1295R7754l4119J84665
4787F014705L6563J85830K57843K45714L01363N8616J73385J89882K29333J70861
4777G864095J84657L26518M52161L31870L21942N29333M50592M45972M01157N56547
4767A1864844O77488O33922O17818R72787J040176R47127J138729J261482J374691
4758B0529064J197393J105453N80206P847k93138l14824m09782p14403m36041
4749B1251775m773j31806J95270M78095N62933P88132Q30983J111966J422534
4740B6505109J595580J974256J880530J579207N12411o78330j184965j750272
4732C0433526j645376j526586j263595o77950p72330n36560j45365l86700j53355
$$ plain form
4723 23325709 23108796 22998127 22992349 23034479 23110444 23366280 23711283 23890253 24067462 24372155
4713 24372155 24174599 24134752 24259179 24454387 25075018 25820354 26583752 26910157 26495094 25478921
4703 25478921 23906000 22503463 21165566 20137624 19397803 18566986 18164066 17729957 17670643
4694 17670643 17976677 18184555 18717599 19575671 20662356 22098229 23804388 25529297 26758107
4685 26758107 26951694 26171584 24892972 23298183 21646611 20092420 18377136 17134268
4677 17134268 16294396 15563601 14938379 14615484 14227586 14126547 14153172 14058276 14461345 14750815
4667 14750815 15132164 15761793 16119750 16342710 16346695 16148976 15646957 14974981 14076928 13191173
4657 13191173 12427396 11652958 11157157 10757871 10497162 10324348 10264692 10257145 10223606 10278699
$$ packed form
4723B3325709k16913j10669n778M2130P5965K55836L45003J78970J77209L04693
4713B4372155j97556l9847J24427J95208O20631P45336P63398L26405m15063j016173
4703B5478921j572921j402537j337897j027942p39821q30817m02920m34109n9314
4694A7670643L06034K07878N33044Q58072J086685J435873J706159J724909J228810
4685B6758107J93587p80110j278612j594789j651572j554191j715284j242868
4677A7134268q39872p30795o25222l22895l87898j01039K6625r4896M03069K89470
4667A4750815L81349O29629L57957K22960L985j97719n02019o71976q98053q85755
4657A3191173p63777p74438m95801l99286k60709j72814n9656p547l3539N5093
$$ plain form
4647 10278699 10404460 10350688 10376889 10218430 10021427 9824180 9785343 9714329 9787135 9948474
4637 9948474 9950048 10042463 9968992 9961432 10044729 10140948 10195233 10042075 9874856 9783876 9585491
4626 9585491 9290261 9189118 9216624 9162532 9149317 9143912 9171982 9254213 9478428 9709915 9908465
4615 9908465 10249970 10338532 10210264 10158656 10041154 9872986 9764955 9966232 10190994 10273815
4605 10273815 10383824 10536023 10669909 10998351 11294469 11685193 12186183 12805961 13414893
4596 13414893 13985183 14717359 15559715 16538894 17636837 18990120 20429611 21725315 22766895
4587 22766895 23476840 23551994 23093826 22769386 22676644 22539893 22746743 23037123 23427523 24040470
4577 24040470 25006030 26057658 27763833 29431728 31240014 33587610 35595145 36506672
$$ packed form
4647A0278699J25761n3772K6201j58459j97003j97247l8837p1014P2806J61339
4637I948474J574R2415p3471p560Q3297R6219N4285j53158j67219r0980j98385
4626I585491k95230j01143K7506n4092j3215n405K8070Q2231K24215K31487J98550
4615I908465L41505Q8562j28268n1608j17502j68168j08031K01277K24762Q2821
4605A0273815J10009J52199J33886L28442K96118L90724N00990O19778O08932
4596A3414893N70290P32176Q42356R79179J097943J353283J439491J295704J041580
4587B2766895P09945P5154m58168l24440r2742j36751K06850K90380L90400O12947
4577B4040470R65560J051628J706175J667895J808286K347596K007535R11527
$$ plain form
4569 36506672 36550346 36077339 34900553 33572817 32202993 31054209 30569741 30502254 30959577
4560 30959577 31294555 31539579 31537803 31135313 30921332 30874804 30997787 31306008 31310013 30878654
4550 30878654 30109012 28923515 27671171 26916539 26431197 26647958 26948970 27429148 27764402
4541 27764402 27259358 26448257 25265267 23755204 21917281 20501316 19358182 18263709
4533 18263709 17557237 16916330 16443341 16289212 16017576 15708076 15797143 15996978 16270995 16647262
4523 16647262 16463803 15923066 14826187 13776901 12595718 11478363 10609852 10061671 9595070
4514 9595070 8872850 8419920 8061820 7601519 7258068 6809133 6671955 6413071 6190859 5831448
4504 5831448 5760768 5501065 5398612 5213063 4979324 4874572 4674182 4618108 4581082 4586634
$$ packed form
4569C6506672M3674m73007j176786j327736j369824j148784m84468o7487M57323
4560C0959577L34978K45024j776m02490k13981m6528J22983L08221M005m31359
4550C0878654p69642j185497j252344p54632m85342K16761L01012M80178L35254
4541B7764402n05044q11101j182990j510063j837923j415965j143134j094473
4533A8263709p06472o40907m72989j54129k71636l09500Q9067J99835K74017L76267
4523A6647262j83459n40737j096879j049286j181183j117355q68511n48181m66601
4514I595070p22220m52930l58100m60301l43451m48935j37178k58884k22212l59411
4504E831448p0680k59703j02453j85549k33739j04752k00390n6074l7026N552
$$ plain form
4494 4586634 4423427 4283728 4266391 4181413 3981048 3809374 4001341 4044415 3833141 3746078
4484 3746078 3697624 3738909 3619943 3504842 3401553 3413822 3299320 3404680 3316802 3245946
4474 3245946 3162021 3216360 3278744 3225978 3161118 3189659 3235647 3434063 3429489 3355339 3400232
4463 3400232 3478827 3529431 3425700 3314979 3333716 3422850 3405533 3469362 3428549 3383204 3618170
4452 3618170 3778081 3789768 3907146 3997020 4143889 4031509 4047162 4256998 4386145 4565514
4442 4565514 4698851 4972150 4925050 4791266 4841736 4925648 4879573 4858645 4797893 4617768 4858403
4431 4858403 4898189 4713727 4659273 4701882 4812095 4721881 4625528 4659289 4828547 5009898 5014254
4420 5014254 5057560 5210116 5446711 5751476 6003643 6207368 6491643 6446202 6207806 5904181
$$ packed form
4494D586634j63207j39699j7337q4978k00365j71674J91967M3074k11274q7063
4484C746078m8454M1285j18966j15101j03289J2269j14502J05360q7878p0856
4474C245946q3925N4339O2384n2766o4860K8541M5988J98416m574p4150M4893
4463C400232P8595N0604j03731j10721J8737Q9134j7317O3829m0813m5345K34966
4452C618170J59911J1687J17378Q9874J46869j12380J5653K09836J29147J79369
4442D565514J33337K73299m7100j33784N0470Q3912m6075k0928o0752j80125K40635
4431D858403L9786j84462n4454M2609J10213r0214r6353L3761J69258J81351M356
4420E014254M3306J52556K36595L04765K52167K03725K84275m5441k38396l03625
$$ plain form
4410 5904181 5767981 5539664 5424775 5313536 4902160 4994660 4820204 4555825 4468340 4555870
4400 4555870 4569512 4501353 4456846 4484021 4515939 4550066 4706222 4940036 4979246 5089534 5177616
4389 5177616 5145021 5185785 5073430 4930593 4791168 4861782 4664259 4563738 4609238 4662270
4379 4662270 4906227 4963398 5013250 5186643 5220932 5550681 5917000 6102802 6373293 7089176
4369 7089176 7741852 8652820 9710231 10561293 11039450 10913545 10447087 9733039 9132275
4360 9132275 8631217 8496279 8271233 8068939 8044536 8181761 8190947 8474471 8835291 9313149
4350 9313149 9944407 10679145 11580224 12605550 14106741 15700700 17928503 20664435 23317865
4341 23317865 25125728 25024992 23053411 20741955 18534764 16523374 14884012 13764524
$$ packed form
4410E904181j36200k28317j14889j11239m11376R2500j74456k64379q7485Q7530
4400D555870J3642o8159m4507K7175L1918L4127J56156K33814L9210J10288Q8082
4389E177616l2595M0764j12355j42837j39425P0614j97523j00521M5500N3032
4379D662270K43957N7171M9852J73393L4289L29749L66319J85802K70491P15883
4369G089176O52676R10968J057411Q51062M78157j25905m66458p14048o00764
4360I132275n01058j34938k25046k02294k4403J37225R186K83524L60820M77858
4350I313149O31258P34738R01079J025326J501191J593959K227803K735932K653430
4341B3317865J807863j00736j971581k311456k207191k011390j639362j119488
$$ plain form
4333 13764524 12767336 12134709 11723240 11391481 11338145 11419897 11565597 11732441 12189655 12661505
4323 12661505 13460832 14539114 15897257 18003026 20535382 23343066 25407119 25502815 23903886
4314 23903886 21441280 18979700 16568634 14757819 13370184 12198189 11314667 10488137
4306 10488137 9836449 9227244 8942423 8752290 8541426 8328103 8427326 8480106 8660111 8859847
4296 8859847 9314818 10209759 10955965 11651228 11856993 11635391 10895561 10121737 9483582 8810614
4286 8810614 8504398 8403543 8272000 8218227 7887221 7738546 7326168 6996514 6691104 6215783
4276 6215783 5821797 5700590 5489818 5393426 5304147 5202248 5258427 5272243 5345901 5160599
4266 5160599 5381421 5708824 5929812 6135188 6593527 6896643 7423358 7745970 7944107 8096248
$$ packed form
4333A3764524r97188o32627m11469l31759n3336Q1752J45700J66844M57214M71850
4323A2661505P99327J078282J358143K105769K532356K807684K064053R5696j598929
4314B3903886k462606k461580k411066j810815j387635j171995q83522q26530
4306A0488137o51688o09205k84821j90133k10864k13323R9223N2780J80005J99736
4296H859847M54971Q94941P46206O95263K05765k21602p39830p73824o38155o72968
4286H810614l06216j00855j31543n3773l31006j48675m12378l29654l05410m75321
4276F215783l93986j21207k10772r6392q9279j01899N6179J3816P3658j85302
4266E160599K20822L27403K20988K05376M58339L03116N26715L22612J98137J52141
$$ plain form
4256 8096248 7946312 7666062 7300287 7089505 6832721 6596892 6221523 5926950 5599671 5279740
4246 5279740 5071760 4916756 4913266 5035426 5134647 5307240 5371516 5618407 5987013 6344012
4236 6344012 6650659 6949009 7156871 7319516 7473886 7298561 7003797 6551246 6144294 5702623
4226 5702623 5382523 5049057 4745077 4624057 4208446 4010415 3799897 3662497 3457196 3409839
4216 3409839 3154844 3050181 3153787 3168184 3335662 3356514 3321958 3349055 3442543 3348131 3471456
4205 3471456 3466289 3189525 3173375 2955561 2776032 2640328 2594066 2563746 2524914 2494291 2307026
4194 2307026 2306179 2213869 2173334 2072442 2240900 2441369 2153643 2179566 2317963 2223312 2202884
4183 2202884 2125918 1950007 2049806 2191892 1958677 2025887 1878386 1763424 1959534 2077477
$$ packed form
4256H096248j49936k80250l65775k10782k56784k35829l75369k94573l27279l19931
4246E279740k07980j55004l490J22160R9221J72593O4276K46891L68606L56999
4236F344012L06647K98350K07862J62645J54370j75325k94764m52551m06952m41671
4226E702623l20100l33466l03980j21020m15611j98031k10518j37400k05301m7357
4216C409839k54995j04663J03606J4397J67478K0852l4556K7097R3488r4412J23325
4205C471456n167k76764j6150k17814j79529j35704m6262l0320l8832l0623j87265
4194B307026q47r2310m0535j00892J68458K00469k87726K5923J38397r4651k0428
4183B202884p6966j75911R9799J42086k33215O7210j47501j14962J96110J17943
$$ plain form
4173 2077477 2107314 2078509 1939978 1907273 1947425 1956019 2214844 2312253 2185209 2153369 2179521
4162 2179521 2254700 2246086 2151841 2258796 2429070 2407476 2437780 2525112 2521469 2438479 2472452
4151 2472452 2479965 2569027 2627937 2763979 2975501 2984539 3054030 2986764 3230828 3669562 4019478
4140 4019478 4134907 4084291 4078565 3959808 4034359 3784780 3870417 4022390 4122422 4270165
4130 4270165 4249975 4201607 4150889 4340585 4567206 4710500 5058478 5459334 6070801 6579586
4120 6579586 6873754 6946531 6660414 6160746 6002472 5560588 5400428 5383184 5433074 5393102
4110 5393102 5392713 5428720 5523511 5726503 5812386 5849973 5926432 6036612 6296055 6463364 6564137
4099 6564137 6743152 6797362 7298533 7566992 7757177 8117772 8423271 8923204 9394670 9680477
$$ packed form
4173B077477K9837k8805j38531l2705M0152Q594K58825R7409j27044l1840K6152
4162B179521P5179q614r4245J06955J70274k1594L0304Q7332l643q2990L3973
4151B472452P513Q9062N8910J36042K11522R038O9491o7266K44064M38734L49916
4140D019478J15429n0616n726j18757P4551k49579Q5637J51973J00032J47743
4130D270165k0190m8368n0718J89696K26621J43294L47978M00856O11467N08785
4120F579586K94168P2777k86117m99668j58274m41884j60160j7244M9890l9972
4110E393102l89L6007R4791K02992Q5883L7587P6459J10180K59443J67309J00773
4099F564137J79015N4210N01171K68459J90185L60595L05499M99933M71466K85807
$$ plain form
4089 9680477 10285823 10699100 11372262 12092681 12828987 13737481 15161768 16379580 17844859
4080 17844859 19699317 21949295 24452045 27922851 32312648 38247561 45877310 55034671
4072 55034671 61270944 58231718 49639081 40731648 34204947 29519330 25984086 23253976
4064 23253976 21171201 19418474 17986836 17021865 15968132 15321371 14859297 14149989 13616453
4055 13616453 13280208 13017090 13129273 13062500 13022545 13035363 13238979 13436775 13709507 14059208
4045 14059208 14480504 15089262 15618773 16190467 16832291 17452297 18295476 18922460 19647870
4036 19647870 20113941 21017735 22295766 23892392 25929134 28210620 30215964 31881904
4028 31881904 34066004 37363586 41746750 48029608 56282816 66119921 70758497 68423104
$$ packed form
4089I680477O05346M13277O73162P20419P36306R08494J424287J217812J465279
4080A7844859J854458K249978K502750L470806M389797N934913P629749R157361
4072E5034671O236273l039226q592637q907433o526701m685617l535244k730110
4064B3253976k082775j752727j431638r64971j053733o46761m62074p09308n33536
4055A3616453l36245k63118J12183o6773l9955J2818K03616J97796K72732L49701
4045A4059208M21296O08758N29511N71694O41824O20006Q43179O26984P25410
4036A9647870M66071R03794J278031J596626K036742K281486K005344J665940
4028C1881904K184100L297582M383164O282858Q253208R837105M638576k335393
$$ plain form
4020 68423104 62431485 54638114 47993616 43081362 39963326 37958499 36833520 36298212
4012 36298212 36007489 35850959 35434337 34285863 33136609 31981016 30887900 30267506 30077895
4003 30077895 29881857 30093906 30473560 31349210 32507294 33894658 35777321 37909854 39852729
3994 39852729 41714380 43134816 44020011 43961761 43118736 41247592 39079529 36749231 34918694
3985 34918694 33320242 32078242 31524107 31094295 30805628 31104423 31501300 32117887 33253024
3976 33253024 34600597 35762096 36718074 36916007 36240935 35269629 33539198 31403161 28890215
3967 28890215 26481760 24424533 22672294 21191232 19884331 18934265 18390149 17795784 17311171
3958 17311171 16993115 16938469 16976404 17208320 17344636 16871367 16222346 15361464 14377363 13425477
$$ packed form
4020F8423104n991619p793371o644498m912254l118036k004827j124979n35308
4012C6298212k90723j56530m16622j148474j149254j155593j093116o20394j89611
4003C0077895j96038K12049L79654Q75650J158084J387364J882663K132533J942875
3994C9852729J861651J420436Q85195n8250q43025j871144k168063k330298j830537
3985C4918694j598452j242000n54135m29812k88667K98795L96877O16587J135137
3976C3253024J347573J161499R55978J97933o75072r71306j730431k136037k512946
3967B8890215k408455k057227j752239j481062j306901r50066n44116n94365m84613
3958A7311171l18056n4646L7935K31916J36316m73269o49021q60882r84101r51886
$$ plain form
3948 13425477 12532691 11652754 10994646 10344525 9705543 9007570 8636060 8186751 7644826
3939 7644826 7138975 6939822 6664868 6333133 6159219 5929653 5827058 5627171 5548037 5257235
3929 5257235 5124956 5052600 4899745 4741191 4677847 4695173 4640683 4464933 4364195 4422636
3919 4422636 4459943 4442859 4276023 4162051 4098553 4132038 4285691 4274037 4180270 4342616 4553990
3908 4553990 4611552 5083359 5345231 5321995 5473815 5539006 5262939 5200012 5061836 5069294 5082070
3897 5082070 5050504 5213174 5181184 5394597 5473236 5475678 5655047 5726084 5701645 5644268 5695550
3886 5695550 5555021 5325284 5222924 4997896 4766347 4599736 4554015 4484913 4303253 4257053
3876 4257053 4448406 4477741 4539729 4577936 4610671 4320146 3997554 3733634 3364750 3169848
$$ packed form
3948A3425477q92786q79937o58108o50121o38982o97973l71510m49309n41925
3939G644826n05851j99153k74954l31735j73914k29566j02595j99887p9134k90802
3929E257235j32279p2356j52855j58554o3344J7326n4490j75750j00738N8441
3919D422636L7307j7084j66836j13972o3498L3485J53653j1654r3767J62346K11374
3908D553990N7562M71807K61872k3236J51820O5191k76067o2927j38176P458J2776
3897E082070l1566J62670l1990K13413P8639K442J79369P1037k4439n7377N1282
3886E695550j40529k29737j02360k25028k31549j66611m5721o9102j81660m6200
3876D257053J91353K9335O1988L8207L2735k90525l22592k63920l68884j94902
$$ plain form
3866 3169848 3005121 2927056 2721112 2643055 2474706 2486797 2456248 2404448 2330378 2383984 2254491
3855 2254491 2102035 2140626 2017298 1950946 1943650 1959894 1982914 2003435 1897268 1813919 1766780
3844 1766780 1734335 1864297 1799452 1888776 1960834 1940589 2040784 2071941 2003593 1998433 2070774
3833 2070774 1929100 1839931 1742334 1803962 1783477 1636424 1583355 1568418 1501635 1522504 1494904
3822 1494904 1582979 1523161 1455393 1511521 1566403 1332069 1373518 1419839 1364236 1363193 1238184
3811 1238184 1247234 1128835 1038253 1059358 1204180 1174887 1169013 1123377 1228547 1075845 994505
3800 994505 1051208 1038879 1070312 1037632 1063812 1141479 1123389 1185303 1090203 1172623 1320232
3789 1320232 1345502 1342377 1280147 1312195 1432123 1412838 1391923 1428311 1332105 1443453 1330412
$$ packed form
3866C169848j64727p8065k05944p8057j68349J2091l0549n1800p4070N3606j29493
3855B254491j52456L8591j23328o6352p296J6244K3020K0521j06167q3349m7139
3844A766780l2445J29962o4845Q9324P2058k0245J00195L1157o8348n160P2341
3833B070774j41674q9169r7597O1628k0485j47053n3069j4937o6783K0869k7600
3822A494904Q8075n9818o7768N6128N4882k34334M1449M6321n5603j043j25009
3811A238184R050j18399r0582K1105J44822k9293n874m5636J05170j52702q1340
3800I94505N6703j2329L1433l2680K6180P7667j8090O1914r5100Q2420J47609
3789A320232K5270l125o2230L2048J19928j9285k0915L6388r6206J11348j13041
$$ plain form
3778 1330412 1394958 1419207 1256974 1204229 1265475 1317801 1286293 1305606 1244510 1263963 1246377
3767 1246377 1407929 1401038 1489064 1335644 1191152 1171372 987696 1044701 1105568 1050619 1124971
3756 1124971 1177525 1175650 1211625 1198967 1236587 1376407 1345221 1279453 1382868 1388555 1466245
3745 1466245 1494287 1466975 1346242 1491787 1432024 1356540 1279196 1155377 1211776 1337450 1250099
3734 1250099 1256769 1368488 1342228 1232713 1317489 1368514 1297425 1242489 1347541 1341989 1346168
3723 1346168 1378205 1329021 1335881 1300466 1407089 1385261 1318727 1547760 1506891 1399264 1298354
3712 1298354 1276581 1417669 1269501 1287878 1358229 1252010 1182676 1325881 1299929 1335272 1433124
3701 1433124 1247978 1217239 1307704 1196358 1225682 1270861 1250941 1264460 1322145 1332897 1291047
$$ packed form
3778A330412O4546K4249j62233n2745O1246N2326l1508J9313o1096J9453j7586
3767A246377J61552o891Q8026j53420j44492j9780j83676N7005O0867n4949P4352
3756A124971N2554j875L5975j2658L7620J39820l1186o5768J03415N687P7690
3745A466245K8042k7312j20733J45545n9763p5484p7344j23819N6399J25674q7351
3734A250099O670J11719k6260j09515Q4776N1025p1089n4936J05052n552M179
3723A346168L2037m9184O860l5415J06623k1828o6534K29033m0869j07627j00910
3712A298354k1773J41088j48168J8377P0351j06219o9334J43205k5952L5343R7852
3701A433124j85146l0739R0465j11346K9324M5179j9920J3519N7685J0752m1850
$$ plain form
3690 1291047 1247879 1400330 1414496 1209831 1205016 1166354 1264812 1312010 1288662 1374538 1301722
3679 1301722 1239750 1312406 1310902 1431917 1538223 1419378 1340460 1380822 1464238 1528015 1505792
3668 1505792 1434118 1392840 1523409 1520293 1479738 1481346 1450389 1498905 1583797 1640130 1650509 1707749
3656 1707749 1624233 1751041 1698969 1683526 2006501 1770712 1781894 1845386 1967742 2097142
3646 2097142 2028782 2048103 2095422 1945461 1858153 2000356 2062258 2232157 2359961 2327294 2260512
3635 2260512 2183249 2254246 2260128 2157318 2261769 2250515 2466010 2650098 2479846 2500060 2622473
3624 2622473 2634755 2699190 2781647 2799663 2572610 2756229 2908677 2982601 3046028 2813428 2951624
3613 2951624 3111370 3168967 3206624 3221660 3505191 3670738 3928067 3816959 3890945 3909985
$$ packed form
3690A291047m3168J52451J4166k04665m815l8662R8458M7198k3348Q5876p2816
3679A301722o1972P2656j504J21015J06306j18845p8918M0362Q3416O3777k2223
3668A505792p1674m1278J30569l116m0555J608l0957M8516Q4892N6333J0379N7240
3656A707749q3516J26808n2072j5443L22975k35789J1182O3492J22356J29400
3646B097142o8360J9321M7319j49961q7308J42203O1902J69899J27804l2667o6782
3635B260512p7263P0997N882j02810J04451j1254K15495J84088j70252K0214J22413
3624B622473J2282O4435Q2457J8016k27053J83619J52448P3924O3427k32600J38196
3613B951624J59746N7597L7657J5036K83531J65547K57329j11108P3986J9040
$$ plain form
3603 3909985 4088842 4117984 4305616 4433949 4451772 4559346 4529110 4578480 4578448 4736276 4709592
3592 4709592 4816549 4865068 5014421 5090551 5225152 5511018 5809843 6010468 6341904 6601838
3582 6601838 7045674 7600345 8341622 9380104 10795100 12330793 12803843 11715930 10216881
3573 10216881 8989028 8325196 7947405 7579064 7458957 7372980 7324431 7383363 7268972 7319612
3563 7319612 7355273 7419212 7535703 7596006 7622585 7852122 8035267 8216846 8452237 8577786
3553 8577786 8709745 8983975 9242953 9489525 9612236 9830875 10086322 10490361 10828001 11117215
3543 11117215 11433030 11838261 12391169 12776309 13291824 13804867 14379663 14785177 15432390
3534 15432390 16040739 16726117 17270238 17949268 18729577 19486913 20199410 21125834 22149965
$$ packed form
3603C909985J78857K9142J87632J28333J7823J07574l0236M9370l2J57828k6684
3592D709592J06957M8519J49353P6130J34601K85866K98825K00625L31436K59934
3582F601838M43836N54671P41277J038482J414996J535693M73050j087913j499049
3573A0216881j227853o63832l77791l68341j20107q5977m8549N8932j14391N0640
3563G319612L5661O3939J16491O0303K6579K29537J83145J81579K35391J25549
3553H577786J31959K74230K58978K46572J22711K18639K55447M04039L37640K89214
3543A1117215L15815M05231N52908L85140N15515N13043N74796M05514O47213
3534A5432390O08349O85378N44121O79030P80309P57336P12497R26424J024131
$$ plain form
3525 22149965 23225614 24417969 25513348 26543771 27925926 29217088 30609302 31998298
3517 31998298 33533325 35328447 37083321 38887312 40647755 42332454 44215132 45995703
3509 45995703 47832264 49655846 51656387 53309593 55013691 56660104 57878813 59259959
3501 59259959 60671805 61976123 62789680 63662051 64414814 64952403 65155344 65251753 65114670
3492 65114670 64672820 63960011 63078839 62462884 61496047 60321744 59225196 57951002 56312347
3483 56312347 54629267 52841484 50673280 48822606 46923731 45286058 43358038 41477739
3475 41477739 39545433 37750266 36122334 34371295 32540412 30932962 29393339 27653672
3467 27653672 26144787 24804237 23471698 22213909 21067971 19848832 18881763 17993415
$$ packed form
3525B2149965J075649J192355J095379J030423J382155J291162J392214J388996
3517C1998298J535027J795122J754874J803991J760443J684699J882678J780571
3509D5995703J836561J823582K000541J653206J704098J646413J218709J381146
3501E9259959J411846J304318Q13557Q72371P52763N37589K02941R6409j37083
3492F5114670m41850p12809q81172o15955r66837j174303j096548j274194j638655
3483E6312347j683080j787783k168204j850674j898875j637673j928020j880299
3475D1477739j932306j795167j627932j751039j830883j607450j539623j739667
3467B7653672j508885j340550j332539j257789j145938j219139r67069q88348
$$ plain form
3459 17993415 17094814 16377601 15675956 14904476 14055451 13391721 13005585 12365223 12027145
3450 12027145 11602310 11133304 10757670 10440284 10310173 10124144 9778933 9524162 9358791
3441 9358791 9091855 8835981 8631557 8591683 8405236 8165847 8138327 8052922 8011149 7973497
3431 7973497 7931467 7824097 7757534 7766342 7582519 7556490 7608109 7579307 7539223 7722035 7816659
3420 7816659 7805775 7867117 7882687 7855562 7888945 7680308 7667106 7595766 7707580 7653475 7551603
3409 7551603 7584519 7426208 7358595 7340078 7181825 7152587 7089342 7112395 6887341 6716509 6595702
3398 6595702 6460730 6469743 6334328 6250959 6260938 6259836 6147016 6099851 6032498 6033413 6086822 5999052
3386 5999052 6064396 6127789 5962844 5910121 5824367 5967222 5945221 5968697 5996281 6002466 6040108
$$ packed form
3459A7993415q98601p17213p01645p71480q49025o63730l86136o40362l38078
3450A2027145m24835m69006l75634l17386j30111j86029l45211k54771j65371
3441I358791k66936k55874k04424l9874j86447k39389k7520q5405m1773l7652
3431G973497m2030j07370o6563Q808j83823k6029N1619k8802m0084J82812R4624
3420G816659j0884O1342J5570k7125L3383k08637j3202p1340J11814n4105j01872
3409G551603L2916j58311o7613j8517j58253k9238o3245K3053k25054j70832j20807
3398F595702j34972R013j35415q3369R979j102j12820m7165o7353R15N3409q7770
3386E999052O5344O3393j64945n2723q5754J42855k2001K3476K7584O185L7642
$$ plain form
3375 6040108 6064333 5972299 6135840 6311097 6254864 6362909 6415084 6419869 6499561 6560193 6498662
3364 6498662 6619259 6508550 6571537 6588859 6664865 6675285 6761137 6850617 6813386 6873334 6889354
3353 6889354 7026585 7056881 7290568 7285577 7468621 7677402 7615240 7907361 8066121 8028622
3343 8028622 8138221 8228653 8313493 8296787 8443974 8428389 8433425 8572961 8753780 8676024 8756338
3332 8756338 8766946 8977952 8911088 8908778 8847849 8793997 8875105 8943768 9108842 9114794 9111454 9287988
3320 9287988 9249283 9324380 9420445 9487138 9832814 9902309 10090538 10246591 10221992 10474391 10610646
3309 10610646 10871765 11155168 11256279 11462194 11670088 11846100 12005332 12296783 12484512
3300 12484512 12892290 13159098 13468488 13600096 13991643 14319771 14821900 15118985 15450508
$$ packed form
3375F040108K4225r2034J63541J75257n6233J08045N2175M785P9692O0632o1531
3364F498662J20597j10709O2987J7322P6006J0420Q5852Q9480l7231N9948J6020
3353F889354J37231L0296K33687m991J83044K08781o2162K92121J58760l7499
3343H028622J09599R0432Q4840j6706J47187j5585N036J39536J80819p7756Q0314
3332H756338J0608K11006o6864k310o0929n3852Q1108O8663J65074N952l340J76534
3320I287988l8705P5097R6065O6693L45676O9495J88229J56053k4599K52399J36255
3309A0610646K61119K83403J01111K05915K07894J76012J59232K91451J87729
3300A2484512M07778K66808L09390J31608L91547L28128N02129K97085L31523
$$ plain form
3291 15450508 15781684 16125535 16541734 16909529 17374789 17779637 18243268 18628105 19145615
3282 19145615 19526722 20100540 20559916 21129697 21704226 22477636 23260061 23809084 24685469
3273 24685469 25533670 26357019 27295825 28417953 29537601 30736464 31875952 33003064 34315293
3264 34315293 35399765 36437320 37519781 38776328 39851339 41086845 42484300 43856705
3256 43856705 45214021 46457172 47674343 48791080 50062761 51120959 52199728 53433049
3248 53433049 54535031 55454257 56457047 57349094 58106114 58960631 59866726 60859851 62049359
3239 62049359 63215010 64326906 65779687 67366252 68815076 70534597 72221005 74439818
3231 74439818 76725194 79455344 82647425 86104478 89974530 94004219 98348971 102676190
$$ packed form
3291A5450508L31176L43851M16199L67795M65260M04848M63631L84837N17510
3282A9145615L81107N73818M59376N69781N74529P73410P82425N49023Q76385
3273B4685469Q48201Q23349R38806J122128J119648J198863J139488J127112J312229
3264C4315293J084472J037555J082461J256547J075011J235506J397455J372405
3256D3856705J357316J243151J217171J116737J271681J058198J078769J233321
3248E3433049J101982R19226J002790Q92047P57020Q54517R06095R93125J189508
3239F2049359J165651J111896J452781J586565J448824J719521J686408K218813
3231G4439818K285376K730150L192081L457053L870052M029689M344752M327219
$$ plain form
3223 102676190 107224439 111864751 116681493 121830749 127028426 132623225 138457243 144298275
3215 144298275 150342141 156579171 163278725 170156991 177357099 184922547 193270775 201886351
3207 201886351 210860499 220295502 229693779 238262040 245721913 251712947 256358636 260124879
3199 260124879 262928024 265524266 268203048 270351386 271437649 271280429 269072984 264526157
3191 264526157 257567086 248647341 238692062 227948874 217547927 207467399 197624394 187919692
3183 187919692 178080109 167894964 157469246 147077393 136942019 127379659 118774931
3176 118774931 111008718 103944075 97672839 92067338 87248281 83034000 79097648 75670638
3168 75670638 72796286 70119759 67781952 65586695 63759356 62049810 60580723 58911286
$$ packed form
3223A02676190M548249M640312M816742N149256N197677N594799N834018N841032
3215A44298275O043866O237030O699554O878266P200108P565448Q348228Q615576
3207B01886351Q974148R435003R398277Q568261P459873N991034M645689L766243
3199B60124879K803145K596242K678782K148338J086263j57220k207445m546827
3191B64526157o959071q919745r955279j0743188j0400947j0080528r843005r704702
3183A87919692r839583j0185145j0425718j0391853j0135374r562360q604728
3176A18774931p766213p064643o271236n605501m819057m214281l936352l427010
3168G5670638k874352k676527k337807k195257j827339j709546j469087j669437
$$ plain form
3160 58911286 57275810 55919886 54732939 53745511 52800859 51811057 50859121 49943817 49024571
3151 49024571 47956880 46730227 45621800 44525459 43354816 42280145 40935901 39904869
3143 39904869 38918980 37938929 36835077 35930497 34810468 33865875 32989164 31672568 30653023
3134 30653023 29837762 29056262 28070286 27303509 26497193 25735542 25024526 24436363 23702544
3125 23702544 22989218 22520552 21859783 21143303 20374551 19925491 19246469 18630421 18090443
3116 18090443 17842276 17405291 16774218 16457453 15994183 15519713 15026690 14830711 14380540
3107 14380540 13931564 13625336 13520964 13082377 12817332 12628151 12571953 12191467 11834168 11506013
3097 11506013 11206433 11077362 10965067 10876343 10801923 10635875 10653322 10436710 10364712 10323675
$$ packed form
3160E8911286j635476j355924j186947r87428r44652r89802r51936r15304r19246
3151D9024571j067691j226653j108427j096341j170643j074671j344244j031032
3143C9904869r85889r80051j103852r04580j120029r44593q76711j316596j019545
3134C0653023q15261p81500r85976p66777q06316p61651p11016n88163p33819
3125B3702544p13326m68666o60769p16480p68752m49060o79022o16048n39978
3116A8090443k48167m36985o31073l16765m63270m74470m93023j95979m50171
3107A4380540m48976l06228j04372m38587k65045j89181n6198l80486l57299l28155
3097A1506013k99580j29071j12295q8724p4420j66048J7447k16612p1998m1037
$$ plain form
3087 10323675 10097640 9955196 9723577 9611951 9691694 9561275 9377996 9308666 9263397 9281964
3077 9281964 9182531 9060883 9010734 9072905 8778246 8757686 8682428 8605799 8737936 8643418 8422486
3066 8422486 8554889 8595172 8638156 8734749 8745410 8823376 8840886 8933111 8925003 8871334 8749575
3055 8749575 8803995 8920208 9143002 9103613 9132442 9120359 9013818 8972580 8889038 8908670 8833740
3044 8833740 8998482 8965279 8911230 8979030 9078089 9104383 9276132 9459013 9405178 9593280 9899766
3033 9899766 10009166 10269781 10509635 10632002 10872667 11001938 10926675 10910258 10833123 10942089
3023 10942089 11059588 10957743 10886256 10824012 10780203 10826858 10918129 11013904 11015392 11203118 11474188
3012 11474188 11762589 11995055 12248025 12549236 12838564 13145344 13427520 13774859 14066854
$$ packed form
3087A0323675k26035j42444k31619j11626P9743j30419j83279o9330m5269J8567
3077I281964r9433j21648n0149O2171k94659k0560p5258p6629J32137r4518k20932
3066H422486J32403M0283M2984R6593J0661P7966J7510R2225q108n3669j21759
3055H749575N4420J16213K22794l9389K8829j2083j06541m1238q3542J9632p4930
3044H833740J64742l3203n4049O7800R9059K6294J71749J82881n3835J88102L06486
3033I899766J09400K60615K39854J22367K40665J29271p5263j6417p7135J08966
3023A0942089J17499j01845p1487o2244m3809M6655R1271R5775J488J87726K71070
3012A1474188K88401K32466K52970L01211K89328L06780K82176L47339K91995
$$ plain form
3003 14066854 14216954 14471184 14695258 14862568 15208752 15485923 15430509 15604482 15760731 15951874
2993 15951874 16231396 16495097 16701576 17197034 17628548 17834341 18321625 18796524 19312496
2984 19312496 19893217 20398604 20969165 21567268 22293327 22987213 23862385 24457247 24725939
2975 24725939 25033888 25524111 26282435 26913137 27576951 28618301 29562366 30441727 31674627
2966 31674627 33063357 34549257 36431999 38314880 40284482 42473765 44530528 46717554
2958 46717554 48791840 50659171 52348430 53623466 53909181 53415839 52874137 53046935 53875895
2949 53875895 55677170 57443293 57906249 56456974 54262420 51416966 48773477 46302451
2941 46302451 43878926 41801458 40128470 38863599 38106997 37544888 37327685 37332710 37785770
$$ packed form
3003A4066854J50100K54230K24074J67310L46184K77171n5414J73973J56249J91143
2993A5951874K79522K63701K06479M95458M31514K05793M87284M74899N15972
2984A9312496N80721N05387N70561N98103P26059O93886Q75172N94862K68692
2975B4725939L07949M90223P58324O30702O63814J041350R44065Q79361J232900
2966C1674627J388730J485900J882742J882881J969602K189283K056763K187026
2958D6717554K074286J867331J689259J275036K85715m93342n41702J72798Q28960
2949E3875895J801275J766123M62956j449275k194554k845454k643489k471026
2941D6302451k423525k077468j672988j264871p56602n62109k17203N025M53060
$$ plain form
2932 37785770 38505985 39569380 40851344 42476016 44514280 47332583 51182166 56238400
2924 56238400 62214951 65433496 64369493 60723511 56039183 50750829 45547833 41029984
2916 41029984 37550864 34871087 32867635 31207994 30020799 29142568 28535889 28379337 28488873
2907 28488873 28436475 28685240 29302817 30391058 31849272 33768341 35945370 37853892 38656449
2898 38656449 37807493 35591806 32663115 29771853 26947696 24575772 22878937 21670950
2890 21670950 20556001 19665017 19090330 18446258 18011651 17665665 17281980 17015175 17097021
2881 17097021 17347227 16823160 15783463 14719314 13857462 13204327 12777646 12283314 11976882
2872 11976882 11612036 11101777 10775839 10490148 10433740 9998059 9769148 9523016 9213899 9129707
$$ packed form
2932C7785770P20215J063395J281964J624672K038264K818303L849583N056234
2924E6238400N976551L218545j064003l645982m684328n288354n202996m517849
2916D1029984l479120k679777k003452j659641j187195q78231o06679j56552J09536
2907B8488873n2398K48765O17577J088241J458214J919069K177029J908522Q02557
2898C8656449q48956k215687k928691k891262k824157k371924j696835j207987
2890B1670950j114949q90984n74687o44072m34607l45986l83685k66805Q1846
2881A7097021K50206n24067j039697j064149q61852o53135m26681m94332l06432
2872A1976882l64846n10259l25938k85691n6408m35681k28911k46132l09117q4192
$$ plain form
2862 9129707 8962040 8599420 8372418 8328283 8140621 7712259 7618515 7435855 7437538 7423860
2852 7423860 7321206 7198816 6995513 7060095 7087583 6816018 6585034 6580897 6693584 6606584
2842 6606584 6442665 6309073 6204375 6190094 6048735 5959704 5872599 5926132 5842529 5634663
2832 5634663 5686465 5594543 5573862 5416957 5246342 5221678 5289607 5293307 5195798 5230778 5171536
2821 5171536 5055479 4924811 4921629 4845187 4772351 4788442 4694253 4621396 4666369 4676654 4687349
2810 4687349 4544245 4535215 4401109 4451992 4547574 4379907 4505314 4437646 4423773 4460562 4380626
2799 4380626 4345842 4373496 4249354 4301497 4325650 4347183 4437316 4405066 4494760 4463133 4539883
2788 4539883 4568569 4689252 4622896 4650001 4795143 4853003 5079379 5111840 4914511 5095170
$$ packed form
2862I129707j67667l62620k27002m4135j87662m28362r3744j82660J683j3678
2852G423860j02654j22390k03303O4582K7488k71565k30984m137J12687q7000
2842F606584j63919j33592j04698j4281j41359q9031q7105N3533q3603k07866
2832E634663N1802r1922k0681j56905j70615k4664O7929L700r7509L4980n9242
2821E171536j16057j30668l182p6442p2836J6091r4189p2857M4973J0285J0695
2810D687349j43104r030j34106N0883R5582j67667J25407o7668j3873L6789p9936
2799D380626l4784K7654j24142N2143K4153K1533R0133l2250Q9694l1627P6750
2788D539883K8686J20683o6356K7105J45142N7860K26376L2461j97329J80659
$$ plain form
2778 5095170 5267355 5431679 5619490 5859093 6146138 6294820 6365132 6499630 6836265 7335377
2768 7335377 7746397 8332554 8810497 9261102 9480450 9458296 9360752 9167355 9047356 9053918
2758 9053918 9128406 9199138 9227475 9181382 8895625 8633035 8592772 8758096 9155916 9397599
2748 9397599 9435025 9537743 9668172 10111680 10606135 11371483 12286701 13195233 13881272 14005341
2738 14005341 13801388 13379365 12957971 12912435 12979502 13067078 13452177 13299716 12630013 12112756
2728 12112756 11863502 11657078 11649773 11674411 11569745 11609086 11816208 12074425 12205365 12411013
2718 12411013 12665149 12992823 13364315 13545369 13667603 13588942 13467461 13580246 13822546 14079330
2708 14079330 14500692 14935944 15243057 15351649 15605180 15779636 15924956 15929293 15911927 15757839
$$ packed form
2778E095170J72185J64324J87811K39603K87045J48682P0312J34498L36635M99112
2768G335377M11020N86157M77943M50605K19348k2154r7544j93397j19999O562
2758I053918P4488P0732K8337m6093k85757k62590m0263J65324L97820K41683
2748I397599L7426J02718J30429M43508M94455P65348R15218R08532O86039J24069
2738A4005341k03953m22023m21394m5536O7067Q7576L85099j52461o69703n17257
2728A2112756k49254k06424p305K4638j04666L9341K07122K58217J30940K05648
2718A2411013K54136L27674L71492J81054J22234p8661j21481J12785K42300K56784
2708A4079330M21362M35252L07113J08592K53531J74456J45320M337j7366j54088
$$ plain form
2698 15757839 15374667 15027293 14557516 14052590 13853124 13510520 13484508 13613407 13519529 13815987
2688 13815987 13919863 14120995 14508914 14693942 14921011 15171233 15425848 15491129 15384317 15153156
2678 15153156 14864915 14427106 14093795 13624023 13008111 12643187 12312397 11873085 11390523
2669 11390523 11324443 11279207 11022687 11004754 11039652 10946687 10811394 10688055 10637876 10249727
2659 10249727 9815308 9557857 9170037 8711053 8133884 7667595 7394012 7101528 6782092
2650 6782092 6473404 6193353 6083931 5829688 5578232 5440567 5301208 5091239 5046106 4878022
2640 4878022 4652870 4524128 4462890 4128620 4133419 4053097 3930992 3893641 3671182 3591773 3380431
2629 3380431 3294480 3165788 3169247 2976840 2965387 2879769 2777615 2869309 2639242 2673407 2661745
$$ packed form
2698A5757839l83172l47374m69777n04926j99466l42604k6012J28899r3878K96458
2688A3815987J03876K01132L87919J85028K27069K50222K54615O5281j06812k31161
2678A5153156k88241m37809l33311m69772o15912l64924l30790m39312m82562
2669A1390523o6080m5236k56520j7933L4898r2965j35293j23339n0179l88149
2659A0249727m34419k57451l87820m58984n77169m66289k73583k92484l19436
2650F782092l08688k80051j09422k54243k51456j37665j39359k09969m5133j68084
2640D878022k25152j28742o1238l34270M799q0322j22105l7351k22459p9409k11342
2629C380431q5951j28692L459j92407j1453q5618j02154R1694k30067L4165j1662
$$ plain form
2618 2661745 2462673 2337585 2382402 2415799 2299467 2257741 2268662 2307886 2201381 2223357 2176098
2607 2176098 2171849 1959129 1951163 1966569 1894331 1801805 1735262 1698523 1647763 1444379 1405748
2596 1405748 1555967 1543188 1544672 1595283 1694222 1497874 1162144 1284426 1299334 1280317 1334129
2585 1334129 1381752 1384540 1372170 1372161 1206913 1282977 1176083 1038347 1112655 1149809 1039517 951183
2573 951183 934454 916303 935376 893447 880918 906273 953121 875133 878216 935713 852894 745431
2561 745431 555600 736438 755101 790373 679655 693311 751038 633932 551002 533864 819556
2550 819556 820206 816497 657944 569813 623003 545056 527273 578701 675385 697485 610054 558043
2538 558043 698507 594510 562636 526679 554563 516889 550750 591183 542864 628707 473298
$$ packed form
2618B661745j99072j25088M4817L3397j16332m1726J0921L9224j06505K1976m7259
2607B176098m249k12720p966J5406p2238r2526o6543l6739n0760k03384l8631
2596A405748J50219j2779J484N0611R8939j96348l35730J22282J4908j9017N3812
2585A334129M7623K788j2370rj65248P6064j06894j37736P4308L7154j10292q8334
2573I51183j6729j8151J9073m1929j2529K5355M6848p7988L083N7497q2819j07463
2561G45431j89831J80838J8663L5272j10718J3656N7727j17106q2930j7138K85692
2550H19556O50l709j58553q8131N3190p7947j7783N1428R6684K2100q7431n2011
2538E58043J40464j03997l1874l5957K7884l7674L3861M0433m8319Q5843j55409
$$ plain form
2527 473298 473467 544180 547347 606076 525820 618923 612186 521400 407720 363202 434419 404550
2515 404550 293877 266974 331039 442202 466526 337242 450375 457131 366496 375762 319618
2504 319618 357699 305458 485034 397050 252527 289663 291767 413670 340278 320670 199997
2493 199997 342149 431465 383461 409435 204175 268511 325841 324000 349505 482332 423425
2482 423425 358351 397618 343355 340025 315691 384370 387956 339537 306040 364054 362317 203487
2470 203487 82903 230092 200283 288563 397254 394943 251581 331717 209994 290672 395587
2459 395587 288139 158923 105053 186609 338187 263557 240993 311912 409559 359096 259666
2448 259666 174400 228386 205139 391720 363163 380612 306897 220768 279795 309020 317701 221713
$$ packed form
2527D73298J69P0713L167N8729q0256R3103o737r0786j13680m4518P1217k9869
2515D04550j10673k6903O4065J11163K4324j29284J13133O756r0635R266n6144
2504C19618L8081n2241J79576q7984j44523L7136K104J21903p3392j9608j20673
2493A99997J42152Q9316m8004K5974k05260O4336N7330j841K5505J32827n8907
2482D23425o5074L9267n4263l330k4334O8679L586m8419l3497N8014j737j58830
2470B03487j20584J47189k9809Q8280J08691k311j43362Q0136j21723Q0678J04915
2459C95587j07448j29216n3870Q1556J51578p4630k2564P0919R7647n0463r9430
2448B59666q5266N3986k3247J86581k8557J7449p3715q6129N9027K9225Q681r5988
$$ plain form
2436 221713 290126 299748 162982 120680 94919 86868 231056 143350 226397 24700 172834
2425 172834 161802 212370 174924 156272 196298 207021 269377 277848 197921 105190 181003 208936
2413 208936 305189 177296 85450 85812 186917 264522 136070 249211 231658 143055 4660
2402 4660 -122001 -46003 86367 191945 166605 199261 245098 335959 315049 129153 147509
2391 147509 190445 148205 36004 181812 129730 110805 227630 192116 231050 131173 61717
2380 61717 136889 190155 -42222 52238 241007 143519 144832 188709 145761 24970 -6787
2369 -6787 -152962 -42393 37838 58884 187933 44704 -122654 -123429 -124074 -15767 11876 -148868
2357 -148868 58665 -65680 -130929 -27753 -28574 -5281 -50684 14670 -37217 70589 49774
$$ packed form
2436B21713O8413R622j36766m2302k5761q051J44188q7706Q3047k01697J48134
2425A72834j1032N0568l7446j8652M0026J0723O2356Q471p9927r2731P5813K7933
2413B08936R6253j27893r1846L62J01105P7605j28452J13141j7553q8603j38395
2402D660j26661P5998J32370J05578k5340L2656M5837R0861k0910j85896J8356
2391A47509M2936m2240j12201J45808n2082j8925J16825l5514L8934r9877o9456
2380F1717P5172N3266k32377R4460J88769r7488J313M3877m2948j20791l1757
2369f787j46175J10569Q0231K1046J29049j43229j67358p75o45J08307K7643j60744
2357a48868K07533j24345o5249J03176q21K3293m5403O5354n1887J07806k0815
$$ plain form
2346 49774 -42170 39844 -136727 -173517 -14812 -51126 34485 62194 72799 75955 -39072
2335 -39072 38666 76996 21790 -12183 -31274 205377 149302 -24040 -37211 -93956 -4566
2324 -4566 -25350 -33716 -49539 -57061 162315 264387 150741 24087 173252 3337 -15287
2313 -15287 -18787 19272 78360 36451 33089 -59331 -150526 13624 89634 121750 41025 188987
2301 188987 126667 36279 -9791 46285 14823 98914 95770 13785 38187 -139021 -91649 -152417
2289 -152417 -46263 115808 122880 85768 -26852 -96294 -12501 -29635 154676 73152 -55398
2278 -55398 37180 42571 -6015 82294 -49511 106355 133821 32248 92752 163487 61636
2267 61636 -17108 139871 174677 139019 89821 -6899 -83716 2504 35007 32617 53766 56807
$$ packed form
2346D9774r1944Q2014j76571l6790J58705l6314Q5611K7709J0605L156j15027
2335c9072P7738L8330n5206l3973j9091K36651n6075j73342j3171n6745Q9390
2324d566k0784q366j5823p522K19376J02072j13646j26654J49165j69915j8624
2313a5287l500L8059N9088m1909l362r2420r1195J64150P6010L2116q0725J47962
2301A88987o2320r0388m6070N6076l1462Q4091l144q1985K4402j77208M7372o0768
2289a52417J06154J62071P072l7112j12620o9442Q3793j7134J84311q1524j28550
2278e5398R2578N391m8586Q8309j31805J55866K7466j01573O0504P0735j01851
2267F1636p8744J56979L4806l5658m9198r6720p6817Q6220L2503k390K1149L041
$$ plain form
2255 56807 79679 34795 103603 101199 71532 84769 199572 114933 31266 -68700 -48662 -57798
2243 -57798 21647 -53265 122260 42880 -79355 -69285 -93078 -65265 -102700 6360 -57096
2232 -57096 -44535 -72637 -61663 -98372 -44879 74734 12100 30805 62992 109780 92097 112824
2220 112824 43831 100270 150460 174446 143614 148002 65662 51539 17304 -60569 39795 69431
2208 69431 102066 163590 42041 134954 160820 63629 2251 74281 212457 165187 49340
2197 49340 22601 84512 113794 157744 124455 140488 220568 139081 169674 56095 11712 91204
2185 91204 108546 220932 80810 154666 279484 296362 59569 54368 61395 106621 33748
2174 33748 108186 240572 250756 174888 202612 309914 346175 427359 485282 379434 446773
$$ packed form
2255E6807K2872m4884O8808k404k9667J3237J14803q4639q3667r9966K0038r136
2243e7798P9445p4912J75525p9380j22235J0070k3793K7813l7435J09060o3456
2232e7096J2561k8102J0974l6709N3493J19613o2634J8705L2187M6788j7683K0727
2220A12824o8993N6439N0190K3986l0832M388q2340j4123l4235p7873J00364K9636
2208F9431L2635O1524j21549R2913K5866r7191o1378P2030J38176m7270j15847
2197D9340k6739O1911K9282M3950l3289J6033Q0080q1487L0593j13579m4383P9492
2185I1204J7342J12386j40122P3856J24818J6878k36793n201P027M5226p2873
2174C3748P4438J32386J0184p5868K7724J07302L6261Q1184N7923j05848O7339
$$ plain form
2163 446773 579373 447703 434288 563985 621163 631260 727578 619688 579321 726329 933495
2152 933495 873210 957848 971355 952173 1070403 914883 1118808 1160892 1211281 1168016 1197072
2141 1197072 1316361 1477786 1559224 1445914 1443219 1469685 1832378 1961024 1935555 2133126
2131 2133126 2141063 2240174 2305739 2384795 2409528 2515789 2848241 3009667 3224870 3562943 3822799
2120 3822799 3950969 4259362 4593662 4802021 5369194 5963743 6491254 7251889 7937195 8536638
2110 8536638 9173515 10256799 11496066 13019969 15477930 18254635 22425503 27470541
2102 27470541 33787596 34845296 29059856 22924182 18265301 15207002 12819739 11186383
2094 11186383 9803435 8693717 7933632 7321604 6907483 6138623 5472618 5021882 4522081
$$ packed form
2163D46773J32600j31670j3415J29697N7178J0097R6318j07890m0367J47008K07166
2152I33495o0285Q4638J3507j9182J18230j55520K03925M2084N0389m3265K9056
2141A197072J19289J61425Q1438j13310k695K6466L62693J28646k5469J97571
2131B133126P937R9111O5565P9056K4733J06261L32452J61426K15203L38073K59856
2120C822799J28170L08393L34300K08359N67173N94549N27511P60635O85306N99443
2110H536638O36877J083284J239267J523903K457961K776705M170868N045038
2102B7470541O317055J057700n785440o135674m658881l058299k387263j633356
2094A1186383j382948j109718p60085o12028m14121p68860o66005m50736m99801
$$ plain form
2085 4522081 4174528 3702780 3559168 3433925 3003730 2655822 2541807 2410963 2421165 2341019
2075 2341019 2223788 2204947 1926577 1759867 1794427 1562894 1488410 1556439 1233278 1322320
2065 1322320 1312450 1163125 974233 933405 1046667 889263 946276 912998 876968 886951 765780
2054 765780 779861 742967 779535 749056 654164 786965 679218 476993 486721 473939 565897
2043 565897 639614 582006 491989 515751 544537 607672 598774 535893 464813 487470 413534 398000
2031 398000 478668 379528 376470 431629 272242 165268 188695 243576 385545 163190 209268
2020 209268 203046 271761 174568 160541 131109 103525 59650 270105 222761 106470 132950
2009 132950 179627 122180 146558 155098 213568 148241 191170 217619 135049 39847 117374 81639
$$ packed form
2085D522081l47553m71748j43612j25243m30195l47908j14015j30844J0202q0146
2075B341019j17231j8841k78370j66710L4560k31533p4484O8029l23161Q9042
2065A322320r870j49325j88892m0828J13262j57404N7013l3278l6030R983j21171
2054G65780J4081l6894L6568l0479r4892J32801j07747k02225R728j2782R1958
2043E65897P3717n7608r0017K3762K8786O3135q898o2881p1080K2657p3936j5534
2031C98000Q0668r9140l058N5159j59387j06974K3427N4881J41969k22355M6078
2020B09268o222O8715r7193j4027k9432k7584m3875K10455m7344j16291K6480
2009A32950M6677n7447K4378Q540N8470o5327M2929K6449q2570r5202P7527l5735
$$ plain form
1997 81639 101332 205104 255975 135124 160706 136517 215257 185233 132445 162776 124684
1986 124684 135169 140199 212770 156104 67678 75956 28113 106417 130024 46780 62501 33580
1974 33580 -92788 -49200 114953 41646 118701 86380 69929 -10873 -64715 -18456 25341
1963 25341 45696 -33153 -26054 16090 6808 -253567 -189205 -68329 -107793 32456 56673 230243
1951 230243 155483 -5795 -170334 -87920 -81253 -119887 9537 42832 -40489 12763 47796
1940 47796 -17562 7010 -73210 -125516 -112626 -55504 -32217 51691 12891 -67051 137812 -4796
1928 -4796 8025 27408 50822 181402 61918 -18700 -8193 -152336 -134758 -99470 33260
1917 33260 65638 55167 87915 -5399 -55294 63937 64275 84099 65990 125186 170510 161327
$$ packed form
1997H1639J9693J03772N0871j20851K5582k4189P8740l0024n2788L0331l8092
1986A24684J0485N030P2571n6666q8426Q278m7843P8304K3607q3244J5721k8921
1974C3580j26368M3588J64153p3307P7055l2321j6451q0802n3842M6259M3797
1963B5341K0355p8849P099M2144r282k60375O4362J20876l9464J40249K4217J73570
1951B30243p4760j61278j64539Q2414O667l8634J29424L3295q3321N3252L5033
1940D7796o5358K4572q0220n2306J2890N7122K3287Q3908l8800p9942K04863j42608
1928d796J2821J9383K3414J30580j19484q0618J0507j44143J7578L5288J32730
1917C3260L2378j0471L2748r3314m9895J19231L38J9824j8109N9196M5324r183
$$ plain form
1905 161327 -6419 -6308 -55769 83715 61322 12992 120602 54428 22186 708 -74400
1894 -74400 30329 59652 -49846 -176648 -107813 2642 -37771 781 -5435 12882 -47048
1883 -47048 -185511 -142768 -39812 -205009 -58649 -7090 7980 53384 115838 126164 -36032
1872 -36032 -105107 -35326 -111057 -90033 -153875 -99688 43429 8330 104743 109004 -21093 -44427
1860 -44427 -25338 3641 47486 172060 102045 78030 13233 -38105 -3650 -90024 53707
1849 53707 -188590 -86453 -82790 -61761 -103014 -8767 31481 -35705 -133606 -90684 -85572 -98209
1837 -98209 -42883 5881 12141 11806 11972 66605 -38789 -78442 24551 -99018 -96167 -118199
1825 -118199 -71359 -90244 -74707 -9523 58974 63593 -39601 -100883 -83839 -137696 -135021 -45122
$$ packed form
1905A61327j67746J11m9461J39484k2393m8330J07610o6174l2242k1478p5108
1894g4400J04729K9323j09498j26802O8835J10455m0413L8552o216J8317n9930
1883d7048j38463M2743J02956j65197J46360N1559J5070M5404O2454J0326j62196
1872c6032o9075O9781p5731K1024o3842N4187J43117l5099R6413M261j30097k3334
1860d4427J9089K8979M3845J24574p0015k4015o4797n1338L4455q6374J43731
1849E3707k42297J02137L663K1029m1253R4247M0248o7186r7901M2922N112j2637
1837i8209N5326M8764O260l35J66N4633j05394l9653J02993j23569K851k2032
1825a18199M6840j8885J5537O5184O8497M619j03194o1282J7044n3857K675Q9899
$$ plain form
1813 -45122 -27748 12916 -35976 -86699 -47021 -38620 -67798 -139889 -173586 -97144 -17749 -75692
1801 -75692 53738 31200 84085 30854 -79636 -38100 -110845 -91855 -4026 -70319 67945
1790 67945 69339 -134006 -288348 -197436 -184398 -118372 -163060 -167742 -197796 -110382 -72798 -201170
1778 -201170 -92823 11571 -69083 -26920 -40024 -100692 -191950 -68215 -87042 4725 -8043
1767 -8043 -48824 -88044 -97818 -8485 -79230 -126811 -51082 -94857 -245383 -68263 23754 -55099
1755 -55099 -53345 -100758 -80181 26246 -36306 34083 103892 -116786 -106015 -142161 -3303
1744 -3303 16474 -10357 -106953 -117582 -44590 -115680 -159369 -128481 -192981 -101060 -92373 -102357
1732 -102357 -86342 -47481 33494 -70778 59692 -74104 -63842 19881 -24311 -33941 77853
$$ packed form
1813d5122J7374M0664m8892n0723L9678Q401k9178p2091l3697P6442P9395n7943
1801g5692J29430k2538N2885n3231j10490M1536p2745J8990Q7829o6293J38264
1790F7945J394k03345j54342R0912J3038O6026m4688m682l0054Q7414L7584j28372
1778b01170J08347J04394q0654M2163j3104o0668r1258J23735j8827R1767j2768
1767h043m0781l9220r774Q9333p0745m7581P5729m3775j50526J77120R2017p8853
1755e5099J754m7413K0577J06427o2552P0389O9809k20678J0771l6146J38858
1744c303J9777k6831r6596j0629P2992p1090m3689L0888o4500R1921Q687r984
1732a02357J6015L8861Q0975j04272J30470j33796J0262Q3723m4192r630J11794
$$ plain form
1721 77853 44142 -9666 -35740 -163856 -17890 -69655 -72377 47723 -69253 -103006 -25477
1710 -25477 2665 40533 -128296 -98151 -62867 -96571 -166598 -104446 -66033 -134994 -77983 -134969
1698 -134969 -101781 -122561 -47283 -71031 -67448 -186100 -161361 -210330 -190824 -108453 -99159 -196385
1686 -196385 -281261 -160846 -186226 -256413 -186957 -101847 -77001 -29645 -127447 -132226 -43671 -74535
1674 -74535 -222835 -182624 -85951 -207874 -107618 -58069 10622 -121023 30105 -8238 -305272
1663 -305272 -291756 -169293 -84970 86195 66042 -27711 -69632 -133586 -132388 -47279 -101392
1652 -101392 -34090 -119553 -54114 -139156 -48625 -121899 -63902 16340 -14711 10059 -82320 -34135
1640 -34135 -18864 -106917 -91502 -233583 -145952 10782 -107568 -104416 -220088 -237462 -80302
$$ packed form
1721G7853l3711n3808k6074j28116J45966n1765k722J20100j16976l3753P7529
1710b5477K8142L7868j68829L0145L5284l3704p0027O2152L8413o8961N7011n6986
1698a34969L3188k0780P5278k3748L583j18652K4739m8969J9506Q2371R294r7226
1686a96385q4876J20415k5380p0187O9456Q5110K4846M7356r7802m779Q8555l0864
1674g4535j48300M0211R6673j21923J00256M9549O8691j31645J51128l8343k97034
1663c05272J3516J22463Q4323J71165k0153r3753m1921o3954J198Q5109n4113
1652a01392O7302q5463O5439q5042R0531p3274N7997Q0242l1051K4770r2379M8185
1640c4135J5271q8053J5415j42081Q7631J56734j18350L152j15672j7374J57160
$$ plain form
1629 -80302 -100781 -221649 -137666 -156900 -39167 -7503 -58526 -74300 -16991 15908 -92890
1618 -92890 21877 -71083 -216566 -85744 -118133 -12937 102229 -4917 74889 26923 52586
1607 52586 -14952 60043 8261 -65936 -82234 -149298 -128398 -291517 -160404 -133127 -169905
1596 -169905 -156582 -171532 -117077 -111603 341 -8330 -26374 -64692 -18134 19528 -13439 -54268
1584 -54268 -60450 -37485 -37511 21405 -102972 -10514 -20196 9173 184669 115938 -181045 -211637
1572 -211637 -27867 39918 -43743 -51614 -21360 -48645 -132357 -70016 -70948 -60381 9153 -26537
1560 -26537 50382 59314 -35157 -34784 -130217 -63458 -44700 2265 -19315 -87167 -160911 -86584
1548 -86584 -196938 -84600 87633 7876 -154258 43238 -5874 -58912 -124959 -243142 -80132
$$ packed form
1629h0302k0479j20868Q3983j9234J17733L1664n1023j5774N7309L2899j08798
1618i2890J14767r2960j45483J30822l2389J05196J15166j07146P9806m7966K5663
1607E2586o7538P4995n1782p4197j6298o7064K0900j63119J31113K7277l6778
1596a69905J3323j4950N4455N474J11944q671j8044l8318M6558L7662l2967m0829
1584e4268o182K2965k6N8916j24377R2458r682K9369J75496o8731k96983l0592
1572b11637J83770O7785q3661p871L0254k7285q3712O2341r32J0567O9534l5690
1560b6537P6919Q932r4471L73r5433O6759J8758M6965k1580o7852p3744P4327
1548h6584j10354J12338J72233p9757j62134J97496m9112n3038o6047j18183J63010
$$ plain form
1537 -80132 -3870 -41760 54989 74245 17920 -88783 -92593 -22962 -32691 -156819 -119623 -118461
1525 -118461 -161737 -44567 6257 -19367 -54703 -93772 -159087 -58281 98117 -9243 28776
1514 28776 -17198 -87827 -3043 -14015 -146757 -107792 -174418 -144317 60245 -10302 -157008
1503 -157008 -143842 146679 51404 82872 -36150 -105380 -52790 69296 -2147 -166283 -116682
1492 -116682 -53979 -61936 -60798 -51685 -15269 -206689 -161509 -81761 -190699 7199 -118833
1481 -118833 -149341 -193538 -135719 -47191 73102 -13426 -25817 4264 166722 159246 137784
1470 137784 158114 -16674 -113517 -88689 -140892 -32064 -50596 -168338 -61168 -136620 -46259
1459 -46259 5081 88568 177506 190519 186259 100556 30867 20237 -251469 -65381 -15561 106348
$$ packed form
1537h0132P6262l7890R6749J9256n6325j06703l810O9631r729j24128L7196J162
1525a18461m3276J17170N0824k5624l5336l9069o5315J00806J56398j07360L8019
1514B8776m5974p0629Q4784j0972j32742L8965o6626L0101K04562p0547j46706
1503a57008J3166K90521r5275L1468j19022o9230N2590J22086p1443j64136M9601
1492a16682O2703p957J138R113L6416j91420M5180P9748j08938J97898j26032
1481a18833l0508m4197N7819Q8528J20293q6528j2391L0081J62458p476k1462
1470A37784K0330j74788r6843K4828n2203J08828j8532j17742J07170p5452R0361
1459d6259N1340Q3487Q8938J3013m260q5703o9689j0630k71706J86088M9820J21909
$$ plain form
1447 106348 111879 6007 -73497 -131135 -86653 -114940 -28556 -139727 -230575 -130888 -122557 -101671
1435 -101671 -125213 -176575 -7427 180017 72538 -115935 -139548 -22498 86713 -81386
1425 -81386 -28424 -70372 -67176 -42667 -140061 -69101 35572 2402 15991 64555 -208723 -149489
1413 -149489 -179556 -111625 -149909 88395 -19034 -86372 -152858 13107 -76382 -109662 -82063
1402 -82063 -77328 -82488 -28096 -36138 70714 24398 -56157 -168325 -201455 -109267 -251385 -335890
1390 -335890 -298753 -99118 -64389 -148371 -200640 -141289 -139544 -31134 -119660 25816 34930
1379 34930 8346 -30014 -79616 -62029 -206828 -112200 -44617 -141765 -93354 -111319 -106880 -42699
1367 -42699 -59238 -60913 -188706 -113820 -15844 3360 72439 148513 157702 21550 56768 39886
$$ packed form
1447A06348N531j05872p9504n7638M4482k8287Q6384j11171r0848R9687Q331K0886
1435a01671k3542n1362J69148J87444j07479j88473k3613J17050J09211j68099
1425h1386N2962m1948L196K4509r7394P0960J04673l3170J3589M8564k73278N9234
1413a49489l0067O7931l8284K38304j07429o7338o6486J65965q9489l3280K7599
1402h2063M735n160N4392q042J06852m6316q0555j12168l3130R2188j42118q4505
1390c35890L7137J99635L4729q3982n2269N9351J745J08410q8526J45476R114
1379C4930k6584l8360m9602J7587j44799R4628O7583r7148M8411j7965M439O4181
1367d2699j6539j675j27793P4886R7976J9204O9079P6074R189j36152L5218j6882
$$ plain form
1355 39886 -5392 -2194 32321 -106343 -164235 -67270 -66131 28735 -45763 -69561 -67249 -127856
1343 -127856 -31676 55943 106007 -96683 -164478 -318393 -190032 -188765 -21510 -121604 -114758
1332 -114758 -163535 -109423 -93929 -70194 -100625 -189057 -99981 -26067 -167272 -151872 -131142
1321 -131142 -101499 -19660 -94094 -50985 -188028 -83576 -115280 -63022 -130599 -119839 -36732
1310 -36732 -656 8211 41268 159749 24051 -137878 -60023 -97433 -187024 55259 7598
1299 7598 12712 12956 -21657 -40429 -25076 11699 -38722 -39748 -109990 -109069 -17510 38750 -91017
1286 -91017 -125892 -46657 94430 47444 129026 176415 16917 92058 110 108607 32476
1275 32476 -50310 -66316 -25215 -41101 -26921 -111721 -85640 -154778 13367 108231 -55794
$$ packed form
1355C9886m5278L198L4515j38664n7892R6965J139R4866p4498k3798K312o0607
1343a27856R6180Q7619N0064k02690o7795j53915J28361J267J67255j00094O846
1332a14758m8777N4112J5494K3735l0431q8432Q9076P3914j41205J5400K0730
1321a31142K9643Q1839p4434M3109j37043J04452l1704N2258o7577J0760Q3107
1310c6732L6076Q867L3057J18481j35698j61929P7855l7410q9591K42283m7661
1299G598N114K44l4613j8772J5353L6775n0421j026p0242R21R1559N6260j29767
1286i1017l4875P9235J41087m6986Q1582M7389j59498P5141r1948J08497p6131
1275C2476q2786j6006M1101j5886J4180q4800K6081o9138J68145R4864j64025
$$ plain form
1264 -55794 -73996 -62311 -69983 -57201 -143069 -92846 -27726 -159244 -145836 -154221 -152009 -203028
1252 -203028 -212010 -1315 83084 -49368 -141926 47841 -96843 -232044 -111379 -227205
1242 -227205 -117466 -99567 16865 -14162 -4946 142346 -16001 -118257 102363 70636 -23797
1231 -23797 50211 48266 -2047 20144 25725 -82274 -53612 -72836 -141390 -109414 -158254 100016
1219 100016 -69767 -113916 -128805 -126648 -165823 33979 53706 16048 -122019 -77799 -100405
1208 -100405 -8635 80576 38972 16026 -219778 -97007 -23713 -138509 -166449 -111042 -99206
1197 -99206 -63820 -15264 11231 43992 1867 40784 79663 -45270 43409 10049 -53013 144288
1185 144288 86483 -135121 46871 -35758 -46054 -3505 136547 35307 39648 9119 -95851
$$ packed form
1264e5794j8202J1685p672J2782q5868N0223O5120j31518J3408q385K212n1019
1252b03028q982K10695Q4399j32452r2558J89767j44684j35201J20665j15826
1242b27205J09739J7899J16432l1027R216J47292j58347j02256K20620l1727r4433
1231b3797P4008j945n0313K2191N581j07999K8662j9224o8554L1976m8840K58270
1219A00016j69783m4149j4889K157l9175J99802J9727l7658j38067M4220k2606
1208a00405R1770Q9211m1604k2946k35804J22771P3294j14796k7940N5407J1836
1197i9206L5386M8556K6495L2761m2125L8917L8879j24933Q8679l3360o3062J97301
1185A44288n7805k21604J81992q2629j0296M2549J40052j01240M341l0529j04970
$$ plain form
1174 -95851 40897 -71552 8704 26203 -45296 -169498 -189628 -64501 -89101 -215224 -57201
1163 -57201 176123 82553 2393 24442 -65303 -35164 -84753 -136122 -89136 -47544 16078 123969
1151 123969 -52168 -53996 -205191 -42629 -84352 -50991 -80982 -153918 -123625 -149694 -15648
1140 -15648 73075 -10242 1566 -108817 -208252 -46821 37827 22427 -1246 159334 -137220
1129 -137220 -158153 -108213 -106890 -150159 -188883 -7160 138180 25101 4931 -80816 33548
1118 33548 51494 -50809 -82420 -28190 -11532 96015 81899 -112852 -117435 15150 34513
1107 34513 37554 78995 -8064 -25285 -75892 -69880 -64062 -27961 -62172 -51444 33235 -96133
1095 -96133 -150467 -122194 -51488 -17524 -8995 18758 173470 81313 170087 312301 131620
$$ packed form
1174i5851J36748j12449Q0256J7499p1499j24202k0130J25127k4600j26123J58023
1163e7201K33324r3570q0160K2049q9745L0139m9589n1369M6986M1592O3622J07891
1151A23969j76137j828j51195J62562m1723L3361k9991p2936L0293k6069J34046
1140a5648Q8723q3317J1808j10383r9435J61431Q4648j5400k3673J60580k96554
1129a37220k0933M9940J323m3269l8724J81723J45340j13079k0170q5747J14364
1118C3548J7946j02303l1611N4230J6658J07547j4116j94751m583J32585J9363
1107C4513L041M1441q7059j7221n0607O012N818L6101l4211J0728Q4679j29368
1095i6133n4334K8273P0706L3964Q529K7753J54712r2157Q8774J42214j80681
$$ plain form
1084 131620 38005 54334 -23494 -41349 -7024 25450 15148 125965 119257 44848 51221 -49973
1072 -49973 -127722 128918 84673 -98466 -115799 -143741 -213713 -62931 -67931 -27938 -23858 -37387
1060 -37387 -44026 -101310 -89268 4532 195056 3734 -107589 -57541 -172172 -210016 -124327
1049 -124327 23173 39122 -20516 93872 -139744 -64576 11200 -25244 7430 101387 -76009
1038 -76009 -62188 60568 -25198 -58238 -29620 -185 -4467 45283 24072 -26788 -104010 60218
1026 60218 7074 31653 37459 -60766 -75531 17860 12300 -52792 -99500 -174305 3447 -28603
1014 -28603 146966 22683 -139461 23827 63136 -10895 -107992 21327 23912 -39823 -67594
1003 -67594 -120003 -62001 64782 132375 57896 -59903 -30876 -90220 -5200 121215 -8349
$$ packed form
1084A31620r3615J6329p7828j7855L4325L2474j0302J10817o708p4409O373j01194
1072d9973p7749K56640m4245j83139j7333k7942o9972J50782n000L9993M080j3529
1060c7387o639n7284J2042R3800J90524j91322j11323N0048j14631l7844Q5689
1049a24327J47500J5949n9638J14388k33616P5168P5776l6444L2674R3957j77396
1038g6009J3821J22756q5766l3040K8618K9435m282M9750k1211n0860p7222J64228
1026F0218n3144K4579N806r8225j4765R3391n560o5092m6708p4805J77752l2050
1014b8603J75569j24283j62144J63288L9309p4031r7097J29319K585o3735k7771
1003f7594n2409N8002J26783O7593p4479j17799K9027n9344Q5020J26415j29564
$$ plain form
992 -8349 40713 -47553 -30137 57349 -92004 -75418 44015 85693 160878 105597 16299 35337
980 35337 16172 -126440 -16395 1915 -10824 56280 172203 95144 79137 156513 105135
969 105135 70778 33147 83700 14545 -36387 -50239 18602 105366 -12672 79575 409 -11288
957 -11288 17773 17223 78575 80710 90980 -11084 -4593 -152299 -55679 92673 133615 -4451
945 -4451 128130 117626 15637 169332 119453 51887 -27444 -9343 47672 -1891 -65185 36887
933 36887 50037 -12302 171599 114578 28831 16776 -96163 -52279 -74630 -123624 94032
922 94032 -69014 -109743 -69329 17895 -155999 -53789 -54604 11944 138261 77837 -13277 -182307
910 -182307 -166705 57359 112567 -123489 -102378 -133241 -35371 -74555 10409 -41540 -41551 45781
$$ packed form
992h349M9062q8266J7416Q7486j49353J6586J19433M1678P5185n5281q9298J9038
980C5337j9165j42612J10045J8310j2739O7104J15923p7059j6007P7376n1378
969A05135l4357l7631N0553o9155n0932j3852O8841Q6764j18038R2247p9166j1697
957a1288K9061n50O1352K135J0270j02064O491j47706R6620J48352M0942j38066
945d451J32581j0504j01989J53695m9879o7566p9331J8101N7015m9563o3294J02072
933C6887J3150o2339J83901n7021q5747j2055j12939M3884k2351m8994K17656
922I4032j63046m0729M0414Q7224j73894J02210q15O6548J26317o0424r1114j69030
910a82307J5602K24064N5208k36056K1111l0863R7870l9184Q4964n1949j1Q7332
$$ plain form
898 45781 34080 -25152 -4908 75208 122213 -174506 -32685 -59230 -37773 24704 25600 11240
886 11240 -33783 -42025 -105585 -77181 107551 -19760 -86973 -116961 15084 53277 76562 186507
874 186507 86282 119293 104068 -120028 -88136 101570 24410 18349 -7140 -78589 16701
863 16701 59018 41465 35216 71208 -88611 -183643 153459 68738 -45743 -66072 46827
852 46827 56276 64165 64089 58760 119849 -30199 12448 -23096 -17776 -57266 88551 42670 -4251
839 -4251 21220 -42178 23840 -129358 -9938 -20559 -2348 -16789 53900 103238 135506 45362
827 45362 -7199 39097 80942 138206 256796 27738 21288 -72812 45598 79354 -129461
816 -129461 -90937 -115650 -154467 -101756 -8066 -87939 -110702 31113 -54305 -28979 -20942 33908
$$ packed form
898D5781j1701n9232K0244Q0116M7005k96719J41821k6545K1457O2477Q96j4360
886A1240m5023q242o3560K8404J84732j27311o7213k9988J32045L8193K3285J09945
874A86507j00225L3011j5225k24096L1892J89706p7160o061k5489p1449R5290
863A6701M2317j7553o249L5992j59819r5032L37102q4721j14481k0329J12899
852D6827R449P889p6n329O1089j50048M2647l5544N320l9490J45817m5881m6921
839d251K5471o3398O6018j53198J19420j0621J8211j4441P0689M9338L2268r0144
827D5362n2561M6296M1845N7264J18590k29058o450r4100J18410L3756k08815
816a29461L8524k4713l8817N2711R3690p9873k2763J41815q5418K5326Q037N4850
$$ plain form
804 33908 129043 102964 24969 -28534 -4860 -4693 -30339 21665 85389 104485 112388 60329 35126
791 35126 18421 11940 -98308 -93337 125991 119741 25660 23480 43065 42610 46920 8111 68547
778 68547 145506 93005 96020 7054 2413 -25700 44907 16347 173742 210505 173858 194094
766 194094 184082 56473 -94947 -129308 -162441 -103258 -74343 123382 155407 84446 90144
755 90144 -15329 -44020 -164815 -40280 -101924 -57981 124348 -30699 -100837 -10637 -54345
744 -54345 12923 223979 54528 39898 -16986 4027 9717 42636 80875 181140 138650 30395
732 30395 -10402 -48106 114564 140862 -18292 -42747 -36799 -92195 4385 -12270 -27643 -62910
720 -62910 57185 140002 47212 53811 -46831 -62974 14395 610 58379 88735 178981 -15642
$$ packed form
804C3908R5135k6079p7995n3503K3674J67k5646N2004O3724J9096P903n2059k5203
791C5126j6705o481j10248M971K19328o250r4081k180J9585m55M310l8809O0436
778F8547P6959n2501L015q8966m641k8113P0607k8560J57395L6763l6647K0236
766A94094j0012j27609j51420l4361l3133N9183K8915J97725L2025p0961N698
755I0144j05473k8691j20795J24535o1644M3943J82329j55047p0138R0200m3708
744e4345O7268K11056j69451j4630n6884K1013N690L2919L8239J00265m2490j08255
732C0395m0797l7704J62670K6298j59154k4455N948n5396R6580j6655j5373l5267
720f2910J20095Q2817r2790O599j00642j6143P7369j3785N7769L0356R0246j94623
$$ plain form
708 -15642 -105523 17588 94500 -7620 -3055 -30244 127558 147624 172574 188533 181821 165180
696 165180 124610 -51555 -4571 112824 93619 146884 252034 66210 -18258 57902 45841
685 45841 113534 100283 171056 200969 137339 52744 94797 -36999 73553 55379 85985 50815
673 50815 92622 124881 64656 -33603 126060 210762 208340 120872 86754 97121 122222 87840
661 87840 25278 35141 -64585 -84591 -4921 14178 123898 -31161 -103131 -79063 -42766 54517
649 54517 52172 136568 -87886 -27487 108854 65784 148054 -1211 -56254 174457 73475
638 73475 159138 129918 39984 49536 71474 78362 -2827 31774 -7725 30499 69514 61520 108039
625 108039 33628 131151 60743 96663 -30441 175141 144891 97367 179337 131039 62090
$$ packed form
708a5642q9881J23111P6912j02120M565k7189J57802K0066K4950J5959o712j6641
696A65180m0570j76165M6984J17395j9205N3265J05150j85824q4468P6160j2061
685D5841O7693j3251P0773K9913o3630q4595M2053j31796J10552j8174L0606l5170
673E0815M1807L2259o0225r8259J59663Q4702k422q7468l4118J0367K5101l4382
661H7840o2562R863r9726k0006P9670J9099J09720j55059p1970K4068L6297R7283
649E4517k345Q4396k24454O0399J36341m3070Q2270j49265n5043K30711j00982
638G3475Q5663k9220q9934R552K1938O888q1189L4601l9499L8224L9015p994M6519
625A08039p4411R7523p0408L5920j27104K05582l0250m7524Q1970m8298o8949
$$ plain form
614 62090 -16578 38323 -21661 -134667 -44957 83531 125061 -53717 -12975 102450 131900
603 131900 61911 723 71346 160983 68507 -21944 24021 -58341 17357 128410 198462 54845
591 54845 59248 22465 28568 88423 130294 -5968 -74603 -63502 38047 85978 29459 -89724
579 -89724 109297 56313 14891 1281 128301 105920 216835 254475 100870 9176 -3260
568 -3260 15435 -34754 7046 177677 126265 52156 -8222 54423 2103 107879 69169 -42096
556 -42096 16682 -4513 73388 142432 146720 42394 157273 8517 21566 60206 -1647 -19700
544 -19700 -63483 78575 151077 106788 28000 20716 35964 47287 -27576 -61072 -16396 33746
532 33746 -241926 -38435 75537 36337 111652 106851 107400 67780 39818 -21778 -52981 -94012
$$ packed form
614F2090p8668N4901n9984j13006Q9710J28488M1530j78778M0742J15425K9450
603A31900o9989o1188P0623Q9637r2476r0451M5965q2362P5698J11053P0052j43617
591E4845M403l6783O103N9855M1871j36262o8635J1101J01549M7931n6519j19183
579h9724J99021n2984m1422j3610J27020k2381J10915L7640j53605r1694j2436
568c260J8695n0189M1800J70631n1412p4109o0378O2645n2320J05776l8710j11265
556d2096N8778k1195P7901O9044M288j04326J14879j48756J3049L8640o1853j8053
544a9700m3783J42058P2502m4289p8788p284J5248J1323p4863l3496M4676N0142
532C3746k75672K03491J13972l9200P5315m801N49l9620k7962o1596l1203m1031
$$ plain form
520 -94012 171793 94989 145904 80653 142981 51413 26660 35002 53809 -32702 -54869 -14981
508 -14981 36282 34156 10462 -30089 81017 32745 -26542 64519 79288 136074 -9119 -172615
496 -172615 -58070 3149 -153796 10240 55087 88850 85157 -58289 37254 249912 259869
485 259869 272470 322339 237737 -25160 -2573 65199 13855 20219 116872 98099 1900 57969
473 57969 -130820 -48353 17486 36569 -15220 58425 95037 62623 66604 131173 78961 94068
461 94068 35376 71626 141601 81646 89927 30637 78868 9952 196442 52457 -16917 94238
449 94238 -19301 13490 122079 224404 198562 296626 208603 5034 57373 162310 132806
438 132806 145129 137260 276570 133840 87104 88011 -21416 83634 21711 94337 212853
$$ packed form
520i4012K65805p6804N0915o5251O2328r1568k4753Q342J8807q6511k2167L9888
508a4981N1263k126k3694m0551J11106m8272n9287R1061J4769N6786j45193j63496
496a72615J14545O1219j56945J64036M4847L3763l693j43446R5543K12658R957
485B59869J2601M9869q4602k62897K2587O7772n1344O364R6653j8773r6199N6069
473E7969j88789Q2467O5839J9083n1789P3645L6612l2414L981O4569n2212J5107
461I4068n8692L6250O9975n9955Q281n9290M8231o8916J86490j43985o9374J11155
449I4238j13539L2791J08589J02325k5842R8064q8023k03569N2339J04937k9504
438A32806J2323p869J39310j42730m6736R07j09427J05050o1923P2626J18516
$$ plain form
427 212853 152057 174847 88504 72074 224134 99736 148209 -18565 21276 143909 140092
416 140092 216349 99641 134681 177283 158973 205141 23416 -29616 -118680 -62059 -136072
405 -136072 -91421 41928 102627 -14772 41327 108366 144281 59988 -123473 -73900 -58340
394 -58340 -116287 -9198 50758 73896 -67419 -62221 37454 129912 31023 81820 34582 171816
382 171816 130202 -2927 -49614 -30452 88795 -191603 -145892 -140861 -8617 34206 25838
371 25838 31692 -49999 -67982 38413 203611 133366 -1521 35016 50774 87488 -37165
360 -37165 44067 109107 93900 -6802 -76239 -20106 65626 -27169 -21643 105031 130627 -64938
348 -64938 -125258 -14728 -3319 -43609 9330 -56901 -43846 -104160 -159576 7948 143887
$$ packed form
427B12853o0796K2790q6343j6430J52060j24398M8473j66774L9841J22633l817
416A40092P6257j16708L5040M2602j8310M6168j81725n3032q9064N6621p4013
405a36072M4651J33349O0699j17399N6099O7039L5915q4293j83461M9573J5560
394e8340n7947J07089N9956K3138j41315N198R9675R2458r8889N0797m7238J37234
382A71816m1614j33129m6687J9162J19247k80398M5711N031J32244M2823q368
371B5838N854q1691j7983J06395J65198p0245j34887L6537J5758L6714j24653
360c7165Q1232O5040j5207j00702o9437N6133Q5732r2795N526J26674K5596j95565
348f4938o0320J10530J1409m0290N2939o6231J3055o0314n5416J67524J35939
$$ plain form
337 143887 36696 60757 82313 50472 -42012 -31811 2383 66231 7353 -35389 -45872 29525
325 29525 -108893 -82061 -38450 -67830 -44980 -2011 -45999 -9301 12207 -104773 -169000 -127866
313 -127866 -87897 -80317 56449 -5356 6472 82294 35979 -101735 -81403 -63996 -94713 -23915
301 -23915 47072 17337 37478 76980 216496 229871 9568 17724 40808 25162 81502 2573
289 2573 28292 159403 113515 -66791 51155 1082 -27997 -11964 -39614 -83697 -61646 -20112
277 -20112 -65867 -104670 -49400 92734 121818 -41841 -73208 5208 158249 129129 20912
266 20912 25151 51328 -11154 106631 -11975 -863 -1545 -181457 -156826 48356 -10677 -17910
254 -17910 220805 107939 84393 -5690 88677 33604 65209 142941 22530 -81782 -28564
$$ packed form
337A43887j07191K4061K1556l1841r2484J0201L4194O3848n8878m2742j0483P5397
325B9525j38418K6832M3611k9380K2850M2969m3988L6698K1508j16980o4227M1134
313a27866L9969P580J36766o1805J1828P5822m6315j37714K0332J7407l0717P0798
301b3915P0987k9735K0141L9502J39516J3375k20303Q156K3084j5646N6340p8929
289B573K5719J31111m5888j80306J17946n0073k9079J6033k7650m4083K2051M1534
277b0112m5755l8803N5270J42134K9084j63659l1367P8416J53041k9120j08217
266B0912M239K6177o2482J17785j18606J1112o82j79912K4631K05182n9033p233
254a7910K38715j12866k3546r0083R4367n5073L1605P7732j20411j04312N3218
$$ plain form
243 -28564 105655 17209 -67984 -123448 44216 33782 41044 37813 51789 -16076 -57180 -81875
231 -81875 11803 144010 107105 1390 -2217 -79449 95898 42775 89307 69891 12673 -104132
219 -104132 23087 -22457 -6011 113543 119856 54551 -1923 57903 -83341 24594 -46711
208 -46711 -75182 103101 179666 210151 238170 173266 69182 113689 59288 79862 139285 129095
196 129095 -53747 12409 52212 -68428 -22056 11372 39343 -35849 -249230 -137280 940
185 940 -55366 18211 59763 16194 -171881 -20509 -3871 147538 63389 71866 6987 -3608
173 -3608 -76323 -21073 -59666 -95750 23281 -4208 -18415 29094 -159909 42955 54611 28510
161 28510 -65501 11931 45387 68921 30385 92360 15518 -100463 -124165 -66882 19848 231071
$$ packed form
243b8564J34219q8446q5193n5464J67664j0434P262l231J3976o7865m1104k4695
231h1875R3678J32207l6905j05715l607p7232J75347n3123M6532j9416n7218j16805
219a04132J27219m5544J6446J19554O313o5305n6474N9826j41244J07935p1305
208d6711k8471J78283P6565L0485K8019o4904j04084M4507n4401K0574N9423j0190
196A29095j82842O6156L9803j20640M6372L3428K7971p5192k13381J11950J38220
185I40n6306P3577M1552m3569j88075J51372J6638J51409q4149Q477o4879j0595
173c608p2715N5250l8593l6084J19031k7489j4207M7509j89003K02864J1656k6101
161B8510r4011P7432L3456K3534l8536O1975p6842j15981k3702N7283Q6730K11223
$$ plain form
149 231071 147215 58630 40903 25972 -1650 110096 63949 -34690 -51935 -83586 -110125 -147559
137 -147559 -60229 -42418 -35562 31171 55802 -15766 7233 92819 108064 49821 46938 -33451
125 -33451 -94188 -103859 -60268 54477 142888 17538 -6798 -11397 140875 54304 33326 -10278
113 -10278 -17060 49922 4357 13946 106591 43195 -28631 -32061 66199 68423 107011 -31854 58187
100 58187 16928 -91449 79370 36588 46051 205373 165460 63821 -41648 24083 35383
89 35383 60988 65708 62029 80838 33207 72031 75288 -15951 -29800 -86553 -26984 62855 73988
76 73988 113752 154161 8703 -731 12112 112936 144167 89938 124148 76674 73590 25037
64 25037 -61118 6003 87906 60252 -51680 -2425 -52460 -24050 -15069 -96279 6486 121453
$$ packed form
149B31071q3856q8585j7727j4931k7622J11746m6147r8639j7245l1651k6539l7434
137a47559Q7330J7811O856O6733K4631p1568K2999Q5586J5245n8243k883q0389
125c3451o0737r671M3591J14745Q8411j25350k4336m599J52272q6571k0978m3604
113a0278o782O6982m5565R589R2645o3396p1826l430R8260K224L8588j38865R0041
100E8187m1259j08377J70819m2782R463J59322l9913j01639j05469O5731J1300
89C5383K5605M720l679J8809m7631L8824L257r1239j3849n6753N9569Q9839J1133
76G3988L9764M0409j45458r434J2843J00824L1231n4229L4210m7474l084m8553
64B5037q6155O7121Q1903k7654j11932M9255n0035K8410Q981q1210J02765J14967
$$ plain form
52 121453 109327 -9571 1977 -10652 -131 25590 -63609 35856 90057 65346 116821 29523
40 29523 -49355 55985 33046 71256 13487 60719 126197 23175 21394 22297 32235 69395 50725
27 50725 -8074 17387 -35780 40044 13988 7360 -10316 61456 127376 91102 50006 24793
15 24793 -111941 -54497 -70221 -8040 70890 111443 158712 155741 82194 63589 7319 -51864
3 -51864 25503 -44161 63828
0 63828
$$ packed form
52A21453j2126j18898J1548j2629J0521K5721q9199R9465N4201k4711N1475q7298
40B9523p8878J05340k2939L8210n7769M7232O5478j03022j781R03R938L7160j8670
27E0725n8799K5461n3167P5824k6056o628j7676P1772O5920l6274m1096k5213
15B4793j36734N7444j5724O2181P8930M0553M7269k971p3547j8605n6270n9183
3e1864P7367o9664J07989
0F3828
$$ Imaginary data points
##PAGE= N=2
##DATA TABLE= (X++(I..I)), XYDATA
$$ plain form
16383 -1472419 -1446928 -1407204 -1432435 -1510026 -1489613 -1439110 -1308269 -1359129 -1303048 -1219929 -1323983
$$ packed form
16383a472419K5491L9724k5231p7591K0413N0503J30841n0860N6081Q3119j04054
$$ [...]
##END NTUPLES=NMR SPECTRUM
##END=
