##TITLE=1H_EC-3331(11)
 CDCl3
 8 sc, 
 9.9.2024
##JCAMPDX= 6.0         $$ Bruker NMR JCAMP-DX V2.0
##DATA TYPE= NMR SPECTRUM
##DATA CLASS= NTUPLES
##ORIGIN= UXNMR, Bruker Analytische Messtechnik GmbH
##OWNER= root
$$ XWIN-NMR		Version 3.5
$$ Mon Sep  9 14:02:32 2024 Russian Standard Time (UT+4h)  she@DPX200
##.OBSERVE FREQUENCY= 200.1318
##.OBSERVE NUCLEUS= ^1H
##.ACQUISITION MODE= SIMULTANEOUS
##.ACQUISITION SCHEME= undefined
##.AVERAGES= 8
##.DIGITISER RES= 18
##SPECTROMETER/DATA SYSTEM= spect
##.PULSE SEQUENCE= zg30
##.SOLVENT NAME= CDCl3
##.SHIFT REFERENCE= (INTERNAL, CDCl3, 0, 20.9738)
##AUDIT TRAIL= $$ (NUMBER, WHEN, WHO, WHERE, WHAT)
$$ ##TITLE= Audit trail, XWIN-NMR		Version 3.5
$$ ##JCAMPDX= 5.01
$$ ##ORIGIN= Bruker BioSpin GmbH
$$ ##OWNER= she
$$ F:/spectra/data/she/nmr/H-F/1/pdata/1/auditp.txt
$$ ##AUDIT TRAIL=  $$ (NUMBER, WHEN, WHO, WHERE, WHAT)
(   1,<2024-09-09 14:00:39.51 +0400>,<she>,<DPX200>,
      <created by zg, POWCHK disabled, PULCHK disabled
       configuration hash MD5:
       00 E9 B6 7A A2 85 ED C7 34 08 36 98 17 FE 4E 26
       data hash MD5: 16K
       C4 B6 1C D1 62 8A D5 39 94 36 A4 35 CA 32 B8 33>)
(   2,<2024-09-09 14:00:44.23 +0400>,<she>,<DPX200>,
      <Start of raw data processing
       efp BC_mod = 2 LB = 0.24 FT_mod = 6 PKNL = 1 PHC0 = -25992.14 PHC1 = 11.98748 SI = 16K 
       data hash MD5: 16K
       88 3A 1B 3A 24 22 BE 68 5F B5 08 97 12 97 95 F8>)
(   3,<2024-09-09 14:01:06.32 +0400>,<she>,<DPX200>,
      <pk PHC0 = -1.586952 PHC1 = 1.2 
       data hash MD5: 16K
       C2 D8 7E 4D 1D 1B 40 7A AB AC D7 83 EF 60 49 25>)
(   4,<2024-09-09 14:01:09.89 +0400>,<she>,<DPX200>,
      <abs ABSG = 5 
       data hash MD5: 16K
       24 25 58 67 16 B6 03 78 61 2A 2F EC EA 7E 7C 2A>)
$$ ##END=
$$ 
$$ hash MD5
$$ 11 E5 7A 0A D1 ED 74 17 90 1A C8 49 68 BD 03 2F
##$RELAX= 
##$RELAX= 
##$RELAX= 
##$RELAX= 
##$RELAX= 
##$RELAX= 
$$ Bruker specific parameters
$$ --------------------------
##$DU= <F:/spectra>
##$EXPNO= 1
##$NAME= <H-F>
##$PROCNO= 1
##$TYPE= <nmr>
##$USER= <she>
##$AMP= (0..31)
100 100 100 100 100 100 100 100 100 100 100 100 100 100 100 100 100 100 
100 100 100 100 100 100 100 100 100 100 100 100 100 100 
##$AQSEQ= 0
##$AQ_mod= 1
##$AUNM= <au_zg>
##$AUTOPOS= <>
##$BF1= 200.13
##$BF2= 200.13
##$BF3= 200.13
##$BF4= 200.13
##$BF5= 200.13
##$BF6= 200.13
##$BF7= 200.13
##$BF8= 200.13
##$BYTORDA= 1
##$CFDGTYP= 0
##$CFRGTYP= 5
##$CHEMSTR= <none>
##$CNST= (0..31)
1 1 145 1 1 1 1 1 1 1 1 1 1 1 1 1 1 1 1 1 1 1 1 1 1 1 1 1 1 1 1 1 
##$CPDPRG= <>
##$CPDPRG1= <>
##$CPDPRG2= <>
##$CPDPRG3= <>
##$CPDPRG4= <mlev>
##$CPDPRG5= <mlev>
##$CPDPRG6= <mlev>
##$CPDPRG7= <mlev>
##$CPDPRG8= <mlev>
##$CPDPRGB= <>
##$CPDPRGT= <>
##$D= (0..31)
0 1.2 0 0 0 0 0 0 0 0.06 0 0.03 0 0 0 0 0.0002 0 0 0 0 0 0 0 0 0 0 0 0 
0 0 0 
##$DATE= 1725876039
##$DBL= (0..7)
120 120 120 120 120 120 120 120 
##$DBP= (0..7)
150 150 150 150 150 150 150 150 
##$DBP07= 0
##$DBPNAM0= <>
##$DBPNAM1= <>
##$DBPNAM2= <>
##$DBPNAM3= <>
##$DBPNAM4= <>
$$ [...]
##$SUBNAM3= <"">
##$SUBNAM4= <"">
##$SUBNAM5= <"">
##$SUBNAM6= <"">
##$SUBNAM7= <"">
##$SUBNAM8= <"">
##$SUBNAM9= <"">
##$SW= 24.0689170037331
##$SWIBOX= (0..15)
0 0 2 0 0 0 0 0 0 0 0 0 0 0 0 0 
##$SW_h= 4816.95568400771
##$TD= 16384
##$TD0= 1
##$TE= 0
##$TE2= 300
##$TE3= 300
##$TEG= 300
##$TL= (0..7)
0 120 120 120 120 120 120 120 
##$TP= (0..7)
150 150 150 150 150 150 150 150 
##$TP07= 0
##$TPNAME0= <>
##$TPNAME1= <>
##$TPNAME2= <>
##$TPNAME3= <>
##$TPNAME4= <>
##$TPNAME5= <>
##$TPNAME6= <>
##$TPNAME7= <>
##$TPOAL= (0..7)
0.5 0.5 0.5 0.5 0.5 0.5 0.5 0.5 
##$TPOFFS= (0..7)
0 0 0 0 0 0 0 0 
##$TUNHIN= 0
##$TUNHOUT= 0
##$TUNXOUT= 0
##$USERA1= <user>
##$USERA2= <user>
##$USERA3= <user>
##$USERA4= <user>
##$USERA5= <user>
##$V9= 5
##$VALIST= <valist>
##$VCLIST= <CCCCCCCCCCCCCCC>
##$VD= 0
##$VDLIST= <DDDDDDDDDDDDDDD>
##$VPLIST= <PPPPPPPPPPPPPPP>
##$VTLIST= <TTTTTTTTTTTTTTT>
##$WBST= 1024
##$WBSW= 4
##$XGAIN= (0..3)
0 0 0 0 
##$XL= 0
##$YL= 0
##$YMAX_a= 332982
##$YMIN_a= -341790
##$ZGOPTNS= <>
##$ZL1= 120
##$ZL2= 120
##$ZL3= 120
##$ZL4= 120
##$ABSF1= 20.98263
##$ABSF2= -3.086502
##$ABSG= 5
##$ABSL= 3
##$ALPHA= 0
##$AQORDER= 0
##$ASSFAC= 0
##$ASSFACI= 0
##$ASSFACX= 0
##$ASSWID= 0
##$AUNMP= <proc_1d>
##$AZFE= 0.1
##$AZFW= 0.1
##$BCFW= 0
##$BC_mod= 2
##$BYTORDP= 0
##$COROFFS= 0
##$CY= -3
##$DATMOD= 1
##$DC= 0
##$DFILT= <>
##$DTYPP= 0
##$F1P= 0
##$F2P= 0
##$FCOR= 1
##$FTSIZE= 16384
##$FT_mod= 6
##$GAMMA= 0
##$GB= 0
##$INTBC= 1
##$INTSCL= 3.70164e-10
##$ISEN= 128
##$LB= 0.24
##$LEV0= 0
##$LPBIN= 0
##$MAXI= 10000
##$MC2= 0
##$MEAN= 0
##$ME_mod= 0
##$MI= 1.114404
##$NCOEF= 0
##$NC_proc= -6
##$NLEV= 6
##$NOISF1= 3.799351
##$NOISF2= 2.8
##$NSP= 0
##$NTH_PI= 0
##$NZP= 0
##$OFFSET= 20.97382
##$PC= 1
##$PHC0= -25993.73
##$PHC1= 13.18748
##$PH_mod= 1
##$PKNL= yes
##$PPARMOD= 0
##$PSCAL= 0
##$PSIGN= 0
##$REVERSE= no
##$SF= 200.130010988571
##$SI= 16384
##$SIGF1= 3
##$SIGF2= 2
##$SINO= 5.538805
##$SIOLD= 16384
##$SREGLST= <1H.CDCl3>
##$SSB= 0
##$STSI= 16384
##$STSR= 0
##$SW_p= 4816.95568400771
##$SYMM= 0
##$S_DEV= 0
##$TDeff= 16384
##$TDoff= 0
##$TI= <>
##$TILT= no
##$TM1= 0
##$TM2= 0
##$TOPLEV= 0
##$USERP1= <user>
##$USERP2= <user>
##$USERP3= <user>
##$USERP4= <user>
##$USERP5= <user>
##$WDW= 1
##$XDIM= 16384
##$YMAX_p= 269944075
##$YMIN_p= -316393
$$ End of Bruker specific parameters
$$ ---------------------------------
##NTUPLES= NMR SPECTRUM
##VAR_NAME=  FREQUENCY,     SPECTRUM/REAL,   SPECTRUM/IMAG
##SYMBOL=    X,             R,               I
##VAR_TYPE=  INDEPENDENT,   DEPENDENT,       DEPENDENT
##VAR_FORM=  AFFN,          ASDF,            ASDF
##VAR_DIM=   16384,         16384,           16384
##UNITS=     HZ,            ARBITRARY UNITS, ARBITRARY UNITS
##FACTOR=    0.29402158847633, 1,            1
##FIRST=     4197.49077357076, 0,            0
##LAST=      -619.464910436954, 0,           0
##MIN=       -619.464910436954, -316393,     0
##MAX=       4197.49077357076, 269944075,    0
$$ Real data points
##PAGE= N=1
##DATA TABLE= (X++(R..R)), XYDATA
$$ [...]
8219 42639 6462 -23218 105845 75781 26669 150402 7612 -67043 158846 101248 136576
8208 136576 -1099 -71756 -59514 69113 155362 -1120 -52984 59921 121125 157639 -13170
8197 -13170 28848 21089 223829 164670 540494 1252849 238642 84093 -97397 -61100 -75988
8186 -75988 34506 -3247 107829 29357 3776 47010 33980 -133658 -92496 -24296 -63226
8175 -63226 -25381 -35716 12718 -85824 45550 55726 -4875 -5763 136084 32698 189875
8164 189875 91 56287 109008 -56969 -17630 53304 -129412 -66762 7359 31546 -3217
8153 -3217 82865 86588 18104 121221 25243 50652 91066 45830 -70739 -45928 75608 -45537
8141 -45537 113811 20549 -4639 -1238 -16079 6413 98682 44712 121762 165361 -28308 -52554
8129 -52554 35010 192316 -48655 42487 146193 41114 32593 12573 29916 154913 265737
8118 265737 46173 6423 14385 40837 -20845 -69094 201027 40713 123850 53908 -158181
8107 -158181 -34173 9924 10019 -102367 38204 134204 44129 52586 62081 61729 51659 22272
8095 22272 15567 138247 56811 93200 48280 78575 6176 24570 -43881 88231 235058
8084 235058 19999 51225 213455 41665 172352 67419 14715 126902 22646 43919
8074 43919 17841 23459 -34782 23171 84710 10861 -3311 -36405 85870 71405 138307 118159
8062 118159 205976 83315 61017 123452 154019 114284 109428 155884 104729 182342 103501 -19276
8050 -19276 126066 231346 76101 217583 223443 240679 152645 249720 290073 292013 151080
8039 151080 221195 186682 236937 153046 101945 77227 104000 172682 205557 336546 302272
8028 302272 290608 197580 176761 131558 271023 181726 264148 223321 222152 271154 151036
8017 151036 239154 241871 298222 143643 153400 363830 243879 197911 278347 199678 354841
8006 354841 386291 346431 376255 411301 630247 525271 558690 638976 626272 692302 538457
7995 538457 413764 345028 528572 538249 470904 578626 502494 485975 670597 497177 611868
7984 611868 722992 789605 753004 783001 913634 1008430 1001759 1034194 1115425 1305672 1413481
7973 1413481 1529184 1443251 1369702 1479599 1461164 1235347 1223135 1054219 1106563 1050822 944720
7962 944720 931187 744747 734102 627364 575881 494121 455817 397806 370933 441027 454289
7951 454289 426242 428765 528715 540908 369660 255070 230157 183446 178455 103095 115525 69896
7939 69896 135924 245155 132526 228304 274252 325647 284809 216900 128712 160927 209487
7928 209487 224357 132070 173356 133159 225292 137274 186239 -6897 99264 154303 161708
7917 161708 139383 194278 229608 251525 336443 190849 134654 3621 19430 30227 50557
7906 50557 241771 318233 128429 205185 212444 243911 69594 -106675 99108 33372 138974
7895 138974 211387 133790 201461 295301 216288 233278 220013 203955 126560 165728 212846 99936
7883 99936 205400 213224 187896 193964 45956 114122 167842 127021 264810 336858 148446
7872 148446 52898 191030 235040 187922 279475 131217 109092 308644 128556 97832 47337
7861 47337 76928 19717 87654 -30718 125553 77680 162983 136623 268614 180765 99089
7850 99089 274512 117822 117884 84517 140893 73147 96359 62739 84919 126472 103621 113397
7838 113397 246397 73503 -3340 29036 133059 179512 71566 -59662 55980 181527
7828 181527 248441 72546 143641 215175 134241 18208 72404 -129 143046 94101 -10457
7817 -10457 17136 58881 -4582 55872 1738 72057 1938 102874 182009 139760 98244 28384
7805 28384 116000 224694 231263 216695 264211 45947 79630 40830 207433 314726 189737
7794 189737 -24176 -83898 40377 146737 40905 141987 13068 219072 275203 219215
7784 219215 48704 66201 86938 45419 -25997 105099 116454 203994 135520 181393 56092
7773 56092 58353 150292 118249 146980 156212 61683 -26632 66567 96758 164305 99511 131987
7761 131987 98411 232471 131108 -2355 53638 151661 286495 289924 273514 229585 240179
7750 240179 165570 61625 118029 163852 87225 101285 121824 214110 243808 205615 77602
7739 77602 58353 106661 73983 133911 109383 11767 79725 175103 197661 76651 68577 159385
7727 159385 113658 277344 271441 344635 293101 202647 174186 108738 117114 211209 305675 227051
7715 227051 155902 129995 72832 36388 48504 230433 221626 279992 171677 193974 223748
7704 223748 102345 264574 284244 367862 295359 343015 340840 352342 430120 240231 152962
7693 152962 29282 143725 187643 248811 420296 258131 34265 108337 140398 154091 199410
7682 199410 26838 -79390 -28915 220109 163939 113217 121903 221465 150573 175213 389601
7671 389601 338817 225757 223528 328612 261085 215091 237240 176383 198229 160240 151007 119134
7659 119134 203654 304472 278636 241236 120670 171609 231462 191215 162961 231765 136475
7648 136475 250582 24192 152504 184464 116901 195198 263578 319857 331929 248908 115658
7637 115658 295118 373873 357545 431188 430098 329806 331553 355909 258961 186746 353086
7626 353086 509690 435136 680793 535883 391806 545819 487250 448054 443399 372945 335364
7615 335364 331962 313869 355472 297625 474710 455082 406086 480836 435992 556641 476859
7604 476859 359648 416772 402776 456994 493356 532218 288491 306879 433253 449113 420705
7593 420705 302415 296133 310005 294546 333445 424082 458118 420165 329612 327290 462777 321785
7581 321785 319131 463001 491523 446015 309660 142306 294008 348794 258942 333696 556776
7570 556776 481909 310828 550750 427578 406325 366989 393525 239913 358505 391606 387307
7559 387307 279413 459006 461622 345792 425158 376885 331813 260296 382367 354305 316600
7548 316600 341447 446416 407522 312037 352332 298895 365255 466825 327508 486405 351350
7537 351350 184710 320653 350820 393630 325808 274647 316030 342046 374246 537959 500918
7526 500918 369481 453196 381389 458686 566048 605478 572445 461921 347434 506080 376731
7515 376731 277782 403669 540509 476971 469625 331343 472048 581606 547943 568035 569381
7504 569381 584985 525677 557958 601278 462769 463345 460907 504165 564828 572842 539286 512482
7492 512482 483641 605746 528433 458440 426785 510036 506752 593282 505444 488506 570532 711498
7480 711498 759534 655531 716738 637757 687056 533379 606020 686843 560965 762740 742101
7469 742101 624252 681090 645428 664705 731875 691226 667111 742882 757200 826354 755326
7458 755326 730968 663221 729729 667814 728727 759520 768269 611868 497995 641460 796014
7447 796014 880484 839642 830690 848095 782274 898900 865290 890533 961506 1017560 872554
7436 872554 860112 876377 1060964 922368 942584 958455 899830 1047136 1080558 926470 1071578
7425 1071578 1090748 924383 966283 1030131 1111464 1175240 1243900 1222342 1275707 1287646 1401158
7414 1401158 1435024 1420388 1386831 1392900 1405757 1475862 1631332 1770274 1718255 1616214 1691172
7403 1691172 1804703 1758012 1632515 1549103 1788412 1873224 2053209 2170609 2292560 2214400
7393 2214400 2200923 2421042 2363905 2329515 2343309 2467238 2731245 2869188 3145475 3561230
7383 3561230 3813312 3884325 3804566 3657572 3486446 3351595 3495765 3470747 3376721 3460430
7373 3460430 3438410 3500651 3617380 3501799 3509361 3476787 3407617 3585408 3910344 4051444 4052235
7362 4052235 4193708 4373936 4555137 4725045 4987150 5168691 5329755 5712447 6239346 6620200
7352 6620200 7218759 7560283 7842715 7617601 7291916 7070146 7094813 6923836 6725768 6788101
7342 6788101 6840229 6986200 7299736 7555146 7777557 8182769 8702821 9212485 9696739 10304513
7332 10304513 10921213 11787231 12986872 14581072 16329155 18232915 19789882 20273281 19720269
7323 19720269 18880257 18362607 18666154 19465590 20151463 19895581 18778216 17050351 15536849
7314 15536849 14351782 13260415 12765950 12362504 12205101 12313330 12576644 12974901 13901133
7305 13901133 15094476 16634140 18326039 19682844 20453355 21277273 22255837 22540654 22472744
7296 22472744 21833520 21003755 20191398 18886470 17033425 14913577 12949793 11364062 10084615
7287 10084615 9270144 8707608 8396391 7871486 7466544 7034478 6391562 5961413 5879022 5770285
7277 5770285 5345618 5166491 5140004 5005475 4951412 4691040 4560510 4351704 4339286 4300266
7267 4300266 4016991 3959570 4014485 3955508 4016887 4029570 4257524 4237430 4276963 4407539 4662821
7256 4662821 4814147 4689629 4582546 4329408 4347263 4352960 4378682 4510442 4525263 4257511
7246 4257511 4039148 3949829 3667232 3503621 3464330 3466420 3370166 3366636 3405294 3270561 3223845
7235 3223845 3206459 3348718 3382215 3174064 3185312 3139674 3124753 3243935 3237375 3216988 3256847
7224 3256847 3197953 3121346 3161465 3019305 3078765 3022731 3059710 3096201 3148196 3241315 3251970
7213 3251970 3151508 3077374 2957540 3070107 3077779 3150088 3143240 3229364 3213696 3229621 3237550
7202 3237550 3416649 3501884 3484241 3437038 3438183 3455514 3447611 3530605 3714310 3651871 3681716
7191 3681716 3903834 3925735 3886295 3669677 3836781 3868045 4045509 3992329 4115199 4337815
7181 4337815 4418735 4597317 4691864 4950284 4911103 4955136 5241493 5378494 5496792 5454262
7171 5454262 5483716 5538080 5611791 5731053 6031452 6068587 6130192 6350311 6530508 6686139
7161 6686139 7088213 7231088 7404119 7818983 8061426 8357232 8548504 8750664 9192640 9427116
7151 9427116 9766517 10209623 10641081 10898085 11452629 12107864 12604236 13364736 13976843 14854325
7141 14854325 15972213 17280055 18949507 20521173 21475601 21829629 21670952 21628875 22106397
7132 22106397 23132110 24373027 25726139 26356676 26795223 27007195 27068417 27075220 27307809
7123 27307809 28292718 29212921 29588721 29410315 29094542 29449589 30318255 31919342 33880058
7114 33880058 35396503 36678537 37821877 39680791 42238285 45777796 49477453 51986726
7106 51986726 54419696 56305907 57848757 57275240 53860329 49315235 44833482 41353382
7098 41353382 38961812 37425739 36542024 35501714 34305091 33011850 32206755 31936922 31848443
7089 31848443 31956569 32555873 33634738 35475852 38199342 42013278 46058465 48959618
7081 48959618 50837519 50562623 48929425 47117748 45601766 45573387 45365345 44136536 42246599
7072 42246599 40420676 38946079 37616751 36594414 35245132 33911284 32541643 31395589
7064 31395589 30191188 29327166 28880198 28994989 29434530 29670642 29785949 29681689 29430275
7055 29430275 29587257 30144091 30912901 31395240 31481256 31347131 31384283 31638208 32414567 33578383
7045 33578383 35306841 38315195 43141927 49052887 57292544 59961960 57840312 51365267
7037 51365267 43275558 37450802 33141254 30422806 27697566 25677768 23663504 22247646
7029 22247646 21231304 20291836 19294561 18705594 17781394 17171337 16492710 16265820 15907208
7020 15907208 15665727 15480314 15299783 15394842 15481929 15459551 15448113 15486244 15505851 15398698
7010 15398698 15374621 15504120 15707730 15881436 16073377 16044853 16216051 16215397 16285770 16437570
7000 16437570 16707230 17012467 17205235 17405796 17817652 18245143 18558355 18904991 19289557
6991 19289557 19698661 20197181 20783093 21473543 22003107 22795288 23788992 24572958 25425084
6982 25425084 26169830 27082487 28098237 29476158 31015783 32337192 33845431 35501071
6974 35501071 37359266 39274025 40875877 42535499 44263308 46386092 49167552 52251685
6966 52251685 55427174 57167507 57516025 56666007 55783709 55298752 55329474 54296565 52231178
6957 52231178 49720844 47510195 46286829 45788777 45987784 46745841 47672032 48687750 50093619
6948 50093619 51806554 53645221 55675063 58178508 61041116 63629319 65070928 65996202
6940 65996202 67411305 68538908 67867798 65629607 62676452 60051598 57513592 54041228
6932 54041228 49875867 45680821 41914914 39166669 36979617 35424501 34509346 33662275
6924 33662275 33073093 32923974 33182078 34109825 35379180 36645046 36705329 35678827 34066283
6915 34066283 32909882 32218002 31649237 30527322 29019689 27300888 25805129 24479793
6907 24479793 23620327 22940013 22567059 22031108 21690522 21408346 20943453 20839368 20687897
6898 20687897 20648308 20672274 20883124 21081887 21338655 21651029 21773560 22087703 22399394 22752807
6888 22752807 22903439 22937748 22916602 22833749 22984168 23121226 23608480 24042502 24430012 24870994
6878 24870994 25362906 25929492 26680599 27462982 28095153 28207868 28193239 28496155 28912779 29355160
6868 29355160 29848535 30091628 30316326 30429435 30418837 30389146 30494648 30570512 30838677 31108561
6858 31108561 31323624 31543396 31978752 32610252 33326136 33971978 34779727 35844262 36837175
6849 36837175 37643514 38153709 38617805 39039437 39844889 40720639 41543106 42193679 42564465
6840 42564465 42474789 41728854 40981699 40652931 40354673 40551696 41228415 42481622 44111804
6831 44111804 46165373 47863130 48838123 49599237 50472910 50909895 50389522 49236199 47476523
6822 47476523 46027332 44701878 43589697 42637239 42053088 41514105 41079222 40640877 40266533
6813 40266533 39872181 39633208 39802867 40693623 42042054 43816071 46153598 48101902 49850236
6804 49850236 51543488 52886278 54131467 54855552 54364104 52872970 50662827 48437472
6796 48437472 46819890 45496628 44705181 43992507 43390799 42762914 42190071 41562291 41028491
6787 41028491 40735931 40390211 40555740 40969619 42100785 43755216 46102720 49010651 52128160
6778 52128160 55047450 57401717 58846385 58853946 57513044 54986425 51842340 48567418 45977359
6769 45977359 43590696 41537338 40005842 38821422 37975285 36980864 36071950 35182720 34292975
6760 34292975 33501016 33129509 32858590 32830234 32991853 33356359 34080471 35031591 36278804
6751 36278804 37986546 39871358 41491663 42325657 42496556 42076246 41665861 41095811 39868324
6742 39868324 38500454 36565248 34665543 32906474 30963671 29117447 27422608 25991484
6734 25991484 24463036 23336650 22460612 21415668 20475682 19667609 19234551 18965557 18603503
6725 18603503 18368473 18466042 18625315 18671320 18516700 18298074 17985229 17738067 17421174 16912725
6715 16912725 16232553 15352000 14709140 13867216 13112630 12393457 11826053 11357577 10954099
6706 10954099 10644762 10173262 9971358 9799578 9557285 9412732 9421835 9293295 9309030 9182082
6696 9182082 9181022 9119903 8876761 8675412 8696965 8657435 8362548 7985552 7858468 7586374
6686 7586374 7316781 7313296 7179241 7235231 7161693 7129788 6977033 6649471 6340022 6199679
6676 6199679 5973386 5806703 5507538 5249635 5108778 4959829 4951948 4875749 4860744 4799383
6666 4799383 4753463 4646807 4543963 4468979 4677127 4641899 4546890 4546607 4647216 4699649 4683657
6655 4683657 4774499 4613487 4506893 4356061 4375105 4304425 4215432 4166663 4013910 3780902
6645 3780902 3831355 3876165 3755329 3647101 3551917 3481846 3418672 3392111 3385539 3386449 3101035
6634 3101035 3213025 3212161 3099832 3105420 3067949 2976269 3027208 3170370 3008199 3107529 3044940
6623 3044940 3024548 3022469 3016622 2925052 3063242 3129328 2963567 3073882 3103677 3196310 3190869
6612 3190869 3008539 3129647 3144962 3129923 2925983 3011131 3046115 2942815 3096284 3085249
6602 3085249 3070641 3149015 3283610 3319120 3202734 3178876 3289518 3399082 3345570 3297369 3383779
6591 3383779 3437531 3602304 3668481 3762978 3749702 3880576 4077857 4162506 4362885 4572043
6581 4572043 5031881 5383318 5829858 6228429 6462298 6440552 6348207 6503565 6485492 6633024
6571 6633024 6615076 6177299 5859940 5460741 5141723 4923360 4760388 4570948 4435854 4430899
6561 4430899 4340703 4340186 4434993 4486560 4611780 4789165 5056523 5432490 5404867 5662412 5799127
6550 5799127 5735725 5811126 5658569 5709130 5634493 5332416 5061161 4674340 4420122 4180896
6540 4180896 3895929 3684305 3543437 3357200 3283845 3371493 3258030 2935324 2824889 2830813
6530 2830813 2783213 2782834 2732254 2674831 2593708 2404113 2472567 2500671 2383494 2287490 2330156
6519 2330156 2348785 2483084 2219926 2255127 2254748 2217120 2136701 2164712 2208013 2237425 2193188
6508 2193188 2070063 2039797 2039218 1940879 2007785 2075967 2009704 1921637 1998822 1891112 1879663
6497 1879663 1835430 1876479 1852812 1841426 1792424 1829061 1761957 1648741 1531567 1615580 1672654
6486 1672654 1566752 1740051 1667175 1769377 1743349 1837724 1870761 1805271 1907436 1743575
6476 1743575 1793102 1917963 1815890 1649505 1594819 1733981 1661755 1716656 1767490 1701527 1568151
6465 1568151 1784999 1806689 1833426 1599609 1594636 1599391 1636801 1631864 1635930 1670036 1640028 1718920
6453 1718920 1787820 1661036 1728586 1617747 1847498 1821818 1658907 1856027 2052244 2057707
6443 2057707 2103585 2063631 2155947 2117000 2231578 2058509 2021951 2081635 2055328 2066850 2028873
6432 2028873 2194978 2386635 2483947 2465308 2522695 2722816 2646481 2620217 2914872 3013707 3032138
6421 3032138 3088963 3175051 3273536 3542912 3544765 3736596 3945870 3946596 4186158 4522042 4794906
6410 4794906 5138784 5458721 5524502 5615177 5669977 5876398 6131219 6295497 6318920 6171307
6400 6171307 6228977 6293237 6358229 6653673 6945032 7310567 7616217 7941171 8261381 8503381
6390 8503381 8777369 8936363 8948156 9122667 9238441 9449673 9563972 9452124 9613465 9347252
6380 9347252 9307340 9225142 9262478 9146337 9132891 9042478 8883921 8968231 9070680 9217704 9261846
6369 9261846 9274346 9297672 9660906 10159355 10194381 10499528 10555116 10588958 10401162 10078185
6359 10078185 9740855 9492731 9199573 8950736 8724153 8231232 7688764 7197370 6874924
6350 6874924 6475757 6331165 6210117 6182001 5977471 5845142 5879119 5707654 5728484 5875095
6340 5875095 5880198 5736213 5743277 5722023 5486772 5134780 4953106 4964374 4791786 4572063 4316522
6329 4316522 4068333 3782748 3518898 3027192 2716668 2706622 2656405 2524481 2285930 2148289
6319 2148289 2082957 2168925 2140137 2074040 2036857 2008017 1794894 1645599 1678944 1679862 1501605
6308 1501605 1468047 1509879 1479801 1563261 1451185 1396868 1312099 1235871 1423110 1365146 1259370
6297 1259370 1197174 1197987 1093835 1193475 1204886 1190071 1183470 1139039 1085111 1068288 1010958 937587
6285 937587 991446 1073053 903235 873772 976147 1020679 1084805 989779 840157 897263 919052
6274 919052 957507 948428 924552 1053735 1072988 995027 910939 917812 944316 925857 891072 790334
6262 790334 924160 1003660 1001465 994480 1046931 941197 868260 912766 979170 822090 694956
6251 694956 886307 844385 793751 759995 849843 743040 786929 772630 732566 673370 640578
6240 640578 737121 875495 787725 818670 835590 865501 696490 723933 697906 704263 654640
6229 654640 726449 689783 705594 694966 604993 550498 751850 737579 729668 667769 621446 552437
6217 552437 608516 675942 830952 685634 632362 702413 657249 633691 615099 509620 643381
6206 643381 683428 642449 675584 632316 669221 569830 568402 565423 672779 658644 593927 625537
6194 625537 568465 625688 735543 647354 592211 518885 381058 481263 555287 497792 575111
6183 575111 562422 493042 586882 733463 776219 713442 673850 643399 498984 586712 769459
6172 769459 848438 554868 512650 480211 475741 487489 519548 539477 444210 405819 455361 583449
6160 583449 629515 538146 496032 556963 483057 321939 345527 251937 381684 495567 353812
6149 353812 448484 448592 386518 573423 553650 517704 476433 511300 615317 360567 477452
6138 477452 622772 348062 408106 348673 440138 531818 441453 574258 611593 481314 628151
6127 628151 466868 516407 625889 621030 517389 606851 613460 679745 537157 525730 369625
6116 369625 452549 441335 414470 438756 599523 572126 429368 511922 494413 382961 493355
6105 493355 459237 396282 607971 646702 474519 283527 411860 522370 546004 575403 588842
6094 588842 589192 627695 582117 637717 582370 463639 448554 494497 407228 463221 422038 477002
6082 477002 376760 488521 501993 478320 517842 504100 523615 564406 411170 386177 436862
6071 436862 507822 353178 341967 431605 275169 429121 415731 304442 390588 374995 207837
6060 207837 185439 310987 334051 381572 379640 536026 425217 467032 321428 394241 401662
6049 401662 373618 363405 350083 177224 247622 227092 146502 126437 106196 114915 -7420
6038 -7420 163049 439176 357462 343361 303405 171480 108351 223748 295842 167862 209096
6027 209096 337645 147076 147756 221711 149916 314444 402496 372037 341152 306605 84877
6016 84877 123310 158579 294486 266745 262607 122955 245778 150867 42814 83915 212656
6005 212656 295209 280606 399090 333253 261315 307276 184721 79572 99385 54406 175159
5994 175159 108903 123510 188467 228501 203302 173558 209627 283444 236656 147744 240338 254030
5982 254030 128124 125447 170254 94892 119156 144242 211447 136557 189728 132082 259947
5971 259947 309622 220692 171245 182164 117031 15182 137028 118500 55884 178676 124582
5960 124582 161872 169147 226847 127738 209118 126481 74856 -79665 -108977 35752 97019
5949 97019 -70017 -92035 -18936 -26773 -44070 -119665 -51355 -38945 92762 -9286 64900
5938 64900 -3865 55121 149967 51311 -115979 -79692 65737 21316 43520 98037 162557
5927 162557 64162 97774 108039 40125 50211 180632 212024 74865 -543 43429 85264
5916 85264 -89913 23032 -67905 -33149 85795 32086 -155853 -104696 -20750 -5119 -30537
5905 -30537 -53738 11832 -31800 57530 161688 38570 37995 89819 18442 -4109 139629 -13896
5893 -13896 -109669 10408 19853 -8095 -130586 -17524 14889 -106669 -105218 80781 36515
5882 36515 -118637 -79119 -167090 104696 129039 55255 206816 300105 168107 125189 176015
5871 176015 162272 84672 106896 48399 274530 169467 112531 132653 73972 130001 118100
5860 118100 -12591 249585 228597 122888 116415 -33480 70472 115748 -48293 84400
5850 84400 112132 77924 207026 115293 179639 214382 199440 86471 33267 -37810 -35591 -27560
5838 -27560 -40415 69341 -146531 -103890 43300 -22140 97300 81250 134803 44268 109934
5827 109934 39853 149095 -33134 -60319 -146874 45867 78757 83487 102914 60345 91706
5816 91706 106553 -106071 -105612 -93480 86533 133805 150499 34993 6831 115487 -37676
5805 -37676 -115408 -24634 140333 132508 99167 24848 28940 90636 -142320 53597 47622 -35941
5793 -35941 -36293 -27404 -7302 -56504 -206698 -126276 -96377 -108474 -8630 -104797 -99237 -19135
5781 -19135 90674 12751 21090 124678 235934 125541 158869 60810 48732 59968 71986
5770 71986 -64347 -27583 -52280 -106442 -114798 -208788 -73603 -35739 -8000 106204 92393
5759 92393 70559 -3564 16271 -89030 -23805 -6100 -3361 76570 -64456 -86422 -133173 -203302
5747 -203302 -123462 -56875 72141 52333 -85357 -44439 80717 -88890 -53946 -2057 30083
5736 30083 145449 185400 159801 -16172 -112930 -103902 -61155 114562 33095 -63724 15923
5725 15923 91242 -38239 80630 49190 -83350 25072 89613 -69603 71363 117292 27690
5714 27690 57159 20056 -76092 -12076 50832 -47621 -5316 -77562 -203431 -78583 76537
5703 76537 -913 1810 46067 -61494 -55640 -57077 97672 163147 211828 266661 139576 6198
5691 6198 57993 60151 6227 -55132 49678 121356 192825 274534 155969 85663 -799 -35310
5679 -35310 -34551 -34822 21703 -471 -9593 64400 42254 -18787 85286 41617 133542 194087 109236
5666 109236 124050 62384 7105 16695 70620 163423 130961 -9441 145968 169762 130885
5655 130885 -43070 149419 79834 107564 77934 113934 130653 146916 147081 269635 69705
5644 69705 178222 -29407 -31038 226028 119503 100171 121042 100656 267732 315177 124650
5633 124650 133285 48462 124115 245050 129397 150749 228766 66961 -2995 -6028 72132
5622 72132 239146 97110 53569 22866 196463 193417 126886 458602 307233 285155 307295
5611 307295 389826 344395 383998 283389 246063 212469 80155 106191 221082 165674 176902
5600 176902 142021 159402 220399 179517 244500 253104 68897 110139 234755 219639 116510
5589 116510 132710 71866 -88169 -9774 -15658 42894 92576 56162 -36875 -34383 -29117 142505
5577 142505 184508 111073 53894 48728 230220 116984 -20451 50883 128786 136316 65504
5566 65504 -27208 51933 79044 100203 37749 45808 23333 33834 102897 107852 44703 -151014
5554 -151014 -23763 84952 44454 -339 -27188 -92563 -72826 -54058 19226 162405 81010
5543 81010 154833 169834 217715 149649 26795 89014 79142 159804 30979 28438 -51637 -89578
5531 -89578 -149660 -117175 -101604 26107 158518 -48377 60361 -139585 -115861 -14939 -179041
5520 -179041 -50791 35283 76948 914 -153181 -59115 76503 45262 -25475 9152 104010
5509 104010 26813 22767 -84533 9554 157101 34155 113801 58143 31030 37029 63985
5498 63985 -17289 -85462 -62307 52982 113175 45117 -57652 893 -73300 -81803 -46610 -15374
5486 -15374 -12792 74095 154770 65530 51410 -20361 -152685 -79278 -46820 -103904 4788 89407
5474 89407 55695 72600 -12243 38507 72082 36585 72347 -6625 -80445 -67052 -44279 -38310
5462 -38310 -44188 -83697 -168607 -46628 -66701 -35930 31784 -39498 -9562 49275 79510 -100693
5450 -100693 52038 96946 2482 -219733 -9964 6753 -81805 -148748 -187260 2402 -125325
5439 -125325 48572 97414 -8043 27669 57695 37250 -71869 -90 214244 223560 -13565
5428 -13565 76373 76274 -24992 -54036 -1170 54006 -171497 -11960 207632 69948 144827
5417 144827 28966 59014 -2225 4579 -98247 -17319 200064 198187 147950 15145 99266
5406 99266 96178 53687 -80488 -66903 68908 154662 176272 100521 34669 542 -9047 -135711
5394 -135711 -70574 -90565 -64290 48170 4727 20395 -47575 2333 -39026 -111240 69958
5383 69958 5211 -16615 111901 47326 -16442 12247 -99651 28592 24435 31633 29239 12622
5371 12622 102818 83766 67370 74133 88244 -69616 2892 51588 98380 65539 31133 6056
5359 6056 33670 218710 216955 101720 100379 -129191 93076 31243 31358 -95276 -67255 -68689
5347 -68689 9104 -3903 17637 -161714 -221673 -118294 -65608 -60691 -122065 35904 -71615
5336 -71615 -31403 -89641 -98194 -198606 -165614 -54540 137165 48596 130620 269817 175463
5325 175463 78208 69283 41557 51060 40657 174705 181834 20982 157573 121800 -45835
5314 -45835 -120103 -74592 23891 -11610 -90633 53720 74790 4461 122650 18614 -442
5303 -442 -12534 168877 91445 -127001 -80564 64160 133100 77146 92563 124437 47329 73691
5291 73691 143202 188791 102866 22143 -73750 49521 227839 -83757 -81795 -26108 40011
5280 40011 68399 122741 159830 252798 218303 84537 -6689 25223 235653 208052 54127
5269 54127 79425 132807 180967 86082 49965 60909 29292 -19401 -156131 95584 57946
5258 57946 49810 193569 51889 29941 21257 -117111 -85958 -35342 -101292 12378 217525
5247 217525 245533 209778 144041 182269 203716 188873 46062 -14254 231924 238783 197556
5236 197556 185683 248401 145933 213455 135352 280430 412644 286317 256030 203321 100822
5225 100822 50412 208644 134585 -25985 -54522 155170 79475 -18124 83735 -28475 51135
5214 51135 10868 -7018 133394 143310 173470 175804 176800 210503 254619 186700 287082 239094
5202 239094 266424 402915 109912 84111 118528 82905 182266 89748 148893 246804 273652
5191 273652 240546 161641 263916 215677 66653 220847 114482 114947 70743 115439 38958
5180 38958 120721 279186 313792 282406 244877 183102 47989 115250 207760 240423 255621
5169 255621 307242 343025 263265 187951 378179 440616 405432 331403 235639 117187 74751
5158 74751 255463 144475 58358 215577 362320 484271 309572 352318 306003 345156 395978
5147 395978 399797 383513 309038 160895 258532 322457 327266 325887 303495 266487 252964 289647
5135 289647 158843 336895 302165 139745 221285 378160 320085 519403 437924 324284
5125 324284 295768 342930 334772 370884 385330 225872 277549 480847 304218 308587 343595
5114 343595 197687 309469 413205 439507 356017 387911 472968 355902 311122 400426 351212
5103 351212 502602 492158 387646 432730 473303 390642 440988 365154 434895 371579 416051
5092 416051 283344 412639 418109 445845 423091 279396 304374 359594 517874 422374 314480
5081 314480 418063 550331 494116 494367 577430 438222 452179 472253 506036 550269 472645
5070 472645 614193 495068 435221 605257 581314 635956 574484 628166 604375 698594 707262
5059 707262 687623 741234 656478 443775 594464 697303 603548 734142 656649 591469 536969
5048 536969 661551 564717 494286 538812 600202 677271 599848 681771 744894 816363 809693 672996
5036 672996 768529 764486 630368 775446 829016 742176 766297 740035 802571 702300 642845
5025 642845 650584 850221 741962 854987 741614 979650 1009895 861900 815708 860753 887202
5014 887202 962893 1044960 982197 900122 955487 1000156 874865 1001302 1173918 1040422 1059898
5003 1059898 1026787 1059810 1001564 1024406 1208712 1294121 1328508 1155661 1171040 1221856 1193187
4992 1193187 1041266 1163196 1240792 1306362 1399727 1345981 1332208 1303187 1316284 1642555 1727697
4981 1727697 1704949 1600086 1696070 1779294 1722003 1774063 1927857 1907313 2068432 2282509 2317854
4970 2317854 2191237 2301080 2535120 2549549 2508320 2673982 2639146 2789219 3086351 3102337
4960 3102337 2974792 3126018 3262238 3366665 3476593 3426395 3532048 3634319 4008480 4037748
4950 4037748 4029883 4353260 4315359 4402614 4404837 4459239 4753859 4906048 5014807 5205484 5287063
4939 5287063 5493043 5726562 5907382 6098322 6108428 6453527 6637352 6884513 7128674 7376663
4929 7376663 7666992 7877059 8121645 8443055 8667287 9057047 9382979 9638632 9980436 10215812
4919 10215812 10500073 10395177 10353573 10445940 10562885 10684765 10878043 11165472 11585852 12156141
4909 12156141 12818075 13517771 13997439 14721414 15411402 16066305 16570820 17276302 18116492
4900 18116492 18707040 19333681 19734842 20016420 20262639 20416927 20489677 20347988 20181563 19801322
4890 19801322 19438064 19151813 18816294 18649409 18803833 19106264 19448588 19772660 20256532
4881 20256532 20885386 21601414 22384158 23175837 24335783 25386043 26721948 27780106 28534788
4872 28534788 28676644 28047441 26681001 24539657 22277009 20142208 18428799 16978385
4864 16978385 16210391 15503993 15063926 14876253 14483109 14405027 14759749 15147552 15619500 16370846
4854 16370846 17311998 18070615 18588447 18325440 17445094 16318245 14833538 13272681 11792151
4845 11792151 10452561 9391138 8682907 7937812 7423399 6959457 6565070 6173952 5846146
4836 5846146 5695737 5481379 5153613 5074359 4807787 4504105 4516107 4406855 4263884 4206402
4826 4206402 4090086 4023698 4050279 3908923 3904501 3920866 3997903 3988648 3904850 3839215 3762781
4815 3762781 3876075 3802305 3768936 3720761 3813833 3876187 4069481 4273736 4243930 4329607 4375087
4804 4375087 4386590 4546948 4519980 4559079 4529908 4553368 4750914 4720366 4683468 4700306 4622221
4793 4622221 4771387 5029491 5107627 5061565 5225743 5352678 5619028 5888936 6051394 6270880
4783 6270880 6389248 6512223 6764521 7027157 7230702 7457614 7557011 7627587 7757312 7802983
4773 7802983 7646189 7751185 7802820 7983649 8123866 8299288 8451981 8701871 9086446 9618772
4763 9618772 9980458 10136447 10703011 11114914 11475083 11773780 12273063 12489102 12531684 12634410
4753 12634410 12613688 12900949 12957532 13236083 13685704 14084318 14167805 14382691 14577350 14715814
4743 14715814 15093132 15465780 15601079 16285669 16876050 17742174 18667534 19795859 21073253
4734 21073253 22383903 23996023 25194958 26069629 26199204 25927517 25111799 23973534 22762103
4725 22762103 21546375 20333320 19413500 18823476 18413300 18407699 18651315 18792538 19472036
4716 19472036 20474116 21829463 23716196 25934783 27878294 28860669 29093308 28232322 26629806
4707 26629806 24669736 22729310 20665831 18852116 17480379 15910626 14752496 13870871
4699 13870871 13252617 12791368 12569159 12465629 12375363 12557167 12852886 13189875 13678986 13864186
4689 13864186 13559417 13294039 12515971 11771067 11083468 10024735 9159854 8338106 7808432
4680 7808432 7429791 6981176 6590948 6225051 6006219 5725432 5543699 5382136 5258030 5229766
4670 5229766 5045195 4917027 4667314 4863795 4704898 4762077 4693155 4521019 4488766 4507221
4660 4507221 4480844 4517766 4600863 4634226 4583406 4512869 4698354 4499812 4597685 4552543 4341545
4649 4341545 4271196 4316396 4182830 3989531 3886951 3906748 3888047 3958211 3879667 3865086 3923366
4638 3923366 4203698 4529414 4590713 4647673 4542755 4395704 4310981 4272232 4163451 4161698 4069145
4627 4069145 4156751 4280980 4230760 4332168 4194057 4238589 4357970 4342416 4347622 4472364 4600728
4616 4600728 4660259 4855925 4969133 5161296 5234951 5258980 5359361 5454060 5461858 5590414 5782035
4605 5782035 6016114 6319908 6565020 6960065 7138470 7312378 7341949 7568117 7769220 7983636
4595 7983636 8034524 8189522 8367399 8307802 8500883 8469032 8515215 8711692 9179091 9372818
4585 9372818 9742616 10136136 10325425 10698108 10996415 11444682 12022949 12650252 13241378 13617670
4575 13617670 14041487 14331025 14015005 13764078 13316457 12996290 12812676 12634961 12465013
4566 12465013 12256975 11789613 11229491 10642569 10347323 10113585 9840732 9862295 9798586 9928317
4556 9928317 9926622 9732980 9593755 9547254 9593961 9930860 9904467 9649476 9319362 9011623
4546 9011623 8549462 8177608 7780555 7751017 7941278 7842013 7608351 7420832 7198842 7203857
4536 7203857 7266630 7161791 6724911 6365225 5963857 5526674 5170834 5017943 4868682 4515256
4526 4515256 4386240 4334231 4252848 4111095 3971274 3826949 3607527 3489188 3367405 3323680
4516 3323680 3306375 3208425 2985550 2853800 2767456 2561479 2548354 2359151 2237294 2118115
4506 2118115 2063066 1939595 1804440 1788781 1707823 1675776 1731340 1461680 1545876 1570113 1676202
4495 1676202 1622069 1542162 1582746 1528028 1519298 1433021 1358057 1335773 1287325 1368196 1334324 1311929
4483 1311929 1327477 1381482 1319783 1273862 1294540 1236084 1322805 1303996 1282210 1384514 1384153 1164202
4471 1164202 1158412 1203592 1243280 1134899 1054398 1073059 971298 910698 893994 946785 984220
4460 984220 838375 899722 854283 874760 795348 648873 731902 771139 799367 678978 678833
4449 678833 808086 911646 834524 769022 895624 907587 767539 738954 739174 703631 817974
4438 817974 707621 820646 832192 726774 673674 746976 668431 748702 706978 647486 781583
4427 781583 670312 677233 672053 699052 858133 850571 809690 971627 897066 871097 800260 791558
4415 791558 915474 899817 895147 886876 1027037 972050 922784 786215 685585 894531 733438
4404 733438 720339 752090 725736 779743 849098 806196 728853 674922 758080 800564 902014
4393 902014 969854 951619 861598 821207 934395 1074425 1026300 960497 988852 1083952 1128021
4382 1128021 1226108 1249688 1211291 1223488 1303895 1439009 1499567 1511388 1614436 1764525 1967936
4371 1967936 1966751 1990372 1908183 1869666 1808931 1620113 1669374 1690834 1752047 1764206 1773097 1735212
4359 1735212 1790384 1827385 1828915 1976327 1932341 2166750 2298818 2531432 2741338 3053876
4349 3053876 3376684 3838899 4194714 4161252 4121520 3856354 3435997 3027545 2844801 2557570
4339 2557570 2631812 2452992 2471641 2449956 2342262 2337128 2410394 2346865 2378472 2568960 2814930
4328 2814930 3011237 3187705 3559287 3975235 4319881 4480090 4556671 4484634 4190879 3976510
4318 3976510 3688123 3400092 3144880 3054185 2947472 2924579 2782526 2497195 2360800 2141361
4308 2141361 2161423 2279763 2341919 2285254 2344377 2392035 2525373 2610865 2848110 2797908 2889589
4297 2889589 2863139 2829384 2941943 2882891 2812309 2669841 2683095 2753844 2890898 2927952 2835597
4286 2835597 2791626 2748776 2643281 2612074 2490630 2291762 2178745 2299205 2327248 2320968 2388162
4275 2388162 2532156 2591876 2894937 2851070 2830583 2913305 3144740 3368774 3502101 3548766
4265 3548766 3810905 3885920 3900977 3916507 3788142 3735147 3816422 3827274 3676409 3567641 3537542
4254 3537542 3564090 3645172 3644012 3795252 3976551 4209662 4325860 4580516 4905771 5493186
4244 5493186 6220902 7065076 8034083 8796233 9179920 8862301 8271361 7466288 6765577 6078187
4234 6078187 5396597 4937222 4539842 4190311 4050682 3968611 3806257 3569615 3373136 3022021
4224 3022021 2722827 2599133 2501192 2284272 2151493 2202565 2178672 2173838 2065131 2093301 2038926
4213 2038926 2036076 2018975 1908305 1858489 1724013 1706712 1664158 1821051 1762500 1719083 1701101
4202 1701101 1832126 1730495 1723993 1841122 1898287 1827149 1993769 2094676 2152868 2300709
4192 2300709 2464440 2375164 2224712 1989063 1986464 1879110 1765176 1747926 1767233 1681244 1734930
4181 1734930 1721570 1900977 1897750 1882482 1779841 1922482 1976180 1888845 1794247 1911300 2050313
4170 2050313 1961259 2045485 2159016 2048383 2085559 2123417 2172154 2398423 2420449 2424605 2689099
4159 2689099 2706013 2680759 2787852 2820326 2871754 3063976 3201329 3376563 3501080 3403963
4149 3403963 3661010 3812902 3963427 4146751 4150599 4292812 4387760 4566205 4823450 4877011
4139 4877011 5256010 5481062 5956815 6222672 6560621 7030122 7838141 8399682 9045801 9886123
4129 9886123 11094057 12658550 14494746 15828942 15931754 15038366 13555984 12212493 11028547
4120 11028547 10138978 9392211 8931246 8466894 8198732 8041421 7952066 8011115 8039692 8104004
4110 8104004 8235458 8352006 8235482 8274145 8641302 8795442 9149216 9532102 9803506 10254660
4100 10254660 10708822 11170248 11425771 11873291 12289497 12860460 13568689 14406123 15622214
4091 15622214 17016264 18459654 20328447 22221131 24509919 27117699 30231164 33755593
4083 33755593 38552787 45098771 54080120 65448389 78414368 84231849 80509259 69575124
4075 69575124 56751027 46621480 38640041 32502595 27670447 24101468 21412469 19287481
4067 19287481 17095762 15538395 14077885 13105888 12188641 11672229 10889957 10087258 9679691
4058 9679691 9339351 8765846 8469749 8080936 7704394 7479405 7297862 7327541 7179375 7126733
4048 7126733 7017778 6951235 6891204 6788305 6647648 6455560 6524466 6435816 6518141 6612102 6915342
4037 6915342 7177423 7265877 7482491 7700859 8037053 8776830 9688047 11034560 12317868
4028 12317868 13211070 13442575 12651003 11220038 9535090 7995404 6800224 5973770 5312973
4019 5312973 4835213 4159139 3877076 3918212 3588635 3385499 3081559 3024625 2940751 2724825
4009 2724825 2496143 2572474 2380286 2298776 2374145 2125237 2067700 1898634 1921221 2029150
3999 2029150 1912472 1898618 1780110 1830301 1691708 1565289 1494667 1372250 1511049 1591668
3989 1591668 1599569 1544470 1322277 1291221 1383133 1517846 1557893 1446226 1373805 1277654 1191390
3978 1191390 1086416 1082465 958361 953437 1009640 966146 981708 982296 995710 793729 747270 745703
3966 745703 718712 804988 671536 882890 826994 810349 806595 695117 776168 779090 738071
3955 738071 703348 870012 814625 690987 697132 802556 866611 893894 813487 904570 712635
3944 712635 629021 695622 679241 788098 770395 756387 697731 710411 720531 624511 579341
3933 579341 635790 559943 644004 724467 812608 615140 557028 446059 599585 791629 619213
3922 619213 683849 698815 705479 623386 505975 551527 679010 516277 621782 591133 693578
3911 693578 595257 677579 768197 595611 614484 564100 474719 463774 348625 499875 525954
3900 525954 566144 566328 471032 572632 504130 611591 637183 610694 514491 626219 752724
3889 752724 747424 663053 609977 664051 740760 672264 810086 895250 830181 713219 761380
3878 761380 731416 603986 682533 721612 660900 717782 812957 693965 670412 758043 714536
3867 714536 659063 752009 704765 621022 732540 643051 657024 526480 531705 553784 686684
3856 686684 630237 550931 584493 692854 733433 670476 741260 708193 676224 728428 842931
3845 842931 730874 812089 868452 965418 1032690 1086740 1039520 920767 839226 794757 852111
3834 852111 813852 777989 614338 699416 550768 691542 643935 660343 808155 734994 715694
3823 715694 695000 546049 712637 702709 579393 532014 656309 623238 593713 680364 654007
3812 654007 643765 651883 544675 446910 549708 616596 661610 710474 688683 496230 570473
3801 570473 447805 371397 670055 723803 672204 754944 580370 531288 804850 719888 688087
3790 688087 641345 580515 524338 524292 535483 627260 503698 358067 440544 388211 579171 448497
3778 448497 529703 571452 563044 519818 529747 643587 698250 621784 596662 607022 670461 550382
3766 550382 604482 471918 417264 467258 689537 704688 759321 646001 643409 712083 625532
3755 625532 657027 599204 627758 664098 746027 821550 726485 562001 463379 634526 539790
3744 539790 686318 581725 563598 544784 581287 610972 523259 505045 435738 474857 563593
3733 563593 582634 527015 524547 552902 567361 654036 667211 588618 750653 803004 695085
3722 695085 660296 670768 540481 573589 605040 797762 725713 725463 709398 822156 865851
3711 865851 733406 740510 729405 708463 752155 715076 882450 760585 701796 733434 840524
3700 840524 771125 872063 894061 916862 951933 837757 819188 888928 863759 883298 1007978
3689 1007978 976620 931346 904659 1068282 993557 886475 911812 1022659 945313 1000638 1018649
3678 1018649 983740 819947 757369 860292 943385 1097516 972880 1014970 1018244 1073663 1068791
3667 1068791 1109674 1067518 1120565 1078032 1024023 1187149 1137136 1127155 1159955 1288313 1347095
3656 1347095 1355951 1282604 1290253 1198141 1167341 1180880 1359205 1337254 1324843 1384600 1381639 1443992
3644 1443992 1503709 1532870 1480273 1472389 1446096 1468604 1593377 1451228 1397135 1576036 1703169
3633 1703169 1792347 1801035 1785257 1661537 1745259 1792199 1827990 1879488 1922703 1978257 1874174
3622 1874174 2057670 1985100 2006182 2064931 2094175 2096170 2018052 2210338 2308082 2293641 2276787
3611 2276787 2292952 2341203 2420863 2443294 2504052 2333260 2320033 2369533 2282680 2349707 2267067
3600 2267067 2343221 2424727 2468061 2400234 2407272 2547045 2426312 2713887 2850877 3005450 3126229
3589 3126229 3324997 3513774 3948314 4437985 4855400 5935207 6624618 6459528 5764716
3580 5764716 4805853 4221240 3795845 3415581 3142466 2911507 2828929 2618864 2376101 2450895
3570 2450895 2462585 2398492 2207066 2230061 2225811 2139359 2117297 2177980 2149821 2329514 2307882
3559 2307882 2286867 2228239 2210486 2281542 2267867 2199591 2167690 2190163 2163156 2376358 2316855
3548 2316855 2322207 2254336 2339998 2336176 2338825 2363784 2218762 2336345 2344475 2324411 2359436 2268876
3536 2268876 2237853 2368996 2358366 2279874 2285607 2203545 2293887 2391813 2295628 2416677 2540220
3525 2540220 2456087 2457369 2562895 2552714 2460445 2493397 2644552 2587545 2604584 2729688 2671617
3514 2671617 2728706 2613033 2694782 2653197 2644272 2625926 2745490 2817155 2793592 2856938 2921007
3503 2921007 2925675 3044894 2920124 2953812 3117461 3221579 3265521 3180366 3164922 3164082 3204222
3492 3204222 3259372 3219326 3124287 3147036 3151520 3180071 2956261 3041610 3073308 3113966 3210755
3481 3210755 3123343 3158243 3215135 3039188 3222291 3246076 3068969 3098714 3026900 3148890 3181235
3470 3181235 3082404 3020217 3150216 3184477 3145632 2869693 3016322 3092762 3004820 3039747 3115576
3459 3115576 3074516 2979924 3024929 3028558 3067765 3131237 3164998 3197895 3008747 3055338 3128952
3448 3128952 3174557 3108953 3181493 3204523 3241012 3302958 3370841 3475864 3461326 3440451 3475318
3437 3475318 3548180 3472802 3539256 3678046 3861581 3817591 3890044 4006911 4156169 4339763
3427 4339763 4259519 4249691 4396043 4399167 4419684 4489485 4429743 4489961 4490770 4480986 4461395 4363455
3415 4363455 4496921 4515455 4331651 4263097 4267137 4217022 4250358 4265490 4428836 4486180 4551245
3404 4551245 4549723 4560873 4588047 4543120 4543708 4659178 4590458 4721357 4857753 5010599 5063997
3393 5063997 5213819 5121981 5074261 5234803 5177862 5190001 5087513 5126270 5151955 5245218 5351590
3382 5351590 5281974 5075975 4965911 4932189 5059489 5101563 4927394 4877234 4865053 4912294 4792847
3371 4792847 4729545 4855204 4833705 4682904 4737767 4810557 4889625 4895745 4963281 4881111 5040494
3360 5040494 5034124 5024102 5046393 5084992 5144494 5312210 5380242 5323915 5463267 5445265 5406648
3349 5406648 5398748 5508963 5442422 5410457 5646530 5709464 5700658 5705108 5996781 5828474 5783620
3338 5783620 5921866 5898308 6025147 5979378 6060887 5963769 6200472 6311292 6449494 6474810
3328 6474810 6613954 6593848 6715416 6781049 6766652 6921216 6978241 7034863 7046359 7250370 7192376
3317 7192376 7269069 7353141 7422590 7474073 7724898 7697013 7894300 7982961 7900801 8135768 8123309
3306 8123309 8383350 8462780 8618044 8707840 8976479 9250123 9328847 9475962 9618582 9755159
3296 9755159 9993787 9897222 9975937 10204145 10293590 10372416 10439373 10514804 10650957 10802721 10969729
3285 10969729 10927971 11022366 11166836 11249447 11257947 11236558 11364021 11324956 11472810 11475808 11478566
3274 11478566 11694126 11749469 11946886 12217184 12161847 12104637 12269897 12267234 12202701 12283707 12491467
3263 12491467 12574752 12692409 12680047 12693120 12732495 12897779 12872936 12853913 13041672 13040564 13231416
3252 13231416 13220981 13131549 13268237 13460655 13539314 13576504 13575674 13531148 13708817 13822383 13715549
3241 13715549 13965383 14152533 14244294 14361055 14435889 14531513 14666420 14836702 14953465 14944344
3231 14944344 15080512 15117075 15236501 15473018 15665806 15702104 15882448 16112932 16162961 16268552
3221 16268552 16423982 16569396 16691971 16948877 17092004 17563650 17930390 18473337 19102762
3212 19102762 19629703 20293626 21066557 21908399 22588429 23569670 24710344 25863642 26847364
3203 26847364 27703497 28211173 28353261 27681204 26535234 25541861 24133272 22826516 21786587
3194 21786587 20840686 19921147 19294340 18764283 18218241 17852713 17646647 17423586 17089787
3185 17089787 16873546 16539632 16263865 16155104 16124426 16020477 15843952 15668143 15526438 15222051
3175 15222051 15154863 15074982 15038465 15021564 14977006 14952155 14816587 14828218 14961845 14775718 14761189
3164 14761189 14820629 14915599 14840794 14857750 14875321 14865993 14852806 14856990 15060338 14904347 14987679
3153 14987679 14915589 14920224 14844784 14846513 14822330 14650897 14756471 14723989 14852785 14884221 14841890
3142 14841890 14788532 14840341 14915456 14995893 15012702 14924308 15059122 15071731 15060798 15086952 14971130
3131 14971130 14944774 14934296 14981080 14889943 14886088 15050895 14955204 15045678 15069100 15068627 15274539
3120 15274539 15362435 15355733 15374391 15463320 15537289 15428977 15493112 15569570 15633773 15696576 15674698
3109 15674698 15587823 15727469 15800153 15775710 15659338 15804258 15972933 15971345 16166898 16321619
3099 16321619 16401825 16500341 16600187 16707311 16841113 16935990 17044621 17182174 17327043 17445612
3089 17445612 17525202 17591570 17851781 17930349 17997217 18072359 17988170 18318191 18610675 18626701 18860810
3078 18860810 19024829 19000060 19423475 19675307 19858768 20140733 20275683 20368941 20609454 20950839
3068 20950839 21298436 21535440 21836800 22312690 22527839 22884895 23136862 23400185 23779200
3059 23779200 24028026 24310904 24580493 24877157 25035093 25385312 25573261 25878213 26232179
3050 26232179 26603732 27090509 27445307 27731236 28173745 28764462 29235856 29681256 30227823
3041 30227823 30823358 31222724 31739413 32288623 32878213 33469256 34079919 34611681 35107370
3032 35107370 35579186 36263937 36862960 37523563 38100651 38884624 39664474 40424524 41122446
3023 41122446 41884667 42840539 43746008 44598877 45579793 46646748 47676743 48673762 49669001
3014 49669001 50858639 51983068 53188046 54397138 55623236 56821433 58237629 59601668
3006 59601668 61158807 62485653 64008712 65635780 67214296 68894440 70411114 71991812
2998 71991812 73699354 75482835 77300998 79005533 80694492 82555676 84613453 86745742
2990 86745742 88861698 91189633 93679284 96262798 98887692 101858870 104647916 107854986
2982 107854986 111203574 114705762 118643623 122909217 127541892 132577948 138126669 144438758
2974 144438758 151351918 158965837 167315241 176527368 186396466 197100904 208476086 220456804
2966 220456804 232934415 244940854 256169149 265088644 269944075 269800038 264220930 253985578
2958 253985578 241416715 228565082 216359446 205587519 196036063 187601392 179968266
2951 179968266 173168059 166857877 160968533 155508890 150666473 146233853 142266481 138766911
2943 138766911 135442888 132587796 129830450 127295262 124873791 122392423 120132762 117688534
2935 117688534 115223601 112848123 110441252 108121323 105946084 104045073 102059002 99852531
2927 99852531 97594477 95300145 92618933 89688198 87007194 84748984 82776180 81155475
2919 81155475 79728262 78762615 77853319 77201558 77081352 76894716 76085648 75429192 74905411
2910 74905411 75174269 76123029 77196013 77018986 74938244 71766593 68987782 66492373 64568863
2901 64568863 62896590 61204783 59936279 58852042 58103582 57611252 57679173 57895766 57828942
2892 57828942 57375070 56686346 56581291 57169671 58339236 59611321 58849701 56155584 52853789
2883 52853789 50183782 48014028 46079360 44724883 43379113 42364626 41412971 40570236
2875 40570236 39875692 39082744 38511943 38081486 37228797 36619755 36049070 35457040 35150410
2866 35150410 34737841 34333127 34006278 33591192 33286550 32955151 32740730 32473863 32166747
2857 32166747 31783460 31463342 31357558 31218888 30965503 30665275 30533064 30248020 30010708
2848 30010708 29699218 29551206 29293950 29253309 29071646 28834180 28494028 28403712 28295614 28214634
2838 28214634 28001331 27611918 27486507 27379128 27046732 26689452 26473273 26276379 26032421
2829 26032421 25833666 25720149 25383222 25080891 24885120 24752802 24612611 24396928 24198442
2820 24198442 24105749 23924569 23750051 23743723 23392737 23150391 23117652 22881269 22745457 22624065
2810 22624065 22398163 22231411 21838238 21741120 21668042 21429139 21268697 21050136 20881999 20771943
2800 20771943 20578156 20540997 20448726 20345241 20351907 20291425 20401058 20429325 20360908 20370869 20438702
2789 20438702 20347309 20420519 20603566 20689308 20820650 20797123 20869718 21089263 21294454 21541690
2779 21541690 21622035 21833016 22052941 22474949 22901697 23249656 23512815 23933827 24265033 24714845
2769 24714845 24890576 24991104 25286367 25490437 25997995 26126054 26488963 27016918 27399441
2760 27399441 27714067 27916917 28280908 28477807 28771132 29120916 29511912 29994335 30379798
2751 30379798 30925830 31678965 32480296 33484088 34427790 35536675 36499956 37065280 37654946
2742 37654946 38372014 39089473 39966257 41116556 42086497 43358300 44418337 45482381 46666443
2733 46666443 48130339 49536436 51118502 52710639 54378531 55806495 57228630 58505142
2725 58505142 59636071 60586590 61455079 62613527 63611426 64847647 66125727 67684490 69386756
2716 69386756 71301124 73449587 76015584 78800966 81873533 84974369 88338032 91903393
2708 91903393 95423945 98472227 100226452 100786217 100041091 98027132 95234034 92462218
2700 92462218 90213383 88834063 88098771 88071773 88672620 89932589 91346134 93272443 95363120
2691 95363120 97670675 99953811 102129352 103902514 105470464 106402821 106003842 104595282
2683 104595282 102327050 99539598 96008164 92040417 88183215 84853856 81998292 79897641
2675 79897641 78196399 76971721 76171548 75715193 75395691 75124708 74627000 73951396 72754944
2666 72754944 70996901 68895259 66257666 63208991 59956336 56663140 53543094 50749011
2658 50749011 48280291 45869364 43780189 42002402 40190816 38676558 37306528 36095461
2650 36095461 34939300 33792999 32934210 32051679 31088975 30017356 29140591 27962607 26797092
2641 26797092 25636388 24934024 23954523 23218066 22485449 21688786 21085063 20381258 19789404
2632 19789404 19259849 18593496 18000435 17553375 17051002 16590128 16175458 15771033 15517842
2623 15517842 15229167 15098286 14723324 14255486 13990295 13818057 13656204 13266164 12947337
2614 12947337 12729136 12361123 11973841 11602554 11388202 10955984 10769487 10604982 10411664
2605 10411664 10241572 9774974 9509440 9519203 9277119 9133287 9033632 8882258 8687628 8534763
2595 8534763 8533716 8233504 8162572 7981724 7717027 7401229 7172594 7021243 6966473 6754018
2585 6754018 6475461 6297204 6201646 6067822 6080883 5908323 5733378 5681400 5706134 5501276
2575 5501276 5401790 5334602 5136537 4925829 4918587 4824015 4757043 4669468 4700228 4580528 4487847
2564 4487847 4354270 4334547 4288043 4189948 4205513 4217004 4124138 4041268 4020210 3975173 3962778
2553 3962778 3717341 3652489 3720621 3683427 3772111 3624748 3673595 3638417 3704059 3582343 3613607
2542 3613607 3503996 3345472 3279708 3194435 3211107 3082227 2966345 3030697 3030437 2969581 2941084
2531 2941084 2981050 2868113 2978167 2946466 2908535 2994246 2860636 2813765 2830965 2756807 2653385
2520 2653385 2793005 2684207 2603347 2683298 2828108 2746109 2827712 2709073 2583843 2635205
2510 2635205 2551358 2534246 2521872 2455445 2373534 2359834 2465995 2442873 2312949 2543031 2522094
2499 2522094 2438895 2445797 2487150 2522774 2469014 2365473 2424061 2483341 2359256 2281030 2135723
2488 2135723 2085763 2165094 2194227 2137859 2186848 2107709 2139962 2272472 2133470 2010616 2107554
2477 2107554 2154850 2137872 2136771 2103924 2045057 2217483 2196782 2112559 2114636 2131267 2089150 2021931
2465 2021931 1872535 1880502 1893435 1963435 1926723 1929420 1805801 1841320 1891585 1853330 1773957
2454 1773957 1653552 1715183 1777678 1632063 1545462 1419128 1381218 1493179 1554339 1342726
2444 1342726 1370685 1450276 1437253 1425968 1342403 1386638 1323130 1317777 1495861 1478210 1374221
2433 1374221 1246439 1237603 1415609 1418229 1246213 1150568 1023012 1195121 1238675 1205233 1240691
2422 1240691 1322017 1283488 1060546 1274075 1233883 1037415 1141678 1122202 1097839 1059889 1009550
2411 1009550 980903 1063709 1018849 960182 1016196 1037897 982723 917716 875247 941944 890321
2400 890321 921727 936717 937526 836469 746986 780597 759931 797732 783540 721108 654007 711100
2388 711100 764324 774560 693462 746006 681087 718321 786907 812916 847819 875011 750918
2377 750918 638040 721379 737478 773792 704957 732218 785333 640521 613161 668022 603688
2366 603688 578860 745960 562536 570801 560945 435751 457355 525477 523325 481037 584577
2355 584577 447411 375622 454620 465673 554735 440145 474173 442828 488075 426682 464336
2344 464336 457224 459514 303600 301624 342118 340479 487242 509903 433075 379971 362361 420134
2332 420134 382690 352278 442559 381777 386572 398297 349429 380046 450846 366654 357171 348207
2320 348207 227367 283940 383261 353323 256768 180027 103746 126804 307889 318648 301179
2309 301179 592538 358536 401384 285010 285433 200847 133713 283128 223296 219180 309391
2298 309391 417172 427129 224460 84998 206759 192645 221190 260649 361839 305829 250906
2287 250906 231143 159675 199283 288404 231453 183958 238009 267506 122063 287863 371624
2276 371624 265737 153142 166674 261941 358909 261671 249943 38552 61133 191714 216029
2265 216029 195580 194539 102261 224505 169267 199656 222109 129608 190567 212747 182148 280770
2253 280770 298677 105715 24052 58272 20412 52678 112033 76648 94844 176968 96189
2242 96189 37674 -46571 -53390 -74420 26952 145240 141025 121767 170015 193550 188996 168075
2230 168075 134516 183861 231422 287054 191577 122511 167040 258751 217093 147823 -42742
2219 -42742 35295 -57422 4970 49863 172116 250387 218063 166560 259692 106349 213710
2208 213710 204653 282886 207553 206369 356745 306188 314288 203087 164042 96616 29693 193477
2196 193477 236903 252928 334901 381621 423868 445771 312844 207896 337878 331299 243772
2185 243772 237897 407925 430810 450174 400211 341330 254788 312038 591502 666855 418901
2174 418901 521327 605386 597713 616100 777060 571820 678962 634809 693814 709912 752670
2163 752670 883132 901981 1114087 964340 981719 983725 1054090 1180686 1177763 1163619 1113682
2152 1113682 1067408 1222430 1428710 1447636 1502343 1514163 1419760 1533624 1641480 1718975 1934857
2141 1934857 1930647 2103599 2147604 2097186 2295141 2459747 2453249 2787626 2773675 3002739 3145225
2130 3145225 3119323 3204499 3362770 3571317 3773442 4061301 4465166 4774546 5150016 5601123
2120 5601123 6347499 7095746 7691436 8355286 9059183 9863174 10851376 12179729 13926832
2111 13926832 15986592 19263865 23545297 29440165 34762654 33359808 27628212 21821896
2103 21821896 17816661 14561532 12037771 10314275 9208678 8265221 7506330 6880400 6306409
2094 6306409 5576463 5186283 4753845 4149417 3923336 3674390 3392493 3159381 2930841 2660781
2084 2660781 2556912 2498362 2279216 2166091 2003570 1994755 1884774 1766558 1572820 1528500
2074 1528500 1456774 1383241 1328609 1279169 1287813 1125014 1052591 964327 949922 1017311 960011
2063 960011 920769 956994 1019282 928004 762915 831701 697087 643520 528785 503192 623031
2052 623031 533504 615501 743976 571860 629123 610009 456222 340560 372130 410530 467300
2041 467300 574957 397151 257132 226488 206922 183684 292803 263238 131597 222430 261476
2030 261476 94709 179704 320351 138610 102216 106205 85907 116637 200533 141467 214519
2019 214519 -70081 89622 200280 104426 155060 90726 6089 -3998 138317 100684 149411
2008 149411 185595 239624 37526 -20783 17381 225486 130460 30706 15772 81719 -9105
1997 -9105 -42434 104081 73048 19048 55886 83624 -62095 34083 55176 -69984 73579
1986 73579 39432 59881 158123 32989 -50890 28884 91388 22268 60655 103624 140123 35258
1974 35258 -17189 -62568 113957 79345 104609 40747 104552 76855 59586 175788 -12699
1963 -12699 43297 168867 110190 76097 -76632 -72931 -125123 -95327 97503 88689 -112438
1952 -112438 -57876 -15473 -53454 -5080 -45166 13329 -91696 -55804 12986 2074 -79146
1941 -79146 220370 155100 -89251 34931 59937 8669 28243 -61351 -66883 57358 -134762
1930 -134762 -57814 -18169 -52004 76974 2870 -123436 -128864 106421 92272 -55872 -135699
1919 -135699 -107944 14551 194158 43960 27376 80973 17219 28779 93713 73571 -37161
1908 -37161 133625 152470 204266 43202 210676 221596 172802 133679 233000 58179 3400
1897 3400 -19437 -101533 -104982 -101607 -154163 -109096 20301 -77054 -85974 -104935 -77154 -49715
1885 -49715 33829 -15699 -47762 -30262 -104127 48675 -7258 -187857 -138836 -7046 -152429
1874 -152429 -168650 -71767 -112403 -58478 -70667 -109320 -130857 -90711 12003 19155 -44322 6457
1862 6457 -88978 -202245 19013 194012 -122792 31811 10752 -49793 -160936 -160967 43054
1851 43054 81339 -96772 -107637 -13304 90386 -32954 -73115 -56661 102717 102712 -119932 82560
1839 82560 4921 -65904 -15597 47333 14410 49848 92341 33282 -108626 -187478 74922
1828 74922 -83504 -219398 -242911 -203777 -42740 -42638 -107211 -182963 -264214 -153626 -97933
1817 -97933 13586 47012 52422 -177435 -149932 -61630 -86115 -14094 -70818 17304 -11252 7069
1805 7069 18156 -17904 55127 -78471 -111188 -37630 -103605 -74042 -92630 -172983 -102040 -211398
1793 -211398 -128155 13899 -44914 43531 -38186 -26204 -156644 -3404 -73184 -45493 -30061
1782 -30061 -42265 101246 131966 236897 127970 33819 126258 6865 -24977 -116260 -88367
1771 -88367 23474 15868 49369 151556 208046 -42488 -158626 -193721 -26901 33932 -26465
1760 -26465 -155300 -38828 -170276 -103099 88255 3333 -69400 -63368 86359 -90351 -31850
1749 -31850 -68073 -182476 -39654 6864 -64143 69485 44497 123096 -35915 -136942 -37171
1738 -37171 -57273 -148145 -215225 -202632 -90899 27239 -67043 -133844 -147313 -158594 -190473
1727 -190473 -174850 -47588 81013 40294 -8557 -6015 -60627 -180834 -61291 -87061 -144820
1716 -144820 -137812 -240006 -197812 -36324 -168149 -444 -81091 -206921 -68941 -54831 -67433
1705 -67433 -55103 -69592 -47453 -15153 -123853 -28819 -11779 -99254 -94072 -29403 -89834 -70770
1693 -70770 -55595 125869 -13803 111790 61365 -67867 -5879 -100637 -57515 -229839 -151002
1682 -151002 -113719 -111866 17020 -172769 -164258 -32451 -4497 -46326 -71943 -849 67026
1671 67026 -83579 -146675 -43067 -4340 -8509 -44330 -46773 34743 -62898 -44453 42252 -19964
1659 -19964 75626 85361 31343 -70309 -64636 -27150 -38390 -42223 114072 -78283 -197828 -170600
1647 -170600 -106235 -80244 -41633 -137124 -133998 69652 -32348 -31004 -13922 -38031 -89712 -102758
1635 -102758 -89612 37343 33751 127634 108881 154206 25758 -18975 -102638 13153 -33440
1624 -33440 -130860 -35735 -84245 -129141 -133759 -28301 -70669 -63764 -113631 -121910 -21222 -104613
1612 -104613 -91421 -78856 -68730 37477 -36553 -8285 -185426 448 30298 -105869 6407
1601 6407 -7345 -18040 72327 17257 -916 -110480 -71908 -57313 14863 -25288 -18457 117632
1589 117632 52241 -183447 -227296 -166407 -132785 -105924 6174 -112347 -105987 -119903 -93764
1578 -93764 -30072 -10415 231636 184139 -700 51110 -2983 3393 -53441 -87201 6738 -27924
1566 -27924 -54742 -17010 5724 26686 56970 25153 -53795 -140585 49888 -138107 -191163
1555 -191163 -121748 -95330 -174556 -146047 -143452 21761 -72550 -44118 65736 -97221 61964
1544 61964 462 -2652 56848 92696 -176294 -50002 -629 -102527 -84177 -136594 -7353
1533 -7353 -73166 -226851 -233287 -134991 -5681 157365 -16722 -96891 65077 114513 -57496
1522 -57496 -30186 72969 4720 -188907 -122291 -66178 48304 -21220 -163844 -99645 2507
1511 2507 -47328 -979 -39460 -4330 78405 -7674 -1364 80097 205595 8127 -1077 29412
1499 29412 -247632 -135536 -80597 -135829 -6443 -96231 -15624 47419 -80204 -23346 -62395
1488 -62395 -281571 -155023 -124352 -189 48853 -82260 -130548 -48142 30609 -25482 -125001
1477 -125001 -61372 46369 -55880 -82287 -6438 36874 -74716 120116 36428 52742 -90491
1466 -90491 -207449 -103874 -111631 -5679 -159192 -118901 -42857 3505 -7382 -29507 -190849
1455 -190849 -79538 32463 -74557 -24801 -45676 -177218 -226014 -139680 -170600 -162113 -14918
1444 -14918 26564 11349 -2705 107400 -72175 79374 220641 -12131 -1689 69472 72017
1433 72017 -31166 -82255 -55526 18963 -33463 -99465 -93906 -102937 124471 -86746 -151793 -122668
1421 -122668 -123896 -105459 -132039 45380 15214 -152464 -164598 -133630 -25618 -12297 12819
1410 12819 4135 -79714 -1460 75720 -61471 -18909 86647 -108307 -117225 -128526 -31158 31484
1398 31484 -82154 -186112 -49910 -105308 -214630 -237795 -169582 -73714 3818 -93847 -168075
1387 -168075 -169687 -110162 45304 30250 -81439 -111386 -72465 -8889 4800 35255 19449
1376 19449 -103750 -259689 -121776 16817 -68309 -1058 125799 -86452 -44146 22479 -117634
1365 -117634 -193130 -86776 -57331 10735 90342 -145905 -142814 6336 71059 103388 58075
1354 58075 29547 -137649 -126662 8612 18272 56383 2427 -12190 -123715 -176633 -211935
1343 -211935 -102564 -38246 71273 39567 -13568 30412 -54816 -62008 -222661 -148104 -124220
1332 -124220 6893 -60437 -250758 -179512 -212140 -91473 -203562 -2477 216112 53196
1322 53196 -54624 -114922 18315 -149232 -175328 -176103 77522 24389 -8996 1253 230488
1311 230488 172622 73754 55496 -154048 -92978 -49815 -84959 -119577 -135297 -123008 28164
1300 28164 -80188 31309 -53530 -2788 -50825 -73046 -53000 -41628 116027 5016 -81261
1289 -81261 -135630 -142121 80024 -56084 -99980 -100151 -18156 -65961 -52399 -29682 -87868 -42287
1277 -42287 -16759 -3925 -128993 -116396 22157 -41034 110342 37674 -58444 38293 91445
1266 91445 -186091 -88755 -72437 -114709 87843 215101 7120 -55115 -110653 -72647 34760
1255 34760 -124539 35414 20956 44635 161536 -42638 -165676 -29365 -69110 19245 -30303
1244 -30303 -65871 -112388 -192869 -147102 171325 183824 115632 31913 -39254 -46618 2240 53335
1232 53335 139381 63557 -129090 2688 14023 -7470 45166 58106 -16224 20525 -188207
1221 -188207 -56570 -103354 -126294 -2527 -21232 32743 -16774 -68045 -89787 -65797 -26589
1210 -26589 -42320 -6693 60465 15199 -23456 74782 7485 8325 -60471 -118727 -36416 18149
1198 18149 4850 -73819 -129585 -72673 -78606 -95956 -8988 -19401 9290 -153929 -125565 -44284
1186 -44284 -96185 -67289 -8204 -124066 24502 -71814 -77300 95 -67261 -16120 5128 4095
1174 4095 31495 -103997 24264 61288 82498 -67766 -17367 44385 -9010 -138068 -131374
1163 -131374 -77726 9900 45800 -36449 -128490 -92836 -41488 -13076 -105531 -125434 -190308 -184542
1151 -184542 -76469 29439 52675 101615 -85510 -115662 -61901 -15108 -102075 -123207 -117643
1140 -117643 -186772 -57382 -88989 -44961 40231 12719 -58844 49624 5456 -9096 82882
1129 82882 28957 -3119 -6445 -47378 138123 56236 45230 -18822 30370 -12253 -69037 84924
1117 84924 153663 47352 85720 -105123 -30561 -43977 -95866 64043 178851 72072 -130613
1106 -130613 -71544 33242 -61314 29253 -2117 -88191 17993 26562 -21132 85504 30407
1095 30407 133202 -93342 -264011 -140652 -58864 -47502 -21389 -55717 3159 50242 -31668
1084 -31668 -68837 -103397 -54012 -10472 9204 -100912 -21131 -101728 -68388 38852 75574
1073 75574 95680 121919 44966 163347 87236 167842 154082 19550 31271 -17074 -33233
1062 -33233 129 38004 81237 -9294 -3824 772 -81333 -56324 -4402 98403 6667 -37606
1050 -37606 78098 8356 -64103 51096 39383 126832 142333 97163 144332 -19761 -74818
1039 -74818 -94406 -8813 9704 -101153 -26444 112800 33708 79806 90033 -46613 -127759
1028 -127759 -128962 -161720 72760 165332 43854 80003 -71735 -6428 -89614 114203 37756
1017 37756 -205008 -134293 -100681 -78578 53272 -101227 -87662 -97737 -28904 31520 68297
1006 68297 -54843 -44792 -32747 -30491 41350 40107 101328 78089 1431 -57873 -57289 50416
994 50416 151751 110794 121165 44208 -80 -38418 32424 102602 131658 43256 27461 -10707
982 -10707 -65675 -61706 18753 11544 -23507 -37773 7031 -15467 -30727 14968 246138 135353
970 135353 42081 78304 80565 83709 78107 68099 -33769 4302 59186 2578 70239 136411
958 136411 206003 190508 238380 111917 138038 73342 993 16424 81889 47866 121158 107011
946 107011 9647 25020 7844 -47530 -118807 -126220 -90207 189295 54434 153633 113721 10374
934 10374 -4989 -80590 -256188 -135541 -62489 -30480 45604 32663 -2612 -42745 -77166 -24841
922 -24841 7047 -116470 -39703 -122 71098 75271 163563 -5971 -206813 -47416 -41655 -70479
910 -70479 -55914 -76766 -85928 -10556 -41377 41760 68486 16307 -56660 -96211 35801 -126703
898 -126703 11787 139132 83982 -80793 -75788 45541 -39512 69082 -32380 -77256 62369
887 62369 85021 -36658 6712 97793 84756 -36098 20075 75880 11218 -67133 -88813 34657
875 34657 97252 149024 25676 -52518 70385 -127838 -110678 108601 151580 126054 35325
864 35325 34547 -185429 69857 61926 142199 93016 -54286 -29926 -26203 106894 98893 -36593
852 -36593 -76281 37621 -9756 -63040 72276 6229 -49831 46245 -43118 -133853 -84896 545
840 545 -59712 -77479 -154420 -152290 -57840 -31537 -119033 -30991 -8051 39867 76936 1636 59848
827 59848 94652 79776 43811 86111 155825 93314 -38177 -17487 -49566 1314 -56106 -32438
815 -32438 -30012 -175238 -102580 28193 31790 12046 -4176 -94351 100862 148861 308406 68379
803 68379 110363 99936 76463 -9343 94927 86428 -85379 174941 102913 89049 -74860
792 -74860 -51009 27610 7973 -2512 59280 108261 55180 96847 79916 168575 86802 121648
780 121648 158618 107362 37692 78467 41487 30551 23570 -113022 -72660 -17675 25395 -27337
768 -27337 -14897 4848 48682 10578 85557 175207 85798 127816 185382 126616 -15417 -19652
756 -19652 120058 -41772 40842 171436 70262 8506 -30694 -95439 167283 150865 46162
745 46162 -46882 14321 15517 40983 90123 129006 118076 89994 148829 -73446 -268994 -103340
733 -103340 31475 -36862 3051 -10914 65236 142082 -12399 31881 5923 46849 9012
722 9012 90287 116832 107991 35818 -59038 -49577 -49762 100866 94557 159618 -160781 -13475 88343
709 88343 -32649 110502 117861 32443 183202 130101 88528 18579 112409 48362 -42013 -155277
697 -155277 -212191 -91896 33562 133551 -5504 191300 151220 36362 -216 77515 128692
686 128692 -1094 138514 106572 2118 -37364 95309 95406 204905 79533 98819 223775
675 223775 64395 88533 51915 -23343 88070 13394 -32380 64556 -65009 -136623 -116616
664 -116616 43940 -10453 -187714 -88733 70433 19382 -57946 -6574 89551 143511 14647
653 14647 38221 102845 -10501 28599 73068 214485 243758 95316 204736 216382 186888
642 186888 192002 75141 26778 66813 -45062 -36613 2373 -127038 66099 124445 108083
631 108083 60688 59240 -45901 -48072 25922 187842 21211 -62624 -101876 83732 -71738
620 -71738 -3052 -11587 -36073 60299 -100675 -58840 -23742 63229 148141 52958 58379 91828
608 91828 141380 -17921 -64917 -78244 -130302 40570 91188 24113 -97952 44662 28907
597 28907 -43105 37872 92148 66257 294608 118543 62372 -31619 -63475 17241 110713 59302
585 59302 38278 133142 217083 94377 60685 71276 218972 93698 -84911 76367 39668
574 39668 57326 121316 58906 -132989 6612 58997 -15894 -1859 -81481 -12440 72258 6915
562 6915 -43863 -50142 69800 -10246 -63681 -43347 -76689 82773 168263 66845 120216 87077
550 87077 25084 14200 -15028 -144628 42845 29659 -20452 28486 82648 132581 58158 -11807
538 -11807 35192 129188 104600 139053 115246 110312 106149 -53563 -54898 -115480 -83713 -33366
526 -33366 37568 96732 -41405 25683 45237 119017 11106 12393 -765 -24282 -1159 72406
514 72406 102269 59174 -29691 -83372 -15 139058 122492 33632 96178 8650 -121663 110187
502 110187 92849 193987 332831 141204 -22709 25109 128299 219810 103711 140750 -19482
491 -19482 -78843 34483 895 100572 123947 63940 70602 146575 69849 19775 207940 4266
479 4266 -54744 65461 24068 28757 73087 45847 65092 176881 -28577 -13255 36252 7780
467 7780 112220 71719 -80137 -57439 -127470 -65460 -4832 11081 -90511 27947 45663
456 45663 49075 99492 -53646 -760 65093 -55307 92955 162345 69717 16074 -75537 72886
444 72886 -14847 -107125 -72060 68500 50488 26245 -196083 -113300 -130095 -68839 20318 29777
432 29777 107726 10670 4306 99055 133500 19109 121799 202653 188271 162992 111550 11237
420 11237 131730 147712 87571 17831 114055 42837 -45622 -103292 -45004 86047 75862 67788
408 67788 143910 101189 -121957 -117105 53608 98074 -157 43094 155468 266033 338132
397 338132 161124 117563 21833 62592 94534 63936 67429 226536 37878 130978 118305
386 118305 161893 193969 176815 -11088 -165266 66154 23522 31339 -98308 60306 73133
375 73133 151841 147254 31475 166599 244427 137438 5422 -181295 -127145 135117 277488
364 277488 55506 135891 120842 72975 54960 28877 82084 -24327 71429 21640 238394
353 238394 270736 81171 215425 184046 205926 187815 121751 210568 48082 -158451 -44703
342 -44703 75237 -13489 176076 161872 252635 100698 117512 85536 -33957 33842 -6392
331 -6392 -69510 -85579 -76481 67802 43933 -24497 25873 -95834 157859 183462 105872 38847
319 38847 53147 169433 134549 139759 72034 110449 101524 96277 95042 16342 107975 222695
307 222695 219687 121492 139329 103916 58404 110198 142886 177669 118743 160615 138515 79724
295 79724 159084 135016 33851 20875 56898 83108 202724 47330 42012 26961 -103883
284 -103883 -67022 -45562 40242 14088 -102117 42061 -76596 23929 -15741 2924 117275
273 117275 -66387 39003 64769 -86081 187557 239517 60687 182460 273966 109777
263 109777 59800 6202 -63066 54881 103191 63571 60016 36846 166240 60935 51539 54193
251 54193 116696 151027 160370 281506 253586 122968 66745 45811 242558 124712 -56549
240 -56549 135803 107855 171807 178897 -14625 27692 52564 194407 171184 139965 173204 77786
228 77786 2311 -47376 175654 167600 27295 198122 291445 218061 191942 206216 140607 56250
216 56250 186675 91658 292885 98902 25511 197919 199543 155057 173946 133430 68100
205 68100 102549 -78236 -46837 88960 116459 -6972 86035 128496 -4109 -21687 38555
194 38555 183402 124337 104878 162975 193047 137577 209135 156657 142172 -11228 -4312 82368
182 82368 159323 56703 -51858 -129139 -164294 -44430 -80929 -62816 38710 164672 41179
171 41179 -70905 95364 -3284 -16878 56511 100219 129917 -88 107924 148615 139467
160 139467 180492 143927 -27804 9492 -49374 -33959 12921 6150 26769 61009 58674 64659
148 64659 30833 -114397 31300 122219 102848 66397 100618 117925 122563 -4387 -11045 18710
136 18710 -18410 114420 193349 123721 182190 217299 151442 184831 152265 168276 107317 33459
124 33459 124042 193145 133377 158531 153733 21706 2769 98290 215854 63304 80755 61735
112 61735 37718 62125 109380 40433 66918 77189 -26318 94967 103368 118747 218512 143791
100 143791 173368 167471 138101 156135 207030 233551 146109 83943 86320 51140 60508 110511
88 110511 113769 140886 94465 41786 95120 -2412 23850 77424 75107 46873 43831 74254 87899
75 87899 154303 90748 237390 153369 162997 73456 158009 77536 -21376 -784 -1790 133253
63 133253 157028 28907 22594 23862 -16235 -14114 108615 77137 79281 30544 181936 73985
51 73985 51928 113337 93665 144825 33235 46175 33797 27307 -60405 4901 151461 144487
39 144487 52373 69004 82755 53035 88164 53086 13023 8800 79441 180574 164293 150700
27 150700 108463 81158 105216 79734 105928 188075 143239 98738 93809 92031 89475 121364 162033
14 162033 145454 113968 90212 163077 84540 117627 52424 -59015 61846 46179 67109 97312
2 97312 97876 34664
0 34664
$$ Imaginary data points
##PAGE= N=2
##DATA TABLE= (X++(I..I)), XYDATA
16383 -1657020 -1572754 -1544472 -1558574 -1523529 -1462941 -1431177 -1470994 -1426429 -1481648 -1415488 -1364571
16372 -1364571 -1244712 -1250489 -1313718 -1236740 -1206703 -1187966 -1189263 -1279311 -1243658 -1269009 -1179868
16361 -1179868 -1103450 -1037331 -1109372 -1068562 -1044531 -1040589 -1020338 -971542 -1023335 -1034823 -1026070 -960369
16349 -960369 -898630 -991850 -878788 -822672 -818351 -833164 -774597 -756082 -663480 -709376 -756016
16338 -756016 -718929 -734585 -724830 -668011 -573210 -642137 -674098 -528731 -477564 -540455 -513156
16327 -513156 -414587 -428286 -414749 -452165 -410836 -433352 -506680 -390539 -245574 -265118 -305431
16316 -305431 -325979 -235116 -201652 -226515 -250241 -231281 -108274 -61951 -82323 -48203 78595
16305 78595 -20485 -60424 -53973 -6435 -11467 -22075 26498 -61869 108027 162054 91680 -37671
16293 -37671 -16708 103504 156619 127655 155206 192287 270097 231265 180127 291688 283154
16282 283154 438637 369929 360896 442759 346402 267508 204429 239597 493032 571436 609737
16271 609737 647673 621342 480008 395564 434728 551557 521437 546321 560642 461762 490583
16260 490583 585522 617429 541473 555223 534538 656454 639119 656591 687155 760057 744349
16249 744349 723588 796328 720031 823460 903626 983025 901409 908496 930190 939555 958107 790591
16237 790591 957083 788327 825407 915524 831415 879392 861775 843005 905887 1161781 993152
16226 993152 1049351 1090648 1016781 1027328 977307 1030134 996998 1063647 1065661 1015309 1136782
16215 1136782 1188195 1159925 1190888 1116309 1179689 1183873 1117008 1245147 1209830 1215582 1182781
16204 1182781 1186933 1171802 1147365 1359246 1296571 1326200 1319253 1368522 1362129 1376724 1382835 1368696
16192 1368696 1343134 1302194 1248124 1290231 1265053 1273795 1459450 1312438 1447281 1430003 1273446
16181 1273446 1288382 1206333 1187021 1347641 1459128 1501058 1494212 1556758 1442598 1385865 1444908
16170 1444908 1382628 1382781 1397421 1454106 1432635 1335452 1429447 1453405 1445167 1542398 1643698 1546953
16158 1546953 1525262 1434551 1425307 1518600 1409964 1461034 1582581 1422057 1496768 1653945 1636014
16147 1636014 1618232 1570773 1654962 1643279 1597136 1689751 1610325 1535275 1581603 1573457 1560768
16136 1560768 1567051 1669120 1584473 1516988 1636290 1683263 1567902 1534193 1637793 1646208 1632452
16125 1632452 1596362 1559477 1614895 1665178 1685977 1642527 1659816 1808048 1712358 1743473 1642095
16114 1642095 1636811 1694761 1690720 1676910 1594465 1621753 1728469 1762186 1656874 1698626 1654601
16103 1654601 1586839 1744846 1792577 1795587 1687379 1737892 1727746 1712334 1667888 1670222 1737036
16092 1737036 1809801 1695659 1678705 1764390 1779619 1847489 1736860 1601504 1692679 1753017 1703545
16081 1703545 1735908 1759943 1800478 1711001 1649505 1703001 1774022 1699340 1742444 1912495 1921600
16070 1921600 1829094 1814027 1841448 1816366 1767411 1642433 1706484 1632716 1655273 1737461 1661737
16059 1661737 1729611 1764733 1944189 1727839 1779261 1737277 1712183 1779894 1827493 1804508 1886629
16048 1886629 1837462 1804350 1751796 1529935 1582297 1860852 1740088 1747631 1520953 1657779
16038 1657779 1743062 1868448 1965481 1939973 1705791 1642577 1851269 1861002 1795564 1833049 1857070
16027 1857070 1867960 1727809 1741199 1710659 1782938 1839866 1672355 1595286 1613972 1744035 1773060
16016 1773060 1718791 1761740 1770317 1588548 1675258 1846995 1903777 1830676 1807888 1892919 1952908
16005 1952908 1873752 1809114 1713126 1611214 1624296 1720685 1922626 1889897 1827506 1855992 1842241
15994 1842241 1795217 1908509 1828630 1767235 1863850 1772441 1781457 1866779 2003987 1885760 1755009
15983 1755009 1601223 1626350 1624912 1738004 1768978 1828418 1839953 1812106 1862003 1908491 1803476
15972 1803476 1741784 1621279 1678107 1714508 1870515 1894594 1925446 1818057 1832957 1739038 1876702
15961 1876702 1813753 1855048 1927704 1721986 1700184 1729358 1726738 1844796 1831527 1846878 1740092
15950 1740092 1868697 1852115 1889482 1862587 1889243 1834013 1905729 1962833 2003114 1859385 1775388
15939 1775388 1722748 1852828 1755906 1771633 1852840 1727848 1746588 1777454 1700457 1593124 1691363
15928 1691363 1748935 1792007 1880680 1913668 1766282 1822644 1756614 1714226 1687168 1795050 1701899
15917 1701899 1720836 2010069 1899027 1825178 1776255 1737856 1879080 1835960 1906709 1884689 1854235
15906 1854235 1713394 1740182 1744709 1859257 1651386 1715210 1835661 1833903 1788864 1938115 1874959
15895 1874959 1873546 1758912 1692170 1687937 1812960 1921041 1774621 1668373 1795737 1934708
15885 1934708 1922811 1790311 1939024 1884947 1773490 1675231 1729907 1654883 1732065 1892951
15875 1892951 1860744 1940709 1948768 1892103 1927579 1943325 1871257 1795734 1771445 1881629 1885766
15864 1885766 1919441 1794905 1942387 1859601 1795614 1809938 1814955 1769809 1647882 1732284 1657676
15853 1657676 1945405 1959580 1769801 1769362 1705737 1738477 1741334 1880717 1766692 1837764 1780188
15842 1780188 1719000 1700819 1693430 1847040 1757466 1841909 2011059 1997313 1987232 1851145 1744909
15831 1744909 1863019 1791598 1801136 1764846 1805583 1963668 1928022 1900801 1913733 1859936 1781544
15820 1781544 1769723 1937980 1821351 1852803 1907247 1864298 1871734 1824356 1968660 1855668 1756480
15809 1756480 1743421 1771235 1748742 1826142 1780572 1770574 1769722 1794675 1935351 1881727 1750000
15798 1750000 1918103 1958896 1989087 2011634 1921997 1890555 1716100 1883131 1805421 1692748
15788 1692748 1830924 1802405 1617467 1735745 1912304 1906707 1824912 1957038 1916286 1817571
15778 1817571 1847942 1802199 1813034 1858916 1836451 1802973 1797582 1607561 1775969 1845949 1701781
15767 1701781 1588767 1649152 1679856 1825432 2033090 1906154 1786047 1834935 1878553 1765367
15757 1765367 1715943 1670847 1633728 1809321 1805956 1927508 1811476 1821574 1855371 1929147 1913433
15746 1913433 1778248 1866507 1885379 1959739 1918576 1937801 1985231 1853263 1855116 1940345 1909530
15735 1909530 1819074 1824334 1746544 1713175 1840773 1742472 1824476 1757392 1832182 1894437 1769422
15724 1769422 1855440 1627865 1733537 1783688 1858278 1996052 2025006 1929668 1847374 1789989 1645122
15713 1645122 1670341 1756293 1826402 1835003 1802538 1819428 1924322 1717141 1783125 1965817 1881967
15702 1881967 1862029 1956706 1943104 1955804 1866200 1788836 1917208 2021182 2005618 1926410 1869181
15691 1869181 1825950 1832990 1818321 1940034 1972942 1925985 1800617 1834208 1918521 1977590 2043813
15680 2043813 1913190 1861378 1860120 1786557 1824382 1853678 1973980 1943218 1824588 1792321 1723131
15669 1723131 1740025 1709165 1675220 1818372 1977846 1825525 1807639 1806151 1805318 1679296 1793065
15658 1793065 1895757 1903149 1786239 1678489 1793406 1822810 1819664 1930794 1936129 1926430 1781711
15647 1781711 1759432 1803904 1841667 1845067 1799993 1826080 1824096 1849673 1819061 1831321 1746718 1782708
15635 1782708 1813319 1761269 1776114 1837448 1852729 1811102 1848562 1927389 1896939 1921359 1919547
15624 1919547 1913705 1803486 1772100 1767045 1682264 1648120 1692783 1770525 1822469 1663047 1711857
15613 1711857 1690810 1640238 1685723 1693316 1813912 1722171 1826327 1813754 1776601 1903056 1847710
15602 1847710 1842722 1958817 1925528 1929554 1901408 1863350 1918604 1798640 1834524 1882762 1826732
15591 1826732 1788973 1884324 1828559 1958427 1901401 1950132 1957277 1867038 1951849 1839144 1826609
15580 1826609 1885546 1935142 1795209 1849583 1787521 1792244 1664714 1854620 1927257 1933042 1907816
15569 1907816 1732343 1803440 1909544 1787460 1771590 1742573 1796311 1921827 1961717 1926488
15559 1926488 1760940 1836225 1850954 2026961 2007704 1999143 1967621 1873891 1827701 1865462 1936047
15548 1936047 2006651 1853215 1756503 1771123 1862262 1991694 1846379 1789344 1797231 1823415 1918564
15537 1918564 1951062 1915058 1824346 1889158 1981888 1841299 1860126 1840360 1721954 1736116 1846811
15526 1846811 2023771 2081818 2077426 2016208 1865630 1745804 1810963 1794721 1731824 1820530 1979009
15515 1979009 2006739 2007174 2186391 2179010 2036929 1789676 1805301 1780470 1712725 1813234 1706631
15504 1706631 1767896 1764609 1654238 1852186 1829734 1828675 1871049 1960246 2030498 1928588 2008069
15493 2008069 2056925 1826970 1923179 1924483 1842314 1799168 1798362 1830184 1938970 1818004 1911878
15482 1911878 2029580 1853896 1870142 1929179 2037517 1942744 1882841 1717814 1888881 1942894
15472 1942894 1791806 1859341 1845383 1812387 1807907 1904859 1875103 1904020 1978566 1879727 1924262
15461 1924262 1843877 1979219 1913736 1862701 1921917 1945811 1853960 1787828 1910857 1896229 1900003
15450 1900003 1759106 1887364 1790480 1878679 1893359 1853923 1917308 1767709 1800049 1927100
15440 1927100 1965630 1990787 1894175 1828013 1847020 1757229 1925323 1935687 1892728 1759113 1898768
15429 1898768 1808426 1742587 1813159 1854987 1800185 1826348 1767444 1927467 1995862 1813015 1886087
15418 1886087 1893798 1819632 1894841 1833331 1852984 1964282 1973556 1905866 1885366 1930381 1871879
15407 1871879 1919470 2032275 1862302 1890878 1978652 1939362 1777456 1765550 1737843 1645768 1914113
15396 1914113 1896026 1976272 1983814 1922344 1897944 1943271 1868196 1821526 1882076 1826433 1715698
15385 1715698 1706601 1729242 1766276 1858469 1937699 1890162 1944979 1888844 1944087 1966309 1950938
15374 1950938 1975689 1941820 1902551 1992640 1938649 1788148 1700357 1725075 1794728 1860998 2001568
15363 2001568 2109761 1994232 1955601 1889043 1704510 1879448 1814805 1821302 1898363 1980800 1878536
15352 1878536 1937630 1813753 1848792 1981156 1980810 1862368 1957469 1936407 1960232 2086956 1921157
15341 1921157 1938332 1947300 1971069 1929027 1956235 1946253 1699874 1866090 1927846 1878280 1971161
15330 1971161 1960054 1977597 1913516 1844392 1858819 1961847 1969488 1880877 1889055 1949046 1875188
15319 1875188 1943939 1982843 1887468 1775690 1963471 1941538 2033130 2017480 2027675 1884442 1891171
15308 1891171 1914057 1896962 1748011 1888729 1850517 1849250 1746074 1678986 1769906 1871153 1960529
15297 1960529 2094518 2031958 1991746 1900722 1954646 1963785 1949383 1985469 1951858 1906116 1929249
15286 1929249 2062278 1987559 1973271 1718531 1872353 1868305 1935588 1909382 1901185 1780877 1837061
15275 1837061 1990005 1996215 1925523 1736807 1721967 1682733 1837641 2029575 2133987 1946825
15265 1946825 1787014 1875830 2006868 1955019 1829859 1768086 1829458 1866269 1758180 1854866
15255 1854866 1991551 2048608 2031688 2064837 2114228 2006683 1924478 2005870 2026817 1937169 1835585
15244 1835585 1945700 1802556 1932582 1886121 1847015 1922328 1906092 2002057 1923570 1920850 1880342
15233 1880342 1981947 2000890 1973756 2016295 1998981 1991663 1972756 1922997 1905814 1960690 1826560
15222 1826560 1854021 1942411 2005000 2028829 2088781 1944496 1871517 1808816 1958677 1861169 1760755
15211 1760755 1857911 1688605 1887594 1980605 1856528 1832615 2070905 2085622 2033526 2040838 2083191
15200 2083191 2083823 1888098 1992959 2011338 1983986 1985713 1966484 1949578 1927670 1920874 1912254 1856027
15188 1856027 1923445 1869354 1840079 1862074 1854163 1897326 1941764 1982582 1947682 1913161 1913695 1856286
15176 1856286 1953153 2021051 2056336 1924198 1906151 1922320 1894056 1918666 1753513 1908397 1788533
15165 1788533 1896293 1934707 1907918 1783840 1816172 1890501 1834344 1934070 1883402 2001043 1882101
15154 1882101 1818533 1720021 1757883 1919776 2012158 1950769 1891069 1877270 1845113 2012399 2026777
15143 2026777 1943572 1954033 1921821 1894065 1837722 1919846 1963467 1857128 1716752 1676831 1834293
15132 1834293 1832401 1833075 1967293 2065243 1961617 1901068 2118755 2021645 1933115 1812682 1840556
15121 1840556 2028588 1884400 1810764 1926281 2004360 1922796 1906571 1870181 1788983 1851310 1845276
15110 1845276 1776495 1871887 1860355 1983111 1977269 1894335 1802993 1990987 1855086 1747015 1702559
15099 1702559 1872714 1967729 2028390 1907728 1905097 1950246 1873282 1946500 2044062 1914421 1874973
15088 1874973 1963941 2000010 1983707 1907211 1878689 1934277 1836768 1923717 2033145 1946122 2051256
15077 2051256 1898240 1885119 1924346 2023031 1982012 1968885 2098094 1972990 1914325 1916395 1879870
15066 1879870 2020091 1979445 2032128 2046439 1937291 1991932 2116298 2117916 1985161 2041174 2067811
15055 2067811 2084461 2170428 1895555 1831655 1950250 1923462 1933636 1959317 2018087 1988001 1898887
15044 1898887 2044017 2032303 1834108 1816296 1946635 1983879 2088629 2056793 2265058 2061260
15034 2061260 1831575 1964272 1918444 1995335 1908447 1970100 1931671 2029075 2023309 2014376 2049262
15023 2049262 1980845 1881692 1857767 2062071 1839173 1711335 1841593 1961390 2011408 2108742
15013 2108742 2010489 1939174 1876076 1942955 2018047 1912082 1926287 1959601 1944088 1930212 1936488
15002 1936488 1920588 1889078 1952091 1981661 1967391 2036546 2045048 1862638 1867144 1990981 1908606
14991 1908606 1926155 1856931 1986452 1983370 1896881 2011591 1957055 1943012 2051764 1980292 2017104
14980 2017104 2082953 2046794 2034736 1959093 1995263 2029876 1882087 1896234 2019853 2009281 2042460
14969 2042460 2000484 1953501 1905701 2013746 2073073 2043717 2198158 2114247 1911712 1996450 2026969
14958 2026969 1891099 1914734 1998937 1973446 1954851 1956642 2008436 2020534 2098245 2119949 1990387
14947 1990387 2044601 2060478 1885818 1862888 1868936 1902940 1948670 1905560 2070720 1958277 1866609
14936 1866609 2031903 1975925 1963974 1962113 1965485 1967458 1936032 1966478 2003912 2071419 2101810 2002212
14924 2002212 2019585 2082115 2093785 1892583 1982908 1989588 2019700 2130598 2090876 2077972 2000928
14913 2000928 1999858 2037662 2063234 2011069 2032497 2008337 1987783 1986053 1984385 2053531 2066537 1966689
14901 1966689 1934332 1836343 1826366 1937724 1964737 1933302 1929392 1748086 2027983 2049546 2004949
14890 2004949 1899028 2057944 2067879 1972550 1999970 1749212 1957134 2020933 1788763 1842629
14880 1842629 2105034 2030108 2095740 2127582 2104486 1979741 1806218 1834395 1890088 1846989 1822742
14869 1822742 1909671 1984340 1918555 2021260 2109376 2024062 1917112 1804793 1955777 2005653
14859 2005653 1933255 1892802 1878671 1937661 2005465 2085572 2068592 2033285 1957666 1969334 2005784
14848 2005784 2013148 1958771 1941929 2059238 2041031 1955997 1961029 1989672 1975685 2053908 2013968
14837 2013968 1979032 1938979 1994613 1910661 2064321 2041813 1924919 1907500 2070464 1984763 1816142
14826 1816142 1924177 2035193 2105456 1987822 1902362 1874862 2131094 2012234 2082797 2042268
14816 2042268 2055074 1961858 2015681 2088945 1945032 1967018 2005645 1913525 2020584 2097653 2056839
14805 2056839 2012512 1966467 2054894 2049373 2124351 2040905 1980882 1986203 2009311 2111172 2133242
14794 2133242 1984098 2009590 2193980 2142447 1940440 1973145 1934002 1849603 1860442 1902118 1989416
14783 1989416 2101330 2101486 1934033 1925847 1796441 1868789 1885793 1993971 2013311 2064261 2057940
14772 2057940 2112608 2093493 2001548 1839513 1942272 2028110 2155725 2062622 1965950 2057974 2018903
14761 2018903 2138209 1996383 2021933 2010062 2052227 2048007 2007192 2008307 1885326 1921438 2015387
14750 2015387 2074022 2095443 1972169 1944198 1887234 2168053 2097313 1984981 2019860 1939930 1979727
14739 1979727 2119120 2113602 2141360 2064374 2190073 2113232 2125447 2177251 2124184 1973636 2023415
14728 2023415 2012098 1925572 1797027 1819040 1883595 1939801 2054752 2091203 2177688 2088642 2036363
14717 2036363 2030003 2030873 2101958 1968416 1777662 1889967 2018279 2013616 1912933 1869560 1947441
14706 1947441 1994858 2012571 2104437 2123488 1903394 2012285 1987838 2004985 2035634 2038279 1950858
14695 1950858 1994114 1977589 1866447 1934858 2068402 2161401 2155247 2027520 1877808 1873991 1931974
14684 1931974 1961228 1919973 1957940 1917705 1935017 1940313 1975968 2000508 2149702 2085261 2042414
14673 2042414 1950086 1907164 1926048 1967616 1970145 1976876 2050416 2143817 1958647 2049154 1990073
14662 1990073 1980233 2060406 2221325 2136334 2134878 1979525 2013867 1964819 2030525 1864173 1980803
14651 1980803 2109517 2123679 2195707 2028671 2174539 2067991 2005427 2092169 1986102 1920510
14641 1920510 2047798 2084814 2169805 2066552 1903168 2017927 1951838 1890503 2013777 1986319
14631 1986319 1935950 2006789 1954350 1913519 1937137 2051407 1934720 1955711 2070050 2066229 2075313
14620 2075313 2047636 2000382 1997703 1930196 2001116 2031105 1837919 2074810 2168056 1982323 1947556
14609 1947556 2061844 2092219 2105014 2041258 2074135 1999078 2028065 2021019 2058582 2015329 1924649
14598 1924649 2105390 2251313 2074412 1954832 1955112 2191503 2104254 2047569 2167085 1941512
14588 1941512 1921946 2013171 1993742 2022059 2041527 1916235 1987191 1902309 1901599 2046735 2074802
14577 2074802 2145082 2185189 2004115 1946334 2076531 2010380 2121132 2046958 1924261 2011327
14567 2011327 2105330 2019381 2035076 2095615 1957220 1957025 2202822 2085847 2032226 2063308 2234100
14556 2234100 2062976 2078575 1990031 2163934 1988628 2036005 2105519 2062290 2155851 2054992
14546 2054992 2113947 2017726 2095955 2097318 2022055 2054758 1946249 1975584 2123205 1992234 2056146
14535 2056146 1998266 1965594 2030861 2033382 2134402 2120484 2042183 1998998 2020966 2047238 2045260
14524 2045260 2036457 2020137 2003640 2069976 2091106 2123500 2119088 2004332 2089711 2198956 2102647
14513 2102647 1949540 1990717 1998860 2091539 2108894 2005202 2062518 2141426 2227784 2222113 2080801
14502 2080801 2197766 2137617 1939913 1965410 1997616 2082521 2125564 2087300 2069983 2144007 2104794
14491 2104794 2028687 2035002 2007045 1970187 2028900 2099160 2020751 2186682 1976555 1952683 1966901
14480 1966901 1975993 1907869 1971198 2075182 2231109 2119175 2096267 2193885 2146712 2083446 2059696
14469 2059696 2003878 2193245 2202051 1994324 1989242 1896119 2072979 2265517 2066399 1940336
14459 1940336 2078807 2063123 2124251 2114128 1942698 1967423 2025677 2115485 2142959 2023052 1925577
14448 1925577 1948977 2079535 2123255 2083516 2111536 2037812 2163308 2200503 2083153 2121628 2068405
14437 2068405 1955079 1870067 1845327 1924678 1930079 1961940 2005166 2156485 2175529 2197446 2069587
14426 2069587 1995483 2017590 2094667 2173303 2098770 2156883 2126614 1974073 2051337 1993815 1945860
14415 1945860 2255017 2173502 2050649 2231692 2149435 2082393 2124439 1989559 2102384 2145519
14405 2145519 2135537 2044998 1995196 1954455 2017429 1938314 2071365 2102033 2115458 2064354 2158472
14394 2158472 2227037 2250741 2171870 2144958 2167368 1926670 1867746 2056046 2097601 2057977 2131937
14383 2131937 2047011 1884437 2015610 2133739 2114961 2044758 2220737 2151121 1978949 1982827
14373 1982827 2007569 2029479 2081918 2028881 1910298 1893221 2031181 2164983 2328914 2290847
14363 2290847 2057466 2105287 2086210 2091991 2096729 2093371 2090680 2083177 2089892 2246587 2164175 2069219
14351 2069219 2049537 2156599 2146520 2062536 2224739 2090037 1956129 2128436 2103910 2239682
14341 2239682 2327436 2240664 2241850 2111026 2164659 2120041 2060920 2086439 2094708 2116934 2106240
14330 2106240 2131298 2144818 2115076 2140959 2061732 2104590 2137606 2132786 2031203 2018237 2224565
14319 2224565 2307107 2160446 2246401 2089868 2159706 2331691 2174678 2158293 2279315 2150016
14309 2150016 2049580 2126868 2182608 2137751 2174414 2192327 2233272 2239582 2236859 2406595 2193523
14298 2193523 2196094 2022910 2052922 2106445 2146853 2030631 2169728 2177241 2151322 2192875 2006753
14287 2006753 2183648 2142475 2141560 2227814 2059672 2153334 2165934 2295141 2233195 2234556 2180311
14276 2180311 2065080 2085141 2136218 2071770 2116901 2089461 2123149 2107146 2181972 2082911 2103737
14265 2103737 2077209 2049704 2148520 2129637 2061037 2003916 2080092 2042292 2121934 2184211 2106658
14254 2106658 2157146 2039307 2035757 2245283 2319072 2249351 2057248 2093081 2087840 2086393 1980288
14243 1980288 2061937 2137620 2070852 2100543 2088036 2049027 2103193 2169375 1989789 1989100 2063034
14232 2063034 2198452 2182063 2045778 2114356 2127261 2052195 1976282 2039876 1957029 2095784 2070180
14221 2070180 2226097 2306284 2327978 2218206 2205150 2173914 2308693 2285794 2304732 2282029 2224594
14210 2224594 2087424 2102795 2201623 2241283 2110370 2075463 2193130 2173227 2154807 2155448 2100663
14199 2100663 2123218 2061535 1972653 2073765 2116401 2254864 2214438 2156232 2185331 2166567 2129088
14188 2129088 2122718 2171836 2028939 1980065 1972002 2011816 2106394 2088974 2114907 2128932 2294581
14177 2294581 2167521 2061525 2114734 2075611 2013933 2050091 2175746 2198132 2209251 2130716 2072423
14166 2072423 2055647 2092107 2084881 2020589 2159966 2297151 2209996 2139340 2172669 2191028 2254024
14155 2254024 2142529 2126739 2168862 2206710 2070854 2006308 2053156 2178353 2279355 2214390
14145 2214390 2100131 2123782 2106148 2129157 2051682 2106563 2177241 2162509 2283279 2166468 2285215
14134 2285215 2283004 2289612 2228570 2195994 2184463 2168357 2172806 1994699 2079662 2082524 2139965 2160795
14122 2160795 2220993 2215311 2172239 2215376 2130995 2308767 2264173 2243360 2329874 2241501 2175694
14111 2175694 2084309 2121556 2203571 2249259 2220498 2389767 2231138 2152949 2173651 2322964 2109991
14100 2109991 2230314 2287480 2277506 2243445 2181004 2060081 2069834 1995237 2018679 2196676 2287976
14089 2287976 2242070 2136546 2145391 2150087 2225917 2170222 2221331 2064721 2115629 2091387 2089292
14078 2089292 2039044 2014509 2056202 2123790 2026014 2219217 2211862 2268624 2168353 2182061 2282461
14067 2282461 2340029 2293021 2267043 2164430 2154117 2247417 2189213 2132737 2086992 2289297 2291236
14056 2291236 2092187 2137495 2179738 2247103 2227554 2242233 2119322 2131419 2178208 2164246 2264205
14045 2264205 2174645 2310663 2329435 2288130 2158750 2155997 2351816 2272110 2237834 2197009 2129470
14034 2129470 2092559 2120542 2197685 2184641 2278773 2035396 2167641 2179318 2208049 2167775 2087951
14023 2087951 2153412 2027413 2203423 2199298 2133589 2078648 2027272 2059195 2099105 2166767 2164031
14012 2164031 2295948 2278382 2176790 2079248 2112151 2199153 2378793 2345405 2232562 2276030
14002 2276030 2219468 2050400 2251152 2319368 2286456 2194987 2188299 2142934 2260854 2195927 2061349
13991 2061349 2107939 2128003 2049099 2056229 2135921 2113874 2230755 2238816 2296067 2231266 2253449
13980 2253449 2194227 1980364 1951766 1992560 1988631 2074939 2083029 2043949 2095580 2252787 2098755
13969 2098755 2179511 2200253 2321839 2217325 2152472 2175052 2262783 2234740 2165377 2207104 2156812
13958 2156812 2221207 2164782 2040700 2260101 2110874 2158261 2205046 2211955 2335783 2136602
13948 2136602 2059513 2130568 2127552 2150004 2123231 2128022 2090117 2173597 2331793 2332293 2189040 2117319
13936 2117319 2267058 2312889 2163071 2181093 2283993 2333737 2177797 2232824 2252434 2168571
13926 2168571 2242700 2204054 2201030 2166519 2193259 2187735 2167846 2081229 2232429 2318830 2261287
13915 2261287 2215172 2215116 2170736 2184372 2366901 2358348 2206796 2067061 2122967 2229119 2166336
$$ [...]
##END NTUPLES=NMR SPECTRUM
##END=
