##TITLE=1H_EC-3331(1)
 CDCl3
 8 sc, 
 6.9.2024
##JCAMPDX= 6.0         $$ Bruker NMR JCAMP-DX V2.0
##DATA TYPE= NMR SPECTRUM
##DATA CLASS= NTUPLES
##ORIGIN= UXNMR, Bruker Analytische Messtechnik GmbH
##OWNER= root
$$ XWIN-NMR		Version 3.5
$$ Fri Sep  6 14:34:58 2024 Russian Standard Time (UT+4h)  she@DPX200
##.OBSERVE FREQUENCY= 200.1318
##.OBSERVE NUCLEUS= ^1H
##.ACQUISITION MODE= SIMULTANEOUS
##.ACQUISITION SCHEME= undefined
##.AVERAGES= 8
##.DIGITISER RES= 18
##SPECTROMETER/DATA SYSTEM= spect
##.PULSE SEQUENCE= zg30
##.SOLVENT NAME= CDCl3
##.SHIFT REFERENCE= (INTERNAL, CDCl3, 0, 20.9812)
##AUDIT TRAIL= $$ (NUMBER, WHEN, WHO, WHERE, WHAT)
$$ ##TITLE= Audit trail, XWIN-NMR		Version 3.5
$$ ##JCAMPDX= 5.01
$$ ##ORIGIN= Bruker BioSpin GmbH
$$ ##OWNER= she
$$ F:/spectra/data/she/nmr/H-F/1/pdata/1/auditp.txt
$$ ##AUDIT TRAIL=  $$ (NUMBER, WHEN, WHO, WHERE, WHAT)
(   1,<2024-09-06 14:33:34.92 +0400>,<she>,<DPX200>,
      <created by zg, POWCHK disabled, PULCHK disabled
       configuration hash MD5:
       00 E9 B6 7A A2 85 ED C7 34 08 36 98 17 FE 4E 26
       data hash MD5: 16K
       74 6F E6 0E DF EA 4D 8A 05 DF B5 9F 71 E9 AE 26>)
(   2,<2024-09-06 14:33:40.98 +0400>,<she>,<DPX200>,
      <Start of raw data processing
       efp BC_mod = 2 LB = 0.24 FT_mod = 6 PKNL = 1 PHC0 = -25993.12 PHC1 = 12.18748 SI = 16K 
       data hash MD5: 16K
       17 78 0F 25 F9 6F F3 0D 65 CD 42 E6 64 98 A1 C3>)
(   3,<2024-09-06 14:33:55.56 +0400>,<she>,<DPX200>,
      <pk PHC0 = -156.5196 PHC1 = -2.2 
       data hash MD5: 16K
       5E FF 5D CF 70 95 51 DA E7 70 D9 7B AF F4 65 1E>)
(   4,<2024-09-06 14:33:59.14 +0400>,<she>,<DPX200>,
      <abs ABSG = 5 
       data hash MD5: 16K
       B1 7C 37 A0 FA 04 58 50 A1 BF 6F 6F 16 4B AC A1>)
$$ ##END=
$$ 
$$ hash MD5
$$ 54 69 D8 8F 7B 33 CF 21 9E 98 3E EF C5 87 31 7B
##$RELAX= 
##$RELAX= 
##$RELAX= 
##$RELAX= 
##$RELAX= 
##$RELAX= 
$$ Bruker specific parameters
$$ --------------------------
##$DU= <F:/spectra>
##$EXPNO= 1
##$NAME= <H-F>
##$PROCNO= 1
##$TYPE= <nmr>
##$USER= <she>
##$AMP= (0..31)
100 100 100 100 100 100 100 100 100 100 100 100 100 100 100 100 100 100 
100 100 100 100 100 100 100 100 100 100 100 100 100 100 
##$AQSEQ= 0
##$AQ_mod= 1
##$AUNM= <au_zg>
##$AUTOPOS= <>
##$BF1= 200.13
##$BF2= 200.13
##$BF3= 200.13
##$BF4= 200.13
##$BF5= 200.13
##$BF6= 200.13
##$BF7= 200.13
##$BF8= 200.13
##$BYTORDA= 1
##$CFDGTYP= 0
##$CFRGTYP= 5
##$CHEMSTR= <none>
##$CNST= (0..31)
1 1 145 1 1 1 1 1 1 1 1 1 1 1 1 1 1 1 1 1 1 1 1 1 1 1 1 1 1 1 1 1 
##$CPDPRG= <>
##$CPDPRG1= <>
##$CPDPRG2= <>
##$CPDPRG3= <>
##$CPDPRG4= <mlev>
##$CPDPRG5= <mlev>
##$CPDPRG6= <mlev>
##$CPDPRG7= <mlev>
##$CPDPRG8= <mlev>
##$CPDPRGB= <>
##$CPDPRGT= <>
##$D= (0..31)
0 1.2 0 0 0 0 0 0 0 0.06 0 0.03 0 0 0 0 0.0002 0 0 0 0 0 0 0 0 0 0 0 0 
0 0 0 
##$DATE= 1725618814
##$DBL= (0..7)
120 120 120 120 120 120 120 120 
##$DBP= (0..7)
150 150 150 150 150 150 150 150 
##$DBP07= 0
##$DBPNAM0= <>
##$DBPNAM1= <>
##$DBPNAM2= <>
##$DBPNAM3= <>
##$DBPNAM4= <>
$$ [...]
##$SUBNAM3= <"">
##$SUBNAM4= <"">
##$SUBNAM5= <"">
##$SUBNAM6= <"">
##$SUBNAM7= <"">
##$SUBNAM8= <"">
##$SUBNAM9= <"">
##$SW= 24.0689170037331
##$SWIBOX= (0..15)
0 0 2 0 0 0 0 0 0 0 0 0 0 0 0 0 
##$SW_h= 4816.95568400771
##$TD= 16384
##$TD0= 1
##$TE= 0
##$TE2= 300
##$TE3= 300
##$TEG= 300
##$TL= (0..7)
0 120 120 120 120 120 120 120 
##$TP= (0..7)
150 150 150 150 150 150 150 150 
##$TP07= 0
##$TPNAME0= <>
##$TPNAME1= <>
##$TPNAME2= <>
##$TPNAME3= <>
##$TPNAME4= <>
##$TPNAME5= <>
##$TPNAME6= <>
##$TPNAME7= <>
##$TPOAL= (0..7)
0.5 0.5 0.5 0.5 0.5 0.5 0.5 0.5 
##$TPOFFS= (0..7)
0 0 0 0 0 0 0 0 
##$TUNHIN= 0
##$TUNHOUT= 0
##$TUNXOUT= 0
##$USERA1= <user>
##$USERA2= <user>
##$USERA3= <user>
##$USERA4= <user>
##$USERA5= <user>
##$V9= 5
##$VALIST= <valist>
##$VCLIST= <CCCCCCCCCCCCCCC>
##$VD= 0
##$VDLIST= <DDDDDDDDDDDDDDD>
##$VPLIST= <PPPPPPPPPPPPPPP>
##$VTLIST= <TTTTTTTTTTTTTTT>
##$WBST= 1024
##$WBSW= 4
##$XGAIN= (0..3)
0 0 0 0 
##$XL= 0
##$YL= 0
##$YMAX_a= 182964
##$YMIN_a= -317522
##$ZGOPTNS= <>
##$ZL1= 120
##$ZL2= 120
##$ZL3= 120
##$ZL4= 120
##$ABSF1= 20.99732
##$ABSF2= -3.071812
##$ABSG= 5
##$ABSL= 3
##$ALPHA= 0
##$AQORDER= 0
##$ASSFAC= 0
##$ASSFACI= 0
##$ASSFACX= 0
##$ASSWID= 0
##$AUNMP= <proc_1d>
##$AZFE= 0.1
##$AZFW= 0.1
##$BCFW= 0
##$BC_mod= 2
##$BYTORDP= 0
##$COROFFS= 0
##$CY= -3
##$DATMOD= 1
##$DC= 0
##$DFILT= <>
##$DTYPP= 0
##$F1P= 0
##$F2P= 0
##$FCOR= 1
##$FTSIZE= 16384
##$FT_mod= 6
##$GAMMA= 0
##$GB= 0
##$INTBC= 1
##$INTSCL= 3.70164e-10
##$ISEN= 128
##$LB= 0.24
##$LEV0= 0
##$LPBIN= 0
##$MAXI= 10000
##$MC2= 0
##$MEAN= 0
##$ME_mod= 0
##$MI= 1.114404
##$NCOEF= 0
##$NC_proc= -7
##$NLEV= 6
##$NOISF1= 3.799351
##$NOISF2= 2.8
##$NSP= 0
##$NTH_PI= 0
##$NZP= 0
##$OFFSET= 20.98116
##$PC= 1
##$PHC0= -26149.64
##$PHC1= 9.98748
##$PH_mod= 1
##$PKNL= yes
##$PPARMOD= 0
##$PSCAL= 0
##$PSIGN= 0
##$REVERSE= no
##$SF= 200.130009517325
##$SI= 16384
##$SIGF1= 3
##$SIGF2= 2
##$SINO= 5.538805
##$SIOLD= 16384
##$SREGLST= <1H.CDCl3>
##$SSB= 0
##$STSI= 16384
##$STSR= 0
##$SW_p= 4816.95568400771
##$SYMM= 0
##$S_DEV= 0
##$TDeff= 16384
##$TDoff= 0
##$TI= <>
##$TILT= no
##$TM1= 0
##$TM2= 0
##$TOPLEV= 0
##$USERP1= <user>
##$USERP2= <user>
##$USERP3= <user>
##$USERP4= <user>
##$USERP5= <user>
##$WDW= 1
##$XDIM= 16384
##$YMAX_p= 490428205
##$YMIN_p= -1192040
$$ End of Bruker specific parameters
$$ ---------------------------------
##NTUPLES= NMR SPECTRUM
##VAR_NAME=  FREQUENCY,     SPECTRUM/REAL,   SPECTRUM/IMAG
##SYMBOL=    X,             R,               I
##VAR_TYPE=  INDEPENDENT,   DEPENDENT,       DEPENDENT
##VAR_FORM=  AFFN,          ASDF,            ASDF
##VAR_DIM=   16384,         16384,           16384
##UNITS=     HZ,            ARBITRARY UNITS, ARBITRARY UNITS
##FACTOR=    0.29402158847633, 1,            1
##FIRST=     4198.95959242285, 0,            0
##LAST=      -617.996091584857, 0,           0
##MIN=       -617.996091584857, -1192040,    0
##MAX=       4198.95959242285, 490428205,    0
$$ Real data points
##PAGE= N=1
##DATA TABLE= (X++(R..R)), XYDATA
$$ [...]
8289 -96409 62249 127816 92758 8304 -41782 17243 23068 42994 99139 152370 -41059 -89796
8277 -89796 -30640 -18239 29077 -11229 -37020 -26172 -42925 -33465 -115294 -73390 -30895 -73680
8265 -73680 -64332 2422 19450 -89533 6039 -1873 -41111 -57026 -14078 -11938 -85322 -47296
8253 -47296 -36303 -148131 -111768 -75408 -91859 -61293 -86433 -89736 -113777 -100167 -66504 -46516
8241 -46516 -66108 -134630 -151573 -110049 -79818 -5252 -52911 -54295 32085 -44113 -67163 -101659
8229 -101659 -73958 -128669 -167343 -179355 -159241 -81842 11794 -67967 -36601 -38708 -35989 -125936
8217 -125936 -70828 -13906 -21116 16687 -61505 -84717 -34413 -44204 -52412 -74029 7721 -84146
8205 -84146 -293621 -160185 -154880 -108523 -119061 -171493 -162060 -252751 -88313 -46152 -283835
8194 -283835 -371028 -521748 -12136 159273 38533 50596 -29167 -54022 -65201 -50369 -87478
8183 -87478 -107059 -38810 5058 18645 33379 -14342 -26103 -81425 -196321 -75966 -65967 -42929
8171 -42929 -28311 -47393 2411 46211 54348 -46391 -10510 -38765 4911 -64216 -33237 -18220
8159 -18220 4890 16395 -54207 -87129 -140147 -90387 -97265 -93012 81707 52470 -39665 -116333
8147 -116333 -88120 -126652 -64747 -77737 -43669 -135090 -33770 3746 -84627 37794 36852 8140
8135 8140 -18435 -40555 -72185 -31811 -132743 -74482 -22906 -151735 -52354 -78169 -17289 70418
8123 70418 22526 94799 56843 -24294 37903 59841 28357 -1257 24126 22271 -48758 -80145
8111 -80145 -132652 -61272 -112133 -79065 -63508 -39635 -9254 -42525 -31739 -53604 -49661 5915
8099 5915 -60854 -83534 -34513 -40086 -129 -1653 -47254 -45796 -50623 -42311 -36370 -66239 -193682
8086 -193682 -62251 8470 -47913 -73346 64029 30898 -6899 -45799 83604 42632 39526
8075 39526 -43856 -121048 -95893 -139626 -74768 -120840 13170 -16279 17423 37266 91118 79917
8063 79917 -119810 -48086 7681 -54190 -114528 -109289 -163832 -132120 -61411 -23101 20218 472
8051 472 -17200 17325 -59128 -154901 -123079 -99276 -49733 -64155 -3778 -97957 -50169 -95742
8039 -95742 -120403 -25260 -2780 -71951 -98419 -88734 -33571 -23265 -13416 19365 9883 4595 22821
8026 22821 -41556 -70171 -1752 11466 -96687 -7168 5122 38831 33590 -17303 35084 -32201
8014 -32201 7596 12478 -26891 -61744 -11381 39036 -34892 -99435 38087 79701 36122 -11432
8002 -11432 775 44788 31523 -41188 78077 117919 114959 109714 26346 29689 -5714 -25438
7990 -25438 29257 4040 8860 45028 89030 61097 154318 172593 172271 142947 138984 112920 199728
7977 199728 224562 190194 239714 272881 126077 144624 278247 277461 310991 328198 332839 248804
7965 248804 307715 369295 453318 393025 450028 440320 455379 508251 582984 572345 551439 370867
7953 370867 418165 311516 255712 275397 248091 254749 180332 194606 166351 93340 135740 114852
7941 114852 90468 144267 111926 155610 129882 3756 63530 -12988 116975 164306 183290
7930 183290 130626 28157 118806 100455 20095 6551 56965 -13539 -56013 13619 -79122
7919 -79122 -16686 55076 23480 -4866 13315 34492 25577 12908 -10389 -37554 -2717 9694
7907 9694 -42589 -9802 67321 5901 -205646 -6361 -48766 48516 50863 41811 -15365 66802
7895 66802 98607 65888 59792 9967 31663 -45891 -118217 -100973 -85432 4203 50486 3488
7883 3488 -41433 -74062 -55802 17786 -5354 -98831 -66865 1800 -23250 130753 36119 81308
7871 81308 -10190 86106 60866 150235 152327 -37412 -113635 -9763 -1288 -7770 3632 39041
7859 39041 146617 -40449 3426 -2941 60492 -10223 -64389 -101157 -56115 -84235 -94302 -117319
7847 -117319 -131169 -101128 101501 131894 84524 79106 -28165 -17316 -45512 -96645 -101074 -69078
7835 -69078 53867 41882 32954 -57758 -5007 10334 52051 -56651 -97433 98699 19471
7824 19471 37173 17708 -9748 -8403 44307 74216 -10125 14861 -72813 -36631 -20931 37408
7812 37408 22496 43480 56549 54013 -9833 20360 78370 76783 39260 41606 -46873 -28242
7800 -28242 -11280 -8389 -2057 -19491 109410 118930 122661 -91573 -147780 -27876 33930 67616
7788 67616 85405 38483 1732 -29199 -85070 -36630 -34608 -19270 14078 20715 -26804 15681
7776 15681 94902 -4529 -71260 -20329 45576 64207 -16490 -70812 -49955 -118784 -157941 -209985
7764 -209985 -113725 -100412 -99161 -119680 -155209 -39427 72456 -9462 2843 -30616 -76838
7753 -76838 -43345 -12652 52212 30024 67584 122628 126590 106446 82597 77305 81568 110330
7741 110330 104640 105953 -56788 9208 22798 22725 113825 131613 45710 52279 97199 182880 267316
7728 267316 216069 177259 71738 121115 130745 98928 174981 212732 151297 160079 150335 173970
7716 173970 138266 38597 71911 87515 79727 102057 92434 133498 130743 110821 138685 209268
7704 209268 152211 77871 48851 135195 95098 34767 102230 78894 142920 103274 203014 163342
7692 163342 69015 117113 60983 178541 171225 217529 214192 200146 172515 189850 130233 94563
7680 94563 48268 57910 106677 71680 83165 155733 47108 79731 159962 144069 200629 -32566
7668 -32566 -20831 139883 52485 101055 123205 108738 66104 -3297 -27600 55157 66935 78676
7656 78676 102226 70206 59611 -27329 -9219 6303 66822 34900 174041 228289 64940
7645 64940 6106 86647 170753 125351 62349 157668 74412 34960 86897 186029 142253 77044
7633 77044 139233 87494 54687 43944 131667 211559 213503 94198 119921 151287 168712 94976
7621 94976 50383 180846 195244 233951 201468 256406 172190 231257 195505 177242 253122 252950
7609 252950 269770 222394 199602 162134 202791 270532 149054 176791 249256 307097 223820
7598 223820 213669 211520 150223 211105 172060 157909 135884 307836 248184 209807 177978 246047
7586 246047 233541 224666 244353 175422 269523 270602 197403 194478 179847 244718 180486 198302
7574 198302 86611 -3319 34254 58096 125704 169229 189493 114918 93878 197687 233179
7563 233179 188826 186383 203465 127423 172758 205687 119339 215324 113975 213995 248136
7552 248136 191659 209412 206434 181122 238728 241796 178917 134573 77992 150821 143146 55899
7540 55899 245971 241823 303333 307874 404780 416853 413304 350329 360910 377874 413127 440660
7528 440660 362650 400916 313848 308546 398358 357900 320559 305713 273543 310171 344117 290983
7516 290983 279331 283753 262005 325590 363420 376120 354780 447608 478984 574039 574948 557880
7504 557880 635652 646511 741679 774042 593520 524766 414448 444045 425357 454111 385608
7493 385608 428442 348519 454875 382422 292157 273347 335406 379537 386075 351561 337657 317807
7481 317807 304100 246534 281906 322727 315728 321116 372775 424869 433831 466631 426801 275948
7469 275948 342635 425762 437143 378653 298019 298450 365688 324128 360873 424516 418641 425638
7457 425638 421073 420791 407738 341930 271041 248867 237358 364818 379750 375727 357511 269220
7445 269220 333088 418114 311495 364242 356690 375734 317495 416382 363209 398823 313542 321843
7433 321843 332495 401570 390009 322868 372573 408783 459224 469353 408030 439494 414692 434195
7421 434195 504869 537555 557128 481475 551901 573549 545034 516048 451859 371064 503144
7410 503144 514344 477791 534239 503498 602290 642821 731052 682885 778629 730403 735034 785769
7398 785769 887469 939902 1004005 1282443 1359113 1125384 1159567 1110248 995876 882361 981008
7387 981008 963396 1054761 1074707 969918 1100429 1020028 1003577 1103879 1146208 1163185 1168842
7376 1168842 1161017 1268320 1362464 1419235 1494860 1627049 1696169 1819892 1802313 1632450 1701423
7365 1701423 1749009 1646344 1726604 1697992 1739380 1846772 1790660 1750271 1800117 1734970 1687486
7354 1687486 1843583 1878560 2011288 2047834 2055815 2126815 2140615 2303298 2403512 2466755 2495358
7343 2495358 2494895 2695523 3025658 3180366 3440977 3509008 3638758 3746563 3699050 3711941 3551218
7332 3551218 3652726 3765211 3740939 3774456 3718782 3861807 4018874 4238035 4411459 4670076
7322 4670076 5033016 5181610 5521663 5941773 6401223 7047421 7850260 8878293 9957962
7313 9957962 11304100 12460663 12881578 12544491 12062324 11722901 11845845 12386742 12961990
7304 12961990 12984145 12165464 11040902 9906141 9046149 8512979 8125749 7943175 7749324
7295 7749324 7853498 8020435 8343390 8758072 9531547 10357827 11675851 12863732 13411024
7286 13411024 13942317 14760206 15154238 15273785 14891365 14010761 13626176 13032497 11819132
7277 11819132 10338984 8967279 7987684 7151361 6550388 6074636 5853403 5497557 5180586
7268 5180586 4843075 4485293 4234795 3952495 3746938 3653832 3584692 3439798 3291878 3267483
7258 3267483 3292472 3117144 2999885 3060919 3099672 3026575 3012312 2957136 2814690 2862164 2965488
7247 2965488 2850577 2969648 2999965 3142026 3141571 3189192 3077609 2915071 2889225 2966729 2954223
7236 2954223 2929622 3093095 3159618 3036548 2876110 2866648 2897616 2843594 2797008 2829464 2763947
7225 2763947 2869710 2947278 2950292 2904973 2846316 2949667 2909428 2844510 2825788 2667853 2668491
7214 2668491 2632558 2546920 2571154 2579045 2612356 2509974 2570249 2548752 2657591 2698577 2603240
7203 2603240 2581756 2678766 2589946 2659512 2736324 2746304 2658052 2832930 2859430 2838489 2774579
7192 2774579 2708896 2698460 2641691 2577293 2634612 2492911 2572415 2533053 2564162 2552979 2555314
7181 2555314 2593805 2654085 2667240 2801508 2795190 2810965 2839713 2821774 2906905 2889160 3002239
7170 3002239 3193860 3131469 3076907 3079875 3151967 3288275 3355300 3323535 3320664 3462916 3513077
7159 3513077 3655893 3722310 3754979 3751821 3851096 3965371 4093689 4071957 4128193 4214500 4333930
7148 4333930 4389905 4508534 4602625 4689327 4947533 5044825 5142433 5337939 5618605 5757558
7138 5757558 5929614 6152503 6370665 6460098 6655940 6911806 7173025 7455588 7637513 7900791
7128 7900791 8303602 8661926 9029246 9340695 9756601 10298599 10975649 11794799 12750976 13911517
7118 13911517 14790648 15340971 15417769 15246468 15412807 16000122 16925985 17904963 18515924 18914610
7108 18914610 19178744 19243034 19184329 19352098 19784972 20725671 20945625 20718777 20564381 20632774
7098 20632774 21099438 22107799 23488994 24906024 26133057 27061150 28079443 29444261
7090 29444261 31490800 34613790 37041632 38355284 39599969 41174171 42282917 40823348
7082 40823348 37575673 34326854 31664627 30341769 29604941 29513452 29296891 28810908 28122317
7073 28122317 27782766 27451786 27793583 28149231 28789910 29511771 30694545 32046707 34349976
7064 34349976 37124692 40913318 44604259 46945090 46660544 45290779 43978838 43864418
7056 43864418 44987842 47231604 48122374 48543732 48943066 49800826 50660740 52250174 54258209
7047 54258209 56914399 60122459 65617537 72879599 84645426 99347892 122786801 141373567
7039 141373567 131815352 110568877 88131875 73759667 64037249 57234216 51863323 48033183
7031 48033183 44364393 41521199 38821975 36331096 33957164 31807053 30079989 28577996
7023 28577996 27556162 26762731 26130234 25651177 25145001 24948469 24812083 24800262 24845972 25024863
7013 25024863 25276754 25379363 25368606 25417867 25436597 25559563 25470729 25209341 25068866 24938132
7003 24938132 25002629 25211246 25476363 25906918 26375268 26970217 27531565 28149059 28705295 29493160
6993 29493160 30492852 31648763 33011613 34521617 36128214 37399483 38760093 39925264
6985 39925264 41194548 42563254 44254834 46483760 49235753 52305689 55566934 58094139
6977 58094139 59398400 60266421 61599539 64106092 66982621 68009210 67644961 67090382 66878022
6968 66878022 67373592 68548040 70368414 73119206 76636026 80640006 84847718 89694318
6960 89694318 94791574 99978641 105818248 112271117 119977270 129941044 142606321 153802128
6952 153802128 161496012 168070072 172999910 175632039 176170239 171128819 160188809 148046835
6944 148046835 136939460 127842885 119862681 113814536 109580988 107650421 106798533 106727389
6936 106727389 106854040 106805609 106808293 107767933 109640050 112348533 116087660 121862694 130398661
6927 130398661 142917439 158492258 175055264 187763172 192383897 185774899 168037657
6920 168037657 146260231 126067971 109782402 96985678 86847016 78641629 72283661
6913 72283661 67408149 63521862 60166543 57057010 54131160 51254592 48815917 46733076
6905 46733076 45084421 43752376 42752175 41761028 40321870 38728387 37259952 36041913
6897 36041913 35349650 34583644 33705721 32798875 32237733 31848188 31373995 30723858 29853990
6888 29853990 28813141 27956958 27286442 26716163 26434405 26210136 26029485 25959669 25802525
6879 25802525 25810386 25933536 26166554 26571009 26978801 27358693 27774544 28318395 28658780 29147831
6869 29147831 29778618 30517655 31328625 32312783 33421084 34983348 36889834 39046086 41064671
6860 41064671 42179010 42702761 43307444 44447341 46329061 48590515 50443617 52017632
6852 52017632 53396737 53948027 53657062 52928407 52447149 52412520 52963655 54057117 55383872
6843 55383872 56632033 58057030 59515315 60833974 62545582 65019266 66664202 66691774
6835 66691774 66012276 65973084 66937509 68961709 71903167 74828061 76521905 76861583 76593136
6826 76593136 76458439 76895527 77747000 79103548 81182417 83984795 87741272 92801755 97902370
6817 97902370 101761669 105347250 109885078 114471494 114403783 110657027 105899081 102515744
6809 102515744 100573147 99703447 99793286 101295481 104637196 110217829 117718152 126778856
6801 126778856 134429195 137614867 136726306 134696706 133580346 134272392 136653772 141343152
6793 141343152 146168210 147730753 147697757 144423531 137098766 127879280 119717578 113853260
6785 113853260 109013353 104029180 99238687 95250900 92428161 90758699 90339341 91122752
6777 91122752 93153004 96257136 99930222 103931280 107366232 108238060 106870256 105362500
6769 105362500 105487347 106988473 107520254 104509038 99334808 93863032 89702760 85928465
6761 85928465 82257074 79373399 77361289 75729468 74353210 72326675 69418516 66073216
6753 66073216 62884247 60439861 58880028 57845464 56645017 54898083 52620898 50146801
6745 50146801 48024414 46540337 45404390 44740349 44335357 44304157 44515804 45021059 45963687
6736 45963687 47736252 50146088 53482809 57344155 60417482 61219154 60045083 58147839
6728 58147839 56703724 56184449 56402744 56158284 54798492 52500571 49365072 45776302 42092402
6719 42092402 38928954 36514242 34575425 32911162 31790881 30809370 30280087 30085029 30349302
6710 30349302 30945028 32090750 32939885 32931928 32226966 31473992 31172504 31145804 30538912 28943208
6700 28943208 27043968 25168271 23604973 22069793 20745285 19581377 18665596 17870595
6692 17870595 17179622 16704147 16467760 16376897 16321183 16482227 16594398 16698515 16882374 16933753
6682 16933753 16630314 15859354 15098898 14608621 14305709 13851833 13207808 12459519 11717342
6673 11717342 11170747 10652121 10306228 9832057 9404024 9167148 8873265 8571674 8368054
6664 8368054 8153601 8058904 7935134 7836680 7852518 7704119 7714733 7544900 7221646 6908289
6654 6908289 6633822 6249611 6051176 5905506 5746341 5618495 5492363 5437376 5385271 5265488
6644 5265488 5176949 5132137 4936899 4838840 4835335 4716635 4570350 4540035 4430875 4345955 4451530
6633 4451530 4335497 4178125 4037978 3989504 4002411 3877347 3784218 3761722 3647557 3576400
6623 3576400 3606199 3577674 3556122 3519726 3558404 3557499 3535215 3521361 3573403 3615589 3628839 3671824
6611 3671824 3781174 3870687 3884528 4002259 4162503 4368386 4484128 4564361 4526426 4523038 4479268
6600 4479268 4504350 4437364 4360047 4211983 4170226 4110277 4010814 4052751 4063782 4167736 4127036
6589 4127036 4271612 4380548 4497038 4708335 4803354 5106732 5241211 5360075 5547381 5671323
6579 5671323 5753364 5728607 5779393 5681933 5509090 5379185 5165597 4948055 4754870 4622634
6569 4622634 4453952 4433328 4565627 4766192 4825116 4844075 4739289 4676165 4679109 4858485 5036259
6558 5036259 4986167 4938248 4614237 4275905 4091874 3897884 3679046 3559902 3327009 3208240
6548 3208240 3066653 3097720 3053429 3109804 3236067 3424441 3498081 3605017 3692833 3702755 3716820
6537 3716820 3807678 3776167 3819057 3931543 3975856 3959538 3975322 3804715 3583867 3541049 3372312
6526 3372312 3232760 3035572 2786786 2649398 2483297 2454110 2472367 2343539 2285496 2259141
6516 2259141 2265644 2192218 2169795 2128797 2078408 2103640 1977795 1964485 2005764 1942177 1902712
6505 1902712 1839698 1948329 1939567 1967815 1936752 1903644 1872287 1845444 1908611 1850340 1909440
6494 1909440 1991785 1895584 2006349 2111250 2171554 2053431 1951963 2010840 1830587 1772839
6484 1772839 1738411 1693863 1561048 1441551 1463124 1445246 1563533 1507007 1449368 1476081 1492802
6473 1492802 1500950 1439190 1384000 1424092 1450192 1461500 1474287 1414123 1399109 1387316 1511123
6462 1511123 1620993 1650310 1754264 1643141 1514624 1478096 1449816 1395458 1504869 1420982
6452 1420982 1381915 1368646 1318747 1399344 1395637 1340298 1342353 1369869 1356992 1336984 1221128 1382267
6440 1382267 1417084 1438505 1464938 1363350 1384071 1449668 1498028 1592770 1603932 1690963 1598739
6429 1598739 1644177 1760620 1720464 1820778 1848141 1897911 1859241 1952542 1973977 2002494 2049937
6418 2049937 2143915 2244841 2329653 2363636 2388229 2443730 2549472 2550222 2765262 2854403 2925844
6407 2925844 3014183 3195708 3495455 3663728 3856557 4147561 4386544 4559215 4819066 5111787
6397 5111787 5266408 5344912 5529080 5674852 5853909 5960282 6073317 6252813 6417514 6523866
6387 6523866 6746921 7013915 7433821 7647904 8156431 8624932 9156938 9855786 10501096 11055516
6377 11055516 11427274 11798218 12164575 12647425 13399604 14085962 14621475 15293520 16316566
6368 16316566 17781416 19458659 21158121 22026201 21974492 21547664 21198454 21406910 22154976
6359 22154976 22305933 21367343 19819690 18327428 17250268 16532898 16104680 15554643 14931065
6350 14931065 14552636 14313837 14331005 14443826 14588675 14776740 14918731 15498219 16312999 17137551
6340 17137551 17648176 18041450 18279332 18082007 17775985 17792843 17999401 17618968 16431581
6331 16431581 14864649 13188130 11741317 10627097 9723181 9055974 8326720 7614739 7274118
6322 7274118 6834320 6370366 6067059 5687230 5270813 4907689 4523891 4229417 3928063 3841093
6312 3841093 3681855 3541528 3436371 3310034 3130925 2932289 2847245 2686235 2622865 2567039
6302 2567039 2489405 2378793 2295582 2173325 2134844 2048873 1925075 1915731 1755108 1670914 1685228
6291 1685228 1698388 1597278 1550900 1387576 1449880 1383855 1268635 1258690 1235131 1241160 1216918
6280 1216918 1238731 1087851 1165249 1232130 1165176 1198611 1144632 1070498 1080634 917337 845179
6269 845179 725572 877546 875166 814989 804328 811078 681084 799506 744465 687686 692677
6258 692677 658197 602123 503714 544034 673089 603031 531939 633739 542741 447855 476995
6247 476995 407246 443741 438778 407789 490224 414805 466353 418586 354623 363630 384898 403691
6235 403691 238958 335520 360276 285942 224123 253762 349271 226353 267233 434559 441009
6224 441009 305886 266436 275316 424333 312661 246054 292801 179710 195780 254420 235011
6213 235011 125469 141771 239172 261314 229448 254009 349709 372087 240269 218810 231926
6202 231926 149646 122281 206660 214939 206879 280958 252078 218864 186530 254322 162656 173968
6190 173968 234269 230543 123316 114429 102853 104433 123443 34478 131174 211067 79539 125910
6178 125910 190038 148225 217032 167530 93138 53812 99357 92341 111574 139645 126063 149029
6166 149029 98514 93460 52396 -21766 -22868 42172 71529 110094 68644 173046 149961 3476
6154 3476 70517 26627 49630 132060 179869 57684 -3280 18586 -54886 6563 -42341 10792
6142 10792 82383 80071 114249 50337 -2838 42223 179556 127825 88010 126087 150293 168074
6130 168074 137019 94286 125048 45537 78576 161630 83017 139273 82985 100148 102640 107463
6118 107463 167153 191028 163310 117948 90992 74217 -14378 34620 51383 72804 132628 114933
6106 114933 110647 155793 126146 162369 120276 125733 118400 141919 185590 71704 73484 69144
6094 69144 127786 105359 149765 107564 105043 110632 199639 207541 229624 150547 66011 81355
6082 81355 -15153 149660 132627 12641 49922 91661 201492 219051 136195 58973 108506
6071 108506 84408 140113 122063 134316 71392 124094 169998 181961 177907 233611 192635 128903
6059 128903 107920 19879 124790 199561 197679 202115 80984 41972 86530 35178 120100 79193
6047 79193 109141 104807 130475 134947 127910 17171 22535 -20235 90179 44653 -9065 -24414
6035 -24414 57737 84271 65797 16537 52660 98243 118233 79806 107745 111571 68714 131320
6023 131320 54843 49432 49831 154430 98182 43138 87748 50849 73369 74383 129268 72998
6011 72998 63474 84305 86281 131583 21726 95838 53269 37955 36937 -89541 -78541 -17238
5999 -17238 52192 13050 7387 -7473 -63362 55332 -31552 -44635 -80338 -98680 -144169 -78032
5987 -78032 -94860 -66801 -97855 -137391 -96405 -37237 -96953 40279 55142 59325 20258 -42366
5975 -42366 -53006 -46479 -45042 -19711 -49908 -60513 -37502 -21422 -12310 3940 -21182 -68879
5963 -68879 -6788 -30383 16537 11163 12908 19238 50708 29534 -2459 -62302 -48431 30161
5951 30161 6349 -17055 -71805 -34935 18515 -61822 -12793 27919 -30228 17014 -2170 -53368
5939 -53368 -106163 -206352 -42230 5992 -28048 -43581 -64890 -55745 -26357 -90905 -73477 -56713
5927 -56713 -561 -2275 -45587 -19093 -11150 9630 -46234 43500 -33765 10212 -43812 -195010
5915 -195010 -154578 18172 -21895 -152684 -139530 -130093 9201 -95200 -152118 -155778 -134869
5904 -134869 -46802 -87525 -127948 -20440 -33884 39184 36424 -29816 -140517 -87293 -165392
5893 -165392 -204523 -77183 35932 -64829 -27330 -24079 -23689 -39318 -13154 -68066 -105640 38908
5881 38908 56833 478 -77211 -76358 5566 -26763 -83313 -50967 -104080 -117120 -73539 -64451
5869 -64451 -24954 -17736 6427 -75525 -122028 -64564 -17237 -87042 -200174 -77663 -39657 -44282
5857 -44282 -28236 -51559 -134483 -173317 -120531 -108241 -107729 -111215 -107703 -39491 -22636 13816 16851
5844 16851 -2370 -55444 -29611 -9101 -80540 -117674 -85435 -6240 110243 9058 -120935
5833 -120935 -47605 34754 12734 -4547 -42791 19677 -94969 -125537 -54747 -10629 -35461
5822 -35461 -89837 -120196 -69683 -107129 -75040 -74751 -97437 -102059 -7291 39608 -38321 -148816
5810 -148816 -180782 -210084 -137621 -21338 -51006 -94737 -111138 -104809 -124384 -52925 -80901 -106993
5798 -106993 8325 -3028 -17840 -87471 -61117 28659 1652 -60325 -130440 -139614 -82759 -62356
5786 -62356 -40194 -90837 -7611 -83914 -72369 -65687 -108290 -15995 -90722 -153049 -117508 35501
5774 35501 20946 104171 -2622 -14838 -34984 -62366 -17723 8035 25803 10846 111675
5763 111675 38107 -72121 -111435 -115891 -27557 -86029 -70330 -85326 -113931 -84319 -72069 -87390
5751 -87390 -32794 -11567 24203 5995 8535 -65668 -10201 -84246 -119956 -47355 -83567 -116415
5739 -116415 -117339 -49045 57812 5389 27443 -23432 25002 72438 107567 6549 -118532
5728 -118532 -42097 -39577 -29929 -23387 9982 3756 -65296 26924 2104 -66089 -31760 -92431
5716 -92431 -56282 -21271 67580 47444 7952 -20084 -47848 -23761 -84809 -120263 -23627 -49922
5704 -49922 -20365 -29393 -48573 -3104 -28071 -53468 -30234 -82916 64654 137474 124286 8338
5692 8338 86918 49823 49312 -9639 -42842 -6544 -27310 18751 67635 106584 -29643 -20931
5680 -20931 71622 11040 38861 -16378 -23701 49123 55512 86062 177557 172617 72632 58518
5668 58518 83288 137620 55740 67286 143991 86269 88200 110862 172573 152191 41776 59635
5656 59635 57410 47741 8626 -3071 8033 48878 33566 -61339 -39583 -86107 -82972 -135565
5644 -135565 -34507 -65306 -25031 42171 47469 34044 113384 140853 139417 116854 40297 144046
5632 144046 96716 29782 92243 200546 115446 115303 122319 114853 149249 97235 80253 195695
5620 195695 219955 223951 176700 245134 236820 231933 132494 219778 195570 162804 112280 -1990
5608 -1990 -38510 29431 30287 66521 -4433 113365 121871 19988 169468 124403 110556 221367
5596 221367 254232 97725 159403 254665 165093 286764 282944 210409 285034 281859 176656
5585 176656 179336 67888 42292 63640 105631 72423 79815 119395 156222 66635 63260 138683
5573 138683 46252 123433 90883 105608 107669 41777 97416 86422 24815 -6496 52934 76073
5561 76073 -13587 84561 49300 -14231 -56276 -42136 -7473 -50747 -85227 58957 30600 59182
5549 59182 107430 147239 171807 100751 40975 116969 59720 27147 13886 -45004 -16811 -25171
5537 -25171 -30306 -59336 -80205 24264 2925 -9580 -67735 10382 -43369 -79731 -128761 -156212
5525 -156212 22346 -21011 -51124 1499 -33725 -44916 36091 -19262 -482 53369 -43058
5514 -43058 24220 78283 22663 7048 -27404 -37386 -112561 78951 84679 47588 14987 78836
5502 78836 19114 -52044 -65788 -86888 -20369 -59881 -94439 -121675 -115595 -25475 -85951 -76563
5490 -76563 -55806 -77115 -78045 -89219 -33295 -50715 -4634 18573 -37579 -57207 -72778 -62853
5478 -62853 -91485 -152316 -103735 -110089 -87127 -42830 18976 6643 45 -122763 -193023 -145617
5466 -145617 -98379 -54182 -89389 -127530 -23757 16317 25719 6949 54394 2395 -23336 -108252
5454 -108252 -8009 -36119 -54570 -104988 -94291 -79994 -72392 -86556 -49449 7909 -27460 31112
5442 31112 26881 -33993 -26558 -7624 840 54071 -31679 -14273 -42093 -49229 -65229 -25085 88079
5429 88079 -18575 -18308 78184 101688 4520 8821 -27353 35523 122051 -70375 112653 5140
5417 5140 -11118 104044 65729 3550 13613 -31204 -11193 2350 6313 1017 28109 3418
5405 3418 53076 34352 -10280 -73886 -36253 9045 30437 65006 -18416 -20908 2493 -33970
5393 -33970 1616 3802 23374 24982 72704 20621 -16814 76865 -18426 -50945 68915 75365
5381 75365 120234 -19643 31241 39035 -8329 32156 18405 59103 63138 74820 6168 98987
5369 98987 24033 3756 81459 51138 27258 35240 -53716 -118511 -401 25773 -1842 17895
5357 17895 -23190 -19539 33888 25237 111612 101510 124975 189392 203230 186064 170698 57196
5345 57196 35415 84921 24836 -22197 2583 13510 60870 139540 194175 94607 -17498 101691
5333 101691 60023 77884 89231 134300 87781 76185 62560 130869 116126 136381 66196 95859
5321 95859 83989 151983 83853 84972 38548 19487 83455 72329 86454 111320 185387 196485
5309 196485 158314 132834 135071 138908 77523 38127 60771 144877 167527 106292 173053 150761
5297 150761 126375 177409 48355 63623 121335 86472 194378 175014 188688 70168 59462
5286 59462 108802 87313 127662 44550 52926 82845 45592 105773 57651 76135 121036 72776
5274 72776 156026 198723 116174 218563 172268 124688 91005 -2483 111322 48894 -18131
5263 -18131 89492 106043 72436 22711 14011 14170 47238 137562 187604 49373 12803 36806
5251 36806 90787 94515 57687 77797 75145 35486 162800 93311 60081 153957 220113 153650
5239 153650 96229 150808 78647 204749 138804 66613 135140 139524 109173 111734 139949 165792
5227 165792 204951 259569 195723 288158 265315 165995 125592 236672 230274 236243 254586 283739
5215 283739 229819 163438 227937 262360 311980 249846 235586 148401 171815 185313 190912 147742
5203 147742 203169 212159 139389 249655 203798 178944 250129 216072 162774 145471 161123 215155
5191 215155 187610 179836 262971 248841 184221 213347 276714 294922 218164 188867 386546 409518
5179 409518 304141 192237 281006 260314 411763 428147 368994 394750 412086 341072 485810
5168 485810 510024 553774 533191 518822 563887 531472 489537 494150 529755 496144 570826 535521
5156 535521 548559 586357 543870 534252 574210 542545 512021 501759 645673 725039 657648 695526
5144 695526 621601 570189 621377 602495 653145 629053 693001 714684 690673 643886 769641
5133 769641 770729 769887 776007 788736 805211 830208 868227 820842 780704 822841 727236 826374
5121 826374 803542 793534 768010 746101 748861 724249 830703 763220 816916 741637 740180 818572
5109 818572 762911 780468 927685 1031049 972763 917534 877197 893423 830191 763204 716836
5098 716836 726839 796781 858888 766307 775696 788256 890921 899377 813606 824471 798923 798051
5086 798051 846511 815006 871871 821623 846976 838686 888701 848781 813286 799907 826947 876867
5074 876867 885628 859291 819397 832110 799197 922700 903531 884393 791082 777779 745184 836804
5062 836804 857908 847547 839022 961092 921993 902497 888003 944037 1077781 1106592 1064180
5051 1064180 1022751 1013349 990618 1101428 1120196 1048792 1098473 1213673 1212901 1169431 1241261 1332253
5039 1332253 1315486 1239637 1209168 1225462 1272506 1313309 1414195 1356337 1355591 1441523 1371539 1419979
5027 1419979 1474067 1546686 1463317 1467210 1507444 1412311 1553065 1574633 1597025 1563412 1678122
5016 1678122 1724272 1717392 1674528 1773946 1791479 1783949 1754588 1763634 1895390 1936739 1977895 1877946
5004 1877946 1885056 1974386 2055418 2103583 2016802 2021075 2076662 2106412 2049222 2172737 2305036
4993 2305036 2244320 2236517 2275393 2376639 2463254 2501680 2561583 2657443 2674265 2681900 2738021 2794460
4981 2794460 2849993 2964442 3038563 3168297 3225516 3239093 3417839 3461203 3623978 3722724 3854672
4970 3854672 4031430 4045739 4129207 4338730 4405577 4496359 4671039 4774899 4950403 5047726
4960 5047726 5310507 5514080 5753758 5972200 6207229 6509689 6756420 6914227 7282101 7640726
4950 7640726 7949283 8307086 8661283 9093300 9583974 10135671 10640400 11132974 11771322 12411655
4940 12411655 13040196 13558194 14044088 14495360 14944594 15113105 15283956 15442894 15802990
4931 15802990 16045594 16353597 16856891 17360954 17930164 18678611 19510218 20289767 21283142
4922 21283142 22413338 23670133 24832358 26014166 27179791 28045759 28639143 28952657 28846472
4913 28846472 28623629 28577563 28549422 28813114 29309149 30015610 31027559 32228131 33664401
4904 33664401 35342202 37368342 39825131 42566183 45684020 48556830 50908464 52199494
4896 52199494 52437796 51460063 49802798 48069620 46301081 45060434 44319076 44161890 44488031
4887 44488031 45382320 46775791 48444662 50722951 53581399 56890944 60968513 65651739
4879 65651739 71007316 76475397 80870380 83139464 82635072 78934898 73276684 67022629
4871 67022629 61460493 56887525 53517405 50892257 49054059 47879393 47210531 47163213 47613020
4862 47613020 48489156 49933556 51967774 54702624 57880923 60867953 62643137 62688900 60899306
4853 60899306 57702805 53645368 49526839 45656906 41907585 38599640 35833728 33514290
4845 33514290 31497020 29946905 28594596 27622878 26799188 26242339 26225806 26431622 26981843
4836 26981843 27292464 26634472 25499808 24070289 23091731 22253046 21438208 20454959 19546186
4827 19546186 18826242 18105804 17602533 17218483 16878881 16812665 16748065 16838642 17199736 17855110
4817 17855110 18878018 20137221 20721764 19653431 17877426 16083520 14692497 13733406
4809 13733406 13036739 12528292 12135651 11756297 11596527 11468455 11460458 11542756 11576145 11713440
4799 11713440 12167193 12621620 13456528 14416614 15504754 15868801 15164499 13827691 12612938
4790 12612938 11765702 11177814 10774726 10472021 10170679 10040326 10152948 10034771 9936246 9969511
4780 9969511 10148989 10255077 10426369 10676939 11084213 11530322 12022101 12138406 11963427 11580334
4770 11580334 11208077 10986899 10850111 10835958 10927239 11094010 11323440 11569375 11872263 12107577
4760 12107577 12296909 12675670 12992394 13411017 14134462 14753243 15524580 16306068 16999105
4751 16999105 17743712 18461555 19331483 20042912 20650640 20983103 21204400 21104218 20865378
4742 20865378 20721070 20750927 20893446 21098066 21425943 21923560 22591604 23249127 24139705 25020626
4732 25020626 25861195 26964424 28115094 29288385 30524999 31273138 31519006 31202272 30592265
4723 30592265 30020639 29489345 28959358 28634478 28438265 28579038 28806560 29308945 30137390
4714 30137390 31028511 32221538 33479956 34551513 35926506 37128127 38251509 39242408
4706 39242408 40196751 41194711 42381929 43855112 45894627 48603328 51915198 55740716
4698 55740716 59533586 62376102 63422437 62326761 59872218 57113989 54680122 52969402
4690 52969402 52014773 51350442 50776039 50429487 50214193 50332201 51061325 52372591 54427850
4681 54427850 57593198 61943031 67659784 74332935 80261815 82949904 81607621 76897844
4673 76897844 70597833 64093464 58032234 53009160 49048833 45895148 43419096 41293480
4665 41293480 39782405 38570805 37616111 37016458 36871004 37183132 37996213 39242618 40831327
4656 40831327 42117352 42548345 41775539 39755183 36927837 33742519 30793617 28093245
4648 28093245 25944259 24168894 22761293 21764844 20900435 20203708 19618148 18976106 18257836
4639 18257836 17632712 17056452 16474829 16191679 15996898 15945258 15816569 15684480 15704183 15764231
4629 15764231 15731366 15693362 15897326 16113071 16395496 16472333 16211688 15694772 15207851 14710716
4619 14710716 14467921 14309718 14029881 13915297 14045623 14074098 14294817 14684135 15022289 15345018
4609 15345018 15514303 15757382 15904532 16077425 16434309 16950614 17872301 19004670 20547554
4600 20547554 21555262 21304102 20469871 19436396 18903319 18701360 18665293 18886978 19230558
4591 19230558 19691157 20321198 21141996 22057792 23249276 24495449 25676315 26744527 27530868
4582 27530868 28155052 28730282 29535733 30777685 32099869 34072007 35282987 35063497 34630509
4573 34630509 34274770 34493032 35305103 36465282 38062553 39685984 41384492 42776183 43804478
4564 43804478 44767953 45626614 46328631 47363481 49046001 51294898 54362068 58018452 61766669
4555 61766669 64707377 65967040 65534106 63908737 61907253 60206519 59065898 58432271
4547 58432271 58203067 58222973 58224928 58693023 60029310 62304276 65538043 69788279 74399025
4538 74399025 78020948 79482415 78683658 75912271 71577522 66197486 60799915 56046317
4530 56046317 52452775 49824525 47981231 46924288 46259564 45730126 45704890 46282036 47528257
4521 47528257 49331130 50903973 51455993 50108757 46718684 42296214 37722777 33595919
4513 33595919 30305448 27521362 25069730 23044152 21270931 19918847 18671747 17432353
4505 17432353 16330256 15450765 14754351 14082587 13399272 12780091 12283865 11714708 11095911
4496 11095911 10569666 10144537 9763272 9523910 9093966 8700292 8365222 8174540 7976540
4487 7976540 7672481 7533782 7351657 7124027 6981721 6901112 6741270 6559820 6460553 6348533
4477 6348533 6277555 6134506 5947936 5899792 5848614 5668388 5469599 5401670 5331486 5242970 5201359
4466 5201359 5226525 5139651 5069478 4967501 4999722 4943758 4939762 4954907 5001950 4902708 4882998
4455 4882998 4843031 4837373 4740531 4768039 4767109 4837790 4835050 4833489 4809538 4893010 4915531 4965381
4443 4965381 5048772 5183286 5317983 5300961 5421099 5582237 5704899 5853341 5955435 6067528
4433 6067528 6143184 6147406 6163651 6230481 6345292 6511419 6628862 6817141 7016691 7130906
4423 7130906 7320780 7556731 7788518 8078739 8402589 8998553 9684047 10508005 11533164
4414 11533164 12522779 13640175 15258701 17147393 19807453 23445114 28638171 33455934
4406 33455934 32525510 28392769 22959133 18681514 15798949 13684132 12049968 10776835
4398 10776835 9701144 9011036 8393447 7857848 7280337 6743352 6475900 6060608 5868428
4389 5868428 5678366 5510525 5227541 5042683 4899411 4710854 4640486 4435963 4261670 4150114
4379 4150114 4068167 3960622 3919434 3866626 3740611 3722814 3713443 3651642 3572615 3540939 3574840
4368 3574840 3577033 3582572 3605125 3622003 3638112 3596286 3680884 3889517 3975426 3986894 4085530 4256232
4356 4256232 4474881 4765560 4969358 5310919 5878215 6345724 6638534 6576612 6274912 5841240
4346 5841240 5455244 5232773 5077765 4943645 4925719 4915240 4846431 4919153 5038377 5226550
4336 5226550 5440218 5705098 6057414 6469655 6975603 7516626 8294848 9446689 10825754
4327 10825754 12313336 13437576 13379717 12381066 10864847 9483314 8436517 7666764 7154690
4318 7154690 6813469 6447658 6293742 6131050 6130876 6098021 6290292 6442407 6787294 6998107
4308 6998107 7225008 7824397 8530659 9446496 10757112 12284769 13454494 13602935 12769580
4299 12769580 11313112 9843448 8660695 7861185 7170722 6669511 6268722 5845638 5460427
4290 5460427 5221620 5078212 4905975 4829835 4757521 4801897 4819486 4946094 5153447 5453472
4280 5453472 5818391 6351191 6753311 6924497 6713082 6238960 5879618 5494278 5390550 5218729
4270 5218729 5177593 4969542 4549723 4357901 4191414 3859446 3720036 3603418 3500651 3399903
4260 3399903 3351862 3284203 3298497 3324877 3232336 3372670 3478726 3610518 3754771 3957034
4250 3957034 4219676 4413398 4611523 4859511 4983699 5024423 5077411 4854308 4617078 4420928
4240 4420928 4237982 4171958 3991979 3915680 3719780 3610021 3483183 3442675 3415911 3359030
4230 3359030 3373333 3428304 3542311 3645775 3697266 3915339 4013882 4306475 4602671 4959022
4220 4959022 5276092 5455747 5577770 5699685 5761335 5931892 6040111 5830447 5474821 4954360
4210 4954360 4532271 4214487 3854439 3635558 3532266 3294304 3162077 3014170 2994571 2891758
4200 2891758 2863476 2857478 2763982 2843694 2864563 2797854 2905172 2748749 2698474 2757945 2574764
4189 2574764 2540387 2404013 2429931 2355648 2281283 2141229 2116243 2034435 2062408 2036733 1925940
4178 1925940 2010294 2092750 2017478 1959579 2054460 2129853 2127034 2120862 2154540 2195817 2154133 2271959
4166 2271959 2491244 2514706 2499232 2419857 2317468 2212623 2189077 2169345 2140837 2177171 2180722
4155 2180722 2111042 2228083 2146594 2136793 2215732 2208771 2225003 2244367 2291003 2417225 2423793 2395156
4143 2395156 2508396 2523407 2545390 2589134 2705493 2760776 2729924 2726366 2760715 2839576 2950590
4132 2950590 3087351 3220127 3265766 3396323 3530401 3531856 3598882 3798576 3841994 4032282
4122 4032282 4196936 4360035 4557827 4692079 5083109 5206314 5298527 5459322 5781599 6165797
4112 6165797 6483394 7119111 7748193 8375205 9056708 9320350 9066309 8418632 7826721 7213098
4102 7213098 6694957 6440167 6268564 6177248 6148724 6143905 6198702 6259524 6218451 6343942 6372171
4091 6372171 6584035 6700662 6814917 7000752 7207666 7382933 7682561 7921310 8241404 8580784
4081 8580784 8846355 9179833 9433860 9835197 10296411 10750973 11294263 12049549 12799902 13487975
4071 13487975 14441194 15807612 17271417 18935889 20905058 23027425 25716518 29212288
4063 29212288 33699909 40052459 48018084 57486548 60994917 56132702 47643457 38981504
4055 38981504 32804385 28272646 24853714 22055746 20006970 18352354 16916610 15875299
4047 15875299 15058228 14281292 13607167 13062122 12650571 12472217 12249066 12186017 12119340 12037474
4037 12037474 12055741 12067255 12125328 12275802 12521225 12899251 13126985 13442268 13873412 14252919
4027 14252919 14466725 15133866 15640897 15902656 16320224 16900208 17645520 18435379 19409010
4018 19409010 20690948 22119152 23310716 24549497 25882151 27589445 29819001 32553993
4010 32553993 36344454 41195213 47413882 52014097 51750644 48449340 44385706 41020848
4002 41020848 38573533 36877144 35568480 34968211 34647259 34734079 35154497 35908232 36983599
3993 36983599 38489940 40234872 42495925 45158562 48042684 51408409 54959569 58507769
3985 58507769 62041385 65104702 66897562 66792544 64720241 61782090 58987508 56793478
3977 56793478 55404944 54910841 54905554 55316671 56200517 57721874 60034217 63136321 67033401
3968 67033401 71200270 75148163 78119291 79403758 78725820 75699341 70564435 64608585
3960 64608585 58739098 53811941 50171731 47217706 45132449 43768434 42572098 41641673
3952 41641673 41315935 41631645 42462445 43609884 44911093 45469667 44351150 41613928 37884976
3943 37884976 33911772 30431659 27360358 24833233 22660769 20715776 19055146 17681421
3935 17681421 16628785 15635238 14688946 13861681 13121148 12328855 11730958 11261788 10764386
3926 10764386 10204833 9909619 9535077 9098599 8755799 8635389 8408843 7972620 7711647
3917 7711647 7594857 7474913 7176930 6985773 6762371 6650811 6498105 6348157 6186672 6141647
3907 6141647 6149660 6087757 5916540 5835276 5807643 5804861 5865443 5981198 6068751 6152651 6269480
3896 6269480 6207415 6151894 6074031 5937037 5842432 5716592 5649082 5565821 5525558 5563622 5585664
3885 5585664 5603024 5575507 5632228 5680962 5715485 5706027 5676616 5624122 5489756 5268751 5244128
3874 5244128 5089043 5003844 4841577 4709308 4684944 4541411 4474499 4423415 4438518 4477834 4553239
3863 4553239 4483994 4371476 4139418 3851093 3773620 3526318 3458456 3257950 3248904 3223772 3077924
3852 3077924 3052810 3036153 2937066 2807715 2773197 2709546 2576634 2505628 2458098 2437417 2475947
3841 2475947 2417812 2438206 2392293 2382232 2361211 2320853 2321242 2295195 2280394 2162334 2119265 2252243
3829 2252243 2190935 2202558 2209243 2174260 2238319 2206831 2188871 2223731 2207333 2250548 2221491 2128338
3817 2128338 2052351 1996052 1923897 1919437 1905199 1873019 1959828 1851744 1886253 1895830 1798893 1816465
3805 1816465 1798194 1707780 1651622 1701015 1722940 1740115 1774598 1815998 1759717 1746013 1685301
3794 1685301 1720588 1679348 1616034 1683231 1721285 1762463 1782449 1718206 1718274 1785309 1852048 1914127
3782 1914127 1774323 1843430 1901487 1817879 1933183 1911708 1933570 1904513 2030395 2060794 2064051
3771 2064051 1972028 2017647 1977744 1904138 1955952 2001604 2006282 1961143 1974576 2126464 2127103 2117489
3759 2117489 2142544 2129103 2085576 2098956 2209380 2263007 2228218 2150789 2227173 2339332 2298092
3748 2298092 2204079 2300346 2294092 2314639 2322968 2366186 2459601 2496984 2484045 2566966 2622340 2582907
3736 2582907 2585220 2578791 2539551 2644651 2694379 2531065 2454579 2483800 2517728 2607842 2607049 2659486
3724 2659486 2771586 2833307 2856887 2847543 2787788 2893379 2919098 2923298 2924356 2935294 2891500 2859356
3712 2859356 2879631 2843299 2981373 2912569 2845932 2888660 2885685 2891078 2864591 2917197 2840474 2797238
3700 2797238 2970866 2941563 2815054 2875783 2946761 2928789 2832164 2793370 2887401 2932486 2996445
3689 2996445 3075481 3015168 3017321 3095020 3053040 2984493 2977539 2992760 3031013 3147427 3122621 3070182
3677 3070182 3110220 3201863 3270993 3349727 3299990 3298251 3348137 3304427 3330405 3336759 3368726 3434900
3665 3434900 3502143 3543774 3539628 3574591 3678455 3667884 3849527 3781491 3781013 3759916 3826874 3948491
3653 3948491 4022374 4224842 4190079 4237821 4227674 4306345 4384297 4451420 4492310 4512602 4519593
3642 4519593 4483781 4571992 4668367 4707374 4718961 4821916 4972311 5060662 5111097 5235590 5278497
3631 5278497 5336491 5394592 5359793 5517551 5584802 5592286 5668666 5728020 5924673 5994106 6109477
3620 6109477 6192541 6220455 6339033 6559939 6658554 6759776 6850882 6923772 6998859 7151157 7232194
3609 7232194 7369335 7544986 7683262 7836548 7862489 8067154 8136516 8268701 8442649 8670085
3599 8670085 8841742 9004776 9231989 9339423 9448228 9656078 9954490 10115694 10266179 10448870
3589 10448870 10663362 10866885 10958128 11110436 11289081 11461466 11803279 11987802 12165653 12409546
3579 12409546 12720931 12941401 13214785 13579836 13889375 14072340 14416000 14840941 15219443
3570 15219443 15614609 15940670 16261790 16740048 17202250 17631065 18096861 18398136 18733663
3561 18733663 19171947 19686713 20116160 20659640 21253317 21715966 22268515 22921690 23663858
3552 23663858 24260514 24835399 25465641 26184480 26886284 27664466 28507730 29301857 30235184
3543 30235184 31106258 32009373 32883250 33955432 35067488 36108933 37190243 38360427 39564526
3534 39564526 40942090 42181580 43675588 45189547 46691936 48355279 50017441 51718615
3526 51718615 53535245 55451575 57495099 59575842 61803851 64140926 66666014 69064513
3518 69064513 71635342 74523538 77434002 80546613 83731401 86894946 90161138 93349773
3510 93349773 96698279 100192289 103611087 107071533 110609477 114104611 117454051 120824827
3502 120824827 124122764 127141905 130061034 132794654 135006101 137117373 138933874 140426491
3494 140426491 141828352 142906860 143569187 143927223 143936138 143284761 142109635 140483153 138558142
3485 138558142 136477867 134053902 131488908 128552955 125436238 122161224 118395686 114526785
3477 114526785 110475904 106220480 101970289 97676190 93448862 89386076 85205655 81166046
3469 81166046 77320183 73563597 69754129 66155447 62677365 59326846 56324757 53419585
3461 53419585 50656518 48132564 45719711 43501792 41339901 39372519 37624995 35926118
3453 35926118 34364842 32886912 31500485 30270050 29078202 27966227 27030820 26038640
3445 26038640 25201221 24504102 23839554 23177264 22503757 21783449 21199258 20656477 20274563
3436 20274563 19765169 19270258 18872761 18480956 18203725 17894166 17523706 17206201 16926924
3427 16926924 16663689 16293191 16074435 15810698 15619199 15413193 15139879 14970925 14862307
3418 14862307 14666480 14542792 14542443 14368776 14276512 14217166 13989851 13875682 13909559 13836727 13748391
3407 13748391 13654472 13494136 13455092 13419926 13263798 13048576 12900467 12791263 12459908 12331960
3397 12331960 12212159 11998272 11896287 11668136 11556780 11333085 11139166 10966291 10772453
3388 10772453 10701051 10616569 10521945 10286157 10088229 10072274 10095146 10068677 9946247 9948829 9920317
3377 9920317 9964383 10067220 9954775 9869711 9917208 9877042 9865057 9843081 9799852 9757981 9844203
3366 9844203 9790503 9781669 9771753 9737335 9746186 9784993 9683729 9559788 9629232 9685122 9693058 9720125
3354 9720125 9671161 9606931 9659235 9582044 9583054 9693203 9706146 9798001 9884892 9862878 9830600
3343 9830600 9902340 9969533 9976377 10052723 10098146 10208853 10270062 10284080 10365296 10339772 10424153
3332 10424153 10502852 10656336 10872492 10972154 11225888 11371249 11581694 11769093 11992519 12257781
3322 12257781 12387357 12550499 12692255 12915658 13078730 13201635 13468446 13565533 13699849 13740752
3312 13740752 13942521 14139508 14337524 14611939 14605434 14704360 14982633 15129954 15240603 15438821
3302 15438821 15660598 15955958 16259363 16514848 16842510 17225478 17554827 17841690 18117063
3293 18117063 18553412 18990594 19238565 19581118 20007321 20404586 20790019 21291486 21756227
3284 21756227 22204359 22629996 23082529 23577582 24195443 24734167 25365566 26036168 26626447
3275 26626447 27469621 28227219 29060314 30016899 30984351 32107004 33183747 34423760 35713181
3266 35713181 37205855 38805934 40421913 42115886 43944825 45718915 47586304 49390179
3258 49390179 51099612 52861076 54598850 56370369 58109941 59944405 61691823 63426562
3250 63426562 65163766 66741440 68203150 69572503 70743148 72004388 73400423 74783618
3242 74783618 76292157 77841230 79361998 80933385 82452627 84018009 85726698 87482946
3234 87482946 89578037 91901076 94645247 97571365 100919745 104648023 108744498 113278239
3226 113278239 118202863 123588338 129443355 135957651 143130569 150764520 158952206 167459902
3218 167459902 176270503 185330673 194603529 204140043 213964801 224321331 234896267 246139590
3210 246139590 257850053 270016938 282436506 295077445 308129786 321476195 335036771
3203 335036771 348633485 362129132 375100187 387920746 400455313 413191865 426336482
3196 426336482 440406765 454679665 468327646 479730338 487436809 490428205 488369252
3189 488369252 481878707 471957946 460437387 448203198 435968170 423895446 411603574
3182 411603574 397919808 381922326 362708466 340623842 316370646 291382661 266942983
3175 266942983 244043971 223045530 204240039 187603624 173080689 160110685 148926171
3168 148926171 139200275 130671558 123283960 116758142 111100136 106313695 101989587 98272013
3160 98272013 95010884 91976171 89208495 86696563 84460043 82409689 80545379 78759440
3152 78759440 77247878 75780228 74410745 73001331 71468731 69908332 68117994 66388197
3144 66388197 64541250 62590914 60655761 58836054 56946022 55088563 53415419 51616114
3136 51616114 49719437 47919320 46109336 44293305 42485788 40896507 39385630 37846183
3128 37846183 36483168 35102632 33767596 32542060 31364438 30347400 29298265 28385365
3120 28385365 27517855 26773384 26086778 25384579 24790700 24268377 23656798 23138140 22472670
3111 22472670 22016057 21556157 20920715 20563160 20233923 19750840 19337470 18848746 18454198
3102 18454198 18072957 17675090 17290996 16921438 16728707 16330256 16049041 15837836 15552933
3093 15552933 15411700 15145415 14881260 14716591 14490951 14330561 14139822 13990915 13922949 13709033
3083 13709033 13564757 13447922 13319852 13212683 13110358 13116103 13011229 12920996 12827904 12781902
3073 12781902 12678896 12659052 12653278 12698995 12654297 12589376 12582278 12571480 12489795 12422853 12505100
3062 12505100 12509185 12410226 12405597 12477120 12477477 12542710 12528557 12589340 12711974 12803722 12814380 12902484
3050 12902484 13083991 13194983 13378066 13499288 13655742 13758271 13845940 13731793 13707480 13860412
3040 13860412 13856163 13858513 13940257 13950773 14042657 14062680 14239818 14376071 14492001 14671156 14872664
3029 14872664 15039788 15232335 15391794 15694748 15999622 16293159 16617821 17072645 17220057
3020 17220057 17474292 17839381 18011505 18158646 18429585 18663893 18900178 19133891 19437640
3011 19437640 19690680 20035004 20358322 20717071 21076943 21423939 21871366 22382543 22697092
3002 22697092 23231140 23767418 24420151 24985775 25659241 26266854 26957869 27725868 28393139
2993 28393139 29203484 29847808 30397075 31060528 31536882 32105352 32823211 33516326 34214231
2984 34214231 35083787 35973755 36859208 37817513 38853253 39969293 41060941 42240008 43567797
2975 43567797 45001011 46452710 48106575 49866899 51808267 53966881 56273040 58811042
2967 58811042 61365017 64111826 67194582 70406384 73950896 77839388 81819658 85812117
2959 85812117 89476063 92394868 93982120 94217426 92731594 89912683 86693439 83528231
2951 83528231 80706112 78415233 76514019 75186341 74349143 73989691 73936496 74110923 74631375
2942 74631375 74496585 73335763 72122056 71624147 71859331 72755570 73677375 73837469 72985964
2933 72985964 71533973 70287018 69711172 69437247 69162966 69570153 70365486 71839298 74100423
2924 74100423 77197182 81153806 85749744 91233816 98877779 108716671 119293320 130848848
2916 130848848 147289025 163975873 161848317 148911970 133134420 120255920 110164974
2909 110164974 101209198 93679275 87923457 83814094 81286356 80268168 80363531 80888642
2901 80888642 82006573 84059855 88504374 95054389 105642351 118284722 136422729 149123580
2893 149123580 140577834 122366220 102691524 89160515 80452821 74585334 69739314 65004798
2885 65004798 60111531 55786478 52086264 48900543 45818749 43139597 40955693 39557771
2877 39557771 38768597 38016493 36224955 34151885 31989768 30190789 28492980 27072024
2869 27072024 25874658 24993576 24209848 23442202 22736900 22104999 21394833 20827089 20311034
2860 20311034 19804173 19240400 18767510 18192443 17904854 17562695 17155549 16789869 16582225
2851 16582225 16203768 15816371 15541096 15349182 15086876 14912071 14602925 14438059 14176000
2842 14176000 13948117 13688321 13474898 13396068 13098465 12866926 12731913 12523611 12303871 12088512
2832 12088512 11932731 11692946 11532986 11361950 11208220 10972601 10892844 10754063 10479716 10342970
2822 10342970 10155038 10086767 10082774 9962204 9837266 9686045 9570271 9397017 9307761 9297627
2812 9297627 9176019 9051214 8998874 8854108 8671888 8646263 8488618 8437056 8381357 8322805
2802 8322805 8141700 8036424 8024829 7962459 7848289 7721199 7679700 7596056 7546099 7603415 7547276
2791 7547276 7444736 7437199 7462389 7419331 7449526 7340979 7415363 7344223 7339162 7418653 7484031
2780 7484031 7438069 7495972 7554625 7646011 7681776 7761319 7909638 8008115 8048583 8101263 8230535
2769 8230535 8445468 8712722 8842758 8871983 9066211 9328628 9702006 10028270 10406804 10773322
2759 10773322 10862403 10882574 10909327 10815234 10821182 10765861 10925313 11171097 11385891 11438823 11470935
2748 11470935 11570108 11590845 11585199 11746214 11948792 12318217 12651084 12945201 13314163 13718098
2738 13718098 14333030 15171759 16000197 16582328 16797604 16769929 16755884 16806500 17002474 17320578
2728 17320578 17878572 18489937 19210438 19836209 20126219 20160455 20185166 20392842 20477981 20601968
2718 20601968 20876426 21086959 21477220 21882832 22319734 22900596 23400400 24024905 24744006
2709 24744006 25393785 26055434 26769118 27799159 28879828 29942587 31030021 32035468 32980132
2700 32980132 33362280 33297398 32623748 31511946 30547574 29770824 29164416 28820034 28741015 28808200
2690 28808200 28917710 29219419 29726728 30367742 30867837 31395102 31932943 32461111 32904282
2681 32904282 33062406 33020115 32669970 31871902 30986882 30006200 29022541 27891073 26887527
2672 26887527 26029784 25387988 24789005 24332038 24155487 23965245 23766314 23642722 23413481
2663 23413481 22978130 22523185 21848563 21239030 20308470 19362673 18447106 17509041 16601429
2654 16601429 15677335 14986652 14223431 13599196 13092276 12550590 12115487 11621091 11296765
2645 11296765 10878616 10619383 10277405 10003585 9695477 9356518 9050816 8839984 8520277
2636 8520277 8175597 7860891 7602569 7294886 7064699 6828078 6613816 6412237 6266769 6182525
2626 6182525 6015549 5785347 5561341 5579784 5409474 5138375 5039704 5046535 4822919 4769760
2616 4769760 4686526 4598810 4497419 4358105 4265986 4230118 4112573 3982349 3979939 3812700 3689572
2605 3689572 3517225 3525176 3457504 3312507 3230009 3240979 3146069 3108762 3013132 2931889 2888440
2594 2888440 2822020 2715177 2613841 2660549 2581683 2560411 2452681 2335139 2305204 2299003 2174600
2583 2174600 2153757 2130030 1997735 2004455 1989807 1953789 1921819 1766468 1680061 1717001 1673129
2572 1673129 1641526 1704667 1718947 1646714 1497960 1575244 1568644 1432528 1452006 1511364 1499884
2561 1499884 1432374 1380849 1294458 1295795 1287687 1242201 1167593 1239075 1267697 1122607 1042308 1075936
2549 1075936 1119258 1095932 1154762 1102152 1024417 1134534 1044278 1012769 993150 1070769 1091051
2538 1091051 1007375 990821 947151 986052 941767 917732 946324 905578 940475 963815 919190
2527 919190 971321 1010941 915334 828904 844583 910128 831679 799449 761641 777998 851499 828134
2515 828134 864130 769527 790175 830892 745785 746966 797265 699105 736909 697440 703670 706643
2503 706643 691223 703719 658704 653992 676245 741864 736646 762497 711725 625708 659592 653774
2491 653774 678807 729746 743167 636202 630226 579907 648934 652857 597867 533650 618304 642482
2479 642482 667181 708813 508705 542166 488826 445027 490796 595560 600977 484931 426986
2468 426986 582866 618097 565821 590855 556909 552456 483710 496591 642419 533167 473881
2457 473881 433846 414029 414012 425224 473798 398626 371207 486794 346156 342315 352377 260978
2445 260978 303554 319942 338343 329136 292146 388930 380847 390060 287487 340237 299911 277126
2433 277126 243041 160169 149293 149441 331852 311817 274528 203918 288620 254136 273743 244881
2421 244881 286495 221785 256636 99198 195560 316235 226958 303337 226773 226037 242631 182836
2409 182836 232106 159506 155072 249961 212171 60036 178849 300461 175603 184090 125296
2398 125296 128417 196865 204633 210479 79397 27492 68857 183613 173619 117817 102172 146078
2386 146078 157467 199810 91675 46473 225367 191491 156853 190280 150974 220059 283014
2375 283014 182304 110436 178376 192835 81378 153825 136318 13070 49625 54463 37249
2364 37249 130130 168200 149164 62813 29838 91162 74027 5947 57716 -5863 14931 13257
2352 13257 -14056 72041 76529 52275 77658 36027 48138 98850 68613 -68436 -57947 16300
2340 16300 -18511 -11711 38111 -69583 -51444 44986 2749 -3715 -49115 -45056 33350 55146
2328 55146 -73831 -69932 -26794 -30473 -98946 -69039 -99585 -116350 -26967 55154 12497 -68718
2316 -68718 -10740 -45529 -57831 -66933 12403 72902 94428 18507 -8004 -58523 -125380 -86844
2304 -86844 13209 7539 78194 1002 39182 -40022 -47117 -53010 -136724 -29146 -64034 -9469
2292 -9469 -33053 -56291 -47480 -105401 -194751 -300230 -134716 -76113 -122161 -111280 -41451 -93663
2280 -93663 -110832 -68718 788 -60260 -33057 -1256 -29798 -59455 -51948 -44625 -18639 -18350 -70444
2267 -70444 -11286 -126258 -143379 -148884 -120838 -73295 -54681 -82969 -23125 45953 -101403 -122072
2255 -122072 12015 -103183 -130041 -152044 -140850 -22129 -72710 -157720 -121142 -145891 -108632
2244 -108632 -68648 -107596 -110905 -196640 -166504 -37385 42237 31929 -115876 -230160 -149717
2233 -149717 -157187 -63969 13494 -41357 25814 -101060 -126474 -117887 -104654 -135680 -94942 -31639
2221 -31639 -35544 -102780 -176603 -133387 -125801 -76087 -48244 -112692 -169423 -93366 -28378 -79875
2209 -79875 -24645 133 -101921 -86000 -21387 43757 -43664 -60758 -65519 -84926 -88736 -93536
2197 -93536 -34738 -5068 30973 -16912 -11133 -17709 18324 42367 -31143 -79432 3771 -11051
2185 -11051 45435 98352 72904 -1180 52321 26914 48953 70698 102680 56950 20971 96968
2173 96968 103326 141152 158716 141359 170089 76831 125908 169380 178210 188442 181825 135969
2161 135969 157078 200943 280914 216833 256241 301126 223601 307270 420842 331524 294410
2150 294410 389400 494406 536300 461209 523669 446339 421503 495494 679234 729867 774040
2139 774040 744442 791194 837823 931689 1038130 1067447 1119228 1162708 1227727 1384201 1384268 1422559
2127 1422559 1465216 1629142 1725461 1832590 1905535 1951483 2117356 2256070 2479602 2672532
2117 2672532 2876898 3074409 3420588 3806608 4241648 4573232 4969153 5390054 6091054 6840256
2107 6840256 7980578 9238302 11318311 13782669 17611364 20294213 18390514 14894592
2099 14894592 11298450 9072523 7598874 6474168 5620395 4940062 4436417 4146479 3830455
2090 3830455 3454389 2971333 2524834 2354296 2162820 1879649 1726936 1620559 1533769 1368352
2080 1368352 1210138 1207843 1137446 1131270 1003208 850405 809714 730142 736311 697498 693553 624036
2068 624036 617405 517707 474256 460914 451772 507664 462976 442497 429772 349780 322625 358521
2056 358521 359880 369260 412831 344470 335805 312559 290281 314395 273039 274256 165222 134734
2044 134734 289868 197601 192490 200814 105296 73819 34171 91434 118602 127767 59048 -1656
2032 -1656 66594 18263 27339 89838 7206 -38325 98001 153844 -35133 -32291 -21979 14975
2020 14975 -5405 33037 -14772 -30683 26535 32132 60394 27692 1149 -27430 -87498 -118650
2008 -118650 -62993 -70507 -74057 6619 33427 -6802 -6800 5869 -19571 -73539 -101718 -7243 2200
1995 2200 87257 29704 -30351 3137 -48074 -16927 -26395 45769 37865 34619 -55278 -135411 -79073
1982 -79073 -92291 -33605 -40803 -109506 -142013 -120724 -136763 -112656 -32564 -16071 -172592 -76671
1970 -76671 -22067 -68624 -45539 -10832 -124140 -138697 -171763 -74969 -92926 -101366 -83803 -99960
1958 -99960 -46081 -63588 -66467 -105249 -226068 -165602 -123225 -165002 -144556 -177446 -69601 -89827
1946 -89827 -98039 -47587 -145631 -115745 -44166 -162051 -134546 -81400 -192484 -136724 -118943 -83988
1934 -83988 -87378 -101957 -179399 -204957 -164992 -166244 -191987 -122675 -75709 -143307 -115219 -142350
1922 -142350 -204922 -118314 -49092 -106925 -140184 -148513 -90130 -85901 -93626 -128223 -82298 -62806
1910 -62806 -147202 -144200 -117656 -175713 -108096 -70658 -70903 -10901 -19411 49609 76773 -54561
1898 -54561 -58761 -135094 -25162 -34493 -96864 -124263 -110878 -150616 -40528 -40239 -37313 -45086 -86404
1885 -86404 -182154 -228380 -125900 -168713 -129038 -157054 -157613 -112670 -182352 -100695 -146326 -187084
1873 -187084 -149764 -12652 -27180 -95134 -49099 -51323 -45616 -30478 -34051 -25138 -5524 -44874
1861 -44874 -112874 -77847 -69480 -34836 -25114 -124227 -118820 -141376 -93160 -48566 -44586 -166586
1849 -166586 -184141 -87488 -39407 -38921 -123215 -178101 -150464 -133655 -112237 -23163 -181575 -140319
1837 -140319 -96127 -66127 -23451 -119486 -114620 -122879 -133670 -96287 -131844 -153055 -166268 -68962
1825 -68962 23187 -38277 -225158 -191256 -127806 -176442 -88287 -197240 -141479 -158567 -202251
1814 -202251 -157988 -113376 -155640 -101247 -190416 -175732 -177038 -131941 -49193 -90279 -147870 -123890
1802 -123890 -82289 -110347 -247131 -148398 -168357 -152826 -214884 -85048 -101988 -173043 -149494
1791 -149494 -216416 -175106 -211237 -142498 -131719 -78020 -84772 -70194 -102901 -185788 -99756 -130787
1779 -130787 -119936 -99335 -43954 -60203 -58299 -66825 -144538 -226524 -208944 -275756 -195790 -51071
1767 -51071 -26842 -16261 -271592 -153966 -111519 -127405 -84218 -105022 -101832 -158923 -193591 -126011
1755 -126011 -88694 -47804 -185187 -180740 -175682 -73749 -103919 -247880 -221655 -242839 -164393
1744 -164393 -99458 -88329 -110441 -15521 -21619 -113157 -88678 -152417 -139202 -99783 -20381 -150116
1732 -150116 -150741 -98068 -36984 -106713 -108443 -190398 -168842 -161198 -236131 -197741 -142681 -113713
1720 -113713 -91085 -125394 -178827 -68440 -67216 -156256 -226758 -175544 -131049 -99795 -131748 -117888
1708 -117888 -84433 -118971 -51620 -23326 -90566 -142562 -28014 -49967 -186432 -165043 -156022
1697 -156022 -50388 -177296 -155465 -87775 -100442 -188156 -226807 -128680 -129881 -93708 -137093
1686 -137093 -150295 -118617 -119343 -94312 4356 46963 -81568 -101870 -146971 -148200 -117432 -100729
1674 -100729 -59475 -138409 -170525 -110292 -161947 -115002 -244258 -183039 -188417 -146765 -46038
1663 -46038 -149926 -128299 -123102 -175942 -138059 -108827 -71949 -11854 -136994 -180496 -63280
1652 -63280 -77052 -96839 -87051 -79668 16587 40281 -8780 -78509 -99348 -157833 -71995 59101
1640 59101 23234 -29050 -77917 -78548 -21504 -98460 -82681 -15028 -100033 -111711 -45316 -54261
1628 -54261 -83506 -35564 -78615 -77708 -92708 58893 33432 -155605 -80661 -143879 -100093 -166821
1616 -166821 -94578 -52531 -10727 20563 -75274 -77294 -115362 -78124 -95154 -151851 -63017 -48992
1604 -48992 -8105 -109034 -157083 -88603 -39952 -76802 -153877 -142197 -124027 -107274 -55830 -88970
1592 -88970 -173688 -110725 -7365 -33201 -66810 -59295 -89572 -157888 -177588 -139495 -129229 -157501
1580 -157501 -94356 -16784 -31844 -91740 -103047 -126126 -173587 -226903 -258304 -156957 -166826 -106911
1568 -106911 -96912 -34487 -29661 -114926 -102181 -49962 -83942 -69905 -40310 -97800 -205357 -277149
1556 -277149 -195613 -47325 -26697 -63910 -137964 -78753 -91535 -27027 -90116 -91583 -93044 -116105
1544 -116105 -143167 -185049 -189397 -173741 -150321 -52520 -101302 -166079 -90606 -99714 -128688 -69820
1532 -69820 -86184 -102817 -42676 -91285 -84181 -43088 -92178 -65928 7881 -127780 -101277 -84699
1520 -84699 -59450 -97575 4242 -132663 -121817 -70085 -44756 -65983 -53084 -186589 -193489
1509 -193489 -120732 -217321 -162217 -55481 -58546 -7942 -40261 -127991 -81553 -116786 -94782 -91934
1497 -91934 -116959 -33350 8350 -83928 -118907 -107842 -162065 -155874 -142108 -130085 -157173 -96728
1485 -96728 -24048 -107203 -99241 -105157 -127578 -118394 -97258 -166879 -125910 -154089 -128771 -80269
1473 -80269 -145570 -151534 -62133 11835 63178 -29811 -87161 -33412 -73774 -55530 -39395 -77087
1461 -77087 -56499 -72402 -76572 -92620 -141272 -117980 -156799 -151836 -17706 -32555 35826 -55143
1449 -55143 -145122 -49597 -67014 -89496 9133 3554 -232 -23033 -63659 -23931 -55506 -23584
1437 -23584 -106227 -133776 -57440 -100961 -49918 -69688 -135633 -102936 -69114 -130004 -134864 -80998
1425 -80998 -159449 -102330 -158262 -147903 -115380 -123479 -131488 -64800 -80998 -105364 -76897 -113754
1413 -113754 -22763 -40978 -104415 -135887 -119743 -109213 -54689 -40269 -71825 -17624 -74526 -33122
1401 -33122 -71089 -131644 -157457 -180727 -117550 -130573 -68210 -72770 -97374 -112491 -101191 -75513
1389 -75513 -86853 -50586 -66302 -98680 -19835 -55086 -727 -4018 -97861 -88583 -34733 1211
1377 1211 66174 80768 -50662 -63068 -63968 -71706 -141145 46090 39964 -93842 -6923 46207
1365 46207 -42383 -128456 -106910 -153797 -49494 -73571 -62981 -67667 -140814 -107742 -122941 -184702
1353 -184702 -42036 -68730 -85396 -13226 29758 -132458 -132756 -106765 -75867 -58995 -22987 -50364
1341 -50364 -151420 -69363 -86598 -40459 -86626 -128238 -90479 -100442 -87443 -59590 -30233 -35465
1329 -35465 -28038 -97456 -34091 -36696 -140946 65021 -89998 -198673 -166220 -5169 -122288
1318 -122288 -91911 1057 12111 -111382 -56642 -69730 -139241 -93137 -155295 -60840 37366
1307 37366 -61705 -164931 -41450 -31928 -76972 -110920 -75826 -56460 -125888 -164276 -126536 -89619
1295 -89619 -64023 -97210 -37336 -37544 -104628 -65428 -137848 -164361 49236 -29951 -97593 -9500
1283 -9500 21452 39858 -71811 36498 -6568 -17902 -14016 -23490 -86318 -84179 21654 -20256
1271 -20256 -95976 -120792 -55215 -69628 -130307 -82973 6679 -36860 27631 -39356 -68248 -100573
1259 -100573 -96095 -67295 -51029 -38104 -16695 -68546 -74646 -27498 -97885 22576 32986 -29842
1247 -29842 -54459 -66261 -22287 -1352 3077 5986 -19818 -66040 -107618 -85372 -57041 -124603
1235 -124603 -87965 -42198 23847 -96969 -156078 -28226 27393 13953 -66654 -85452 -37984
1224 -37984 -56176 -36960 -141890 -54588 -44866 -46234 1687 -61339 -70178 22872 -81821 -55662
1212 -55662 -44591 -89661 -84704 -49301 -46890 -6068 21315 -49361 -98933 -5040 31054 55523
1200 55523 88573 -75097 -47029 -33281 29517 -87311 -133788 -110528 -35285 -41020 -82053 -77869
1188 -77869 -22605 -22710 -60471 -6736 9549 47701 9779 -36454 -2003 26662 91900 39639
1176 39639 -46833 39933 23416 -47837 -27197 -105755 -23822 -61424 -69577 32003 1476 -52769
1164 -52769 -43653 30967 103202 1233 -41926 15880 -107015 -39538 85087 -5108 -61387
1153 -61387 -30725 18093 48518 10212 8412 80216 47462 49038 7367 39833 17561 -109240
1141 -109240 -70328 74120 -25075 -21275 32676 13242 -5095 31890 -23663 -590 13130 18223
1129 18223 5851 -29555 -69383 24662 6492 -81343 -72789 -112515 42145 64340 66095 -54788
1117 -54788 -68111 -115701 -56700 -102978 -151470 -96739 -70338 -49504 -16268 -66347 -123036 -73530
1105 -73530 -28108 -61211 -85234 -64463 -72671 -32038 -11424 -62161 -13715 -46828 -82504 31226
1093 31226 15371 -3622 23847 -70553 43588 24012 -13652 12655 -16390 6992 -30948 -23741
1081 -23741 -9136 24423 -84759 -67429 -73559 30846 76778 -105137 -116783 -122364 19782
1070 19782 44166 68938 159307 -444 -42643 63162 -40312 48239 140388 10706 54474
1059 54474 -97848 -123537 550 -11126 233 -18004 -14422 -27833 15717 66370 38241 27460
1047 27460 -8616 82935 -3929 42047 29702 39853 20496 8279 32281 -118818 -94741 -27150
1035 -27150 -138507 -58252 57975 93130 98465 51728 123137 -3634 -13071 16355 46824 93416
1023 93416 59469 -5786 -19048 -50548 35844 -20130 66849 75437 -7587 -12782 -3562 -24454
1011 -24454 -4937 -119 56741 -22184 29 41978 596 -46277 15252 7504 -4246 -17360
999 -17360 79626 70259 -65873 -18698 -6593 24679 -1187 -50413 -106031 73638 -39894 -53272
987 -53272 -110168 -38758 -11561 -38902 -80263 -117112 20365 18609 -47679 38855 20623 2580
975 2580 -36130 -69346 -88021 -28209 -76018 -26990 60492 53073 9822 -57356 -53523 -10722 84070
962 84070 -9667 -53664 15319 -43229 -33266 74592 -7985 5359 -28389 -60423 -35227 -73628
950 -73628 -65177 -42647 -51082 -64767 4881 90133 -44191 -88013 -71161 -74090 -39456 -6847
938 -6847 51854 53276 130161 74666 -90934 -66930 18719 73118 130167 130201 39050 107514 -23839
925 -23839 31902 7905 -80631 -59176 34052 6282 23461 68178 26257 65191 -7956 -13780
913 -13780 -2828 80894 84280 99855 86353 68294 67755 114323 68396 79124 56941 26651 93603
900 93603 48997 -30473 51524 62408 19246 -2819 29998 -28555 -44981 -37495 -45702 -15210
888 -15210 44927 54328 109057 18626 -9197 16884 -41687 -2489 -26883 -65909 67112 87913
876 87913 22694 4532 17135 12529 -44354 6061 31630 56131 244 35484 -20714 93676
864 93676 57959 63984 8439 75893 80537 4106 87588 86338 85033 65435 121391 119783 104921
851 104921 6529 -90942 -10986 -3254 509 32881 5887 65068 29140 -49768 22052 20678
839 20678 -39292 -142382 -74586 33560 -34646 21217 34846 61110 12012 19448 22765 64923
827 64923 -40319 -3373 114321 101058 54786 60741 18032 49275 -19752 54306 31201 19307
815 19307 -1422 -36657 -15499 27436 91492 80985 22001 -65899 -55939 -19361 53508 34408
803 34408 30265 37586 83238 81444 73979 72375 94320 68991 83480 55385 14445 56602 -18263
790 -18263 -53312 21996 -36936 -2410 67832 30346 10552 85514 38669 25529 122111 117650
778 117650 18275 46137 97224 123208 47977 71579 56341 28697 -10041 -19732 22382 108442
766 108442 65130 62330 32619 101900 109059 7106 -20237 62294 55124 85323 9128 15267
754 15267 74243 15633 60406 161074 115420 84492 42315 100240 72344 173233 159123 61580
742 61580 91970 69225 -11151 -99893 -4060 72751 135406 123346 165768 115061 51972 -352
730 -352 16153 31537 64832 22416 30881 -1044 -21060 -23598 14038 69532 3236 -65809 30306
717 30306 28271 37458 -7091 -69796 -27178 105689 79973 40439 -57240 62755 35218 64803
705 64803 89809 93906 27265 102985 96896 -48347 -39973 -7570 31990 77776 94617 12644
693 12644 -28985 60303 86317 60095 101649 130010 134465 116197 106623 49908 77024 40051
681 40051 74316 106098 13670 117588 184706 211064 132708 102144 65687 61181 44208 -17680
669 -17680 97070 28606 111882 128690 63503 11253 -16494 14861 -30798 66014 78829 84116
657 84116 74124 3543 24367 62577 68585 82605 82721 25520 -43140 15886 34243 20352 54368
644 54368 92835 128248 115086 70712 37210 68038 22292 29829 58742 128553 96627 113864
632 113864 98361 73578 34329 92828 56345 83750 3836 68078 166585 111841 88879 102198
620 102198 71354 113072 100837 127993 73763 86328 15550 102978 111584 88733 22114 -31741
608 -31741 78964 69185 86675 104661 42607 68792 159009 28326 108464 167314 184973 208490
596 208490 49703 -18125 21309 105053 51348 -18751 17307 59143 115536 104695 77566 14300
584 14300 -19217 -28084 122259 16745 35205 104467 185125 217810 134884 91712 15265 16464
572 16464 122976 69756 85866 49386 29132 29768 115784 109696 44181 131390 128058 115256 146142
559 146142 200453 194456 49410 122613 64364 75221 91921 85217 32959 -43620 32990 -2158
547 -2158 69031 136586 65563 203718 183743 75454 111541 77848 113822 70698 170171 56514
535 56514 -61929 1480 58605 35723 94013 97277 46237 90663 54287 68513 143829 70161
523 70161 54691 174771 115300 117938 100552 72224 19855 85456 49799 37256 62663 160041
511 160041 163513 90481 78386 67059 91745 88330 81269 38790 108883 138471 96993 101731 79916
498 79916 133342 170997 112786 116072 68106 98112 93668 208204 160076 144210 137410 116676
486 116676 -10261 77930 3267 50683 169134 178182 130536 121079 221655 94848 36053
475 36053 126228 196395 186541 58675 133602 172963 27421 -6845 136247 145533 46398 77037
463 77037 94331 81238 19314 13015 102665 34340 102281 156315 93957 103455 159774 104018
451 104018 150775 87771 68066 65480 58158 101179 136055 143733 148601 124862 60349 131435 106556
438 106556 140217 79638 157015 55062 53615 -793 57841 53809 64786 79904 1236 6664
426 6664 -12272 -29536 122368 57998 81576 134247 138407 92084 105484 170577 149275 26608
414 26608 79318 114303 151717 158513 79941 122801 135206 82250 91558 124432 94507 60255
402 60255 101282 107024 71258 41160 144314 57679 63967 105292 87199 101656 21764 117980
390 117980 147065 115631 1371 24564 119440 189171 112614 117974 41774 54165 63750 17009
378 17009 102902 57988 -59561 -34644 28301 92207 92238 75662 70784 26583 28566 18231 6829
365 6829 80620 69339 131306 20785 82141 81578 83011 128001 59858 119335 157705 42166
353 42166 38346 109529 210277 128910 194349 155923 93540 61666 22585 46173 92309 180703
341 180703 105876 105731 80822 79596 166789 200989 -16864 27379 -2588 41944 34582 150793
329 150793 114764 113169 167660 77386 164227 150958 81876 179927 204704 193003 89172 92234
317 92234 102470 84066 153178 66677 39947 190496 143666 41778 58094 119542 52046 49544
305 49544 67375 51390 198874 94664 60196 62178 74271 -808 21580 47963 144950 126937
293 126937 106411 74063 -16486 2980 102427 153425 117423 111523 137963 50686 15816 64519
281 64519 108027 51168 86541 175455 88657 144350 201767 66130 34499 39318 17063 -15511
269 -15511 11132 71253 71602 77175 -294 -4799 -11041 48859 -1136 53727 64651 87447 100391
256 100391 113386 197627 70524 116636 166366 198575 67618 124467 141716 7297 107254
245 107254 46230 46659 85607 184447 162481 102461 50930 76806 86725 71115 15442 63092
233 63092 31363 73536 196690 178323 109196 90111 165147 150887 197562 174701 158488 101762
221 101762 133408 136082 90821 87061 123384 112978 15343 78384 45868 63034 42523 43512 37093
208 37093 10530 112599 44058 76418 163583 161546 65759 77516 116903 140642 86592 84684
196 84684 67857 48631 24590 -9965 95204 42841 106748 152362 75694 126631 55720 -7549
184 -7549 34355 18463 25954 -7560 -2984 19585 111086 132753 107823 42017 5911 99868 91396
171 91396 -5893 34120 55700 11823 88665 60832 52347 106932 192584 123787 123120 112633 64622
158 64622 90989 100579 15255 148794 88767 50871 5603 93146 129381 45493 88856 139510
146 139510 176702 115929 148284 99743 201202 104381 121815 184133 135548 213739 170755 159135
134 159135 111666 158741 219372 86144 131305 135086 122506 80851 104217 146615 90161 97714
122 97714 98995 15830 -50557 -7727 145553 74469 110910 104172 54455 63021 97896 31160
110 31160 26404 131740 145602 114821 121794 62004 47039 209683 230827 169557 56929 63163
98 63163 131408 119872 37457 51903 41952 58617 162560 104197 119579 144474 83627 53411
86 53411 15114 28971 66638 119895 105523 60193 69259 69119 66757 72582 21459 82764 179990
73 179990 100923 39971 82426 113891 119897 72845 92805 76595 50322 87201 93152 123651
61 123651 85021 125742 86777 169154 155754 145701 125010 112305 102009 161291 123040 30890
49 30890 85053 111708 120341 59114 -17066 -19855 61005 88367 85094 73058 57603 7814 17286
36 17286 -33050 26337 83070 56027 64991 140589 88830 88506 76490 63957 136156 161017 215994
23 215994 177888 104089 126683 142066 137427 50044 25139 1714 -11848 24152 97121 100162
11 100162 102077 82014 124846 95098 26985 144700 206582 147101 150447 114572 96859
0 96859
$$ Imaginary data points
##PAGE= N=2
##DATA TABLE= (X++(I..I)), XYDATA
16383 -2501600 -2437524 -2435878 -2388560 -2373656 -2326955 -2337517 -2246651 -2226676 -2226024 -2225124 -2187833 -2168887
16371 -2168887 -2092592 -2053179 -1985446 -1950200 -1915365 -1872693 -1830707 -1796518 -1751196 -1733675 -1643081
16360 -1643081 -1630355 -1632874 -1636389 -1692299 -1660521 -1585527 -1525278 -1471364 -1390295 -1411178 -1343151 -1296657
16348 -1296657 -1326453 -1308729 -1286364 -1249468 -1170046 -1093292 -1048053 -1030417 -1029955 -1030135 -1066724 -1001546
16336 -1001546 -950655 -885711 -831425 -850752 -775535 -723888 -719127 -736128 -658668 -687714 -705039
16325 -705039 -651855 -581012 -535136 -492368 -451801 -394400 -360502 -330625 -336563 -290734 -302050 -325931
16313 -325931 -285599 -270922 -197518 -134349 -165000 -187221 -40745 -92669 -84506 -8827 109556
16302 109556 119033 87224 81010 130101 206753 219747 254644 245428 335737 370400 428069 377540
16290 377540 388424 398308 410266 399983 490019 546442 479856 447028 506773 614719 585315
16279 585315 682725 658409 745432 743913 768772 775991 795276 760222 799620 912798 865536 917715
16267 917715 926759 944830 942992 965674 1036225 1045908 1146596 1106660 1069042 1078895 1149968 1177703
16255 1177703 1108056 1132436 1292076 1255862 1288834 1366197 1327728 1407675 1377789 1364454 1332465
16244 1332465 1423284 1473562 1414543 1420949 1426057 1517615 1520189 1521961 1507368 1559362 1636439 1650320
16232 1650320 1642866 1691153 1728694 1708273 1732142 1720557 1700078 1776448 1866208 1844991 1849138 1848042
16220 1848042 1960090 1992308 1875581 1845306 1906480 1864907 1932082 1957252 1988761 1858798 1889049
16209 1889049 1951399 1969281 2012458 1997552 2113544 2098763 2063551 2146920 2140931 2174051 2135104
16198 2135104 2127292 2137215 2207467 2253936 2247218 2254790 2260479 2318324 2334789 2348207 2296492 2336758
16186 2336758 2254333 2284440 2375830 2417204 2473971 2382731 2314001 2385698 2343000 2379129 2481973
16175 2481973 2469822 2398936 2487884 2458605 2465728 2569499 2452294 2524275 2496829 2549936 2557882
16164 2557882 2482656 2546818 2503010 2409322 2566503 2592598 2519579 2550928 2572798 2638997 2612669
16153 2612669 2624292 2627255 2556201 2695170 2715326 2666957 2613605 2666626 2623277 2562784 2677484
16142 2677484 2685115 2734269 2763733 2738172 2743732 2721887 2806390 2745384 2710073 2744540 2733676 2603517
16130 2603517 2622575 2674637 2646903 2779006 2850297 2820431 2728511 2687612 2779617 2820937 2743777
16119 2743777 2784968 2840907 2788999 2814196 2825653 2792642 2796056 2809807 2739225 2820390 2852148
16108 2852148 2813824 2898647 2812749 2815068 2841223 2918470 2856208 2885175 2881254 2828698 2820277 2824510
16096 2824510 2927470 2933773 2851302 2855861 2915692 2930416 2820502 2842549 2839732 2862783 2823619
16085 2823619 2976912 3032909 2982908 2962337 2882238 2842793 2855192 2849288 2848658 2889460 2900110 2962531
16073 2962531 3014089 2991932 2906622 2848133 2891399 3001706 2982299 2942196 3019673 3002484 2953449
16062 2953449 2910332 2921435 2961580 3077003 3012501 3070050 3077878 3021106 3030009 2995820 3005911
16051 3005911 3011323 2967004 2947255 2978350 2991444 2952678 2859661 2903963 2953663 2987384 2940674
16040 2940674 2953592 2945719 2975981 2971798 3015286 3094908 3106319 3030177 3014604 2965451 3023190 3115357
16028 3115357 3022682 3048528 2968637 2965003 3018189 2995215 2981221 2980548 2962243 2999332 3006823 2997834
16016 2997834 2969044 2961830 2948329 2939210 2988634 3005806 3027292 3119333 3101112 2968161 2944625
16005 2944625 2945324 3007085 2929406 3053562 3084595 3029866 3026839 3135340 3036151 3050867 3144994
15994 3144994 3059193 3057014 3097669 3098142 3023920 3039705 2973753 2962701 2949953 2995667 3038370 2976075
15982 2976075 3017804 3024704 3008777 2978303 3017245 3142829 3113678 2964500 2970073 2950901 2991548
15971 2991548 2992252 3025102 3067610 3051756 3038952 3134592 3124878 3009953 2923099 2926941 2997263 2917037
15959 2917037 2960634 2932045 3046667 2988330 3064790 3064810 3028385 2961054 2921835 2988020 2979363 2969565
15947 2969565 3074569 3117153 3080596 2959513 3003796 2992272 2946068 2984533 3018296 3074132 3024413
15936 3024413 3016354 2987872 3065689 3027810 3087356 2991635 3040801 3054161 3132712 3061128 2963819
15925 2963819 3052072 2992695 2962659 2975030 3058191 3100305 3061630 3008028 2979734 3006687 3056455
15914 3056455 3100684 3061346 3105144 3061277 3019399 3025336 3073255 3112940 3078390 3161981 3076187
15903 3076187 3062647 3087335 2995828 3059097 3060110 3127964 2993769 2991621 2985607 3056260 3048810 2946393
15891 2946393 2970345 3048308 3138659 3132331 3082950 3037511 2926661 2915003 3083553 3063882 3020927
15880 3020927 3039306 3112076 3057373 3050618 3006350 3088424 3097423 3032809 3035516 3006391 3082229 3097355
15868 3097355 3070566 3071427 3083953 3082158 3092307 3130863 3015204 2962378 3114646 3076313 3094161
15857 3094161 3211102 3152352 3053743 3070180 3123037 3076587 3033572 2984455 3111883 3199906 3095324
15846 3095324 3123129 3087581 3048038 3109333 3141712 3120203 3063861 3072200 3025994 3125303 3074252
15835 3074252 3073564 3200556 3155888 3154072 3144442 3026810 3062066 3124675 3087941 3142291 3072888 3065586
15823 3065586 3146760 3033753 3030245 3038459 3137375 3126736 3119542 3097076 3049780 3086220 3094346 3100799
15811 3100799 3099133 3083326 3093791 3085881 3134468 3054421 3128401 3158766 3211198 3164036 3140510 3160762
15799 3160762 3124904 3139756 3146953 3096663 3100028 3171801 3179413 3120295 3106697 3067785 3189124 3050077
15787 3050077 3043705 3150221 3018831 3056537 3038159 3122615 3172911 3147504 3141166 3155442 3072748
15776 3072748 3122766 3240956 3223015 3109399 3104648 3111456 3101050 3206162 3095699 3032325 3116182
15765 3116182 3045308 3115363 3219993 3240711 3236364 3197686 3115656 3100834 3102549 3075199 2993719
15754 2993719 3058351 3025818 3071420 3105014 3082045 3093770 3138479 3123935 3130856 3105684 3197375
15743 3197375 3126668 3163632 3206104 3147990 3119333 3123341 3111992 3151437 3148741 3075481 3110545 3131582
15731 3131582 3115989 3037571 3058908 3127048 3093095 3097098 3146802 3221082 3235812 3117984 3166092
15720 3166092 3119952 3146936 3126181 3128431 3135470 3181588 3186438 3154562 3140158 3054170 3084856 3124767
15708 3124767 2955237 3050679 3101594 2981329 3082954 3103365 3101699 3201467 3207103 3061519 3172281
15697 3172281 3113682 3136531 3114635 3125497 3145482 3152305 3099301 3095910 3095862 3091648 3117732 3154657
15685 3154657 3117008 3014044 3085476 3119191 3110923 3165072 3095850 3115005 3070319 3003733 3148299
15674 3148299 3131574 3073313 3027997 3041364 3126945 3184657 3158145 3189341 3176690 3191791 3107971
15663 3107971 3083188 3178119 3152264 3092912 3128619 3116263 3132283 3189399 3108477 3084315 3117614
15652 3117614 3144497 3142846 3129344 3164738 3152793 3172116 3232525 3284044 3175105 3076179 3148933
15641 3148933 3226030 3209726 3152140 3161202 3185722 3242880 3177934 3102662 3174899 3198168 3169561
15630 3169561 3195633 3107421 3043849 3007473 3010153 3059566 2996861 3057425 3041366 3085386 3065724
15619 3065724 3089518 3141866 3132753 3130605 3099920 3201364 3179749 3072808 3167360 3198020 3167804
15608 3167804 3146227 3125460 3122635 3152669 3127005 3180082 3164116 3106674 3098273 3042062 2987827 2975689
15596 2975689 3020763 3238457 3161157 3102887 3101663 3080866 3119765 3120659 3164248 3087639 3109002 3130006
15584 3130006 3131167 3163755 3147576 3146671 3176904 3071490 3117944 3174723 3145511 3123504 3128040 3165709
15572 3165709 3177124 3108421 3153050 3195843 3038210 3107580 3177314 3209735 3236428 3202852 3148896
15561 3148896 3227692 3161926 3115270 3184157 3102531 3156733 3254976 3203805 3095174 3044068 3122340
15550 3122340 3187379 3164542 3260944 3199460 3236858 3192629 3179298 3245720 3216945 3214614 3222461 3238763
15538 3238763 3240076 3220264 3275918 3190288 3135450 3110546 3065415 2961347 3070776 3201977 3195855
15527 3195855 3175085 3146950 3232295 3213334 3171080 3172727 3099429 3098862 3144743 3191375 3147517 3088485
15515 3088485 3121796 3096659 3167663 3213988 3172403 3124498 3201779 3181048 3142794 3063653 3106716
15504 3106716 3053691 3088789 3077392 2942855 3080575 3121800 3040247 3099319 3101935 3123225 3102290
15493 3102290 3139446 3249422 3242015 3187459 3242909 3213498 3244125 3200509 3222563 3152443 3217692
15482 3217692 3185297 3156590 3235706 3182633 3208966 3225010 3184508 3060353 3132695 3164584 3186904
15471 3186904 3176230 3146743 3157746 3176158 3151339 3212894 3244798 3227120 3146687 3185478 3177805
15460 3177805 3201524 3184783 3132084 3064976 3063740 3140715 3135106 3081991 3133502 3176490 3221473 3096497
15448 3096497 3040623 3052999 3170855 3178819 3187383 3204449 3148361 3278501 3233761 3248039 3326048
15437 3326048 3179610 3130950 3163588 3271471 3204684 3283111 3306152 3238582 3242644 3187806 3187656
15426 3187656 3136463 3178560 3293971 3327883 3267834 3298076 3248168 3151621 3165757 3177734 3165058
15415 3165058 3161621 3214408 3246011 3281241 3164852 3186631 3211701 3192611 3122701 3059264 3037586
15404 3037586 3131289 3236416 3314771 3246524 3129919 3234241 3248702 3269089 3239408 3252731 3246928
15393 3246928 3322382 3342566 3330602 3245112 3233761 3249665 3196267 3220541 3176292 3120428 3203475
15382 3203475 3216463 3243699 3223591 3246915 3185650 3225911 3329076 3293897 3257327 3278002 3328596
15371 3328596 3361787 3334579 3274501 3284133 3229170 3127924 3211445 3230928 3258785 3184333 3160615
15360 3160615 3256186 3298013 3252538 3279042 3181993 3103429 3167942 3187223 3261132 3290387 3206422
15349 3206422 3165437 3128752 3183411 3257004 3128486 3163894 3198734 3187463 3190306 3198586 3230063
15338 3230063 3163283 3136205 3226031 3195605 3205124 3265725 3243760 3195334 3231184 3146865 3075106
15327 3075106 3164805 3243499 3297763 3240567 3232398 3171762 3194319 3250739 3155714 3171375 3223987
15316 3223987 3191089 3319229 3288937 3229565 3205497 3218488 3213961 3220298 3271034 3228771 3179766
15305 3179766 3152816 3202679 3236346 3260275 3256313 3158910 3163123 3115007 3042194 3187066 3161556
15294 3161556 3203163 3253597 3262565 3256223 3254040 3240106 3161047 3220840 3151377 3197109 3331449 3296869
15282 3296869 3184983 3231767 3230821 3218266 3291339 3293128 3278159 3309795 3285070 3216045 3351851
15271 3351851 3344068 3278446 3309356 3280217 3286729 3282569 3143172 3293267 3303343 3244643 3298207
15260 3298207 3242662 3303608 3202097 3317968 3269112 3253775 3246466 3247673 3355982 3316422 3337429
15249 3337429 3265715 3213502 3151371 3257866 3327732 3354298 3324738 3206490 3256851 3289133 3199861
15238 3199861 3224507 3289750 3266119 3314538 3281998 3248910 3372638 3287275 3260625 3233433 3249686
15227 3249686 3239926 3315898 3243053 3265636 3266211 3226365 3280858 3183202 3245855 3239404 3209233 3335735
15215 3335735 3283149 3273363 3265468 3302467 3320090 3342921 3350468 3313640 3297390 3202701 3278742 3355442
15203 3355442 3353109 3330105 3253811 3275602 3312118 3284537 3201817 3236635 3322774 3359908 3270975
15192 3270975 3261695 3292129 3309561 3209089 3245913 3274368 3244390 3246067 3238164 3245170 3263684 3275639
15180 3275639 3295185 3273705 3304689 3337750 3257960 3279053 3312939 3323870 3305496 3326613 3313558
15169 3313558 3303589 3253241 3230006 3325920 3292645 3240178 3308000 3350533 3299163 3190715 3287144
15158 3287144 3274526 3278998 3242367 3227569 3284163 3201484 3195755 3271763 3286579 3336297 3235061
15147 3235061 3273836 3310099 3388186 3308139 3289786 3300224 3287044 3313493 3326644 3364722 3359809
15136 3359809 3388088 3324959 3272143 3335176 3272029 3277428 3320113 3395553 3298730 3369943 3333101
15125 3333101 3309054 3252283 3329149 3360199 3329558 3274892 3276642 3272774 3255151 3336244 3325308 3363391
15113 3363391 3246586 3319145 3362432 3324100 3263410 3345165 3270295 3255961 3324441 3230870 3211586
15102 3211586 3327341 3236254 3234287 3286204 3368797 3393381 3311831 3336528 3244349 3282089 3198780
15091 3198780 3231577 3330483 3304788 3372427 3412268 3369561 3293462 3287534 3320707 3295947 3280078
15080 3280078 3287589 3325101 3406535 3328308 3343928 3290987 3242022 3210110 3190578 3281880 3385907
15069 3385907 3319929 3326005 3368591 3282901 3268776 3301897 3289264 3330774 3243499 3334435 3305441
15058 3305441 3355853 3360275 3344346 3324217 3312011 3359457 3332940 3331874 3329385 3364719 3315961 3334765
15046 3334765 3330110 3264697 3331846 3340768 3393328 3404079 3383915 3425554 3408512 3429424 3434202 3440702
15034 3440702 3435091 3327360 3351714 3341356 3321865 3421020 3312044 3315272 3279525 3375042 3360365
15023 3360365 3309789 3303179 3340758 3252493 3206020 3264245 3311068 3328072 3381974 3324968 3373597
15012 3373597 3378126 3301970 3332769 3301039 3356332 3352784 3303024 3299487 3364454 3312524 3292226 3385206
15000 3385206 3425831 3384349 3320963 3355468 3359900 3314795 3329428 3321765 3366211 3378700 3327555 3306984
14988 3306984 3311041 3230569 3277200 3323174 3282250 3321246 3408950 3382007 3347460 3346854 3352233 3329247
14976 3329247 3320057 3312993 3301640 3357986 3310634 3336234 3275617 3287433 3269988 3278711 3361862 3255273
14964 3255273 3351948 3332560 3398832 3435763 3338278 3444508 3400364 3336182 3339786 3319613 3319950 3322271
14952 3322271 3387095 3397596 3315034 3343337 3414895 3407217 3371950 3363614 3354176 3367232 3388818 3381023
14940 3381023 3302080 3298811 3321022 3368351 3424112 3437409 3430565 3343674 3386902 3312809 3302130 3341390
14928 3341390 3404682 3427699 3422811 3352057 3281865 3278367 3358532 3371665 3260405 3337138 3374873
14917 3374873 3381732 3470086 3430489 3389567 3466303 3440792 3342884 3315750 3260115 3255836 3365127
14906 3365127 3425446 3330495 3338782 3317633 3373028 3452060 3379557 3433603 3360308 3379666 3489527
14895 3489527 3512159 3402724 3390488 3359913 3398032 3401729 3371259 3411169 3477987 3397426 3306713
14884 3306713 3228901 3239046 3270755 3313874 3454665 3364299 3336835 3321451 3335052 3402319 3372636
14873 3372636 3406375 3362354 3398013 3438607 3411513 3410789 3423767 3358031 3405087 3432889 3376109 3389539
14861 3389539 3276852 3311336 3370197 3366356 3420412 3412294 3455197 3361110 3373948 3393419 3382701
14850 3382701 3400391 3290043 3308513 3349950 3446143 3423987 3385028 3333000 3366749 3427027 3363939
14839 3363939 3437043 3477834 3406818 3418014 3417014 3472242 3510928 3380260 3386396 3430756 3307800
14828 3307800 3419940 3450803 3442585 3443776 3387153 3403012 3425764 3431155 3429017 3422493 3524121 3552479
14816 3552479 3497827 3488528 3524028 3545985 3529318 3522569 3442222 3467385 3364915 3252881 3304682
14805 3304682 3397714 3431905 3366693 3311987 3418391 3363869 3369267 3411019 3479294 3359366 3297641
14794 3297641 3413539 3393720 3333763 3296028 3331037 3423039 3400607 3393462 3395784 3359271 3393843
14783 3393843 3431402 3489531 3430568 3418566 3434628 3440698 3422283 3408919 3430963 3437488 3459428 3417565
14771 3417565 3372751 3387917 3340900 3293649 3377925 3390893 3368715 3363233 3480877 3494700 3355222
14760 3355222 3357963 3394275 3359142 3412827 3441789 3390907 3477416 3375581 3348044 3329103 3443067
14749 3443067 3361959 3325636 3364761 3428192 3432135 3485816 3465000 3443078 3442961 3403560 3387020 3441031
14737 3441031 3456098 3408405 3412713 3529298 3554634 3591260 3466570 3446029 3395538 3403464 3546294
14726 3546294 3489816 3394448 3377529 3387553 3349975 3323463 3252514 3371536 3335467 3329045 3402138
14715 3402138 3430228 3421743 3328098 3340141 3447492 3415150 3424317 3380099 3393793 3423772 3470327
14704 3470327 3370327 3256778 3417584 3371335 3427482 3525862 3481038 3530628 3452779 3482677 3495854
14693 3495854 3436208 3479462 3596204 3589517 3499580 3506175 3453083 3368997 3497956 3407690 3453389
14682 3453389 3490604 3494644 3452444 3454576 3467489 3461494 3423043 3419006 3437575 3455270 3436216 3405758
14670 3405758 3432696 3451255 3474057 3488329 3518552 3559097 3494420 3440213 3504854 3431895 3499919
14659 3499919 3606588 3541048 3494214 3459796 3495458 3410722 3406548 3348819 3410618 3470765 3466279
14648 3466279 3409579 3443620 3496317 3419536 3404211 3299605 3341054 3425812 3437673 3517453 3512667
14637 3512667 3465111 3404178 3456070 3482361 3395681 3443762 3559392 3530763 3477426 3514506 3500109
14626 3500109 3560970 3538504 3453393 3412896 3501161 3502862 3442609 3482012 3464358 3510764 3482417
14615 3482417 3413112 3485290 3503060 3516430 3393702 3470439 3491280 3546144 3407903 3414876 3468630
14604 3468630 3458889 3528204 3446004 3391327 3406260 3422369 3561915 3549236 3493585 3489257 3500764
14593 3500764 3537592 3489266 3601914 3585817 3431890 3484677 3469552 3485301 3462348 3432008 3472583
14582 3472583 3538099 3520711 3512999 3578423 3558312 3480816 3536357 3455297 3408274 3491891 3478247
14571 3478247 3430470 3469591 3552206 3533286 3519121 3436411 3370346 3348835 3431316 3503177 3635665
14560 3635665 3581368 3499300 3592730 3573122 3511460 3508052 3572402 3628279 3601726 3511092 3495981
14549 3495981 3515137 3544480 3513853 3535109 3499704 3536966 3465877 3497349 3525412 3439760 3541410
14538 3541410 3585851 3583433 3534557 3541355 3471469 3480162 3494900 3541689 3601873 3573387 3523723 3520461
14526 3520461 3495851 3577289 3581837 3577151 3476102 3487726 3432764 3466923 3549341 3616585 3538789
14515 3538789 3498056 3530396 3458681 3484720 3510592 3530290 3561252 3480576 3453142 3578296 3490155
14504 3490155 3490242 3535109 3542334 3506570 3512558 3570313 3523287 3511879 3553553 3547236 3561971 3552522 3523981
14491 3523981 3538335 3512773 3561184 3576885 3549121 3578782 3562429 3496370 3491248 3524556 3518588 3518324
14479 3518324 3544767 3606665 3508770 3464259 3471223 3442583 3463262 3590594 3632250 3611032 3593694
14468 3593694 3535635 3551957 3536043 3575829 3630498 3714657 3604314 3493176 3557464 3561954 3491741
14457 3491741 3522861 3588840 3668667 3515212 3543080 3592686 3623729 3598210 3569295 3605668 3600496
14446 3600496 3492294 3425492 3532063 3512583 3563231 3527331 3546844 3517450 3499630 3454444 3548137
14435 3548137 3516309 3510231 3655602 3658313 3476996 3495378 3640608 3621154 3504020 3499643 3523383
14424 3523383 3552224 3616855 3488670 3534073 3535839 3572092 3450753 3436445 3520887 3536329 3585003
14413 3585003 3516934 3589461 3572182 3503749 3578609 3533028 3514473 3476384 3525472 3561696 3532194
14402 3532194 3568416 3592503 3505997 3420919 3396999 3482968 3623972 3500443 3506645 3532841 3493176
14391 3493176 3520349 3577105 3492516 3517512 3516735 3568242 3593333 3587211 3525077 3555576 3540265 3488946
14379 3488946 3539363 3528956 3519729 3504713 3650196 3621882 3599854 3639397 3601042 3582782 3562703
14368 3562703 3443203 3498870 3541794 3522340 3610396 3520949 3544049 3538017 3579546 3462712 3546159
14357 3546159 3636005 3609299 3601452 3494536 3506138 3558808 3538094 3537250 3611337 3540278 3547300 3593698
14345 3593698 3530185 3565303 3579196 3594579 3656185 3727904 3598837 3660589 3692377 3587031 3662132
14334 3662132 3656188 3575446 3577338 3579782 3627259 3602118 3637343 3594124 3525846 3524788 3492701 3565722
14322 3565722 3583017 3576071 3542773 3570582 3560790 3551565 3495965 3531946 3599323 3607877 3567965 3611255
14310 3611255 3604024 3577861 3576463 3569112 3549790 3575586 3548563 3641566 3648908 3575615 3593060 3677237
14298 3677237 3668281 3612438 3646372 3683702 3662389 3614154 3539921 3548039 3506253 3501822 3512135 3572207
14286 3572207 3635717 3677625 3609651 3535322 3446013 3493931 3510078 3494293 3523188 3638949 3617114
14275 3617114 3556231 3603866 3603383 3634627 3715579 3744729 3606064 3557776 3660982 3700620 3715278
14264 3715278 3598993 3577341 3642824 3592200 3596450 3613829 3529809 3627342 3695163 3532942 3600015
14253 3600015 3601348 3646035 3647263 3655008 3728143 3685216 3661575 3686931 3707041 3610948 3646912 3650944
14241 3650944 3682154 3664932 3618371 3639176 3531544 3555103 3422761 3508244 3550570 3538718 3499682
14230 3499682 3626796 3675263 3606788 3665010 3729952 3735751 3657261 3696787 3627933 3536164 3544295
14219 3544295 3589724 3724580 3731058 3746517 3784323 3802260 3790396 3670326 3725418 3766600 3681775
14208 3681775 3611388 3581716 3624448 3706930 3614200 3568294 3659365 3672861 3597123 3577559 3530929
14197 3530929 3549533 3622537 3557103 3570729 3687774 3636727 3587085 3641726 3612194 3678315 3656210
14186 3656210 3643589 3567229 3611702 3587731 3633357 3667126 3561372 3514394 3631259 3681121 3645965
14175 3645965 3618122 3639577 3653116 3654059 3618759 3510648 3571551 3588092 3604796 3607102 3617922 3521968
14163 3521968 3567103 3602837 3682091 3650062 3652171 3610382 3583556 3654643 3685185 3631562 3618635
14152 3618635 3673072 3678202 3684143 3559631 3694122 3653258 3618470 3584595 3639420 3741814 3712027
14141 3712027 3735859 3728699 3664484 3705483 3715865 3634097 3531179 3507165 3553016 3659139 3742450
14130 3742450 3695999 3656193 3685003 3701178 3634471 3595310 3620619 3694397 3689387 3696250 3661430 3582827
14118 3582827 3624448 3630172 3698678 3696792 3713263 3667330 3596986 3697117 3744932 3729735 3744430
14107 3744430 3696565 3674879 3717345 3676440 3680454 3705588 3707865 3694573 3666735 3648756 3688378 3697833
14095 3697833 3790308 3702176 3621464 3632550 3609554 3577900 3757517 3626778 3551864 3717232 3694018
14084 3694018 3683175 3760440 3698182 3710340 3794629 3686650 3731841 3702509 3610108 3754096 3776712
$$ [...]
##END NTUPLES=NMR SPECTRUM
##END=
