##TITLE=1H_EC-3330-x1
 DMSO
 8 sc, 
 13.8.2024
##JCAMPDX= 6.0         $$ Bruker NMR JCAMP-DX V2.0
##DATA TYPE= NMR SPECTRUM
##DATA CLASS= NTUPLES
##ORIGIN= UXNMR, Bruker Analytische Messtechnik GmbH
##OWNER= root
$$ XWIN-NMR		Version 3.5
$$ Tue Aug 13 13:42:04 2024 Russian Standard Time (UT+4h)  she@DPX200
##.OBSERVE FREQUENCY= 200.1318
##.OBSERVE NUCLEUS= ^1H
##.ACQUISITION MODE= SIMULTANEOUS
##.ACQUISITION SCHEME= undefined
##.AVERAGES= 12
##.DIGITISER RES= 18
##SPECTROMETER/DATA SYSTEM= spect
##.PULSE SEQUENCE= zg30
##.SOLVENT NAME= DMSO
##.SHIFT REFERENCE= (INTERNAL, DMSO, 0, 23.2201)
##AUDIT TRAIL= $$ (NUMBER, WHEN, WHO, WHERE, WHAT)
$$ ##TITLE= Audit trail, XWIN-NMR		Version 3.5
$$ ##JCAMPDX= 5.01
$$ ##ORIGIN= Bruker BioSpin GmbH
$$ ##OWNER= she
$$ F:/spectra/data/she/nmr/H-F/1/pdata/1/auditp.txt
$$ ##AUDIT TRAIL=  $$ (NUMBER, WHEN, WHO, WHERE, WHAT)
(   1,<2024-08-13 13:40:38.59 +0400>,<she>,<DPX200>,
      <created by zg, POWCHK disabled, PULCHK disabled
       terminated by command 'halt'
       configuration hash MD5:
       00 E9 B6 7A A2 85 ED C7 34 08 36 98 17 FE 4E 26
       data hash MD5: 16K
       36 AD 4E F9 3B B7 9B E1 B8 22 A7 6C 16 AE 0A 67>)
(   2,<2024-08-13 13:40:42.50 +0400>,<she>,<DPX200>,
      <Start of raw data processing
       efp BC_mod = 2 LB = 0.24 FT_mod = 6 PKNL = 1 PHC0 = -25997.94 PHC1 = 15.38749 SI = 16K 
       data hash MD5: 16K
       A3 1A 52 AA 5C 26 34 84 75 22 3E 3A 24 00 C9 37>)
(   3,<2024-08-13 13:41:04.98 +0400>,<she>,<DPX200>,
      <pk PHC0 = -3.535355 PHC1 = 2 
       data hash MD5: 16K
       93 05 81 F2 5F 21 D4 2F 70 04 E6 78 38 A2 EF 84>)
(   4,<2024-08-13 13:41:08.40 +0400>,<she>,<DPX200>,
      <abs ABSG = 5 
       data hash MD5: 16K
       8F 12 1E E9 ED D4 C4 AA 8A 49 5A DC FF 25 A5 DB>)
(   5,<2024-08-13 13:41:40.31 +0400>,<she>,<DPX200>,
      <abs ABSG = 5 
       data hash MD5: 16K
       63 7D D1 FD E5 02 D7 41 1D 19 AA 0A 1C 58 9D 77>)
$$ ##END=
$$ 
$$ hash MD5
$$ 9B 26 AF 55 0F 7E 66 2F 09 97 4D 3B 41 D0 67 54
##$RELAX= 
##$RELAX= 
##$RELAX= 
##$RELAX= 
##$RELAX= 
##$RELAX= 
$$ Bruker specific parameters
$$ --------------------------
##$DU= <F:/spectra>
##$EXPNO= 1
##$NAME= <H-F>
##$PROCNO= 1
##$TYPE= <nmr>
##$USER= <she>
##$AMP= (0..31)
100 100 100 100 100 100 100 100 100 100 100 100 100 100 100 100 100 100 
100 100 100 100 100 100 100 100 100 100 100 100 100 100 
##$AQSEQ= 0
##$AQ_mod= 1
##$AUNM= <au_zg>
##$AUTOPOS= <>
##$BF1= 200.13
##$BF2= 200.13
##$BF3= 200.13
##$BF4= 200.13
##$BF5= 200.13
##$BF6= 200.13
##$BF7= 200.13
##$BF8= 200.13
##$BYTORDA= 1
##$CFDGTYP= 0
##$CFRGTYP= 5
##$CHEMSTR= <none>
##$CNST= (0..31)
1 1 145 1 1 1 1 1 1 1 1 1 1 1 1 1 1 1 1 1 1 1 1 1 1 1 1 1 1 1 1 1 
##$CPDPRG= <>
##$CPDPRG1= <>
##$CPDPRG2= <>
##$CPDPRG3= <>
##$CPDPRG4= <mlev>
##$CPDPRG5= <mlev>
##$CPDPRG6= <mlev>
##$CPDPRG7= <mlev>
##$CPDPRG8= <mlev>
##$CPDPRGB= <>
##$CPDPRGT= <>
##$D= (0..31)
0 1.2 0 0 0 0 0 0 0 0.06 0 0.03 0 0 0 0 0.0002 0 0 0 0 0 0 0 0 0 0 0 0 
0 0 0 
##$DATE= 1723542038
$$ [...]
##$SUBNAM3= <"">
##$SUBNAM4= <"">
##$SUBNAM5= <"">
##$SUBNAM6= <"">
##$SUBNAM7= <"">
##$SUBNAM8= <"">
##$SUBNAM9= <"">
##$SW= 24.0689170037331
##$SWIBOX= (0..15)
0 0 2 0 0 0 0 0 0 0 0 0 0 0 0 0 
##$SW_h= 4816.95568400771
##$TD= 16384
##$TD0= 1
##$TE= 0
##$TE2= 300
##$TE3= 300
##$TEG= 300
##$TL= (0..7)
0 120 120 120 120 120 120 120 
##$TP= (0..7)
150 150 150 150 150 150 150 150 
##$TP07= 0
##$TPNAME0= <>
##$TPNAME1= <>
##$TPNAME2= <>
##$TPNAME3= <>
##$TPNAME4= <>
##$TPNAME5= <>
##$TPNAME6= <>
##$TPNAME7= <>
##$TPOAL= (0..7)
0.5 0.5 0.5 0.5 0.5 0.5 0.5 0.5 
##$TPOFFS= (0..7)
0 0 0 0 0 0 0 0 
##$TUNHIN= 0
##$TUNHOUT= 0
##$TUNXOUT= 0
##$USERA1= <user>
##$USERA2= <user>
##$USERA3= <user>
##$USERA4= <user>
##$USERA5= <user>
##$V9= 5
##$VALIST= <valist>
##$VCLIST= <CCCCCCCCCCCCCCC>
##$VD= 0
##$VDLIST= <DDDDDDDDDDDDDDD>
##$VPLIST= <PPPPPPPPPPPPPPP>
##$VTLIST= <TTTTTTTTTTTTTTT>
##$WBST= 1024
##$WBSW= 4
##$XGAIN= (0..3)
0 0 0 0 
##$XL= 0
##$YL= 0
##$YMAX_a= 353609
##$YMIN_a= -248645
##$ZGOPTNS= <>
##$ZL1= 120
##$ZL2= 120
##$ZL3= 120
##$ZL4= 120
##$ABSF1= 23.22007
##$ABSF2= -0.8491173
##$ABSG= 5
##$ABSL= 3
##$ALPHA= 0
##$AQORDER= 0
##$ASSFAC= 0
##$ASSFACI= 0
##$ASSFACX= 0
##$ASSWID= 0
##$AUNMP= <proc_1d>
##$AZFE= 0.1
##$AZFW= 0.1
##$BCFW= 0
##$BC_mod= 2
##$BYTORDP= 0
##$COROFFS= 0
##$CY= -3
##$DATMOD= 1
##$DC= 0
##$DFILT= <>
##$DTYPP= 0
##$F1P= 0
##$F2P= 0
##$FCOR= 1
##$FTSIZE= 16384
##$FT_mod= 6
##$GAMMA= 0
##$GB= 0
##$INTBC= 1
##$INTSCL= 3.70164e-10
##$ISEN= 128
##$LB= 0.24
##$LEV0= 0
##$LPBIN= 0
##$MAXI= 10000
##$MC2= 0
##$MEAN= 0
##$ME_mod= 0
##$MI= 1.114404
##$NCOEF= 0
##$NC_proc= -5
##$NLEV= 6
##$NOISF1= 3.799351
##$NOISF2= 2.8
##$NSP= 0
##$NTH_PI= 0
##$NZP= 0
##$OFFSET= 23.22007
##$PC= 1
##$PHC0= -26001.47
##$PHC1= 17.38749
##$PH_mod= 1
##$PKNL= yes
##$PPARMOD= 0
##$PSCAL= 0
##$PSIGN= 0
##$REVERSE= no
##$SF= 200.129561456204
##$SI= 16384
##$SIGF1= 3
##$SIGF2= 2
##$SINO= 5.538805
##$SIOLD= 16384
##$SREGLST= <1H.CDCl3>
##$SSB= 0
##$STSI= 16384
##$STSR= 0
##$SW_p= 4816.95568400771
##$SYMM= 0
##$S_DEV= 0
##$TDeff= 16384
##$TDoff= 0
##$TI= <>
##$TILT= no
##$TM1= 0
##$TM2= 0
##$TOPLEV= 0
##$USERP1= <user>
##$USERP2= <user>
##$USERP3= <user>
##$USERP4= <user>
##$USERP5= <user>
##$WDW= 1
##$XDIM= 16384
##$YMAX_p= 501949210
##$YMIN_p= -303188
$$ End of Bruker specific parameters
$$ ---------------------------------
##NTUPLES= NMR SPECTRUM
##VAR_NAME=  FREQUENCY,     SPECTRUM/REAL,   SPECTRUM/IMAG
##SYMBOL=    X,             R,               I
##VAR_TYPE=  INDEPENDENT,   DEPENDENT,       DEPENDENT
##VAR_FORM=  AFFN,          ASDF,            ASDF
##VAR_DIM=   16384,         16384,           16384
##UNITS=     HZ,            ARBITRARY UNITS, ARBITRARY UNITS
##FACTOR=    0.29402158847633, 1,            1
##FIRST=     4647.02240311827, 0,            0
##LAST=      -169.933280889437, 0,           0
##MIN=       -169.933280889437, -303188,     0
##MAX=       4647.02240311827, 501949210,    0
$$ Real data points
##PAGE= N=1
##DATA TABLE= (X++(R..R)), XYDATA
$$ [...]
$$ plain form
6103 366453 584486 515482 303562 223982 408310 392266 405243 433436 322307 399078 505429
6092 505429 467046 495609 456099 398616 411442 296068 469925 428636 184954 294071 253504
6081 253504 324455 444080 322998 342712 281546 240169 298649 288066 332098 234372 332521
6070 332521 312769 321461 338353 357387 522858 529406 372911 384175 494165 617498 449860
6059 449860 342706 371975 479203 510008 476892 405551 382306 294500 289611 367639 394149
6048 394149 265547 251895 343495 226709 362268 471481 366947 359365 350886 260741 318934
6037 318934 367082 271996 264517 379870 383736 450801 439479 282678 243943 271653 230812 215553
6025 215553 210349 303996 173253 131268 164692 234338 319594 353700 287660 305098 265487 179498
$$ packed form
6103C66453K18033o9004k11920p9580J84328j6044J2977K8193j11129P6771J06351
6092E05429l8383K8563l9510n7483J2826j15374J73857m1289k43682J09117m0567
6081B53504P0951J19625j21082J9714o1166m1377N8480j0583M4032r7726R8149
6070C32521j9752Q692J6892J9034J65471O548j56495J1264J09990J23333j67638
6059D49860j07154K9269J07228L0805l3116p1341k3245q7806m889P8028K6510
6048C94149j28602j3652R1600j16786J35559J09213j04534p582q479r0145N8193
6037C18934M8148r5086p479J15353L866O7065j1322j56801l8735K7710m0841j5259
6025B15553n204R3647j30743m1985L3424O9646Q5256L4106o6040J7438l9611q5989
$$ plain form
6013 179498 277573 445614 369226 367463 189408 127465 201483 324676 207939 118707 215732
6002 215732 227914 204810 176789 269069 397923 258544 163250 447330 342048 209958 225938
5991 225938 417276 421049 329133 269925 332506 345326 305972 272308 353423 384453 372054 353780
5979 353780 354703 418630 490784 450248 467980 551329 447309 466591 449945 396271 328678 377129
5967 377129 460889 410301 396313 201128 236772 322745 296799 402135 363428 419999 434825
5956 434825 386772 332624 444104 557913 395804 541811 614515 463801 432734 456449 486715
5945 486715 627368 660320 624757 566773 502874 457602 447296 627869 594698 606586 579584
5934 579584 617399 698573 719076 713911 883184 938354 933079 1000685 1098142 970355 1013411 1079176
$$ packed form
6013A79498R8075J68041p6388j763j78055o1943P4018J23193j16737q9232R7025
6002B15732J2182k3104k8021R2280J28854j39379r5294K84080j05282j32090J5980
5991B25938J91338L773r1916n9208O2581J2820l9354l3664Q1115L1030j2399j8274
5979C53780R23O3927P2154m0536J7732Q3349j04020J9282j6646n3674o7593M8451
5967C77129Q3760n0588j3988j95185L5644Q5973k5946J05336l8707N6571J4826
5956D34825m8053n4148J11480J13809j62109J46007P2704j50714l1067K3715L0266
5945D86715J40653L2952l5563n7984o3899m5272j0306J80573l3171J1888k7002
5934E79584L7815Q1174K0503n165J69273N5170n275O7606R7457j27787M3056O5765
$$ plain form
5922 1079176 1131106 1138768 1167555 1088259 944401 867495 711159 624773 537336 574277 609803
5911 609803 719855 687541 692033 645199 696163 622772 550203 407757 425923 536132 431171
5900 431171 432831 614947 828938 818050 704997 686830 647615 583613 568866 692754 595140
5889 595140 641021 649472 710054 630681 585873 538195 570419 674254 591405 601181 669156 649974
5877 649974 645429 722471 789732 739640 641800 876672 714714 775006 871068 809124 760985
5866 760985 779280 716946 878452 924485 927097 973135 1004491 855188 983439 1158113 1110910
5855 1110910 1038986 1144316 1292116 1249300 1182256 1245007 1306088 1378485 1370499 1426919 1517160
5844 1517160 1433706 1427571 1559588 1707161 1736638 1720775 1707267 1847037 1816239 1980263 2047543
$$ packed form
5922A079176N1930P662K8787p9296j43858p6906j56336q6386q7437L6941L5526
5911F09803J10052l2314M492m6834N0964p3391p2569j42446J8166J10209j04961
5900D31171J660J82116K13991j0888j13053j8167l9215o4002j4747J23888r7614
5889E95140M5881Q451O0582p9373m4808m7678L2224J03835q2849R776O7975j9182
5877F49974m545P7042O7261n0092r7840K34872j61958O0292R6062o1944m8139
5866G60985J8295o2334J61506M6033K612M6038L1356j49303J28251J74674m7203
5855A110910p1924J05330J47800m2816o7044O2751O1081P2397p986N6420R0241
5844A517160q3454o135J32017J47573K9477j5863j3508J39770l0798J64024O7280
$$ plain form
5833 2047543 2228863 2261319 2297947 2492641 2641462 2688463 2810859 3102045 3232547 3493223
5823 3493223 3692924 3830048 4002385 4297389 4649687 5038733 5375285 5483127 5690690 6120677
5813 6120677 6504656 7051240 7726022 8280051 8809364 9007563 9036850 8789682 8585932 8534174
5803 8534174 8482584 8652753 8692294 8538780 8719094 8942685 9396351 9972854 10458700 10940766
5793 10940766 11603405 12409032 13181387 14018838 15073642 16174453 17772403 19447594 21374775
5784 21374775 23770974 26639184 29829690 33369973 36747056 39290851 40875445 41247216
5776 41247216 40642077 40076024 39607260 39340534 38981373 37982051 36538433 35080489 33839005
5767 33839005 32944592 31884499 30031186 27540184 24863190 22223547 19718894 17648982
$$ packed form
5833B047543J81320L2456L6628J94694J48821M7001J22396K91186J30502K60676
5823C493223J99701J37124J72337K95004L52298L89046L36552J07842K07563M29987
5813F120677L83979N46584O74782N54029N29313J98199K9287k47168k03750n1758
5803H534174n1590J70169L9541j53514J80314K23591M53666N76503M85846M82066
5793A0940766O62639Q05627P72355Q37451J054804J100811J597950J675191J927181
5784B1374775K396199K868210L190506L540283L377083K543795J584594L71771
5776D1247216o05139n66053m68764k66726l59161r99322j443618j457944j241484
5767C3839005q94413j060093j853313k491002k676994k639643k504653k069912
$$ plain form
5759 17648982 15885980 14454211 13259792 12423959 11554876 10740864 10111525 9722512 9164677
5750 9164677 8813624 8484001 8265697 8101434 7857596 7934033 7974373 8155186 8150897 7986516
5740 7986516 7864139 7511027 7591967 7635400 7436555 7105616 6569354 6160733 5658956 5087682
5730 5087682 4539799 4191012 4019199 3822217 3698268 3365540 3160445 2872323 2630164 2448422
5720 2448422 2441930 2307061 2280683 2208707 2000954 2023975 1913387 1901489 1819194 1748733 1782040
5709 1782040 1658056 1729760 1692006 1617321 1494519 1386542 1347329 1356856 1430411 1422794 1263818
5698 1263818 1122006 1115717 1111158 1173074 972596 1127671 1184159 1218207 1186458 1067326 1101196
5687 1101196 1023848 1152671 1138803 1209046 1294380 1336588 1141005 1249692 1314360 1146553 1215850
$$ packed form
5759A7648982j763002j431769j194419q35833q69083q14012o29339l89013n57835
5750I164677l51053l29623k18304j64263k43838P6437M0340J80813m289j64381
5740G986516j22377l53112Q0940M3433j98845l30939n36262m08621n01777n71274
5730E087682n47883l48787j71813j96982j23949l32728k05095k88122k42159j81742
5720B448422o492j34869k6378p1976k07753K3021j10588j1898q2295p0461L3307
5709A782040j23984P1704l7754p4685j22802j07977l9213R527P3555p617j58976
5698A263818j41812o289m559O1916k00478J55075N6488L4048l1749j19132L3870
5687A101196p7348J28823j3868P0243Q5334M2208j95583J08687O4668j67807O9297
$$ plain form
5676 1215850 1083346 1082030 1040686 922178 958325 982862 919294 921566 961132 912725 940627
5665 940627 895107 795402 908807 970550 931511 880906 852465 919148 873148 866922 882149 964060
5653 964060 811372 839469 975203 898836 736580 610672 656180 670734 740579 774430 763454
5642 763454 559276 452221 474652 464039 536597 662077 477016 541442 491566 465628 528979
5631 528979 635765 543386 488238 582092 676941 505512 517637 621983 571089 609179 380086
5620 380086 405697 241577 210174 323713 455500 384891 345183 351089 289630 316822 316586 319303
5608 319303 273794 224448 239809 233118 309113 297347 124058 230583 396010 200214 111068
5597 111068 162588 166040 91913 167642 326707 251967 75292 110934 148700 97521 215793
$$ packed form
5676A215850j32504j316m1344j18508L6147K4537o3568K272L9566m8407K7902
5665I40627m5520r9705J13405O1743l9039n0605k8441O6683m6000o226J5227Q1911
5653I64060j52688K8097J35734p6367j62256j25908M5508J4554O9845L3851j0976
5642G63454k04178j07055K2431j0613P2558J25480j85061O4426m9876k5938O3351
5631E28979J06786r2379n5148R3854R4849j71429J2125J04346n0894L8090k29093
5620C80086K5611j64120l1403J13539J31787p0609l9708N906o1459K7192k36K717
5608C19303m5509m9346J5361o691P5995j1766j73289J06525J65427j95796q9146
5597A11068N1520L452p4127P5729J59065p4740j76675L5642L7766n1179J18272
$$ plain form
5586 215793 135290 169477 159602 117929 145454 260126 249593 100362 120837 77627 28178
5575 28178 152423 166230 154271 144609 205442 59339 117483 125353 185740 223142 117887 159773
5563 159773 124598 78278 82591 112784 152526 125472 164448 75232 83973 123978 168499 182758
5551 182758 154428 25352 -18534 65966 164780 164663 110470 172605 206133 111598 182268 193564
5539 193564 166867 106700 37623 60101 104579 90835 98911 240163 158045 137550 184166 237769
5527 237769 269978 212782 278343 155970 168463 299348 389761 359450 253012 352708 243636
5516 243636 285785 329064 349746 266249 262164 233938 220056 225542 342007 376683 452628 306677
5504 306677 361924 344833 335937 381975 434139 418761 474313 569640 493242 376011 425743 401070
$$ packed form
5586B15793q0503L4187r875m1673K7525J14672j0533j49231K0475m3210m9449
5575B8178J24245J3807j1959r662O0833j46103N8144P870O0387L7402j05255M1886
5563A59773l5175m6320M313L0193L9742k7054L8976q9216Q741M0005M4521J4259
5551A82758k8330j29076m3886Q4500R8814j17n4193O2135L3528r4535P0670J1296
5539A93564k6697o0167o9077K2478M4478j3744Q076J41252q2118k0495M6616N3603
5527B37769L2209n7196O5561j22373J2493J30885R0413l0311j06438R9696j09072
5516B43636M2149M3279K0682q3497m085k8226j3882N486J16465L4676P5945j45951
5504C06677N5247j7091q896M6038N2164j5378N5552R5327p6398j17231M9732k4673
$$ plain form
5492 401070 425843 385333 475863 470022 475873 556954 527328 585178 497598 537457 480993 373072
5480 373072 445530 570221 666950 403233 390773 448695 394170 468910 479704 500604 476723
5469 476723 380262 270180 230794 201522 282357 344803 438878 383897 439028 403947 467904
5458 467904 336045 170685 311840 201189 147232 269613 298295 378531 333027 318523 249209
5447 249209 441122 276544 102692 90383 8554 44443 31539 154264 278086 175522
5437 175522 -70122 -81251 112210 148190 6816 9068 58537 -9871 -46296 72422 101019
5426 101019 137646 50186 84617 124866 105861 221088 262165 203633 77506 81893 138582
5415 138582 150476 246396 87366 35856 14249 -78109 -72480 9363 109818 -39273 -45032
$$ packed form
5492D01070K4773m0510R0530n841N851Q1081k9626N7850q7580L9859n6464j07921
5480C73072P2458J24691R6729k63717j2460N7922n4525P4740J0794K0900k3881
5469D76723r6461j10082l9386k9272Q0835O2446R4075n4981N5131l5081O3957
5458D67904j31859j65360J41155j10651n3957J22381K8682Q0236m5504j4504o9314
5447B49209J91913j64578j73852j2309q1829L5889j2904J22725J23822j02564
5437A75522k45644j1129J93461L5980j41374K252M9469o8408l6425J18718K8597
5426A01019L6627q7460L4431M0249j9005J15227M1077n8532j26127M387N6689
5415A38582J1894R5920j59030n1510k1607r2358N629Q1843J00455j49091n759
$$ plain form
5404 -45032 -33218 -21335 45933 70969 67419 87805 -46007 -102582 -48469 -30466 -23719 -19128
5392 -19128 2750 28472 105832 48875 10053 123692 106095 46284 143250 -33299 33610
5381 33610 144912 -12065 41325 116017 266395 125401 21861 94026 83975 2376 -53456
5370 -53456 -37626 68594 1744 41719 75948 -123179 -17007 41936 62871 -89731 -129012
5359 -129012 -47993 -78809 22377 84679 24879 -43710 17915 -30208 80964 -20067 -40536
5348 -40536 -86684 -2393 111468 73383 56971 -55239 -16673 66938 143665 4440 20236
5337 20236 -164521 -99871 2745 75932 64325 2613 33163 108149 -24812 -10676 66608
5326 66608 161411 -12794 -64266 36271 -52718 49856 -60212 -35802 -130015 -172700 -200047
$$ packed form
5404d5032J1814J1883O7268K5036l550K0386j33812n6575N4113J8003O747M591
5392a9128K1878K5722P7360n6957l8822J13639j7597n9811R6966j76549O6909
5381C3610J11302j56977N3390P4692J50378j40994j03540P2165j0051q1599n5832
5370e3456J5830J06220o6850L9975L4229j99127J06172N8943K0935j52602l9281
5359a29012Q1019l0816J01186O2302n9800o8589O1625m8123J11172j01031k0469
5348d0536m6148Q4291J13861l8085j6412j12210L8566Q3611P6727j39225J5796
5337B0236j84757O4650J02616P3187j1607o1712L0550P4986j32961J4136P7284
5326F6608R4803j74205n1472J00537q8989J02574j10068K4410r4213m2685k7347
$$ plain form
5315 -200047 -86092 -82537 -4606 -102479 52146 13305 -2214 -1123 -78568 -178458 -155557 26828
5303 26828 -52505 90148 189406 -4857 -11606 -42653 38946 65512 46161 147007 -81086
5292 -81086 -49092 -14274 -83039 -169390 -34871 -69342 -29928 40279 18287 -163559 -70209
5281 -70209 53613 72970 -81719 -212370 -97656 -16635 -2220 31452 -45125 -202799 -102289
5270 -102289 60177 48495 16493 46768 -3763 21273 -98734 -81731 28270 -3419 43011
5259 43011 20127 -132052 -103514 111679 54676 15133 43083 -131495 -9106 77602 -55439
5248 -55439 -120442 17600 5469 -130083 -181943 -176191 -43785 30839 -91710 -119667 -66773
5237 -66773 -80602 -240188 -174612 -135231 -77287 -114879 -98554 -3078 60258 -44048 -71749
$$ packed form
5315b00047J13955L555P7931r7873J54625l8841j5519J091p7445r9890K2901J82385
5303B6828p9333J42653R9258j94263o749l1047Q1599K6566j9351J00846k28093
5292h1086L1994L4818o8765q6351J34519l4471L9414P0207k1992j81846R3350
5281g0209J23822J9357j54689j30651J14714Q1021J4415L3672p6577j57674J00510
5270a02289J62466j1682l2002L0275n0531K5036j20007J7003J10001l1689M6430
5259D3011k2884j52179K8538K15193n7003l9543K7950j74578J22389Q6708j33041
5248e5439o5003J38042j2131j35552n1860N752J32406P4624j22549k7957N2894
5237f6773j3829j59586O5576L9381N7944l7592J6325R5476O3336j04306k7701
$$ plain form
5226 -71749 4455 -91589 98517 -61269 9103 -25287 -88589 -62455 -31205 39788 -88140
5215 -88140 -131736 178235 57732 2116 131377 202029 147088 122073 139796 60493 5148
5204 5148 -12834 67781 55028 25988 42981 -119806 -38809 -54610 -16174 26221 -30190 -45297
5192 -45297 -148054 -7292 80565 -22275 -142179 -93198 -134659 95463 -91130 -132806 -35619
5181 -35619 -83188 -42657 -86280 -110879 9698 59735 -80813 -44569 -26554 -46864 -38113 -118018
5169 -118018 -43804 -61128 -1845 -104091 49565 -84967 -15772 -115822 -206305 -14477 -29447
5158 -29447 -61347 -122203 1237 -80690 14759 5362 51473 47455 -67394 -156061 -128576 -60704
5146 -60704 -25086 -39426 -218202 13412 -92472 -89002 661 71436 113688 -99114 -10183
$$ packed form
5226g1749P6204r6044J90106j59786P0372l4390o3302K6134L1250P0993j27928
5215h8140m3596L09971j20503n5616J29261P0652n4941k5015J7723p9303n5345
5204E148j7982Q0615j2753k9040J6993j62787Q0997j5801L8436M2395n6411j5107
5192d5297j02757J40762Q7857j02840j19904M8981m1461K30122j86593m1676R7187
5181c5619m7569M0531m3623k4599J20577N0037j40548L6244J8015k0310Q751p9905
5169a18018P4214j7324N9283j02246J53656j34532O9195j00050r0483J91828j4970
5158b9447l1900o0856J23440q1927R5449r397M6111m018j14849q8667K7485O7872
5146f0704L5618j4340j78776K31614j05884L470Q9663P0775M2252k12802Q8931
$$ plain form
5135 -10183 73711 -62839 18914 14811 25580 141968 55660 64703 -12532 -83792 -80968 18277
5123 18277 80076 -13867 -252165 -124084 -185612 -106303 -127074 -191767 29181 54894 -53977
5112 -53977 115544 81803 41225 -53019 -92373 87861 41339 56004 19167 -43902 17421
5101 17421 85064 137576 152525 28854 -167925 -152751 4451 -200912 -204682 50 -34091
5090 -34091 44578 38589 -2647 -102895 44052 166368 83490 -47267 -31354 51872 -92850
5079 -92850 -154094 -160237 -213043 -155995 -59080 35157 22934 -53173 -106586 -125437 -87812 -70163
5067 -70163 -50157 -71245 -176844 -161065 -121472 -12913 -100833 -59334 8280 175965 23190
5056 23190 -37263 -55778 7390 -30198 70945 120765 -61424 -51981 -190254 -28530 -95391
$$ packed form
5135a0183Q3894j36550Q1753m103J0769J16388q6308R043p7235p1260K824R9245
5123A8277O1799r3943k38298J28081o1528P9309k0771o4693K20948K5713j08871
5112e3977J69521l3741m0578r4244l9354J80234m6522J4665l6837o3069O1323
5101A7421O7643N2512J4949j23671j96779J5174J57202k05363l770K04732l4141
5090c4091P8669n989m1236j00248J46947J22316q2878j30757J5913Q3226j44722
5079i2850o1244o143n2806N7048R6915R4237j2223p6107n3413j8851L7625J7649
5067g0163K0006k1088j05599J5779L9593J08559q7920M1499O7614J67685j52775
5056B3190o0453j8515O3168l7588J01143M9820j82189R443j38273J61724o6861
$$ plain form
5045 -95391 -61097 -20921 120674 74978 41532 -61164 -64788 -4356 11732 -22219 -139434
5034 -139434 -146398 -54262 56371 -37390 -5515 36496 15845 -62812 -50181 -33581 -89970 -9300
5022 -9300 -160961 -225206 -232250 -94541 -21151 36276 -75118 -6963 58405 59487 -66745 8651
5010 8651 -30821 -156441 -159844 -257957 -280885 36330 27881 -33297 -12519 -136352 -96033 -140633
4998 -140633 -137612 -85430 -51893 66394 117263 -29681 -72736 79053 215986 -60867 629
4987 629 130218 103309 19841 -76469 -58928 -141683 -130847 -103927 -171352 -278207 -39263 -160988
4975 -160988 -126218 -56717 -86845 -14302 73662 -108271 -107042 -38136 5377 49917 100672 95725
4963 95725 27419 37723 -73562 31006 64974 20436 -85447 13871 -141245 -23496 14002
$$ packed form
5045i5391L4294M0176J41595m5696l3446j02696l624O0432J6088l3951j17215
5034a39434o964R2136J10633r3761L1875M2011k0651p8657J2631J6600n6389Q0670
5022i300j51661o4245p044J37709P3390N7427j11394O8155O5368J082j26232P5396
5010H651l9472j25620l403r8113k2928L17215q449o1178K0778j23833M0319m4600
4998a40633L021N2182L3537J18287N0869j46944m3055J51789J36933k76853O1496
4987F29J29589k6909q3468r6310J7541q2755J0836K6920o7425j06855K38944j21725
4975a60988L4770O9501l0128P2543Q7964j81933J229O8906M3513M4540N0755m947
4963I5725o8306J0304j11285J04568L3968m4538j05883R9318j55116J17749L7498
$$ plain form
4952 14002 -32811 -7033 98474 60407 71654 -81712 -117373 -29093 -66304 -141027 -114673
4941 -114673 134575 57555 45662 -21154 104585 -14461 84427 219672 -7777 172751
4931 172751 117074 64388 57406 -2085 43870 59142 -82575 -66153 -68015 -75682 -56428 -53911
4919 -53911 -36989 72060 81601 54023 -111937 -95371 -95422 -180203 -137420 -144793 -229675 -55323
4907 -55323 -9287 -53607 -123744 -48280 -217345 -25767 150589 67158 15312 123270 87215
4896 87215 124744 52537 -7259 -48051 -270684 -110068 -43696 45779 -17610 -80195 56599
4885 56599 16665 -94421 -110235 -100983 -45716 -145462 -34992 32239 -71080 3222 -4428 -84085
4873 -84085 -68848 -136671 -125617 -89479 -82812 -60551 -31972 -38675 63330 -45870 26306 128193
$$ packed form
4952A4002m6813K5778J05507l8067J1247j53366l5661Q8280l7211p4723K6354
4941a14673K49248p7020j1893o6816J25739j19046R8888J35245k27449J80528
4931A72751n5677n2686o982n9491M5955J5272j41717J6422j862p667J9254K517
4919e3911J6922J09049R541k7578j65960J6566n1q4781M2783p373q4882J74352
4907e5323M6036m4320p0137P5464j69065J91578J76356q3431n1846J07958l6055
4896H7215L7529p2207n9796m0792k22633J60616O6372Q9475o3389o2585J36794
4885E6599l9934j11086j5814R252N5267r9746J10470O7231j03319P4302p650p9657
4873h4085J5237o7823J1054L6138O667K2261K8579o703J02005j09200P2176J01887
$$ plain form
4861 128193 45051 16236 -112996 -124877 -7343 -67063 -182687 -61272 150038 112308 49154
4850 49154 75070 -13315 -96075 24883 -21530 -130280 -161082 -204580 -226384 -58372 -18552
4839 -18552 -14478 31175 127676 -22859 -123974 -206727 -52724 -53641 -222902 -184923 -71951
4828 -71951 -66557 7987 21144 4558 71067 74903 -95864 -60189 -69828 18159 120527 -5763
4816 -5763 -12447 -65962 -185863 -7335 28980 -3999 -200325 -157708 -127885 -17331 15604
4805 15604 54313 22170 -93915 -50616 -40142 15335 -115899 4253 39180 52463 219
4794 219 5755 -14901 -34021 4568 21870 -58168 -62373 -88076 -51920 -77382 -38370 -122675 -100576
4781 -100576 71025 141472 10836 -34314 -4763 58550 40679 326 11093 -67251 -58952
$$ packed form
4861A28193q3142k8815j29232j1881J17534n9720j15624J21415K11310l7730o3154
4850D9154K5916q8385q2760J20958m6413j08750l0802m3498k1804J68012L9820
4839a8552M074M5653R6501j50535j01115q2753J54003r17j69261L7979J12972
4828g1951N394P4544J3157j6586O6509L836j70767L5675r639Q7987J02368j26290
4816e763o684n3515j19901J78528L6315l2979j96326M2617K9823J10554L2935
4805A5604L8709l2143j16085M3299J0474N5477j31234J20152L4927J3283n2244
4794B19N536k0656j9120L8589J7302q0038m205k5703L6156k5462L9012q4305K2099
4781a00576J71601P0447j30636m5150K9551O3313j7871m0353J0767p8344Q299
$$ plain form
4770 -58952 124948 -5738 -3482 -102035 -21154 105138 89485 -19566 -45893 -20032 -45396
4759 -45396 -121744 -17640 -38356 10624 -54257 -28571 -19139 29668 -33185 -30081 -40716 40598
4747 40598 -1827 -59262 -12188 -36948 -30316 -94261 -48517 -33325 72941 163420 102290 11769
4735 11769 82295 22159 -40890 -10034 109478 50308 21393 -57040 6549 -35012 -32110 -160551
4723 -160551 -76499 -65824 -88964 -48360 209 -119718 -49401 -134799 -73769 -135021 -78150
4712 -78150 -47118 -38179 -121019 -8107 -186797 -171144 42726 22001 54284 29832 -87144
4701 -87144 -12452 69525 7472 -113042 68150 81063 -20304 20887 -76872 -103989 -67133
4690 -67133 -1691 63023 3446 -105311 41614 19500 -29380 62755 54775 83790 153166 59292
$$ packed form
4770e8952J83900j30686K256r8553Q0881J26292j5653j09051k6327K5861k5364
4759d5396p6348J04104k0716M8980o4881K5686R432M8807o2853L104j0635Q1314
4747D0598m2425n7435M7074k4760O632o3945M5744J5192J06266R0479o1130r0521
4735A1769P0526o0136o3049L0856J19512n9170k8915p8433O3589m1561K902j28441
4723a60551Q4052J0675k3140M0604M8569j19927P0317q5398O1030o1252N6871
4712g8150L1032Q939q2840J12912j78690J5653K13870k0725L2283k4452j16976
4701h7144P4692Q1977o2053j20514J81192J2913j01367M1191r7759k7117L6856
4690f7133O5442O4714n9577j08757J46925k2114m8880R2135p980K9015O9376r3874
$$ plain form
4678 59292 43000 -23363 8083 -72043 -104322 -134690 -61649 60285 -67734 -104143 50342
4667 50342 24201 -8026 -59554 -53917 -109938 22155 -44105 -83880 24895 11242 -34794 -77106
4655 -77106 -200517 -125858 -101797 -80194 -192577 -113763 -47887 -55835 -1379 -92459 -134941 12740
4643 12740 -49224 78289 31409 204594 98842 14783 123902 -18201 51211 100351 -12846
4632 -12846 -48421 -234552 -191533 -35654 -81598 -248803 -90189 105085 71852 -123100 -4595
4621 -4595 -32561 37750 -56031 -60051 -41216 36942 108987 28245 43097 -44362 -28268 -114045
4609 -114045 63384 115576 86468 24393 -78969 -41226 -26157 52567 121104 -73580 -122968
4598 -122968 -145885 -10258 39281 32104 -115041 -91807 -13723 -102357 -115346 -6960 20816
$$ packed form
4678E9292j6292o6363L1446q0126l2279l0368P3041J21934j28019l6409J54485
4667E0342k6141l2227n1528N637n6021J32093o6260l9775J08775j3653m6036m2312
4655g7106j23411P4659K4061K1603j12383P8814O5876p948N4456r1080m2482J47681
4643A2740o1964J27513m6880J73185j05752q4059J09119j42103O9412M9140j13197
4632a2846l5575j86131M3019J55879m5944j67205J58614J95274l3233j94952J18505
4621d595k7966P0311r3781m020J8835P8158P2045q0742J4852q7459J6094q5777
4609a14045J77429N2192k9108o2075j03362L7743J5069P8724O8537j94684m9388
4598a22968k2917J35627M9539p177j47145K3234P8084q8634j2989J08386K7776
$$ plain form
4587 20816 130291 35290 47804 28136 58831 -56869 -28460 -77796 -42214 23637 82260
4576 82260 48415 50748 60325 44010 -206006 -170368 -168698 -46636 28723 3743 76494 101949
4564 101949 5030 16345 39638 132109 218329 110968 132839 159552 -12262 -124475 -142751
4553 -142751 -95818 106416 50827 -92369 -27185 -13615 -27657 1876 -44479 135536 106630
4542 106630 -20571 51679 56424 48340 135436 87516 66349 -29215 -33531 -17156 -120861 -51110
4530 -51110 -119 120793 47398 -96154 26591 -11358 -16207 -134992 -129242 -183236 -46085
4519 -46085 50874 32610 7351 -72505 -97709 30907 78367 -90358 33657 -43776 -35383
4508 -35383 -34894 -87927 -82250 -94521 -51313 -91652 -20887 186855 16674 10936 46590 77690
$$ packed form
4587B0816J09475r5001J2514j9668L0695j15700K8409m9336L5582O5851N8623
4576H2260l3845K333R577j6315k50016L5638J670J22062P5359k4980P2751K5455
4564A01949r6919J1315K3293R2471Q6220j07361K1871K6713j71814j12213j8276
4553a42751M6933K02234n5589j43196O5184J3570j4042K9533m6355J80015k8906
4542A06630j27201P2250M745q084Q7096m7920k1167r5564m316J6375j03705O9751
4530e1110N0991J20912p3395j43552J22745l7949m849j18785N750n3994J37151
4519d6085R6959j8264k5259p9856k5204J28616M7460j68725J24015p7433Q393
4508c5383M89n3033N677j2271M3208m0339P0765K07742j70181n738L5654L1100
$$ plain form
4496 77690 -47497 -93901 -15933 52389 141906 175959 121452 109010 12032 90011 -10115
4485 -10115 -6356 160378 152146 17728 -222354 -25264 -47728 31696 129532 100705 37032
4474 37032 -71599 -164767 -147033 -215153 -30500 -71477 -43816 -195700 -175395 -6370 30102
4463 30102 -20359 -29110 -17499 -51316 -51993 -56474 68421 -26938 -43221 38144 4270 -162579
4451 -162579 -88906 1382 133995 -40456 -35630 -28615 -44022 79592 -114396 -34309 83900
4440 83900 62597 -101938 -100879 -143528 -73812 -153398 -79692 -117464 -87201 -168891 -212536 -95726
4428 -95726 -23375 -105302 -96271 -132952 -92347 -86768 93212 47372 -72957 -196788 -197373 -63516
4416 -63516 -137240 -47213 68725 48955 84669 94167 -4233 -109327 -247083 11108 18755
$$ packed form
4496G7690j25187m6404P7968O8322Q9517L4053n4507j2442r6978P7979j00126
4485a0115L759J66734q232j34418k40082J97090k2464P9424R7836k8827o3673
4474C7032j08631r3168J7734o8120J84653m0977K7661j51884K0305J69025L6472
4463C0102n0461q751J1611l3817o77m481J24895r5359j6283Q1365l3874j66849
4451a62579P3673R0288J32613j74451M826P015j5407J23614j93988Q0087J18209
4440H3900k1303j64535J059m2649O9716p9586P3706l7772L0263q1690m3645J16810
4428i5726P2351q1927R031l6681M0605N579J79980m5840j20329j23831n85J33857
4416f3516p3724R0027J15938j9770L5714R498r8400j05094j37756K58191P647
$$ plain form
4405 18755 -7697 -61425 -12058 -69024 -121331 -23698 157832 64691 -110227 97020 -16286
4394 -16286 -20515 52396 -116284 -175219 -70434 -160957 -58038 -6965 -60769 -140551 -187956
4383 -187956 -85488 -116074 -39289 -22652 -89767 -125432 -118674 -183597 -63938 -128760 -106936
4372 -106936 -115616 -74363 -32704 42316 31177 -93129 -128144 -88215 -231530 -74733 54191
4361 54191 -36152 17460 -17766 -30198 -156775 -105708 -16326 -52843 -71077 -112392 -130866 9743
4349 9743 -34518 -15958 52277 -142823 -129626 -162617 6895 133674 162490 86597 19080
4338 19080 63321 61329 6597 62664 -112221 -77089 29983 92215 -81812 -91393 -49216 -37824
4326 -37824 -6304 -41604 -98802 1434 68710 24497 73807 274 170124 107531 -6662
$$ packed form
4405A8755k6452n3728M9367n6966n2307R7633J81530r3141j74918K07247j13306
4394a6286m229P2911j68680n8935J04785r0523J02919N1073n3804p9782m7405
4383a87956J02468l0586P6785J6637o7115l5665O758o4923J19659o4822K1824
4372a06936q680M1253M1659P5020j1139j24306l5015L9929j43315J56797J28924
4361E4191r0343N3612l5226j2432j26577N1067Q9382l6517j8234m1315j8474J40609
4349I743m4261J8560O8235j95100J3197l2991J69512J26779K8816p5893o7517
4338A9080M4241j992n4732N6067j74885L5132J07072O2232j74027r581M2177J1392
4326c7824L1520l5300n7198J00236O7276m4213M9310p3533J69850o2593j14193
$$ plain form
4315 -6662 -82469 -166143 -142197 -87491 -36344 78069 99187 150192 8809 19722 116249 14337
4303 14337 -39222 -9898 84910 46818 67523 63924 41316 23767 -58790 -29727 -140426 -69901
4291 -69901 51242 -58728 -21768 -24547 7832 70843 -60257 48646 84216 -12307 -57480
4280 -57480 155140 145334 -45925 -84572 -133107 -171185 -52994 29085 3100 26359 -101331
4269 -101331 25141 47144 75119 104504 89205 109539 55190 95861 -93125 -87117 -32102
4258 -32102 -101284 -19437 98935 29866 72642 142590 -17121 153715 188950 22817 142209
4247 142209 37563 145928 53752 -5823 103213 154283 141019 113937 219756 -118418 -80402
4236 -80402 -23301 76615 178183 96471 137784 226510 118257 172024 107697 166961 169416 57486
$$ packed form
4315f662p5807q3674K3946N4706N1147J14413K1118N1005j41383J0913R6527j01912
4303A4337n3559K9324R4808l8092K0705l599k2608j7549q2557K9063j10699P0525
4291f9901J21143j09970L6960k779L2379O3011j31100J08903L5570r6523m5173
4280e7480K12620r806j91259l8647m8535l8078J18191Q2079k5985K3259j27690
4269a01331J26472K2003K7975K9385j5299K0334n4349M0671j88986O008N5015
4258c2102o9182Q1847J18372o9069M2776O9948j59711J70836L5235j66133J19392
4247A42209j04646J08365r2176n9575J09036N1070j3264k7082J05819l38174L8016
4236h0402N7101R9916J01568q1712M1313Q8726j08253N3767o4327N9264K455j11930
$$ plain form
4224 57486 186362 155679 66538 286 122757 85267 29948 -46084 78619 107153 116685
4213 116685 156310 128322 251877 173324 216128 121594 -54790 66971 102859 27667 -34938
4202 -34938 121907 175431 117915 79576 75163 98812 13235 41426 96451 -39648 53531 139812
4190 139812 -35272 67831 49697 13073 -43409 70388 9626 9860 85452 9686 113544
4179 113544 90856 150564 53778 -27429 -144789 85721 87219 -51373 -133033 3014 59468
4168 59468 193185 71975 116728 47678 29820 153905 120577 54017 59878 84957 82685 -3314
4156 -3314 16081 49321 61816 79565 35491 123666 29575 42583 -51859 -39018 111147 188050
4144 188050 75896 100641 8898 -17892 -78171 64233 108858 47436 59222 91284 72359
$$ packed form
4224E7486J28876l0683q9141o6252J22471l7490n5319p6032J24703K8534R532
4213A16685L9625k7988J23555p8553M2804r4534j76384J21761L5888p5192o2605
4202c4938J56845N3524n7516l8339m413K3649q5577K8191N5025j36099R3179Q6281
4190A39812j75084J03103j8134l6624n6482J13797o0762K34P5592p5766J03858
4179A13544k2688N9708r6786q1207j17360K30510J498j38592q1660J36047N6454
4168E9468J33717j21210M4753o9050j7858J24085l3328o6560N861K5079k272q5999
4156c314J9395L3240J2495J7749m4074Q8175r4091J3008r4442J2841J50165P6903
4144A88050j12154K4745r1743k6790o0279J42404M4625o1422J1786L2062j8925
$$ plain form
4133 72359 2959 52098 28444 -26645 -129116 -97814 -11047 -31092 -35582 -152909 -14780
4122 -14780 -110145 -22147 -982 -33376 130871 67855 11376 32383 6426 34442 -73431
4111 -73431 -13878 14395 -23362 70455 112792 160670 97478 63937 206123 120423 46751 16086
4099 16086 81314 207191 251937 195652 26429 768 -107490 -134902 -26012 141052 76947
4088 76947 146302 27212 -134771 -109829 72352 -38348 97190 152647 77836 129659 24894
4077 24894 9731 -15341 48559 100938 57504 26451 -2751 -62881 36433 -58365 700 92795
4065 92795 44662 10596 45476 -53533 -11928 108375 -38606 5016 53515 79136 21644
4054 21644 136320 112379 -56759 -113627 70619 65721 -26793 72587 59737 -41763 14266
$$ packed form
4133G2359o9400M9139k3654n5089j02471L1302Q6767k0045m490j17327J38129
4122a4780r5365Q7998K1165l2394J64247o3016n6479K1007k5957K8016j07873
4111g3431N9553K8273l7757R3817M2337M7878o3192l3541J42186q5700p3672l0665
4099A6086O5228J25877M4746n6285j69223k5661j08258k7412J08890J67064o4105
4088G6947O9355j19090j61983K4942J82181j10700J35538N5457p4811N1823j04765
4077B4894j5163k5072O3900N2379m3434l1053k9202o0130R9314r4798N9065R2095
4065I2795m8133l4066L4880r9009M1605J20303j46981M3622M8499K5621n7492
4054B1644J14676k3941j69138n6868J84246m898r2514R9380j2850j01500N6029
$$ plain form
4043 14266 56312 73197 20280 -95035 1660 21080 60714 -8106 -61196 8872 -23410 -15916
4031 -15916 -41215 50022 221176 195284 195117 -101489 -15215 24396 6167 17540 5715 -38129
4019 -38129 -132416 -107512 73824 39535 133894 187026 22515 -77781 77582 138607 92732
4008 92732 192653 42359 49351 50320 131265 112876 -5533 104628 123986 87771 84649 59588
3996 59588 182751 213391 176695 193265 247674 217474 -21059 66069 132581 181088 178983 82459
3984 82459 83237 215954 191009 178817 178726 19014 52886 142203 175372 94935 101071 47828 195311
3971 195311 168315 65273 124935 154635 160360 151000 138826 168902 142157 210497 243541 302727
3959 302727 527026 550305 431920 379555 431037 451430 448707 373838 526596 515108 587252
$$ packed form
4043A4266M2046J6885n2917j15315R6695J9420L9634o8820n3090P0068l2282P494
4031a5916k5299R1237J71154k5892j67k96606Q6274L9611j8229J1373j1825m3844
4019c8129r4287K4904J81336l4289R4359N3132j64511j00296J55363O1025m5875
4008I2732R9921j50294O992R69Q0945j8389j18409J10161J9358l6215l122k5061
3996E9588J23163L0640l6696J6570N4409l0200k38533Q7128O6512M8507k105r6524
3984H2459P78J32717k4945j2192r1j59712L3872Q9317L3169q0437O136n3243J47483
3971A95311k6996j03042N9662K9700N725r360j2174L0076k6745O8340L3044N9186
3959C02727K24299K3279j18385n2365N1482K0393k723p4869J52758j1488P2144
$$ plain form
3948 587252 583893 566625 554508 416635 516962 638765 610665 646948 717226 832233 744635
3937 744635 599571 737575 761621 795489 710333 819767 910439 900241 802924 939286 1000381
3926 1000381 896437 894585 824159 820474 907688 723921 580741 502831 724898 632361 714911
3915 714911 650922 568854 581813 699919 700847 613931 547376 560453 476380 507695 636314 576513
3903 576513 463869 227599 206856 404105 392090 388063 442844 503469 484169 358703 143135
3892 143135 181037 269448 231291 318729 227330 309377 229485 60385 146522 121886 235978
3881 235978 365810 325123 353846 213436 193531 135364 49526 54703 175903 210874 199410
3870 199410 228351 243719 195703 184545 163662 169212 184810 164423 153079 38172 62248 166694
$$ packed form
3948E87252l359j7268j2117j37873J00327J21803k8100L6283P0278J15007q7598
3937G44635j45064J38004K4046L3868q5156J09434R0672j0198r7317J36362O1095
3926A000381j03944j852p0426l685Q7214j83767j43180p7910K22067r2537Q2550
3915G14911o3989q2068J2959J18106R28q6916o6555J3077q4073L1315J28619n9801
3903E76513j12644k36270k0743J97249j2015m027N4781O0625j9300j25466k15568
3892A43135L7902Q8411l8157Q7438r1399Q2047p9892j69100Q6137k4636J14092
3881B35978J29832m0687K8723j40410j9905n8167q5838N177J21200L4971j1464
3870A99410K8941J5368m8016j1158k0883N550J5598k0387j1344j14907K4076J04446
$$ plain form
3858 166694 256542 201718 132806 260138 244087 261177 241885 220185 106195 234815 205571
3847 205571 308235 330945 310188 275386 275742 201813 189627 209678 313672 300213 263377 213396
3835 213396 320391 250958 256242 195773 244202 196960 139256 160615 66972 147964 286053
3824 286053 255319 310952 338013 338314 395833 241364 252907 234909 444732 442358 444891 407034
3812 407034 384023 389793 226352 241266 271522 326258 326346 365093 387298 375408 328419 369008
3800 369008 376385 420511 436804 572162 549123 498616 514355 507848 593409 546937 507356 457246
3788 457246 503900 556208 674354 560948 604304 436646 419354 459955 554483 733977 674684
3777 674684 579713 617340 611934 482688 508508 547766 762055 846818 837087 652791 556430
$$ packed form
3858A66694Q9848n4824o8912J27332j6051J7090j9292k1700j13990J28620k9244
3847B05571J02664K2710k0757l4802L56p3929j2186K0051J03994j3459l6836m9981
3835B13396J06995o9433N284o0469M8429m7242n7704K1359r3643Q0992J38089
3824B86053l0734N5633K7061L01N7519j54469J1543j7998K09823k374K533l7857
3812D07034k3011N770j63441J4914L0256N4736Q8L8747K2205j1890m6989M0589
3800C69008P377M4126J6293J35358k3039n0507J5739o507Q5561m6472l9581n0110
3788D57246M6654N2308J18146j13406M3356j67658j7292M0601R4528J79494n9293
3777F74684r4971L7627n406j29246K5820L9258K14289Q4763r731j84296r6361
$$ plain form
3766 556430 711528 824626 828450 967908 846057 980191 1110177 890508 939113 975043
3756 975043 858793 902861 1056411 991993 1061751 1334114 1485204 1452321 1399273 1570994 1671831
3745 1671831 1617025 1755807 1644500 1861005 2031112 2067123 2077757 2275165 2365897 2364400 2402438
3734 2402438 2495186 2699719 3032906 3183017 3333550 3569424 3740184 4007884 4202738 4443278
3724 4443278 4841694 5196008 5553354 5895227 6317143 6613331 7020039 7602207 7948272 8437331
3714 8437331 8922722 9271725 9711446 9936316 10183042 10367615 10616057 10803069 11072811 11066506
3704 11066506 11298697 11747501 12129815 12597125 13146921 13628020 14230462 14567571 14721065
3695 14721065 14912434 14757902 14632237 14271655 13777767 13238233 12825591 12315711 11888016
$$ packed form
3766E56430J55098J13098L824J39458j21851J34134J29986k19669M8605L5930
3756I75043j16250M4068J53550o4418O9758K72363J51090l2883n3048J71721J00837
3745A671831n4806J38782j11307K16505J70107L6011J0634J97408R0732j497L8038
3734B402438R2748K04533L33187J50111J50533K35874J70760K67700J94854K40540
3724D443278L98416L54314L57346L41873M21916K96188M06708N82168L46065M89059
3714H437331M85391L49003M39721K24870K46726J84573K48442J87012K69742o305
3704A1066506K32191M48804L82314M67310N49796M81099O02442L37109J53494
3695A4721065J91369j54532j25665l60582m93888n39534m12642n09880m27695
$$ plain form
3686 11888016 11576365 11289876 11206795 11011073 10799439 10727297 10504884 10194667 10145071 9993607
3676 9993607 9440955 8997732 8495859 8009944 7469712 6940648 6484603 6050966 5752783 5370350
3666 5370350 4950674 4611356 4450125 4164216 3863668 3727425 3471809 3199193 3166583 2973371
3656 2973371 2834177 2567418 2468343 2476723 2363296 2194681 2052664 2006237 1918057 1953567 1808701
3645 1808701 1657562 1599541 1618554 1502095 1449604 1388207 1303895 1332162 1261300 1245161 1233113
3634 1233113 1232518 1339598 1161122 1264512 1204201 1041812 1036931 979361 849445 940003 795840
3623 795840 692205 678520 830320 780668 830881 741492 594094 562265 669496 725540 731400
3612 731400 596951 458139 571037 617972 623686 522047 269725 380697 419454 436611 403250
$$ packed form
3686A1888016l11651k86489q3081j95722k11634p2142k22413l10217m9596j51464
3676I993607n52652m43223n01873m85915n40232n29064m56045m33637k98183l82433
3666E370350m19676l39318j61231k85909l00548j36243k55616k72616l2610j93212
3656B973371j39194k66759r9075Q380j13427j68615j42017m6427q8180L5510j44866
3645A808701j51139n8021J9013j16459n2491o1397q4312K8267p0862j6139j2048
3634A233113n95J07080j78476J03390o0311j62389m881n7570j29916R0558j44163
3623G95840j03635j3685J51800m9652N0213q9389j47398l1829J07231N6044N860
3612G31400j34449j38812J12898M6935N714j01639k52322J10972L8757J7157l3361
$$ plain form
3601 403250 505244 538497 431176 430820 488334 426433 356784 339496 385437 341046 318508 364770
3589 364770 288295 285235 381713 337937 429539 238518 246587 321193 268052 358136 376340 354667
3577 354667 213725 397622 344778 371591 350008 276889 271851 258422 194154 238639 190731
3566 190731 323287 272689 207134 265713 400893 365435 403085 316109 288256 456052 495117
3555 495117 426850 361205 389589 495686 344286 406346 399458 378711 340288 305182 328037
3544 328037 351417 388456 372870 434647 439591 351840 304293 300561 331411 263023 341018 315635
3532 315635 470504 384806 477842 375598 452969 487388 405925 388135 422181 393244 373566
3521 373566 388942 452812 500242 401815 411465 389416 319811 233457 291253 391096 325565 291820
$$ packed form
3601D03250J01994L3253j07321l56N7514o1901o9649j7288M5941m4391k2538M6262
3589C64770p6475l060R6478m3776R1602j91021Q069P4606n3141R0084J8204k1673
3577C54667j40942J83897n2844K6813k1583p3119n038j3429o4268M4485m7908
3566A90731J32556n0598o5555N8579J35180l5458L7650q6976k7853J67796L9065
3555D95117o8267o5645K8384J06097j51400O2060o888k0747l8423l5106K2855
3544C28037K3380L7039j5586O1777M944q7751m7547l732L0850o8388P7995k5383
3532C15635J54869q5698R3036j02244P7371L4419q1463j7790L4046k8937j9678
3521C73566J5376O3870M7430r8427R650k2049o9605q6354N7796R9843o5531l3745
$$ plain form
3509 291820 176666 202290 301737 182790 245128 243865 177001 269637 383313 405979 394478
3498 394478 407999 222978 -57933 120604 101483 224012 123920 161908 143407 151696 190855
3487 190855 157100 150157 234748 139983 113732 155812 189098 234082 245882 98452 258392
3476 258392 251452 109109 112069 298769 288822 288350 331623 330057 274220 347697 273770 199688
3464 199688 174630 112395 204909 217286 343793 189264 166728 311373 71853 148333 199772
3453 199772 285654 386326 273202 254485 183520 226995 232861 233394 312189 278468 178036 178755
3441 178755 159893 296510 352851 291587 255053 333332 221985 170747 117009 207888 273653
3430 273653 228806 250235 237911 136475 219343 193335 289030 225661 181397 247482 109058
$$ packed form
3509B91820j15154K5624R9447j18947O2338j263o6864R2636J13676K2666j1501
3498C94478J3521j85021k80911J78537j9121J22529j00092L7988j8501Q289L9159
3487A90855l3755o943Q4591r4765k6251M2080L3286M4984J1800j47430J59940
3476B58392o940j42343K960J86700r947m72M3273j566n5837P3477p3927p4082
3464A99688k5058o2235R2514J2377J26507j54529k2536J44645k39520P6480N1439
3453A99772Q5882J00672j13124j8717p0965M3475N866N33P8795l3721j00432P19
3441A78755j8862J36617N6341o1264l6534P8279j11347n1238n3738R0879O5765
3430B73653m4847K1429j2324j01436Q2868k6008R5695o3369m4264O6085j38424
$$ plain form
3419 109058 64390 90916 190570 244874 192973 230248 203679 281383 254951 232334 362556
3408 362556 337743 279349 200029 197445 171605 255796 193793 105121 57978 12650 268351 314201
3396 314201 289061 336240 279175 399247 303151 384481 396605 243288 234817 166830 117461
3385 117461 88583 248325 219040 354133 293988 241981 342764 325134 491356 378193 220533
3374 220533 231540 140752 256547 302403 155286 144923 257244 255609 273320 245734 126802
3363 126802 185646 225250 282383 348764 380747 362582 488777 397254 442401 375567 425513
3352 425513 351415 262441 185050 145788 312819 268372 316037 142692 282238 325176 274347
3341 274347 303471 186214 221800 339953 253334 205760 284974 282006 400536 246366 276945
$$ packed form
3419A09058m4668K6526R9654N4304n1901L7275k6569P7704k6432k2617J30222
3408C62556k4813n8394p9320k584k5840Q4191o2003q8672m7143m5328K55701M5850
3396C14201k5140M7179n7065J20072r6096Q1330J2124j53317q471o7987m9369
3385A17461k8878J59742k9285J35093o0145n2007J00783j7630J66222j13163j57660
3374B20533J1007r0788J15795M5856j47117j0363J12321j635J7711k7586j18932
3363A26802N8844L9604N7133O6381L1983j8165J26195r1523M5147o6834M9946
3352D25513p4098q8974p7391l9262J67031m4447M7665j73345J39546M2938n0829
3341B74347K9124j17257L5586J18153q6619m7574P9214k968J18530j54170L0579
$$ plain form
3330 276945 361002 396176 372166 305875 344700 356511 305295 409179 274387 263857 364933
3319 364933 376719 390461 537192 514878 399744 472526 502214 460713 423646 448832 225589
3308 225589 221324 429840 481168 415534 427809 379406 296924 293348 447267 438134 399081 565897
3296 565897 422825 280310 351335 348434 395170 347573 367469 390170 412414 589968 544429
3285 544429 341182 331222 281982 339378 530171 681513 640386 574729 576654 486593 374298
3274 374298 465984 459587 390559 410589 446471 508519 635804 715020 648870 665559 603571 604791
3262 604791 609198 570949 613594 612083 623597 470180 575430 629146 550666 654952 730941
3251 730941 625943 667859 699829 736857 829512 910847 920257 741400 746349 935715 885413
$$ packed form
3330B76945Q4057L5174k4010o6291L8825J1811n1216J03884j34792j0530J01076
3319C64933J1786J3742J46731k2314j15134P2782K9688m1501l7067K5186k23243
3308B25589m265K08516N1328o5634J2275m8403q2482l576J53919r133l9053J66816
3296E65897j43072j42515P1025k901M6736m7597J9896K2701K2244J77554m5539
3285E44429k03247r960m9240N7396J90793J51342m1127o5657J925r0061j12295
3274C74298R1686o397o9028K0030L5882O2048J27285P9216o6150J6689o1988J220
3262F04791M407l8249M2645j511J1514j53417J05250N3716p8480J04286P5989
3251G30941j04998M1916L1970L7028R2655Q1335R410j78857M949J89366n0302
$$ plain form
3240 885413 904838 835200 977312 953687 853476 877200 826074 1045095 1024396 1030133 1022949
3229 1022949 1098232 1062833 1141203 1235598 1208630 1342659 1245253 1243362 1189697 1076290 1244687
3218 1244687 1399226 1413900 1517837 1644365 1574088 1549095 1824194 1896277 1891669 1984024 1907327
3207 1907327 2026154 2256098 2291554 2241442 2248920 2427199 2527362 2623569 2835899 2911177 2947176
3196 2947176 3036471 3175887 3456615 3696326 3806221 3924803 4081507 4328049 4624319 4796771
3186 4796771 5026542 5351760 5531859 5570348 5779815 6049533 6365098 6810527 7161569 7534051
3176 7534051 7950035 8530712 8912816 9306267 9804302 10485701 10979252 11435378 11632471 12055723
3166 12055723 12302945 12435221 12571574 12733833 12806374 12924489 13240303 13563547 13805376 14292441
$$ packed form
3240H85413J9425o9638J42112k3625j00211K3724n1126K19021k0699N737p184
3229A022949P5283l5399P8370R4395k6968J34029r7406j891n3665j13407J68397
3218A244687J54539J4674J03937J26528p0277k4993K75099P2083m608R2355p6697
3207A907327J18827K29944L5456n0112P478J78279J00163R6207K12330P5278L5999
3196B947176Q9295J39416K80728K39711J09895J18582J56704K46542K96270J72452
3186D796771K29771L25218J80099L8489K09467K69718L15565M45429L51042L72482
3176G534051M15984N80677L82104L93451M98035O81399M93551M56126J97093M23252
3166A2055723K47222J32276J36353J62259P2541J18115L15814L23244K41829M87065
$$ plain form
3156 14292441 14866248 15410100 15925480 16360073 16765747 16778528 16683655 16244300 15717780 15163719
3146 15163719 14530857 13970415 13409075 12846764 12372277 12032808 11633765 11445164 11246926
3137 11246926 11025428 10881108 10746253 10441943 10002453 9692117 9200244 8638849 8132234
3128 8132234 7757155 7298603 6926939 6597892 6184939 5822830 5630996 5380351 5060352 4776453
3118 4776453 4605878 4408513 4240180 4020699 3882346 3716761 3531129 3586672 3526898 3377176
3108 3377176 3302082 3264620 3124638 2886206 2922853 2815848 2764075 2846012 2813853 2687419 2673159
3097 2673159 2573424 2496742 2484574 2450773 2635237 2454924 2666837 2774784 2610881 2538227
3087 2538227 2288554 2360957 2290923 2318529 2446796 2338981 2345634 2344748 2198855 2298443 2415055
$$ packed form
3156A4292441N73807N43852N15380M34593M05674J2781r4873m39355n26520n54061
3146A5163719o32862n60442n61340n62311m74487l39469l99043j88601j98238
3137A1246926k21498j44320j34855l04310m39490l10336m91873n61395n06615
3128H132234l75079m58552l71664l29047m12953l62109j91834k50645l19999k83899
3118D776453j70575j97365j68333k19481j38353j65585j85632N5543n9774j49722
3108C377176p5094l7462j39982k38432L6647j07005n1773Q1937l2159j26434j4260
3097B673159r9735p6682j2168l3801J84464j80313K11913J07947j63903p2654
3087B538227k49673P2403p0034K7606J28267j07815O653q86j45893R9588J16612
$$ plain form
3076 2415055 2502928 2442922 2458919 2506092 2417060 2480923 2432780 2378944 2454033 2459502 2510006 2548601
3064 2548601 2581971 2615934 2566138 2524458 2620414 2744926 2722149 2704907 2768034 2729930 2680978
3053 2680978 2690426 2678302 2738514 2866387 2881556 2959255 2848699 2830280 2915303 2938501 3000694
3042 3000694 3024176 3030092 3022782 3100078 3162918 3190489 3111702 3101219 2976698 3140929 3194990
3031 3194990 3094340 3299320 3246011 3190071 3429803 3639144 3637376 3610787 3709274 3697453 3792452
3020 3792452 3778885 3705579 3862918 3872974 3958543 3941802 4182134 4178831 4197230 4190961 4232606
3009 4232606 4159162 4249859 4287047 4381786 4527229 4559018 4785279 4900483 5045095 4971996 4996230
2998 4996230 5079422 5239022 5383731 5365864 5481181 5608091 5549499 5845800 5987853 6115517
$$ packed form
3076B415055Q7873o0006J5997M7173q9032O3863m8143n3836P5089N469N0504L8595
3064B548601L3370L3963m9796m1680R5956J24512k2777j7242O3127l8104m8952
3053B680978R448j2124O0212J27873J5169P7699j10556j8419Q5023K3198O2193
3042C000694K3482N916p310P7296O2840K7571p8787j0483j24521J64231N4061
3031C194990j00650K04980n3309n5940K39732K09341j768k6589R8487j1821R4999
3020C792452j3567p3306J57339J0056Q5569j6741K40332l303J8399o269M1645
3009D232606p3444R0697L7188R4739J45443L1789K26261J15204J44612p3099K4234
2998D996230Q3192J59600J44709j7867J15317J26910n8592K96301J42053J27664
$$ plain form
2988 6115517 6088729 6413117 6495634 6484411 6646503 6817792 6935206 7141261 7381944 7791124
2978 7791124 8023675 7960817 8208074 8572224 8767278 9037564 9436678 9653110 9836193 10281887
2968 10281887 10684903 11103765 11486887 11816895 12312403 12729052 13359483 14031075 14601073
2959 14601073 15090128 15849610 16530017 17297610 17945920 18692610 19671725 20589972 21529002
2950 21529002 22655067 23723691 24680792 25678030 26823053 28151282 29496511 30938541
2942 30938541 32364364 33910418 35460788 37073370 38786803 40455171 41935836 43686025
2934 43686025 45419301 47514593 49765528 52422505 55572971 58817358 61924563 64966354
2926 64966354 67594895 70276706 72817770 75307442 78214816 81020836 84003883 86713969
$$ packed form
2988F115517k6788L24388Q2517j1223J62092J71289J17414K06055K40683M09180
2978G791124K32551o2858K47257L64150J95054K70286L99114K16432J83083M45694
2968A0281887M03016M18862L83122L30008M95508M16649O30431O71592N69998
2959A4601073M89055P59482O80407P67593O48310P46690R79115R18247R39030
2950B1529002J126065J068624R57101R97238J145023J328229J345229J442030
2942C0938541J425823J546054J550370J612582J713433J668368J480665J750189
2934D3686025J733276K095292K250935K656977L150466L244387L107205L041791
2926F4966354K628541K681811K541064K489672K907374K806020K983047K710086
$$ plain form
2918 86713969 89624893 92758264 95945648 99645504 103618232 108287078 113483702 119271016
2910 119271016 125514714 132357868 140311755 148938688 159076593 170880503 185271438 202454033
2902 202454033 223271402 248440855 279200221 318030732 368738478 429883053 484489435
2895 484489435 501949210 474521363 424303822 368629313 315620248 269244402 230582488
2888 230582488 199299762 174205861 153517659 136536389 122405452 110433954 100313349
2881 100313349 91814153 84655592 78367636 72787826 67750086 63131689 58951766 55227053
2873 55227053 51778206 48719296 45931409 43207232 40689133 38567783 36501416 34499515
2865 34499515 32463360 30706355 29054749 27555979 26188149 24756184 23565894 22581370
$$ packed form
2918H6713969K910924L133371L187384L699856L972728M668846N196624N787314
2910A19271016O243698O843154P953887Q626933J0137905J1803910J4390935J7182595
2902B02454033K0817369K5169453L0759366L8830511N0707746O1144575N4606382
2895D84489435J7459775k7427847n0217541n5674509n3009065m6375846l8661914
2888B30582488l1282726k5093901k0688202j6981270j4130937j1971498j0120605
2881A00313349q499196p158561o287956n579810n037740m618397m179923l724713
2873E5227053l448847l058910k787887k724177k518099k121350k066367k001901
2865C4499515k036155j757005j651606j498770j367830j431965j190290r84524
$$ plain form
2857 22581370 21518864 20627479 19653146 18872032 18110057 17366134 16579255 15959388 15384821
2848 15384821 14913842 14442374 13934602 13351590 12895468 12495143 11910572 11427219 10953764
2839 10953764 10629139 10198870 9973384 9707653 9438606 9122272 8846789 8553149 8319625
2830 8319625 8160526 7922188 7616536 7457359 7365868 7244583 6888320 6707097 6448801 6419838
2820 6419838 6265541 6137077 5970852 5987360 5779637 5612808 5489508 5316236 5335321 5213901
2810 5213901 5134433 4864966 4767260 4803497 4628940 4638783 4530669 4452089 4407365 4293224 4286620
2799 4286620 4238539 3972138 3938420 4120040 3907778 3798823 3814463 3796675 3668180 3600121
2789 3600121 3852128 3832446 3787429 3738409 3695449 3768909 3729120 3838468 3904397 3716749 3524423
$$ packed form
2857B2581370j062506q91385r74333p81114p61975p43923p86879o19867n74567
2848A5384821m70979m71468n07772n83012m56122m00325n84571m83353m73455
2839A0953764l24625m30269k25486k65731k69047l16334k75483k93640k33524
2830H319625j59099k38338l05652j59177r1491j21285l56263j81223k58296k8963
2820F419838j54297j28464j66225J6508k07723j66829j23300j73272J9085j21420
2810E213901p9468k69467r7706L6237j74557R843j08114p8580m4724j14141o604
2799D286620m8081k66401l3718J81620k12262j08955J5640j7788j28495o8059
2789C600121K52007j9682m5017m9020m2960P3460l9789J09348O5929j87648j92326
$$ plain form
2778 3524423 3377730 3234588 3081336 2939332 3062414 2927599 2806813 2588472 2566438 2463741
2768 2463741 2500788 2520841 2570873 2501650 2393615 2336122 2450865 2425072 2350962 2343680 2234091
2757 2234091 2242364 2085164 1940021 1807531 1769428 1805516 1807684 1754274 1641033 1587058 1533630
2746 1533630 1557719 1704951 1728194 1485916 1530385 1558320 1602645 1432558 1423353 1436914 1519068
2735 1519068 1606174 1545087 1429867 1367012 1484043 1480044 1434336 1473827 1502602 1352300 1512945
2724 1512945 1416947 1464754 1432907 1397148 1421203 1525870 1481878 1447260 1386836 1333036 1362191
2713 1362191 1406557 1417099 1426338 1376717 1500326 1430336 1290505 1359397 1414312 1354206 1398397
2702 1398397 1327094 1438253 1493507 1344799 1341115 1367022 1358879 1373174 1386062 1327627 1331860 1378125
$$ packed form
2778C524423j46693j43142j53252j42004J23082j34815j20786k18341k2034j02697
2768B463741L7047K0053N0032o9223j08035n7493J14743k5793p4110p282j09589
2757B234091Q273j57200j45143j32490l8103L6088K168n3410j13241n3975n3428
2746A533630K4089J47232K3243k42278M4469K7935M4325j70087r205J3561Q2154
2735A519068Q7106o1087j15220o2855J17031l999m5708L9491K8775j50302J60645
2724A512945r5998M7807l1847l5759K4055J04667m3992l4618o0424n3800K9155
2713A362191M4366J0542R239m9621J23609o9990j39831O8892N4915o0106M4191
2702A398397p1303J11159N5254j48708l684K5907q143J4295J2888n8435M233M6265
$$ plain form
2690 1378125 1430395 1304341 1317512 1318605 1287379 1332699 1421674 1333618 1271513 1242231 1318224
2679 1318224 1385248 1335026 1116319 1288909 1383663 1399362 1266523 1235730 1181152 1275883 1111391
2668 1111391 1179468 1221571 1144440 1135706 1281695 1179676 1149192 1225932 1085154 1150424 1122171
2657 1122171 1184955 1089121 1150457 1109287 1115747 1082802 1176750 1170356 1192009 1109933 1054210 1131021
2645 1131021 1143098 1045591 1140853 1060210 1067692 1043188 940569 1013082 1007406 941137 989964 1034689
2633 1034689 961247 908252 1018292 966010 989534 1007580 1035830 1121697 1165323 1086023 1086931 1062836
2621 1062836 969359 986609 1000746 984086 888348 854066 800511 864987 912324 769461 920067
2610 920067 895786 867160 890992 864455 936665 903591 808676 808324 863371 871787 984616 953949
$$ packed form
2690A378125N2270j26054J3171J093l1226M5320Q8975q8056o2105k9282P5993
2679A318224O7024n0222k18707J72590R4754J5699j32839l0793n4578R4731j64492
2668A111391O8077M2103p7131q734J45989j02019l0484P6740j40778O5270k8253
2657A122171O2784r5834O1336m1170O460l2945R3948o394K1653q2076n5723P6811
2645A131021J2077r7507R5262q0643P482k4504j02619P2513n676o6269M8827M4725
2633A034689p3442n2995J10040n2282K3524J8046K8250Q5867M3626p9300R08k4095
2621A062836r3477J7250J4137j6660r5738l4282n3555O4476M7337j42863J50606
2610I20067k4281k8626K3832k6537P2210l3074r4915l52N5047Q416J12829l0667
$$ plain form
2598 953949 841578 786223 975197 965304 834912 837198 879248 1016426 743745 725128 855736
2587 855736 798621 739227 788443 845553 962150 988888 941862 984848 886470 808701 731249
2576 731249 1037372 1000415 878245 921007 772851 786971 972876 980176 955437 920263 762282
2565 762282 868516 865167 797089 763498 715575 822739 857440 823951 844153 962839 983349
2554 983349 910484 877375 935318 724235 776182 735097 921383 833506 854882 869440 971357
2543 971357 1034170 926683 979756 999565 1084365 1151265 1161294 1099770 953563 1033327 1015691
2532 1015691 1050516 1340405 1320048 1416036 1384785 1341578 1232082 1184321 1246321 1339572 1372027
2521 1372027 1407208 1365064 1250199 1198866 1261841 1292666 1281492 1367948 1299486 1303666 1386972
$$ packed form
2598I53949j12371n5355J88974r893j30392K286M2050J37178k72681j8617J30608
2587H55736n7115n9394M9216N7110J16597K6738m7026M2986r8378p7769p7452
2576G31249L06123l6957j22170M2762j48156J4120J85905P300k4739l5174j57981
2565G62282J06234l349o8078l3591m7923J07164L4701l3489K0202J18686K0510
2554I83349p2865l3109N7943k11083N1947m1085J86286q7877K1376J4558J01917
2543I71357O2813j07487N3073J9809Q4800O6900J0029o1524j46207P9764j7636
2532A015691L4825K89889k0357R5988l1251m3207j09496m7761O2000R3251L2455
2521A372027L5181m2144j14865n1333O2975L0825j1174Q6456o8462M180Q3306
$$ plain form
2510 1386972 1395286 1277794 1228660 1209531 1157152 1246956 1241605 1223861 1181385 1118878 1203113 1296853
2498 1296853 1325565 1375640 1360022 1334896 1396776 1408389 1478899 1579701 1476426 1389424 1506465
2487 1506465 1532996 1584387 1567601 1523182 1649750 1726091 1812775 1786795 1927039 1946865 1980449
2476 1980449 1933277 2111057 2145473 2104498 2318703 2140687 2098680 2262066 2336853 2336772 2366226
2465 2366226 2408692 2416646 2500089 2855242 2991972 3023849 3194639 3199454 3377302 3512596 3716799
2454 3716799 3724590 4031027 4220856 4322158 4485942 4702555 4987733 5135163 5384117 5552090
2444 5552090 5738035 5940940 6081511 6271349 6433406 6513287 6839746 7116282 7308088 7524547
2434 7524547 7740319 7955303 8024706 8279586 8703441 8887082 9065957 9073178 9277504 9367192
$$ packed form
2510A386972Q314j17492m9134j9129n2379Q9804n351j7744m2476o2507Q4235R3740
2498A296853K8712N0075j5618k5126O1880J1613P0510J00802j03275q7002J17041
2487A506465K6531N1391j6786m4419J26568P6341Q6684k5980J40244J9826L3584
2476A980449m7172J77780L4416m0975K14205j78016m2007J63386P4787q1K9454
2465B366226M2466P954Q3443L55153J36730L1877J70790M815J77848J35294K04203
2454C716799P791L06437J89829J01302J63784K16613K85178J47430K48954J67973
2444E552090J85945K02905J40571J89838J62057P9881L26459K76536J91806K16459
2434G524547K15772K14984O9403K54880M23855J83641J78875P221K04326Q9688
$$ plain form
2424 9367192 9628643 9954705 9977695 10106202 10199783 10371557 10460108 10611466 10790361 10830320
2414 10830320 10922797 10899816 10988700 10988378 10861414 10983042 10952754 10989624 10907893 10790054 10757644
2403 10757644 10700592 10689496 10510712 10440287 10302590 10224151 10164549 9893377 9758906 9684439
2393 9684439 9472786 9257798 9163558 9039766 8782049 8679926 8600207 8289208 8047539 7891619
2383 7891619 7586899 7415903 7132593 6930054 6720129 6341197 6155756 6048971 5863521 5650452
2373 5650452 5484011 5259122 5110500 5056544 4902340 4725389 4528848 4491061 4232558 4047782
2363 4047782 3962996 3860592 3847580 3624542 3451827 3325096 3331636 3242599 3225211 3139306 3051883
2352 3051883 2924605 2838473 2808346 2872490 2716965 2673041 2754805 2634255 2713496 2672754 2595357
$$ packed form
2424I367192K61451L26062K2990J28507R3581J71774Q8551J51358J78895L9959
2414A0830320R2477k2981Q8884l22j26964J21628l0288L6870q1731j17839l2410
2403A0757644n7052j1096j78784p0425j37697p8439n9602k71172j34471p4467
2393I684439k11653k14988r4240j23792k57717j02123p9719l10999k41669j55920
2383G891619l04720j70996k83310k02539k09925l78932j85441j06785j85450k13069
2373E650452j66441k24889j48622n3956j54204j76951j96541l7787k58503j84776
2363D047782q4786j02404j3012k23038j72715j26731O540q9037j7388q5905q7423
2352C051883j27278q6132l0127O4144j55525m3924Q1764j20550P9241m0742p7397
$$ plain form
2341 2595357 2530400 2722251 2856725 2772360 2841874 3047744 3173859 3034204 3073986 3171269
2331 3171269 3378717 3466450 3631512 3837261 3953302 4260583 4569111 4838857 5106427 5289033
2321 5289033 5539649 5826735 6385076 6672541 7077823 7664289 8125862 8771495 9216497 9800723
2311 9800723 10541563 11291910 12078786 12898977 13975145 15238460 16481209 18212730 20089231
2302 20089231 22287102 24668799 27332190 29944933 32113643 34444738 36862756 39541136
2294 39541136 42765619 45926595 47926744 49127007 50203734 51771110 53588258 55422501
2286 55422501 55980095 54866590 52973558 51042841 49634617 48369773 46776991 44207658
2278 44207658 41017767 37682637 34873777 32270710 29960805 27683922 24875124 22119213
$$ packed form
2341B595357o4957J91851J34474q4365O9514K05870J26115j39655L9782R7283
2331C171269K07448Q7733J65062K05749J16041L07281L08528K69746K67570J82606
2321E289033K50616K87086N58341K87465M05282N86466M61573O45633M45002N84226
2311I800723P40840P50347P86876Q20191J076168J263315J242749J731521J876501
2302B0089231K197871K381697K663391K612743K168710K331095K418018K678380
2294C9541136L224483L160976K000149J200263J076727J567376J817148J834243
2286E5422501N57594j113505j893032j930717j408224j264844j592782k569333
2278D4207658l189891l335130k808860k603067k309905k276883k808798k755911
$$ plain form
2270 22119213 19644196 17487813 15591912 14057834 12905807 11844403 10825294 9801671
2262 9801671 9155106 8394893 7793387 7433844 7005724 6503189 6167306 5710205 5492843 5180066
2252 5180066 4955668 4589747 4454571 4298917 4013770 3806435 3606454 3507438 3227523 3153720
2242 3153720 3061274 3129298 2869141 2636007 2572692 2520417 2454219 2343246 2189772 2296627
2232 2296627 2224334 2018432 1969608 1966835 1892212 1625893 1450538 1467867 1520981 1548860 1592144
2221 1592144 1535902 1540322 1525277 1372201 1366054 1428742 1485173 1381071 1385528 1359837 1343522 1283672
2209 1283672 1219290 1280736 971843 881827 947781 1058968 1037964 968818 1021494 1120798 915118
2198 915118 875315 1001380 1040358 1048721 944387 1034728 961861 802429 882616 1028088 904325
$$ packed form
2270B2119213k475017k156383j895901j534078j152027j061404j019109j023623
2262I801671o46565p60213o01506l59543m28120n02535l35883m57101k17362l12777
2252E180066k24398l65921j35176j55654k85147k07335j99981r9016k79915p3803
2242C153720r2446O8024k60157k33134o3315n2275o6198j10973j53474J06855
2232B296627p2293k05902m8824k773p4623k66319j75355J7329N3114K7879M3284
2221A592144n6242M420j5045j53076o147O2688N6431j04102M457k5691j6315n9850
2209A283672o4382O1446l08893r0016O5954J11187k1004o9146N2676R9304k05680
2198I15118l9803J26065L8978Q363j04334R0341p2867j59432Q0187J45472j23763
$$ plain form
2187 904325 779379 843081 918058 901004 951181 844115 960159 830606 858784 812740 703355
2176 703355 655643 745229 720334 771073 692910 562100 667959 615220 681876 687757 697132 676029
2164 676029 676610 756558 756378 712338 788868 681537 681457 712339 647116 706113 702430 626579 663417
2151 663417 586700 499896 523558 585730 659960 562186 564038 615998 606072 463743 602863 620558
2139 620558 522760 548346 562807 627371 627998 586045 600566 689808 687424 629183 487100 628929
2127 628929 479934 614361 615562 490832 683896 685310 648170 597464 670044 623217 641798
2116 641798 660086 700175 654151 728988 744593 646685 612451 613785 747093 712943 777560 649668
2104 649668 662181 865362 926146 784120 740258 855488 864212 954015 831776 798568 997220
$$ packed form
2187I04325j24946O3702P4977j7054N0177j07066J16044j29553K8178m6044j09385
2176G03355m7712Q9586k4895N0739p8163j30810J05859n2739O6656N881R375k1103
2164F76029N81P9948j80m4040P6530j07331q0L0882o5223N8997l683p5851L6838
2151F63417p6717q6804K3662O2172P4230r7774J852N1960r926j42329J39120J7695
2139F20558r7798K5586J4461O4564O27m1953J4521Q9242k384n8241j42083J41829
2127F28929j48995J34427J201j24730J93064J414l7140n0706P2580m6827J8581
2116F41798J8288M0089m6024P4837J5605r7908l4234J334J33308l4150O4617j27892
2104F49668J2513K03181O0784j42026m3862J15230Q724Q9803j22239l3208J98652
$$ plain form
2093 997220 1093097 952438 1014844 1022858 967408 1067561 1113308 1208783 1332624 1406287 1376953
2082 1376953 1481694 1529533 1541833 1794222 1800577 1887590 2032089 1952868 2064958 2252423 2388642
2071 2388642 2578022 2702767 2807531 2952962 3137591 3385972 3553486 3737138 4170374 4433463
2061 4433463 4534568 4781226 5185085 5444854 5610251 5825189 6136416 6461789 6648113 6762503
2051 6762503 7060184 7354179 7482737 7706874 7962857 8144162 8323976 8536627 8618987 8707499
2041 8707499 8656160 8841349 8668401 8616993 8665934 8632978 8564877 8306751 8280491 8117378 7965598
2030 7965598 7665929 7489821 7386580 7189471 6775159 6653230 6538452 6176946 5939301 5632170
2020 5632170 5572203 5360460 5105473 4892831 4733143 4690972 4619848 4528814 4519363 4505133 4441981
$$ packed form
2093I97220R5877j40659O2406Q014n5450J00153M5747R5475J23841P3663k9334
2082A376953J04741M7839J2300K52389O355Q7013J44499p9221J12090J87465J36219
2071B388642J89380J24745J04764J45431J84629K48381J67514J83652M33236K63089
2061D433463J01105K46658M03859K59769J65397K14938L11227L25373J86324J14390
2051F762503K97681K93995J28558K24137K55983J81305J79814K12651Q2360Q8512
2041H707499n1339J85189j72948n1408M8941l2956o8101k58126k6260j63113j51780
2030G965598k99669j76108j03241j97109m14312j21929j14778l61506k37645l07131
2020E632170n9967k11743k54987k12642j59688m2171p1124r1034r451j4230o3152
$$ plain form
2009 4441981 4499437 4674033 4810526 5107990 5453270 5811592 6352415 7458547 8744410
2000 8744410 9223800 8505422 7558936 6536120 5530649 4715624 4134916 3503861 3049352
1991 3049352 2780149 2456638 2456072 2323866 2132460 1957252 1786104 1679836 1554848 1600417
1981 1600417 1501041 1474102 1327252 1304930 1085004 1110100 1339139 1264828 1214488 1134755 1099648
1970 1099648 967629 923903 971090 877991 915043 902153 853993 867289 872698 778943 705512
1959 705512 670207 669996 611616 608109 746979 624845 819224 834733 703625 619838 615290 597389
1947 597389 592108 582466 512294 516830 592082 636883 562806 646094 635825 517574 459045 428441
1935 428441 450927 384553 550561 640417 472459 408200 491457 440235 453507 360316 458255
$$ packed form
2009D441981N7456J74596J36493K97464L45280L58322N40823J106132J285863
2000H744410M79390p18378r46486j022816j005471q15025n80708o31055m54509
1991C049352k69203l23511n66j32206j91406j75208j71148j06268j24988M5569
1981A600417r9376k6939j46850k2322k19926K5096K29039p4311n0340p9733l5107
1970A099648j32019m3726M7187r3099L7052j2890m8160J3296N409r3755p3431
1959G05512l5305k11n8380l507J38870j22134J94379J5509j31108q3787m548j7901
1947E97389n281r642p0172M536P5252M4801p4077Q3288j0269j18251n8529l0604
1935D28441K2486o6374J66008Q9856j67958o4259Q3257n1222J3272r3191R7939
$$ plain form
1924 458255 557458 709052 577791 588554 595071 553846 400912 417639 561749 539278 520822
1913 520822 471059 388045 455168 390304 404045 301618 403623 540780 511552 558252 375485
1902 375485 427630 455459 442881 406204 523182 531796 385391 468134 500440 401080 401255 398650
1890 398650 316710 427493 265810 345150 466039 441195 436732 323893 362087 461627 313319
1879 313319 296059 492136 472771 400355 433734 411432 355828 416373 412669 403447 319228 624922
1867 624922 564477 566566 509258 514485 462688 437547 482639 469237 456946 469716 455504 454329
1855 454329 421739 471796 522544 401368 421216 354778 315917 378071 485235 499603 491215
1844 491215 428507 367037 410180 504042 400177 580993 587539 581198 561729 399207 535702
$$ packed form
1924D58255R9203J51594j31261J0763O517m1225j52934J6727J44110k2471j8456
1913E20822m9763q3014O7123o4864J3741j02427J02005J37157k9228M6700j82767
1902C75485N2145K7829j2578l6677J16978Q614j46405Q2743L2306r9360J75k605
1890C98650q1940J10783j61683P9340J20889k4844m463j12839L8194R9540j48308
1879C13319j7260J96077j9365p2416L3379k2302n5604O0545l704r222q4219L05694
1867F24922o0445K089n7308N227n1797k5141M5092j3402j2291J2770j4212j175
1855D54329l2590N0057N0748j21176J9848o6438l8861O2154J07164J4368q388
1844D91215o2708o1470M3143R3862j03865J80816O546o341j9469j62522J36495
$$ plain form
1833 535702 654074 691998 654150 518754 599271 522373 586711 798637 634083 581571 707859
1822 707859 676926 629701 721885 589187 560205 599975 546615 475879 590717 611488 640279
1811 640279 543249 623718 748249 671065 657937 725982 671661 611082 548981 585720 675424
1800 675424 604048 557530 637912 690498 640713 642105 817742 823938 929315 967425 965560 957054
1788 957054 929874 1047886 896064 945805 880942 933581 1138567 1081991 974531 982699 1115126
1777 1115126 1155835 1169235 1028598 1007578 992518 990620 1055668 1149475 1158683 1193218 1274937 1005182
1765 1005182 994162 1171963 1271095 1198440 1143859 1255483 1336227 1281057 1395866 1365541 1227490
1754 1227490 1399464 1489145 1463633 1387972 1461157 1592892 1727604 1822363 1832090 1780764 1888049
$$ packed form
1833E35702J18372L7924l7848j35396Q0517p6898O4338K11926j64554n2512J26288
1822G07859l0933m7225R2184j32698k8982L9770n3360p0736J14838K0771K8791
1811F40279r7030Q0469J24531p7184j3128O8045n4321o0579o2101L6739Q9704
1800F75424p1376m6518Q0382N2586m9785J392J75637O196J05377L8110j865q506
1788I57054k7180J18012j51822M9741o4863N2639K04986n6576j07460Q168J32427
1777A115126M0709J3400j40637k1020j5060j898O5048R3807R208L4535Q1719k69755
1765A005182j1020J77801R9132p2655n4581J11624Q0744n5170J14809l0325j38051
1754A227490J71974Q9681k5512p5661P3185J31735J34712R4759R727n1326J07285
$$ plain form
1743 1888049 1888334 1901737 1957297 1987155 2046629 2172763 2439002 2429271 2532016 2684329 2795861
1732 2795861 2968204 3062665 3147653 3406819 3512617 3654574 3921180 4096689 4414380 4605704
1722 4605704 4874477 5018763 5163496 5468340 5946880 6246678 6486885 6994438 7422598 7714005
1712 7714005 8092450 8648428 9298826 9980718 10660291 11280254 12018475 12840713 13551872 14393198
1702 14393198 15186065 16155057 16859483 17513184 18175084 18646075 18930497 19096635 19342824
1693 19342824 19293329 19206411 19048334 18884668 18425946 18060501 17639034 17167683 16469317 15691274
1683 15691274 14966259 13976285 13102889 12366847 11598851 10823876 10161484 9573341 8939018
1674 8939018 8431690 7827864 7379291 7043201 6694562 6338266 5993574 5824505 5631206 5422790
$$ packed form
1743A888049K85J3403N5560K9858N9474J26134K66239r731J02745J52313J11532
1732B795861J72343R4461Q4988K59166J05798J41957K66606J75509L17691J91324
1722D605704K68773J44286J44733L04844M78540K99798K40207N07553M28160K91407
1712G714005L78445N55978O50398O81892O79573O19963P38221Q22238P11159Q41326
1702A4393198P92867R68992P04426O53701O61900M70991K84422J66138K46189
1693A9342824m9495q6918j58077j63666m58722l65445m21467m71351o98366p78043
1683A5691274p25015r89974q73396p36042p67996p74975o62392n88143o34323
1674H939018n07328o03826m48573l36090l48639l56296l44692j69069j93299k08416
$$ plain form
1664 5422790 5174315 4924228 4959571 4971132 4751782 4654503 4352388 4263571 4136797 4020885
1654 4020885 3860737 3811621 3801377 3604288 3541267 3815468 3689809 3603501 3473732 3387223
1644 3387223 3393411 3335761 3299116 3232844 3180839 3143601 3099086 3273389 3175350 3122720 3338767
1633 3338767 3474478 3322127 3430422 3186782 3288715 3421914 3510380 3517870 3527242 3633912
1623 3633912 3607161 3791234 3895449 4058293 4090536 4166246 4474194 4552345 4719071 5036140
1613 5036140 5293679 5485088 5750215 6113183 6242421 6462417 6658643 6826824 7025839 7033556
1603 7033556 7112121 7224611 7276546 7447303 7553934 7611335 7610382 7877013 8099725 8433962 8728596
1592 8728596 8883072 9185229 9603378 10106965 10569326 10932690 11405773 11985548 12616319 13122176
$$ packed form
1664E422790k48475k50087L5343J1561k19350r7279l02115q8817j26774j15912
1654D020885j60148m9116j0244j97089o3021K74201j25659q6308j29769q6509
1644C387223O188n7650l6645o6272n2005l7238m4515J74303r8039n2630K16047
1633C338767J35711j52351J08295k43640J01933J33199Q8466P490R372J06670
1623C633912k6751J84073J04215J62844L2243P5710L07948P8151J66726L17069
1613E036140K57539J91409K65127L62968J29238K19996J96226J68181J99015P717
1603G033556P8565J12490N1935J70757J06631N7401r53K66631K22712L34237K94634
1592H728596J54476L02157M18149N03587M62361L63364M73083N79775O30771N05857
$$ plain form
1582 13122176 13900047 14913683 15919401 16782940 17790494 18840009 20084562 21269287
1574 21269287 22649192 24142650 25619687 27060414 28492602 29818627 31090579 32212838
1566 32212838 32891923 33380191 33929947 34186005 34206209 34135981 33847295 33525590 32936289 32072778
1556 32072778 31295794 30339807 29225575 27979202 26629416 25347983 23983464 22451691
1548 22451691 20984042 19690761 18468162 17177538 16097141 15230462 14443398 13567550 12765090
1539 12765090 12043933 11533536 11023678 10564577 10003918 9718575 9246484 8996406 8757361
1530 8757361 8631555 8526332 8335402 8092773 7857283 7716868 7816832 7713870 7821705 7765742
1520 7765742 7662580 7712291 7695371 7673469 7605170 7555560 7368358 7185645 7001440 6869523
$$ packed form
1582A3122176P77871J013636J005718Q63539J007554J049515J244553J184725
1574B1269287J379905J493458J477037J440727J432188J326025J271952J122259
1566C2212838O79085M88268N49756K56058K0204p0228k88686l21705n89301q63511
1556C2072778p76984r55987j114232j246373j349786j281433j364519j531773
1548B2451691j467649j293281j222599j290624j080397q66679p87064q75848q02460
1539A2765090p21157n10397n09858m59101n60659k85343m72091k50078k39045
1530H757361j25806j05223j90930k42629k35490j40415R9964j02962J07835n5963
1520G765742j03162M9711j6920k1902o8299m9610j87202j82713j84205j31917
$$ plain form
1510 6869523 6759124 6555085 6244440 6165066 5974403 5813817 5686551 5644616 5456899 5352450
1500 5352450 5235511 5385215 5304957 5281968 5337565 5351898 5400734 5457906 5526605 5638653 5581758
1489 5581758 5722662 5894849 6034189 6263534 6651714 6703584 6805156 7071571 7348745 7558533
1479 7558533 7839180 8272938 8696025 8951751 9324386 9713786 10185596 10682899 11161053 11645771
1469 11645771 12369710 13066351 13763981 14588813 15513256 16518371 17557087 18672064 19939134
1460 19939134 21301754 22736255 24293433 25973889 27871999 29577089 31363240 33065203
1452 33065203 34559506 36023317 37115505 38138450 38868361 39322483 39606951 39615357 39402968
1443 39402968 39093393 38689365 37962156 37072815 35978891 34593720 32849484 31229533 29511220
$$ packed form
1510F869523j10399k04039l10645p9374j90663j60586j27266m1935j87717j04449
1500E352450j16939J49704q0258k2989N5597J4333M8836N7172O8699J12048n6895
1489E581758J40904J72187J39340K29345L88180N1870J01572K66415K77174K09788
1479G558533K80647M33758M23087K55726L72635L89400M71810M97303M78154M84718
1469A1645771P23939O96641O97630Q24832R24443J005115J038716J114977J267070
1460A9939134J362620J434501J557178J680456J898110J705090J786151J701963
1452C3065203J494303J463811J092188J022945P29911M54122K84468Q406k12389
1443C9402968l09575m04028p27209q89341j093924j385171j744236j619951j718313
$$ plain form
1434 29511220 27689901 26020262 24254790 22602132 21065066 19669222 18403897 17365234
1426 17365234 16383152 15287379 14426278 13627075 12887948 12321829 11759330 11203525 10692540
1417 10692540 10193945 9748713 9353322 9023446 8681653 8344475 8040394 7806306 7452989
1408 7452989 7242335 6995658 6633824 6508397 6370526 6173533 6029456 5956516 5776430 5686117
1398 5686117 5576570 5534937 5390742 5312419 5362220 5253641 5238751 5356648 5316383 5245922 5210188
1387 5210188 5357255 5522191 5492830 5686475 5699994 5598023 5668357 5755946 5704183 5660289 5730081
1376 5730081 5553760 5400146 5228848 5120179 5179224 5173112 5172564 5185279 5212688 5417521 5544456
1365 5544456 5719255 5764991 5657895 5897413 5963706 6253683 6401040 6590536 6810512 6886476
$$ packed form
1434B9511220j821319j669639j765472j652658j537066j395844j265325j038663
1426A7365234r82082j095773q61101p99203p39127n66119n62499n55805n10985
1417A0692540m98595m45232l95391l29876l41793l37178l04081k34088l53317
1408G452989k10654k46677l61834j25427j37871j96993j44077p2940j80086r0313
1398E686117j09547m1633j44195p8323M9801j08579j4890J17897m0265p0461l5734
1387E210188J47067J64936k9361J93645J3519j01971P0334Q7589n1763m3894O9792
1376E730081j76321j53614j71298j08669N9045o112n48J2715K7409K04833J26935
1365E544456J74799M5736j07096K39518O6293K89977J47357J89496K19976P5964
$$ plain form
1355 6886476 7051236 7361932 7866471 8173386 8357484 8814368 9209277 9840560 10400404 10938930
1345 10938930 11608538 12175933 12893474 13481082 13939418 14589847 14875379 15117163 15185392 15362415
1335 15362415 15389171 15312532 15194913 15063948 15047722 14959994 15013726 14893538 14856911 14796419 15005409
1324 15005409 15000317 14865612 14656274 14354780 13853141 13451241 12912407 12335575 11701192 10898492
1314 10898492 10186380 9661078 9080057 8554043 8150832 7602072 7153679 6730630 6303059
1305 6303059 5990252 5780213 5555810 5293059 5104150 5075447 4926646 4590387 4635183 4570289
1295 4570289 4353435 4407899 4162355 4032366 3943377 3933525 3944272 4045456 4072214 4101801 4228426
1284 4228426 4319007 4387256 4393019 4359237 4277387 4314189 4439301 4495929 4448628 4325049 4189162
$$ packed form
1355F886476J64760L10696N04539L06915J84098M56884L94909O31283N59844N38526
1345A0938930O69608N67395P17541N87608M58336O50429K85532K41784O8229J77023
1335A5362415K6756p6639j17619j30965j6226q7728N3732j20188l6627o0492K08990
1324A5005409n092j34705k09338l01494n01639m01900n38834n76832o34383q02700
1314A0898492p12112n25302n81021n26014m03211n48760m48393m23049m27571
1305F303059l12807k10039k24403k62751j88909k8703j48801l36259M4796o4894
1295D570289k16854N4464k45544j29989q8989r852J0747J01184K6758K9587J26625
1284D228426R0581O8249N763l3782q1850L6802J25112N6628m7301j23579j35887
$$ plain form
1273 4189162 4103408 3846391 3695434 3571338 3349047 3118235 3089226 2989770 2815851 2777036
1263 2777036 2701369 2596207 2612654 2663110 2506398 2675471 2721344 2753679 2756587 2632160 2536518
1252 2536518 2513751 2363236 2245195 2180885 2243093 2207285 2332790 2295456 2255937 2055745 2061133
1241 2061133 2064185 2071254 2211262 2201117 2167499 2161091 2318468 2236004 2286608 2399161 2416856
1230 2416856 2306827 2234281 2357725 2386244 2258779 2282030 2362127 2548399 2565659 2593277 2565815
1219 2565815 2435011 2434326 2698478 2685381 2785719 2909146 2911219 2960779 2993182 2954870 3098235
1208 3098235 3154237 3180202 3266591 3213147 3496077 3656300 3600235 3671802 3853164 3928117 4017196
1197 4017196 4328381 4492295 4708250 5043676 5304790 5516035 5889614 6202661 6615120 6832344
$$ packed form
1273D189162q5754k57017j50957j24096k22291k30812k9009r9456j73919l8815
1263B777036p5667j05162J6447N0456j56712J69073M5873L2335K908j24427r5642
1252B536518k2767j50515j18041o4310O2208l5808J25505l7334l9519k00192N388
1241B061133L052P069J40008j0145l3618o408J57377q2464N0604J12553J7695
1230B416856j10029p2546J23444K8519j27465K3251Q0097J86272J7260K7618k7462
1219B565815j30804o85K64152j3097J00338J23427K073M9560L2403l8312J43365
1208C098235N6002K5965Q6389n3444K82930J60223n6065P1567J81362P4953Q9079
1197D017196L11185J63914K15955L35426K61114K11245L73579L13047M12459K17224
$$ plain form
1187 6832344 7373148 7732120 8490338 8999574 9508352 10020421 10569820 11311950 11914566 12534280
1177 12534280 13306157 14167706 15179278 16138842 17013691 18262903 19384998 20786060 22154670
1168 22154670 23730152 25634568 27606763 29762002 32121201 34692082 37821233 41415448
1160 41415448 45299159 49612242 54567312 60039069 66168087 72548156 78745632 84113768
1152 84113768 87224927 87636474 85326887 80832683 74957503 68430213 61895318 55934589
1144 55934589 50294060 45284556 41055156 37156675 33811954 30922067 28447374 26160673
1136 26160673 24251274 22502077 20856766 19324328 18183011 16944021 15903933 15164287
1128 15164287 14293192 13482140 12715403 11907554 11293035 10663769 10218963 9571611 9084687
$$ packed form
1187F832344N40804L58972P58218N09236N08778N12069N49399P42130O02616O19714
1177A2534280P71877Q61549J011572R59564Q74849J249212J122095J401062J368610
1168B2154670J575482J904416J972195K155239K359199K570881L129151L594215
1160D1415448L883711M313083M955070N471757O129018O380069O197476N368136
1152H4113768L111159M11547k309587m494204n875180o527290o534895n960729
1144E5934589n640529n009504m229400l898481l344721k889887k474693k286701
1136B6160673j909399j749197j645311j532438j141317j238990j040088p39646
1128A5164287q71095q11052p66737q07849o14519o29266m44806o47352m86924
$$ plain form
1119 9084687 8658405 8362463 7975591 7529735 7153367 6853479 6818014 6303406 5948417 5821626
1109 5821626 5555819 5392692 5039938 4904489 4584014 4421388 4296538 4227117 4029659 3845453
1099 3845453 3769104 3607635 3565284 3348391 3232472 3167518 3123892 2999054 2981139 2858972
1089 2858972 2699503 2645693 2504257 2298402 2251118 2272411 2184251 2218194 2204365 1939169 1997169
1078 1997169 1838986 1920836 1885625 1804506 1822769 1896695 1865811 1759566 1758200 1669019 1780807
1067 1780807 1487591 1339789 1404096 1369073 1315280 1309769 1395062 1287377 1264441 1366166 1192372
1056 1192372 1266935 1157263 1047310 1183000 1230029 1146898 1150440 1078309 1038132 1043484 1061337
1045 1061337 1048848 1041200 1022062 913001 952797 895625 868036 786277 898489 845148 764914
$$ packed form
1119I084687m26282k95942l86872m45856l76368k99888l5465n14608l54989j26791
1109E821626k65807j63127l52754j35449l20475j62626j24850o9421j97458j84206
1099C845453p6349j61469m2351k16893j15919o4954m3626j24838j7915j22167
1089B858972j59469n3810j41436k05855m7284K1293q8160L3943j3829k65196N8000
1078A997169j58183Q1850l5211q1119J8263P3926l0884j06245j366q9181J11788
1067A780807k93216j47802O4307l5023n3793n511Q5293j07685k2936J01725j73794
1056A192372P4563j09672j09953J35690M7029q3131L542p2131m0177N352J7853
1045A061337j2489p648j9138j09061L9796n7172k7589q1759J12212n3341q0234
$$ plain form
1034 764914 792033 820993 659768 646900 686763 622330 622321 758307 707155 570084 577102 706570
1022 706570 721585 662454 561110 560745 612165 661797 574945 517961 632000 591943 527973 516880
1010 516880 429537 399739 446976 525383 611850 552260 562390 507209 374482 391061 519991
999 519991 589567 402531 435772 380043 405132 495864 361385 436947 491150 475902 439982
988 439982 445555 544290 389804 337042 444994 485436 515086 488894 424788 339352 372747 282326
976 282326 261091 290768 243098 349810 469568 379132 341280 395631 420027 343999 429735
965 429735 442929 311290 262583 521414 566960 434436 434729 458555 352120 394011 476919
954 476919 436810 478951 483833 477367 640697 673258 564100 498275 572470 768235 709076 674177
$$ packed form
1034G64914K7119K8960j61225j2868L9863o4433rJ35986n1152j37071P018J29468
1022G06570J5015n9131j01344l65N1420M9632q6852n6984J14039m0057o3970j1093
1010E16880q7343k9798M7237P8407Q6467n9590J0130n5181j32727J6579J28930
999E19991O9576j87036L3241n5729K5089R0732j34479P5562N4203j5248l5920
988D39982N573R8735j54486n2762J07952M0442K9650k6192o4106q5436L3395r0421
976B82326k1235K9677m7670J06712J19758r0436l7852N4351K4396p6028Q5736
965D29735J3194j31639m8707K58831M5546j32524K93K3826j06435M1891Q2908
954D76919m0109M2141M882o466J63330L2561j09158o5825P4195J95765n9159l4899
$$ plain form
942 674177 763550 771224 735578 742478 671947 721088 585877 563143 554405 477415 603740 553727
930 553727 487108 502792 490674 386766 320243 336063 424885 357003 326884 317550 455759 413085
918 413085 368040 304959 195224 225178 139726 175436 270193 226952 215078 299005 282697 207276
906 207276 301559 373950 264901 258232 204029 181250 217685 303609 161932 301167 270978
895 270978 152656 184799 127127 175736 130855 175737 116069 124881 270079 259549 41386
884 41386 8098 77756 229600 242665 174947 139111 144810 79904 13994 99697 153017 71748
872 71748 130611 112688 189910 267366 270104 161063 81868 161307 157921 120297 213844 151247
860 151247 33074 -39167 4454 129956 194308 110193 78628 304314 149357 143204 138219
$$ packed form
942F74177Q9373P674l5646O900p0531M9141j35211k2734q738p6990J26325n0013
930E53727o6619J5684j2118j03908o6523J5820Q8822o7882l0119r334J38209m2674
918D13085m5045o3081j09735K9954q5452L5710R4757m3241j1874Q3927j6308p5421
906B07276R4283P2391j09049o669n4203k2779L6435Q5924j41677J39235l0189
895B70978j18322L2143n7672M8609m4881M4882n9668Q812J45198j0530k18163
884D1386l3288O9658J51844J3065o7718l5836N699o4906o5910Q5703N3320q1269
872G1748N8863j7923P7222P7456K738j09041p9195P9439l386l7624R3547o2597
860A51247j18173p2241M3621J25502O4352q4115l1565K25686j54957o153m985
$$ plain form
849 138219 35738 12661 -65730 -26182 79653 176776 165200 212703 156636 225410 254192
838 254192 182349 248757 118003 137216 134579 136493 -34429 41400 12581 143290 237989 53935
826 53935 69782 89222 131402 127644 84677 147582 111917 -43700 2757 23106 -2686 209953
814 209953 240443 187632 51448 -2417 94795 201408 245551 144383 125532 77308 54034
803 54034 79287 61129 55221 -62253 9594 62858 182611 33900 5620 73257 43223 226908
791 226908 56582 -44071 24480 17324 45271 157423 220892 121285 93548 35072 83420
780 83420 77270 91514 16575 57209 1567 -12138 187599 136292 3370 37021 117557 135205
768 135205 239300 236312 65402 180490 117718 86076 144866 63252 70320 88578 -54478
$$ packed form
849A38219j02481k3077p8391L9548J05835R7123j1576M7503n6067O8774K8782
838B54192p1843O6408j30754J9213k637J914j70922P5829k8819J30709R4699j84054
826E3935J5847J9440M2180l758m2967O2905l5665j55617M6457K0349k5792K12639
814B09953L0490n2811j36184n3865R7212J06613M4143j01168j8851m8224k3274
803E4034K5253j8158n908j17474P1847N3264J19753j48711k8280O7637l0034J83685
791B26908j70326j00653O8551p156K7947J12152O3469r9607k7737n8476M8348
780H3420o150J4244p4939M0634n5642j3705J99737n1307j32922L3651Q0536J7648
768A35205J04095k988j70910J15088o2772l1642N8790q1614P068J8258j43056
$$ plain form
757 -54478 -102535 -9663 -10536 71406 -12017 -117297 -92395 83097 150712 82961 71404 63071
745 63071 82645 134387 145152 32044 -39611 3665 18145 194686 33689 158533 141885
734 141885 64156 66528 273183 166224 120572 -19480 16707 45415 -148350 -64397 -10227
723 -10227 88493 86405 46250 137 30390 176045 274615 212435 43367 102110 43512 -16233
711 -16233 -137669 5329 -49237 11092 8944 -7450 184523 176494 173015 120099 56027 69507
699 69507 134940 77632 69282 19565 -47647 -38068 41905 -80807 -77328 -76252 -181552 -128633
687 -128633 -31622 -37572 -11020 32047 71003 47064 -7934 89018 72370 149675 131405 82248
675 82248 64944 -29552 -175948 87751 74753 -14778 29392 55408 113515 61553 33659 114297
$$ packed form
757e4478m8057R2872q73Q1942q3423j05280K4902J75492O7615o7751j1557q333
745F3071J9574N1742J0765j13108p1655M3276J4480J76541j60997J24844j6648
734A41885p7729K372K06655j06959m5652j40052L6187K8708j93765Q3953N4170
723a0227R8720k088m0155m6113L0253J45655R8570o2180j69068N8743n8598n9745
711a6233j21436J42998n4566O0329k148j6394J91973q029l479n2916o4072J3480
699F9507O5433n7308q350m9717o7212R579P9973j22712L479J076j05300N2919
687a28633R7011n950K6552M3067L8956k3939n4998R6952j6648P7305j8270m9157
675H2248j7304r4496j46396K63699j2998q9531M4170K6016N8107n1962k7894Q0638
$$ plain form
663 114297 80383 44777 -12967 -39931 133858 -19299 49475 220572 92454 -49126 -18734
652 -18734 -58615 -687 46864 21526 -69228 58336 27442 -147938 -36407 7546 -93913
641 -93913 -35418 -158614 -85186 -3292 12129 -94395 -54559 -96347 37150 8508 -15783
630 -15783 -2811 36812 6989 -108732 -30768 25835 -25614 -69536 3769 -10337 14539 134228
618 134228 191479 108562 -25913 21421 -16074 22453 -10176 31248 -42898 -63165 -48024 -40891
606 -40891 96547 42434 -25845 181305 255203 83166 38874 80502 91471 83447 149837 140942
594 140942 103971 116047 140844 267825 179680 144082 52784 75844 114329 133189 182731 225447
582 225447 357188 382451 422931 643768 787143 755606 671162 583691 450337 395555 354030
$$ packed form
663A14297l3914l5606n7744k6964J73789j53157O8774J71097j28118j41580L0392
652a8734l9881N7928M7551k5338r0754J27564l0894j75380J11531M3953j01459
641i3913N8495j23196P3428Q1894J5421j06524L9836m1788J33497k8642k4291
630a5783J2972L9623k9823j15721P7964N6603n1449m3922P3305j4106K4876J19689
618A34228N7251q2917j34475M7334l7495L8527l2629M1424p4146k0267J5141P133
606d0891J37438n4113o8279K07150P3898j72037m4292M1628J0969q024O6390q895
594A40942l6971J2076K4797J26981q8145l5598r1298K3060L8485J8860M9542M2716
582B25447J31741K5263M0480K20837J43375l1537q4444q7471j33354n4782m1525
$$ plain form
571 354030 359890 356905 312769 213230 114451 67719 90387 89955 76000 225839 135669 85006
559 85006 -38353 150521 237517 170 55743 109526 54928 100655 76745 53200 -8760
548 -8760 -105598 -177679 -49945 -142173 -130828 -76956 -43341 -62753 6081 42451 11667 -60740
536 -60740 -215087 8256 92456 4391 -3352 19634 40538 -80250 -70406 -108962 -49314 -14745
524 -14745 -21866 39320 44420 -40838 79197 84990 38330 -71382 -11918 16335 47214 91143
512 91143 31149 -84754 -103461 -169926 -46051 -107394 -44626 -116224 -200705 -48242 -131851
501 -131851 -55792 -16321 -48140 -20806 56328 133852 69458 -25989 -50349 -42043 -62995 -71847
489 -71847 -124764 -74978 -135066 -159148 -202256 -134664 -61362 -163399 -160964 -174639 -113937 -123499
$$ packed form
571C54030N860k985m4136r9539r8779m6732K2668m32j3955J49839r0170n0663
559H5006j23359J88874Q6996k37347N5573N3783n4598M5727k3910k3545o1960
548h760r6838p2081J27734r2228J1345N3872L3615j9412O8834L6370l0784p2407
536f0740j54347K23343Q4200q8065p743K2986K0904j20788R844l8556N9648L4569
524a4745p121O1186N100q5258J20035N793m6660j09712N9464K8253L0879M3929
512I1143n9994j15903j8707o6465J23875o1343O2768p1598q4481J52463q3609
501a31851P6059L9471l1819K7334P7134P7524o4394r5447k4360Q306k0952q852
489g1847n2917M9786o0088k4082m3108O7592P3302j02037K435j3675O0702r562
$$ plain form
477 -123499 -1844 -142397 -142756 -174525 -173078 -237275 -154527 -77045 -25165 -192948 -94816 -33967
465 -33967 -107059 -82062 -135535 -85661 -132647 -186512 -44056 30296 22816 2126 -67385 -13716
453 -13716 -34999 -80665 -38152 -62879 -91464 -84807 -131470 14766 -38129 -86749 -303188 -32672
441 -32672 -69444 -114771 -34295 16467 -77090 -132358 23523 65282 68391 -23666 -148879 -175021
429 -175021 -129412 -166009 -18814 -61390 -70914 -84967 34234 24084 -37016 -47007 105639 80842
417 80842 -75215 4425 46892 24011 15098 -74712 54421 -57265 30036 -11228 -36076 -94602
405 -94602 -118374 -200440 -158993 -119879 -113907 -15977 -59192 -74420 -87372 -75371 -151692 -187939
393 -187939 -153700 -67741 -174885 -53928 -88949 -85989 -179401 -331475 -178292 -99476 -144856
$$ packed form
477a23499J21655j40553l59l1769J447o4197Q2748P7482N1880j67783R8132O0849
465c3967p3092K4997n3473M9874m6986n3865J42456P4352p480k0690o9511N3669
453a3716k1283m5666M2513k4727k8585O657m6663J46236n2895m8620k16439K70516
441c2672l6772m5327Q0476N0762r3557n5268J55881M1759L109r2057j25213k6142
429a75021M5609l6597J47195m2576r524j4053J19201j0150o1100r991J52646k4797
417H0842j56057P9640M2467k2881q913q9810J29133j11686Q7301m1264k4848n8526
405i4602k3772q2066M1447L9114N972R7930m3215j5228j2952J2001p6321l6247
393a87939L4239Q5959j07144J20957l5021K960r3412j52074J53183P8816m5380
$$ plain form
382 -144856 -191940 -175459 -169189 -202415 -64020 -176410 -207286 -181611 -208596 -54981 -93120
371 -93120 -203853 -140462 -44326 -72328 -196031 -200804 -132948 -100228 -5533 -33263 -60116 -132076
359 -132076 -170945 10074 58586 -107274 -112558 -210966 -172337 -120398 -105883 3191 -49844
348 -49844 -176709 -188218 -231941 -81511 -106932 -81388 -32743 -103960 -39851 -106879 -33640 -128336
336 -128336 -263181 -232768 -202989 -202711 -187979 -158869 -6202 -75908 -212088 -125320 -48277 -77483
324 -77483 -236398 -75255 11423 167024 -38109 12916 2622 -134374 -158353 -129068 -85582
313 -85582 -112641 -83457 -58725 -29059 -192433 -143513 -104036 -140923 -169797 -28532 -132397
302 -132397 -248387 -162402 -118405 -54280 -14777 -113863 -210237 -231167 -196423 -127379 -4448
$$ packed form
382a44856m7084J6481O270l3226J38395j12390l0876K5675k6985J53615l8139
371i3120j10733O3391R6136k8002j23703m773O7856L2720R4695k7730k6853p1960
359a32076l8869J81019M8512j65860n284r8408L8629N1939J4515J09074n3035
348d9844j26865j1509m3723J50430k5421K5544M8645p1217O4109o7028P3239r4696
336a28336j34845L0413K9779K78J4732K9110J52667o9706j36180Q6768P7043k9206
324g7483j58915J61143Q6678J55601k05133N1025j0294j36996k3979K9285M3486
313h5582k7059K9184K4732K9666j63374M8920L9477l6887k8874J41265j03865
302a32397j15990Q5985M3997O4125L9503r9086r6374k0930L4744O9044J22931
$$ plain form
291 -4448 -29743 -132599 -240224 -275466 -147924 -243583 -144781 -144644 -396125 -216355 -104813
280 -104813 -224755 -285706 -279637 -239042 -63736 -64240 -185897 -213694 -95174 -220393 -224296 -155633
268 -155633 -233969 -180281 -69853 -112062 -41856 64496 -48193 -57672 -74713 -37702 -72623
257 -72623 -186496 -153930 -183752 -135210 -143734 -197657 -166390 -108017 -113621 -11417 -81350 -248896
245 -248896 -188743 -145370 -266897 -187218 -229829 -141437 -117548 -183881 -224783 -201349 -281280 -265367
233 -265367 -178434 -265176 -191012 -266435 -311240 -180313 -177194 -109740 -249498 -360804 -273599
222 -273599 -205588 -214996 -147974 -62832 -68044 -77440 -158677 -34340 -214666 -160532 -82433 -102525
210 -102525 -13750 -75080 -118301 -190722 -117375 -44406 -95408 -178364 -165592 -193259 -149957 -104549
$$ packed form
291d448k5295j02856j07625l5242J27542r5659R8802J37k51481J79770J11542
280a04813j19942o0951O069M0595J75306n04j21657k7797J18520j25219l903O8663
268a55633p8336N3688J10428m2209P0206J06352j12689r479j7041L7011l4921
257g2623j13873L2566k9822M8542q524n3923L1267N8373n604J02204o9933j67546
245b48896O0153M3373j21527P9679m2611Q8392K3889o6333m0902K3434p9931J5913
233b65367Q6933q6742P4164p5423m4805J30927L119O7454j39758j11306Q7205
222b73599O8011r408O7022Q5142n212r396q1237J24337j80326N4134P8099k0092
210a02525Q8775o1330m3221p2421P3347P2969n1002q2956J2772k7667M3302M5408
$$ plain form
198 -104549 -88786 -151119 -145384 -91616 -159662 -313929 -213152 -128042 -85974 -120952 -223595
187 -223595 -278290 -237586 -307621 -213408 -73383 -243915 -153251 -129493 -186861 -205610 -115787
176 -115787 -135659 -167612 -142620 -153953 -267013 -170397 -168144 -175160 -66640 -4899 -122169 -272279
164 -272279 -217404 -180797 -190712 -217432 -307899 -316264 -137705 -62543 -96165 7597 -111092 -113180
152 -113180 -169094 -206874 -156469 -268380 -256403 -259078 -155924 -84376 -216877 -232982 -207968
141 -207968 -143923 -65909 -168886 -143567 -106409 -240563 -177876 -169494 -174752 -117678 -65957 -156326
129 -156326 -201778 -276468 -239995 -173574 -201244 -220749 -236766 -231164 -212789 -239826 -217087 -204572
117 -204572 -56656 -124725 -102743 -191111 -185321 -262473 -173444 -265135 -164763 5939 -144144
$$ packed form
198a04549J5763o2333N735N3768o8046j54267J00777Q5110M2068l4978j02643
187b23595n4695M0704p0035R4213J40025j70532R0664K3758n7368j8749Q9823
176a15787j9872l1953K4992j1333j13060R6616K253p016J08520O1741j17270j50110
164b72279N4875L6607r915k6720r0467q365J78559P5162l3622J03762j18689k088
152a13180n5914l7780N0405j11911J1977k675J03154P1548j32501j6105K5014
141b07968O4045P8014j02977K5319L7158j34154O2687Q382n258N7074N1721r0369
129a56326m5452p4690L6473O6421k7670j9505j6017N602J8375k7037K2739J2515
117b04572J47916o8069K1982q8368N790p7152Q9029r1691J00372J70702j50083
$$ plain form
106 -144144 -175045 -112756 -162260 -89542 -206670 -339862 -320809 -314723 -175931 -185197 -236979 -202176
94 -202176 -137112 -110775 -56472 -93796 -40184 -270330 -222891 -322951 -285185 -391193 -313194
83 -313194 -279486 -281617 -286385 -199116 -67123 -145649 -242878 -269748 -134402 -214405 -217075 -119342
71 -119342 -105609 -89121 -166834 -150370 -161702 -84619 -93828 -231756 -257261 -179353 -119750 -98771
59 -98771 -135473 -184115 -208313 -137659 -134342 -207737 -250828 -170896 -152892 -226011 -292384 -305398
47 -305398 -232057 -242041 -254256 -291149 -260838 -322961 -271064 -182168 -264483 -277019 -302695 -196489
35 -196489 -147247 -185044 -311844 -277252 -114298 -155381 -384131 -256803 -129389 -198341 -296934
24 -296934 -325421 -292292 -294660 -157520 -191082 -133323 -182006 -239370 -328403 -134057 -155601 -202289
$$ packed form
106a44144l0901O2289m9504P2718j17128j33192J9053O086J38792r266n1782L4803
94b02176O5064K6337N4303l7324N3612k30146M7439j00060L7766j06008P7999
83c13194L3708k131m768Q7269J31993p8526r7229k6870J35346q0003k670R7733
71a19342J3733J6488p7713J6464j1332P7083r209j37928k5505P7908N9603K0979
59i8771l6702m8642k4198P0654L317p3395m3091P9932J8004p3119o6373j3014
47c05398P3341r984j2215l6893L0311o2123N1897Q8896q2315j2536k5676J06206
35a96489M9242l7797j26800L4592J62954m1083k28750J27328J27414o8952r8593
24b96934k8487L3129k368J37140l3562N7759m8683n7364q9033J94346k1544m6688
$$ plain form
12 -202289 -155926 -211753 -223803 -179609 -149132 -183567 -295587 -260516 -197238 -144626 -155441 -167875
0 -167875
$$ packed form
12b02289M6363n5827j2050M4194L0477l4435j12020L5071O3278N2612j0815j2434
0a67875
$$ Imaginary data points
##PAGE= N=2
##DATA TABLE= (X++(I..I)), XYDATA
$$ plain form
16383 -1653000 -1574939 -1604294 -1615624 -1557538 -1604914 -1562826 -1474203 -1505824 -1466715 -1537888 -1367375
16372 -1367375 -1379213 -1374116 -1377421 -1365315 -1270656 -1247087 -1180921 -1176140 -1307953 -1241655 -1221290 -1272410
16360 -1272410 -1334387 -1130028 -1166289 -1130237 -1231777 -1199653 -1102817 -1154936 -1041469 -1078873 -1025870
16349 -1025870 -1020264 -1068006 -1165767 -1008196 -929246 -1024671 -992906 -950436 -955373 -953971 -919162 -899943
16337 -899943 -899233 -843632 -982885 -892304 -792579 -734337 -742628 -728368 -809895 -770411 -835754 -836673
16325 -836673 -735266 -767961 -773631 -669764 -755751 -806490 -825053 -821243 -690227 -627375 -603203
16314 -603203 -585520 -641803 -550283 -476939 -476976 -510185 -466809 -477675 -452591 -424837 -507080 -479671
16302 -479671 -505281 -522820 -496313 -491725 -384366 -394795 -487645 -360081 -354603 -368461 -370923 -449711
$$ packed form
16383a653000P8061k9355j1330N8086m7376M2088Q8623l1621L9109p1173J70513
16372a367375j1838N097l305J2106R4659K3569O6166M781j31813O6298K0365n1120
16360a272410o1977K04359l6261L6052j01540L2124R6836n2119J13467l7404N3003
16349a025870N606m7742r7761J57571P8950r5425L1765M2470m937J402L4809J9219
16337h99943P10N5601j39253R0581R9725N8242q291J4260q1527L9484o5343r19
16325h36673J01407l2695n670J03867q5987n0739j8563L810J31016O2852K4172
16314f03203J7683n6283R1520P3344l7l3209M3376j0866K5084K7754q2243K7409
16302d79671k5610j7539K6507M588J07359j0429r2850J27564N478j3858k462p8788
$$ plain form
16290 -449711 -412205 -325365 -254569 -333025 -189159 -111443 -206376 -220180 -283119 -299201 -264841
16279 -264841 -194962 -193228 -228473 -64621 -139261 -189053 -109864 -67111 -137913 -32392 -69453
16268 -69453 -14969 -40326 -48423 -25465 -14639 3847 -1755 68791 -2957 -28661 -97045 -56688
16256 -56688 -16367 72261 70110 95148 135062 170495 98784 6512 47770 12833 27265 110793
16244 110793 238204 282386 257287 276709 213771 120433 -35167 43615 75003 41504 68007
16233 68007 211517 161363 319609 315473 295137 355602 388176 418566 344630 299785 390194
16222 390194 387358 386898 358298 332732 296963 246911 352804 215130 308621 303980 283150 324788
16210 324788 369808 395098 380202 380128 460268 462431 358796 486772 485926 566411 519187 547179
$$ packed form
16290d49711L7506Q6840P0796p8456J43866P7716r4933j3804o2939j6082L4360
16279b64841O9879J734l5245J63852p4640m9792P9189M2753p0802J05521l7061
16268f9453N4484k5357q097K2958J0826J8486n602P0546p1748k5704o8384M0357
16256e6688M0321Q8628k151K5038L9914L5433p1711r2272M1258l4937J4432Q3528
16244A10793J27411M4182k5099J9422o2938r3338j55600P8782L1388l3499K6503
16233F8007J43510n0154J58246m136k0336O0465L2574L0390p3936m4845R0409
16222C90194k836m60k8600k5566l5769n0052J05893j37674R3491m641k0830M1638
16210C24788M5020K5290j4896p4Q0140K163j03635J27976q46Q0485m7224K7992
$$ plain form
16198 547179 496282 503266 443481 406195 468889 597223 636989 624308 517339 410942 526545
16187 526545 353003 463805 576493 682719 581083 508110 563299 572359 587634 575892 592330
$$ packed form
16198E47179n0897O984n9785l7286O2694J28334L9766j2681j06969j06397J15603
16187E26545j73542J10802J12688J06226j01636p2973N5189R060J5275j1742J6438
$$ [...]
##END NTUPLES=NMR SPECTRUM
##END=
