##TITLE=1H_EC-3330-X1Y
 DMSO
 8 sc, 
 14.8.2024
##JCAMPDX= 6.0         $$ Bruker NMR JCAMP-DX V2.0
##DATA TYPE= NMR SPECTRUM
##DATA CLASS= NTUPLES
##ORIGIN= UXNMR, Bruker Analytische Messtechnik GmbH
##OWNER= root
$$ XWIN-NMR		Version 3.5
$$ Wed Aug 14 13:50:26 2024 Russian Standard Time (UT+4h)  she@DPX200
##.OBSERVE FREQUENCY= 200.1318
##.OBSERVE NUCLEUS= ^1H
##.ACQUISITION MODE= SIMULTANEOUS
##.ACQUISITION SCHEME= undefined
##.AVERAGES= 8
##.DIGITISER RES= 18
##SPECTROMETER/DATA SYSTEM= spect
##.PULSE SEQUENCE= zg30
##.SOLVENT NAME= DMSO
##.SHIFT REFERENCE= (INTERNAL, DMSO, 0, 21.0517)
##AUDIT TRAIL= $$ (NUMBER, WHEN, WHO, WHERE, WHAT)
$$ ##TITLE= Audit trail, XWIN-NMR		Version 3.5
$$ ##JCAMPDX= 5.01
$$ ##ORIGIN= Bruker BioSpin GmbH
$$ ##OWNER= she
$$ F:/spectra/data/she/nmr/H-F/1/pdata/1/auditp.txt
$$ ##AUDIT TRAIL=  $$ (NUMBER, WHEN, WHO, WHERE, WHAT)
(   1,<2024-08-14 13:49:03.14 +0400>,<she>,<DPX200>,
      <created by zg, POWCHK disabled, PULCHK disabled
       configuration hash MD5:
       00 E9 B6 7A A2 85 ED C7 34 08 36 98 17 FE 4E 26
       data hash MD5: 16K
       22 46 CB 18 2E 3B 14 A2 EC 64 0F 73 A1 D5 80 D7>)
(   2,<2024-08-14 13:49:05.46 +0400>,<she>,<DPX200>,
      <Start of raw data processing
       efp BC_mod = 2 LB = 0.24 FT_mod = 6 PKNL = 1 PHC0 = -25996.13 PHC1 = 12.78748 SI = 16K 
       data hash MD5: 16K
       3D 06 EA 38 1D 69 AC 64 97 6A 9B D5 E7 EA 9A 7A>)
(   3,<2024-08-14 13:49:26.68 +0400>,<she>,<DPX200>,
      <pk PHC0 = -1.786992 PHC1 = 0 
       data hash MD5: 16K
       31 CE A9 08 8D 77 D3 54 25 44 F0 41 4B EB 9A D8>)
(   4,<2024-08-14 13:49:33.35 +0400>,<she>,<DPX200>,
      <abs ABSG = 5 
       data hash MD5: 16K
       4E 65 E1 17 49 1E A2 59 C6 63 A9 78 72 6E CF 77>)
$$ ##END=
$$ 
$$ hash MD5
$$ 1B C4 C9 CF E7 F7 02 21 CF 4E 2F D6 ED 85 9B 5C
##$RELAX= 
##$RELAX= 
##$RELAX= 
##$RELAX= 
##$RELAX= 
##$RELAX= 
$$ Bruker specific parameters
$$ --------------------------
##$DU= <F:/spectra>
##$EXPNO= 1
##$NAME= <H-F>
##$PROCNO= 1
##$TYPE= <nmr>
##$USER= <she>
##$AMP= (0..31)
100 100 100 100 100 100 100 100 100 100 100 100 100 100 100 100 100 100 
100 100 100 100 100 100 100 100 100 100 100 100 100 100 
##$AQSEQ= 0
##$AQ_mod= 1
##$AUNM= <au_zg>
##$AUTOPOS= <>
##$BF1= 200.13
##$BF2= 200.13
##$BF3= 200.13
##$BF4= 200.13
##$BF5= 200.13
##$BF6= 200.13
##$BF7= 200.13
##$BF8= 200.13
##$BYTORDA= 1
##$CFDGTYP= 0
##$CFRGTYP= 5
##$CHEMSTR= <none>
##$CNST= (0..31)
1 1 145 1 1 1 1 1 1 1 1 1 1 1 1 1 1 1 1 1 1 1 1 1 1 1 1 1 1 1 1 1 
##$CPDPRG= <>
##$CPDPRG1= <>
##$CPDPRG2= <>
##$CPDPRG3= <>
##$CPDPRG4= <mlev>
##$CPDPRG5= <mlev>
##$CPDPRG6= <mlev>
##$CPDPRG7= <mlev>
##$CPDPRG8= <mlev>
##$CPDPRGB= <>
##$CPDPRGT= <>
##$D= (0..31)
0 1.2 0 0 0 0 0 0 0 0.06 0 0.03 0 0 0 0 0.0002 0 0 0 0 0 0 0 0 0 0 0 0 
0 0 0 
##$DATE= 1723628942
##$DBL= (0..7)
120 120 120 120 120 120 120 120 
##$DBP= (0..7)
150 150 150 150 150 150 150 150 
##$DBP07= 0
##$DBPNAM0= <>
##$DBPNAM1= <>
##$DBPNAM2= <>
##$DBPNAM3= <>
##$DBPNAM4= <>
##$DBPNAM5= <>
$$ [...]
##$SUBNAM3= <"">
##$SUBNAM4= <"">
##$SUBNAM5= <"">
##$SUBNAM6= <"">
##$SUBNAM7= <"">
##$SUBNAM8= <"">
##$SUBNAM9= <"">
##$SW= 24.0689170037331
##$SWIBOX= (0..15)
0 0 2 0 0 0 0 0 0 0 0 0 0 0 0 0 
##$SW_h= 4816.95568400771
##$TD= 16384
##$TD0= 1
##$TE= 0
##$TE2= 300
##$TE3= 300
##$TEG= 300
##$TL= (0..7)
0 120 120 120 120 120 120 120 
##$TP= (0..7)
150 150 150 150 150 150 150 150 
##$TP07= 0
##$TPNAME0= <>
##$TPNAME1= <>
##$TPNAME2= <>
##$TPNAME3= <>
##$TPNAME4= <>
##$TPNAME5= <>
##$TPNAME6= <>
##$TPNAME7= <>
##$TPOAL= (0..7)
0.5 0.5 0.5 0.5 0.5 0.5 0.5 0.5 
##$TPOFFS= (0..7)
0 0 0 0 0 0 0 0 
##$TUNHIN= 0
##$TUNHOUT= 0
##$TUNXOUT= 0
##$USERA1= <user>
##$USERA2= <user>
##$USERA3= <user>
##$USERA4= <user>
##$USERA5= <user>
##$V9= 5
##$VALIST= <valist>
##$VCLIST= <CCCCCCCCCCCCCCC>
##$VD= 0
##$VDLIST= <DDDDDDDDDDDDDDD>
##$VPLIST= <PPPPPPPPPPPPPPP>
##$VTLIST= <TTTTTTTTTTTTTTT>
##$WBST= 1024
##$WBSW= 4
##$XGAIN= (0..3)
0 0 0 0 
##$XL= 0
##$YL= 0
##$YMAX_a= 284690
##$YMIN_a= -216997
##$ZGOPTNS= <>
##$ZL1= 120
##$ZL2= 120
##$ZL3= 120
##$ZL4= 120
##$ABSF1= 21.01054
##$ABSF2= -3.058594
##$ABSG= 5
##$ABSL= 3
##$ALPHA= 0
##$AQORDER= 0
##$ASSFAC= 0
##$ASSFACI= 0
##$ASSFACX= 0
##$ASSWID= 0
##$AUNMP= <proc_1d>
##$AZFE= 0.1
##$AZFW= 0.1
##$BCFW= 0
##$BC_mod= 2
##$BYTORDP= 0
##$COROFFS= 0
##$CY= -3
##$DATMOD= 1
##$DC= 0
##$DFILT= <>
##$DTYPP= 0
##$F1P= 0
##$F2P= 0
##$FCOR= 1
##$FTSIZE= 16384
##$FT_mod= 6
##$GAMMA= 0
##$GB= 0
##$INTBC= 1
##$INTSCL= 3.70164e-10
##$ISEN= 128
##$LB= 0.24
##$LEV0= 0
##$LPBIN= 0
##$MAXI= 10000
##$MC2= 0
##$MEAN= 0
##$ME_mod= 0
##$MI= 1.114404
##$NCOEF= 0
##$NC_proc= -7
##$NLEV= 6
##$NOISF1= 3.799351
##$NOISF2= 2.8
##$NSP= 0
##$NTH_PI= 0
##$NZP= 0
##$OFFSET= 21.05168
##$PC= 1
##$PHC0= -25997.92
##$PHC1= 12.78748
##$PH_mod= 1
##$PKNL= yes
##$PPARMOD= 0
##$PSCAL= 0
##$PSIGN= 0
##$REVERSE= no
##$SF= 200.129995405416
##$SI= 16384
##$SIGF1= 3
##$SIGF2= 2
##$SINO= 5.538805
##$SIOLD= 16384
##$SREGLST= <1H.CDCl3>
##$SSB= 0
##$STSI= 16384
##$STSR= 0
##$SW_p= 4816.95568400771
##$SYMM= 0
##$S_DEV= 0
##$TDeff= 16384
##$TDoff= 0
##$TI= <>
##$TILT= no
##$TM1= 0
##$TM2= 0
##$TOPLEV= 0
##$USERP1= <user>
##$USERP2= <user>
##$USERP3= <user>
##$USERP4= <user>
##$USERP5= <user>
##$WDW= 1
##$XDIM= 16384
##$YMAX_p= 383544919
##$YMIN_p= -941258
$$ End of Bruker specific parameters
$$ ---------------------------------
##NTUPLES= NMR SPECTRUM
##VAR_NAME=  FREQUENCY,     SPECTRUM/REAL,   SPECTRUM/IMAG
##SYMBOL=    X,             R,               I
##VAR_TYPE=  INDEPENDENT,   DEPENDENT,       DEPENDENT
##VAR_FORM=  AFFN,          ASDF,            ASDF
##VAR_DIM=   16384,         16384,           16384
##UNITS=     HZ,            ARBITRARY UNITS, ARBITRARY UNITS
##FACTOR=    0.29402158847633, 1,            1
##FIRST=     4213.07254386696, 0,            0
##LAST=      -603.883140140753, 0,           0
##MIN=       -603.883140140753, -941258,     0
##MAX=       4213.07254386696, 383544919,    0
$$ Real data points
##PAGE= N=1
##DATA TABLE= (X++(R..R)), XYDATA
$$ [...]
12489 12916 -10315 -264256 -417132 -153980 -279080 -264160 44653 337927 -7723 241552
12479 241552 237164 33397 -44460 -61457 -211524 -248564 353106 61779 137451 157728 -221444
12468 -221444 -171239 -118162 72453 63046 71421 102696 -54496 -154174 -91243 -147975 -51164
12457 -51164 -209857 -107943 8443 -13088 -126650 -155626 156046 -149092 -222740 -202371
12447 -202371 95161 37301 324661 -116717 -30335 -303437 22894 -133177 -232090 -18934
12437 -18934 141160 256054 112196 48209 -278941 56845 88301 -47866 130924 114945
12427 114945 -61290 123916 -261255 -451536 -374631 -37319 68557 147244 164853 -41330
12417 -41330 -80970 -100478 -289055 -92728 35238 356869 -48875 -244927 -15282 -75038
12407 -75038 -121046 95972 -34036 -57927 -30830 -203033 -86505 -105665 198227 -99596
12397 -99596 11573 194089 -5704 39966 30709 20326 -106559 -81307 20222 305466 -49916
12386 -49916 -91318 -215847 -156937 -132714 -129635 137041 518098 331407 322566 220002 -121226
12375 -121226 78221 143698 -73805 -210874 -159895 -19811 -172827 -326043 -154907 -172843
12365 -172843 -296498 22651 40172 363554 67980 -347178 -288940 -153229 61357 -55998
12355 -55998 -7174 -125883 -12216 154257 352927 157341 312520 329887 295662 -55104
12345 -55104 129539 -147126 -174791 -99607 48087 157578 -184163 -93280 35243 129217
12335 129217 -82252 -234791 -306650 1930 183608 -14155 77961 -172233 31980 153752
12325 153752 20413 237593 -139008 -215240 -120757 -172700 15037 -85042 178574 222227
12315 222227 -116419 107842 -437195 -295874 -233700 -188005 -138854 -169472 24959 198207
12305 198207 315768 -136170 187143 303261 282079 151158 8112 -571 364642 175596
12295 175596 119329 144039 -214899 -293640 -18525 287681 285690 291917 49482 -130205 -42584
12284 -42584 39396 188234 86630 148544 172916 50676 169980 217200 64104 -34380 -167699
12273 -167699 -141172 -390751 -272024 -95978 110144 214533 -6833 40891 -148763 -7821
12263 -7821 148065 -178989 -110254 7921 -47014 12127 -135689 -60534 -216165 -235339 -112738
12252 -112738 -50669 43642 101287 415506 143501 -90714 12704 -296195 -182149 196119
12242 196119 289335 -53685 26212 -97562 -182981 -258303 11121 109441 -178038 -221947 -134178
12231 -134178 -63329 120971 336539 241036 -68099 31094 139265 -297358 82226 -92266
12221 -92266 -85312 -42420 -130877 110639 18938 -149629 -67211 -149236 -179237 -180322 84748
12210 84748 -461470 -212534 -229269 -254852 -192787 -133795 -183861 -282927 118509 69140 -107560
12199 -107560 -210156 -325674 34161 116566 -168347 -136024 -195329 -198696 87601 -61106
12189 -61106 -104407 285110 237345 -33389 -270537 113259 206228 487498 301562 172000
12179 172000 -233652 -184940 110052 -95325 226080 378922 -68428 -84174 -60174 -84415
12169 -84415 -175846 -38074 -61000 -131964 -65140 -127786 -132896 -49325 -253187 -98066 114972
12158 114972 87327 -52393 51846 -48602 117136 -12697 -13230 -4024 52734 -122358 -270949
12147 -270949 -331489 52149 -6222 138660 89847 67480 145649 65439 -166002 -356771 -369338
12136 -369338 -172945 -139469 41301 270888 308814 -30963 74487 109963 -140237 48703
12126 48703 -948 8599 -58480 335341 489261 510831 183664 213618 83593 -99870 -134724
12115 -134724 -164525 -187222 8560 236652 39148 -7129 -81915 -1126 57983 7156 -192455
12104 -192455 -285273 41990 101507 191807 -149551 -97309 275954 206514 8757 -34249 -202591
12093 -202591 -137103 -11995 95151 280315 229658 132540 111766 207543 163582 -140960 -135635
12082 -135635 101522 104506 -59688 54988 5982 44210 9814 299220 -37241 -244591
12072 -244591 195371 21954 -140503 29354 133104 76826 234672 320223 12692 94831
12062 94831 -40452 -90310 65666 73901 161914 -86861 71988 -41116 -271663 240644
12052 240644 63312 21615 -19657 -86233 -220914 -47533 -30453 285318 25074 -25757
12042 -25757 -451559 -455889 -260495 -335128 -253239 -271865 -239743 -72614 -183745 -135105 14057
12031 14057 -81776 27892 262830 -50445 -18984 -32813 -7491 132294 133644 275679 -80152
12020 -80152 -11625 -76159 134845 132743 119975 -11582 178793 283240 252824 44436 -136117
12009 -136117 -164882 36157 -58105 193028 186612 91333 -86822 122779 157067 -310064 -48456
11998 -48456 159096 -226275 -200810 -132778 -5059 -132703 59794 -6241 -25187 -6622 71462
11987 71462 146198 644 97253 222863 72924 -107595 131469 -45665 -21023 41375
11977 41375 -51316 71233 8948 -61401 101345 -219706 -186991 93894 -57823 -162805
11967 -162805 5541 63370 -203391 10807 105991 127324 221948 -124918 -157709 -77921 190684
11956 190684 -56710 -149482 -205038 -120240 -96694 -84717 -11613 222394 -97626 -227317 -248835
11945 -248835 -55771 13924 -315158 11362 32649 88880 176736 106117 7996 -181996 -99677
11934 -99677 -143589 73509 281215 45334 -211130 -401254 -289496 -268072 -50512 -70292
11924 -70292 -230863 -371601 -34990 12414 42718 -195100 -172218 -120089 -76191 39494 12284
11913 12284 -110487 -274671 -126324 -18888 -150310 10746 22249 -155127 110731 60702
11903 60702 41226 287051 153259 78058 -145499 -103531 -5005 -67384 -276898 -124976 -355961
11892 -355961 -389820 -109058 -16207 25951 -18459 171475 323027 -1963 325341 259382
11882 259382 -148513 -16315 -98070 34773 -132927 -112678 -53230 -190850 -143190 -149884 -189176
11871 -189176 -229136 -394324 -146455 -221961 -217576 -155933 -10206 174375 78767 135772 186302
11860 186302 369415 400555 67276 52103 340215 111745 70338 199637 161499 66079
11850 66079 290517 61607 -11008 -186112 -267760 -159887 -86132 79635 -183064 -275026
11840 -275026 -28136 -189075 66044 -154450 -201575 -69635 -161637 -112574 -400599 -373005
11830 -373005 -341372 24262 -60516 -147903 -263484 11983 -37758 -1118 -164418 16077
11820 16077 35422 207200 202361 106554 -60101 412322 205318 18555 60341 -122646 -230767
11809 -230767 4929 -202182 -28086 71749 -4244 245126 38555 27973 43896 251614
11799 251614 60409 -159533 123916 72790 30403 -33301 20316 309556 78107 39914
11789 39914 -190721 83019 177131 -157957 -69839 10350 -191569 -14934 170046 31947
11779 31947 -108358 75996 -91344 -138614 -154533 -297429 -41641 98516 38232 -185592
11769 -185592 237542 275990 -165953 -313465 -113256 196760 203814 56014 -174479 4887
11759 4887 -59327 231422 203 71630 -64643 -159507 125598 184432 137992 241338 -32543
11748 -32543 -132503 -287255 -11561 125519 -215792 115441 -36561 92641 241455 55237
11738 55237 -88239 -153932 -147371 -16225 -225283 42672 -132380 -65442 71331 207496
11728 207496 298099 100894 -317508 -22773 201141 54161 -237635 30641 -68424 -209460
11718 -209460 -61270 -89460 -129603 -298060 -49432 53823 50602 -419522 -350531 -29937
11708 -29937 19151 -140151 -223973 -194993 -106276 -134711 168087 302726 222413 276837 224177
11697 224177 122861 135234 -80707 238183 221194 -3584 220339 101533 256251 127617
11687 127617 4761 -178150 -56678 152335 -133675 195944 -56472 42757 -188680 -55381
11677 -55381 -308848 -380670 70206 -41931 20459 132259 24289 6331 -10919 -240102
11667 -240102 -422325 -230787 80264 -85724 6232 116541 189440 30081 46156 -56309
11657 -56309 223638 142041 89627 52298 -209897 137404 23048 42923 160113 108768 139801
11646 139801 1025 120054 277262 -254339 -340745 -75573 263966 273513 145680 -355467
11636 -355467 -410512 -157531 122464 220403 76534 -103186 -100900 -62878 -185341 -307438
11626 -307438 -7839 178258 -144616 -118260 -21032 -234885 -408029 19504 -12071 -268987
11616 -268987 -93279 870 -119205 100223 -10354 45378 -87521 -267513 -298070 -268824
11606 -268824 87666 185260 357340 46479 -302181 -342761 -137151 -103601 -122324 41188
11596 41188 10242 312652 -4132 -214208 -211519 46520 36941 263293 9983 -168998 -107246
11585 -107246 -299141 -67586 -146037 -439145 -261865 -239369 -58956 -114018 136962 64224
11575 64224 -133461 -47135 -213221 1207 244233 232660 113183 112094 184293 295447 -31085
11564 -31085 -241951 235087 -105435 -347610 -73732 -149057 -45795 27890 -160613 -323562
11554 -323562 -225715 49167 181938 354450 447303 270299 67305 75938 113345 -17130
11544 -17130 48786 186822 191397 -164367 -227742 -349240 -140112 34277 -137201 -185517 -133405
11533 -133405 -117488 -230568 -36862 192003 33620 -106857 -117280 -133714 -378644 -169479
11523 -169479 -111808 -248557 -274398 -100116 73611 91163 48230 156530 135161 218917 119896
11512 119896 154751 104257 83291 -134754 -58439 -144825 192617 425157 133358 -215786
11502 -215786 -339353 -362275 -455460 -530053 -339227 -208658 -293625 -106822 119446 37104
11492 37104 59814 4682 -251104 41781 227801 57434 56188 -29271 76875 206493 -50063
11481 -50063 115692 242463 136536 -133515 -61781 -177424 -341160 -258343 -2850 -214987
11471 -214987 -58377 -25471 -48694 78881 32659 -130755 301234 -74066 -48547 204495
11461 204495 -9684 117018 158996 30231 70550 -103803 -333109 166126 577732 107518
11451 107518 -30709 -102919 63323 166092 6297 49922 29529 -76949 -341248 -221469
11441 -221469 48017 317043 284300 295960 139544 28736 266903 -66360 -245476 8119
11431 8119 115395 53590 -37017 -374792 -148052 195809 -180974 -263850 -214490 -270048 -51130
11420 -51130 70809 -84779 -202800 -51913 -30651 68479 -174059 22130 -210802 -107229
11410 -107229 105971 -193570 101323 -149109 -187754 85015 33448 -20137 -120124 -158581
11400 -158581 -102001 -305891 -476730 -336756 -281209 194474 236937 -72530 -210262 -279695
11390 -279695 60893 -126357 -134835 -225850 127252 223232 123933 43204 -122856 104619 -158423
11379 -158423 -66120 -59659 -212485 -85818 -117726 140481 -175620 -120127 -196499 185212 130561
11368 130561 312624 314499 7424 -55812 -184376 -141105 91634 4923 92003 42388 -10412
11357 -10412 -118463 -237056 -271619 247426 104300 -102940 87517 218271 202159 54216
11347 54216 -88239 -172125 -30887 17052 -44826 64416 -133515 -138876 -171441 -51185 132278
11336 132278 52211 112615 537907 88737 49124 90766 -337912 -196448 -67801 333317
11326 333317 143217 17815 -213464 44699 -188017 -57659 281573 38844 71007 73356
11316 73356 145581 185039 349485 90178 28968 47333 162467 279954 40050 123904 15938
11305 15938 48448 -202100 53622 -120761 -24010 83088 125070 -199338 -284115 -138108
11295 -138108 90438 -133987 -47644 233859 93889 -64257 129315 311059 117380 103372
11285 103372 -15934 83240 361126 385754 330370 -10611 40661 171369 -10369 231246
11275 231246 -126992 8439 162120 -278798 -150601 -115716 -30066 148833 100979 -161686
11265 -161686 144512 -28065 -206783 -335496 -218623 -83682 -38596 135054 21245 221196
11255 221196 -85300 35623 -10247 113127 402450 59546 -27676 158793 143824 138889
11245 138889 87297 157356 424649 93482 -38544 -191926 25388 120288 -8774 132596
11235 132596 215764 115589 75146 -222032 -201973 -160621 -128651 85853 64685 25472 171380
11224 171380 286456 267973 -47083 -35702 382848 58515 110102 -22845 51308 391628
11214 391628 94747 329330 -27588 92699 127653 9640 126692 -110501 -121962 -39463
11204 -39463 -214169 -127782 -29261 -224065 -15489 25245 53212 23657 79438 40847 235073
11193 235073 177864 54944 -70932 -149639 24443 33255 89774 545645 232486 -124668
11183 -124668 -146982 -141146 -140283 -86508 -56263 56936 188103 191595 42475 275329 268263 -74484
11171 -74484 53180 293461 4643 128440 80178 -171576 -292023 -170666 -463903 85678
11161 85678 287124 57827 45503 48298 178134 -122535 27449 -109184 -282352 -72043
11151 -72043 -96038 -27721 -83737 -23795 -293137 -145302 -37253 -83913 -112253 -70546 -39796
11140 -39796 -115200 -14915 -367437 -238582 -18166 127092 184595 129638 215887 262019 -74171
11129 -74171 78045 229379 -25440 -61131 -51882 -193779 -203461 -287220 -153769 -107739 -204216
11118 -204216 -219375 98546 -131325 -266784 -13059 107417 -56369 -48745 -5328 -116839
11108 -116839 -177945 -109928 -85514 20369 348618 230325 15988 212318 80514 156619
11098 156619 202662 241311 -56241 -92928 112385 59944 -127536 -121340 131325 -17371 4127
11087 4127 202288 272354 142569 42208 215526 110972 38083 227610 -68463 -196171
11077 -196171 -268204 -35186 -101160 151642 61895 87315 34199 -93595 -149022 -88587 101159
11066 101159 17837 128346 128605 -100508 -336152 111094 162887 -27424 -4021 -77620 103801
11055 103801 184838 187316 8154 -103531 -192175 -77228 140961 -79459 -222916 -131484
11045 -131484 -73989 155084 90316 -59521 162739 60318 319659 301280 65442 82281
11035 82281 -424069 -358521 -174498 -102301 48640 152444 -137359 -148030 53075 -221503
11025 -221503 -194796 184657 240590 -56519 -26819 -86363 -71431 -57075 -48736 1861 303075
11014 303075 227540 65583 -8772 -155906 -155864 128527 295481 254575 230918 -11892 100928
11003 100928 107624 77008 418561 158945 33233 -192528 -220402 -47205 -482 225651
10993 225651 -89128 44798 76180 -130682 -316620 -343019 -291710 66679 -94646 71836
10983 71836 162991 178082 233173 20906 84227 -4949 52049 -447312 -334219 -355336 -69529
10972 -69529 66740 37798 -46444 43230 -112263 3732 25745 52227 166966 39735 125421
10961 125421 154436 175671 233513 299022 79264 -248272 120287 -44038 -228847 -162317
10951 -162317 -34440 -80134 70616 -38560 -117940 -46179 54637 -169521 -76186 147209
10941 147209 31057 108712 147297 229560 378088 371751 54853 114941 121639 20471 -284890
10930 -284890 -27465 -243602 -184012 -52502 -241760 -39789 123611 -38567 211116 203478
10920 203478 -10710 -240852 -220563 -246689 -331457 111840 163859 1068 -104956 118829
10910 118829 -28132 -154773 -54915 118623 233010 39231 185953 -116922 110877 -36222
10900 -36222 20662 49425 -89255 103407 65526 -83204 5277 50910 -261442 -259166 -243035
10889 -243035 -175673 -87023 49481 140896 65813 57746 -49494 -39807 -36003 -102723 -306576
10878 -306576 151281 312308 148397 274405 -186813 -260617 -10914 -111397 -145914 -179324
10868 -179324 -112170 55946 136874 70388 -29665 -211389 -240323 -265352 -36559 78512
10858 78512 -132080 -153020 3495 -63914 267033 -93482 -39540 111679 62399 -139330
10848 -139330 -6052 90649 260500 184451 -52309 43433 -54534 -235340 -269116 -27449
10838 -27449 26673 90966 -262885 -92094 -125496 -53214 151904 -114559 -19070 -408216 -213049
10827 -213049 64875 -55606 -12366 -78486 16580 -27843 149655 -121223 -234383 -161461
10817 -161461 -59662 29263 216168 -28137 -15913 -267976 -399612 -365215 -384009 -433615
10807 -433615 -349142 -49445 245620 -204780 100525 126110 -68646 -153306 46219 11997
10797 11997 77144 -76090 -292152 -16575 -118055 108400 71572 113076 126534 226453 135921
10786 135921 -18473 -27567 -202081 -140029 70660 104246 105195 143347 59174 -56567 31256
10775 31256 13893 333165 173720 -88911 -39080 49348 39433 -96275 -171866 -80789 -4310
10764 -4310 -86283 -107314 37049 -245322 -114626 5728 -47190 47089 -187895 43697 53328
10753 53328 131350 -54742 -54498 -32216 -248436 226472 181610 -265231 58582 105543 6359
10742 6359 -101210 -187831 36956 99092 -84468 -288060 -367582 -83901 114454 175017 49304
10731 49304 -181075 200751 270822 85552 -49987 8862 26937 201377 363311 26282
10721 26282 -159349 -386566 -173596 1390 57155 -48636 258922 181924 -865 -73536
10711 -73536 -140055 -170379 -275035 -209212 177531 206116 11980 238662 -25161 -181165
10701 -181165 -135043 -203767 -219548 -199929 19248 193722 19207 5362 -124345 -262209
10691 -262209 -114962 -246929 -219577 47007 -99561 -46032 -176529 -416082 -220310 242575
10681 242575 -161682 -251086 -174349 -358718 -378959 -188111 24404 96397 -239909 52916
10671 52916 12858 150261 75698 -185424 -954 -12877 158279 94269 -134162 -362034
10661 -362034 -167472 180219 -127754 -11872 -372483 -62500 117656 42706 316472 -81662
10651 -81662 101506 303527 66867 -26576 111937 -30276 -41585 -94942 50270 -25893
10641 -25893 257146 10100 86038 -74602 -8861 83317 71279 227827 209993 162435 34892
10630 34892 -154406 -65349 36998 820 -13995 -391364 -268506 -479602 -396114 -3160
10620 -3160 36649 -69189 12224 -77636 -91923 -246093 -397325 -327559 -412667 -258218 -162955
10609 -162955 40675 79075 -83667 -122608 -16253 132241 5449 -28238 101551 -29431
10599 -29431 -109958 -246444 -171083 -139453 -200854 148062 286362 65983 -156120 -381675
10589 -381675 -264910 -195940 -325759 -227532 -17096 -96374 -325717 -251295 -282532 -54194
10579 -54194 -68988 -180770 73450 -130315 -293704 -155858 -191413 21084 195968 -158425
10569 -158425 -29986 48857 59117 76618 225794 158774 -353173 -65602 39378 44135 136365
10558 136365 -210320 42908 -108442 -226320 230605 -42273 53566 -13595 -77954 67298
10548 67298 -203283 -213960 253022 27641 -118104 204785 223254 234543 380578 199557
10538 199557 38102 387203 362203 161085 186667 90304 253458 254960 123669 48714 105276
10527 105276 -115803 -324666 -211113 -359992 28208 -102461 -254777 -136213 -27931 -81316
10517 -81316 -120787 214495 -223618 -184348 -5303 -18874 274221 222958 -63361 -82529 -387660
10506 -387660 -202446 42564 -80248 39827 127709 -188489 -218921 -78854 -20227 -16062
10496 -16062 -124607 -17337 164061 -36975 37968 214582 33106 22579 -34255 95924
10486 95924 56393 241772 -137597 -190169 -68200 -338598 -249744 68669 24481 -76914
10476 -76914 108066 88173 62683 267045 92494 -203077 91913 89740 -88232 58834
10466 58834 -130182 -121906 -16281 -407862 -226342 -321336 33893 15700 -202900 -4578
10456 -4578 -179671 54566 -53978 131885 -316525 -192934 -61646 -275903 -313442 -17257
10446 -17257 212280 -58138 -24831 10137 300259 314086 211299 94530 -134730 -196541
10436 -196541 -143230 22029 -103729 110567 60734 153142 109249 206717 140542 74967 106309
10425 106309 -321351 -451020 37554 301617 13276 -245807 -216621 -380746 -226044 -314599
10415 -314599 -279780 -69999 87400 15312 -102456 28879 -380294 -206641 -138593 51979
10405 51979 -114782 -254178 -58534 10202 121560 69685 41821 116959 56309 29119 155561
10394 155561 59604 75705 38856 -240885 -69941 -184358 -301889 -145333 29605 134302
10384 134302 284423 263913 -18881 -45621 92004 -59688 -47618 -310312 205749 101563
10374 101563 -316255 108385 67869 -135371 21515 1206 -222158 -216179 -174134 119883
10364 119883 -65196 116066 -116364 -144697 -273090 -413442 -259182 -138549 -60494 81638
10354 81638 73805 90363 -150675 257853 225084 80819 291243 136276 185309 -300708 -96374
10343 -96374 -165909 228313 12400 398783 459180 132474 -68344 -121482 -229677 -238559 -97805
10332 -97805 115224 -208352 -351631 -87427 57725 211685 -19117 -185411 -276339 -238732
10322 -238732 -273500 -382376 -209374 -22883 -6384 16103 140598 106879 97784 388274 275579
10311 275579 64306 204225 72774 122185 172807 -266603 -289930 -339388 -9785 75689
10301 75689 -302191 -233306 -324827 196150 195394 -23663 37788 275801 -26956 -491589 -250940
10290 -250940 -194270 -214279 -120369 -122436 81057 41078 -23505 18936 -152608 95713 165384
10279 165384 200796 58158 -332711 -249595 124299 -63045 -271580 -403373 -359717 -186620
10269 -186620 -86302 -158625 87386 -329561 -280064 -202438 128729 428677 314186 157340
10259 157340 309770 49668 9714 189713 238585 472415 192902 -221744 -246927 65849
10249 65849 -868 -146801 85675 23075 -284489 33080 -51367 -298309 245332 251237 -176019
10238 -176019 -376780 -365486 -174795 -73999 -30312 350044 397628 167822 218906 239403
10228 239403 43829 146602 -136931 -91104 127415 99135 258255 34204 33131 -1007
10218 -1007 -7541 270055 195470 -77059 96677 91695 95783 223411 -62732 -239869 -223968
10207 -223968 -26537 -91950 -337907 -236093 -280398 -351962 94169 438034 306029 204123
10197 204123 -27619 -271983 -360385 -140114 -8207 169789 54642 -294886 -94695 98347
10187 98347 98624 33167 72975 -9741 -98603 -216627 -247835 93466 133366 66149 196772
10176 196772 334771 221092 107636 -155249 44725 201778 87885 -173134 -96862 188951
10166 188951 304194 223617 -27972 132699 43171 -208944 -122581 254923 301607 7577
10156 7577 29724 -220974 -243773 34565 -119513 103396 239804 151488 -55108 -128165 73693
10145 73693 -21033 -349615 -366770 -280858 -138835 -270565 -201041 -168700 3583 -268815 -339565
10134 -339565 -176851 44304 -106686 -279570 -228089 19764 -22779 -97624 227374 34834
10124 34834 -15705 -206545 -87457 99764 271256 124777 -76804 13310 115456 75323
10114 75323 113155 44031 199857 215880 166729 232970 422902 172857 -35126 -84053 86788
10103 86788 -64259 -20595 7578 42238 81005 168934 145374 142375 16092 -7697 137259
10092 137259 -233345 -231536 -261710 -315479 -103059 -32467 -92209 -159296 -234033 -403418 -146196
10081 -146196 -174613 -173664 -235533 -58757 86082 126225 -97069 -27510 184249 103196 60554
10070 60554 -306759 -8818 49417 -23070 -184987 -174841 -104968 -106187 -42074 -185342 -286906
10059 -286906 -61428 16319 -116695 242688 -213373 -258455 -8633 223755 45995 -168274
10049 -168274 -298532 -304831 -206106 -278459 21557 157200 180586 -38247 -184835 -54725
10039 -54725 -59291 -8344 343885 129279 -63672 -240068 -174001 -36072 49957 -114630 -34226
10028 -34226 93517 158844 170354 71223 44748 104203 -108340 139071 249303 333015 307666
10017 307666 -57613 285895 164064 -155890 277966 151933 68683 -201922 -133142 -134618
10007 -134618 -6292 83276 140888 -159299 -162447 22775 -167614 45875 15942 -149157
9997 -149157 95726 240362 96943 392985 73113 12516 78670 -219393 -202613 14815
9987 14815 241399 24815 -287526 -59393 -8059 -120533 -27187 -157698 -426661 -246104
9977 -246104 -170658 -144204 -134495 -246622 -135917 -40833 38496 -61314 71385 17809 244685
9966 244685 6374 -33394 26673 -223116 -45683 120538 141644 -118382 102181 28781
9956 28781 -130594 -94197 -217172 791 -211968 -152541 63599 45718 49523 41640 318304
9945 318304 326228 164948 -105577 -117022 -141060 66118 -128916 -112283 158133 212742 48057
9934 48057 180583 -63889 -191767 -61431 5993 -27815 -158317 -218564 127038 261053
9924 261053 44884 -222745 -233082 -191431 -153327 30282 31707 208278 188692 213 18714
9913 18714 342736 48808 -143464 21678 238757 225758 146929 -2298 -43860 154317
9903 154317 30212 -166872 -103022 -61615 20910 160631 208754 -48301 130145 -67253
9893 -67253 -131871 120818 185134 -70876 32008 -170157 -91376 58090 125332 81412 -36178
9882 -36178 47971 -126766 -192539 34263 -133957 -238062 -140192 -294544 -219167 -349017 -387889
9871 -387889 -253638 168205 138225 74190 -258493 -283136 -104998 10900 168036 468733
9861 468733 267907 -89710 -88796 -31576 -179607 114309 -6600 -382051 -169678 -89633 -217434
9850 -217434 -336344 -215537 -210453 -164558 -17904 -223336 -178100 -64300 -36381 -320977 -344627
9839 -344627 -208037 -402107 -572041 -363180 -88127 -3161 23750 391856 195838 155602
9829 155602 104496 46568 77433 -253557 -478978 -139013 53168 -50998 -16030 -36939 -215995
9818 -215995 65551 367063 484865 -2972 -95773 157765 177339 189860 -85515 56043
9808 56043 232682 395170 97586 146037 -31587 -122389 -177410 -134717 -61783 193605 71696
9797 71696 -342921 -452970 -78402 179236 209886 -139973 -328454 -81506 -384827 -255062
9787 -255062 39933 4144 39392 5060 83977 -12567 -22165 -14715 -107336 -32745 227572 334356
9775 334356 103394 -347767 -302351 -159483 -141560 -150707 -216628 -166658 -132364 -56843 -60741
9764 -60741 36883 37456 -198080 -64697 31036 120014 51351 -151189 -168597 -227974 -121992
9753 -121992 -165433 -178060 -29588 -5012 -23790 -34318 93178 -79146 -23921 -176558 -17389
9742 -17389 136436 -104581 -5553 15265 261007 232801 -59953 312417 50457 153368
9732 153368 113727 -80170 46006 99150 65037 -85939 62723 183090 167224 -65124
9722 -65124 199134 -31665 -221178 -300506 47217 -199735 -82869 -119943 -269489 -24703
9712 -24703 72737 119622 57315 144310 -202101 -209854 -385143 -51563 132220 97473 -173564
9701 -173564 11415 -29181 1727 60544 145068 -125060 -236331 -303946 -501670 -454423 -403374
9690 -403374 -136702 -20034 9524 -208250 78804 4952 117662 76293 -105734 -9327
9680 -9327 -89996 -310709 228549 33815 -321150 -289667 -108152 -142704 -263741 -232924 -117736
9669 -117736 -60055 -276593 -297311 -232102 -192399 167882 216352 244296 110645 978 222494
9658 222494 -11502 -90849 5269 -296220 -313332 -35428 113333 -46491 49738 272909
9648 272909 -38144 -333810 -334436 -193978 -242260 50896 42341 -123820 231875 -185705 -451421
9637 -451421 -477398 -165396 -108990 -172626 53360 37848 -223179 -211248 -126582 -326324 29192
9626 29192 229737 143711 88245 94458 -8002 -185383 -310789 -151562 73094 -72855 -69073
9615 -69073 -55823 -340172 -25737 -43319 9362 123551 -20037 143317 36769 123042 339871
9604 339871 59011 -311409 -13479 185368 35191 -307535 -192417 89284 -94 -35340
9594 -35340 -236279 -311774 156907 138668 -236140 34865 70503 113734 34925 7977 197843
9583 197843 125399 -108707 419271 385233 122314 21484 53834 143190 296848 201778 52198
9572 52198 -203190 -274974 -159147 -159613 -151758 -140848 -191292 186468 396872 127204 54062
9561 54062 -1559 56135 -142976 -160248 -158106 -258042 -308670 23266 200205 -74802 -341006
9550 -341006 -69606 -253311 -16960 116857 134037 176458 270983 178650 40085 76423 -16448
9539 -16448 -82688 -150278 -17988 -84140 -217954 -307853 51245 36692 48677 100356 51174
9528 51174 -16114 163932 54623 -17788 46880 -93096 -129443 -104269 -370345 -284721 -499829
9517 -499829 -314123 -68618 55323 -61298 -112902 -270197 -406687 -165277 -153621 -123990
9507 -123990 -63403 26445 128302 24328 -107148 -150642 -100966 21060 -104939 245269
9497 245269 47283 -18166 137946 11185 -39162 50191 -66359 229465 -53635 -254937
9487 -254937 -329130 -141016 449770 197892 92342 -150611 -373944 -47418 46643 102241
9477 102241 294123 94871 -25969 -99147 33319 -54190 -233798 -506119 -324695 -173867
9467 -173867 -77377 -13156 21513 67158 -225040 -295447 -168748 202955 159444 112630 -13095
9456 -13095 -2704 173776 298052 -33074 -935 82767 542 -93862 -62525 -54734 -6389
9445 -6389 -44720 230171 218982 -254749 -111316 -121627 -318223 -247190 158148 -81295 69455
9434 69455 389061 76749 -133057 -147221 100420 -28576 72909 106498 -7295 -180358
9424 -180358 -38190 -20276 -12423 -889 97851 -96224 -196108 -377141 -52484 -158264 24107
9413 24107 -17224 60107 -72829 -254838 -164755 -74645 -144476 -139698 80498 316563 210170
9402 210170 -9918 20544 -233658 19553 225653 69124 143196 3360 -128196 -116022
9392 -116022 -339861 -104523 -81838 228953 -129577 55928 101155 -201966 -220524 -265028
9382 -265028 -146894 -313086 -178863 2654 -34247 151058 8926 169657 -27150 -55310
9372 -55310 -273483 -33626 -182593 -207478 -254804 19325 -134129 -279974 -42863 -200376
9362 -200376 -225362 -64347 204607 166663 62077 -32686 -90748 -114836 -178940 -261498 31349
9351 31349 371564 164484 138762 72241 -58258 -283847 259983 187862 -111204 3215
9341 3215 30837 31530 75300 -148939 -208804 -162150 -193336 -150245 -82823 -19134 -224815 -77028
9329 -77028 -266763 -49884 -133672 51032 -193476 -211233 147715 69208 50915 -154115 -242826
9318 -242826 62880 87046 -124210 -91514 -267215 -66664 -57300 -84523 94462 155806 -71272
9307 -71272 290197 107985 3287 32104 39986 -265740 -211664 -371749 -58655 124314 -406788
9296 -406788 -242907 -169696 -100674 -168746 -289499 150391 271715 -158314 -99486 -150714 -382349
9285 -382349 -363660 12151 53787 90237 -376320 -321502 -107698 16089 -127695 -52229 -40827
9274 -40827 297900 244467 309253 98577 -34554 16961 25297 -71254 34991 -148877 -212148
9263 -212148 -332209 -357481 -114005 -49807 231339 -75489 -153205 58266 205429 16907
9253 16907 -94726 -220396 -187122 -205408 -224933 70716 50042 120969 78253 -27286 -456485
9242 -456485 -448579 -456977 -259441 -119977 22727 59494 144273 -45856 92903 67946 3955
9231 3955 -171368 -196711 -141341 -58924 85282 236328 73344 -319966 17081 -109033 38812
9220 38812 -106406 -40824 -252568 -331618 64670 -154952 -123456 -288971 -114713 -107050 -169334
9209 -169334 148938 227739 195349 157813 -48955 -97258 -15412 -66831 -30632 105181 185344
9198 185344 206739 54219 -15946 -97501 355992 84753 -187462 -121532 8110 275452
9188 275452 184425 -6498 -158071 -38428 -250580 -173760 -100189 -62638 -233736 -58959
9178 -58959 -26325 -243050 -275645 -200905 -20990 -45398 40295 281531 -52065 76255 -137699
9167 -137699 -144027 89219 -23335 -56668 24775 -185252 -453530 -126907 -24280 -57743 164649
9156 164649 -30570 132210 -131808 51072 -16132 126399 129197 92382 -3389 -127055 -80080
9145 -80080 29551 -123550 26464 8262 68090 131067 378610 121049 53624 -165732 -111778
9134 -111778 215739 56579 -108746 -35432 -66216 -16691 27449 17069 -126088 -74482 109548
9123 109548 57834 -62245 63143 89656 -130499 193692 91909 -64714 160003 388653
9113 388653 154430 28916 55358 335768 295269 157845 -200144 58604 259593 286646
9103 286646 -2581 174126 64446 48956 138119 55254 95692 212945 94888 -229856
9093 -229856 42856 396234 208219 367308 124400 -6000 -70569 -284564 135301 225776
9083 225776 162959 266903 209460 -161798 -195748 -1391 -6569 -154389 -90620 -226687 -461262
9072 -461262 -131792 -34804 -87044 144699 -45073 -65474 -34332 65440 284488 63645 68759
9061 68759 141395 215213 41962 -353221 -85810 -63018 -115679 -206880 -202928 -78859 198462
9050 198462 230124 91363 98645 -327057 -266790 10843 242733 121086 260366 -10506
9040 -10506 236109 278153 -312622 -154675 -31392 -16907 -104255 -165058 58306 163032 49657
9029 49657 -56792 96984 57510 86064 87100 132615 -146545 95796 298730 50789 132179
9018 132179 40894 -75940 -192015 -200284 165463 406102 134369 -12771 -447887 -381513
9008 -381513 172159 245168 1812 -213932 -674 129225 -259899 -405895 -127690 -229210
8998 -229210 -148880 -160773 -152155 156395 113059 98278 282854 14867 74911 -47074 -135800
8987 -135800 212381 267017 -41659 162008 81752 66526 -64257 11865 -30000 -286293 -194213
8976 -194213 -40315 173561 223033 63980 77362 -25386 -385421 -601054 -354209 109831
8966 109831 77363 120260 65797 -108912 -292038 -174211 -150698 -59619 180470 343381 11507
8955 11507 -96814 -124140 -145806 -245760 -127527 -75042 -162004 -65848 47750 79582 147014
8944 147014 -173628 -85848 -127473 49641 4319 -77524 -71886 -160616 -50381 -74716 -34160
8933 -34160 -96725 67259 99113 -211163 -226379 -9285 -53944 -35439 185047 -137669 -296284
8922 -296284 -69975 -39668 219083 391706 175858 21507 -170108 102460 253529 226509
8912 226509 4264 66594 -163036 -31573 23655 144220 -23972 43620 84595 94541 245808
8901 245808 242218 242087 -106537 35304 130670 6105 -210545 -136109 -95668 -153103 -222551
8890 -222551 -87648 77776 56262 -113629 199999 -325314 -212752 -87131 91158 108463
8880 108463 18420 -94640 -7182 120401 2037 191200 -46983 -122004 146156 259721
8870 259721 251191 78580 115281 124718 -320071 -89803 -79285 -90328 -415736 -487720 -61143
8859 -61143 32520 -187375 -3407 21511 -225617 -19610 -289880 -372531 122471 374972
8849 374972 -57772 -73421 10637 -133115 27834 -166785 81771 237774 263172 115634
8839 115634 223583 296593 -37490 28413 124766 44471 178612 316835 78907 32990 -137748
8828 -137748 -192825 -212848 -137570 -212429 20783 149668 -22410 66565 13148 291389 154052
8817 154052 -23129 -181741 87738 -45372 -186859 -263540 -187827 370308 -144684 -335176
8807 -335176 71786 -8425 64997 148331 -115841 46419 -18534 -72823 -54095 138076 14435
8796 14435 164923 521595 33447 -172090 107124 292076 -31585 28823 122740 -46274
8786 -46274 135906 75064 26614 109016 125771 7570 89554 71004 89211 -116964 -159059
8775 -159059 -197882 215196 175163 -115505 145865 -155227 -199548 -129549 -235285 -106721
8765 -106721 -55471 -198680 107510 208500 138034 271550 7240 179466 52271 184532
8755 184532 238802 124464 219503 27051 40586 122005 128257 214813 33068 -82893 39539
8744 39539 -28248 -22967 141363 -254229 -263664 239212 -161502 -39662 -9795 -192323 81841
8733 81841 311826 166814 -44255 212296 -73248 -17269 235724 253492 -47388 99288
8723 99288 -52387 -73108 -73025 -68657 -14609 -101064 -81798 -66228 286960 233927 -139394 -312805
8711 -312805 -82417 272861 56093 -159636 -106021 88798 169121 221117 42271 -28630
8701 -28630 -70875 -9077 93782 205920 137110 -85918 126825 229002 72708 -172440
8691 -172440 132328 334105 483495 119798 -20506 134820 359611 79449 133317 -80424
8681 -80424 -217213 -27687 -61180 -28867 -90866 -36944 -18449 -182841 -25360 834 -146575
8670 -146575 106505 284001 -12130 -166451 -100956 96911 -29654 -374604 -343654 80738
8660 80738 38423 451441 153438 -195438 75325 428295 112942 50449 -166317 -124726
8650 -124726 208258 -133162 -141260 34109 200617 125232 140410 120077 12376 115548 -49692
8639 -49692 -48070 -132132 -243646 6214 -156832 47467 56728 203129 -53865 -238241 -153646
8628 -153646 57553 273058 211904 31230 -207172 -35562 154598 34187 69584 107019
8618 107019 -65702 130148 75951 107885 -57627 -161301 -173280 -164841 -140418 -39587 -17117
8607 -17117 267756 238531 232474 45136 27121 358206 171774 205998 309186 -160500 153241
8596 153241 278845 288553 375700 90575 239879 -53197 -123240 -115134 44146 94105 788
8585 788 -27810 127632 46300 -19300 -58358 42671 -117407 -69712 -300158 3056 172833
8574 172833 72607 190332 189974 6996 242308 167018 -66707 -7461 16658 70494 77753
8563 77753 71530 51816 34244 88938 301700 419292 97862 56509 338130 -5109 -182469
8552 -182469 -117471 -178088 58943 -72114 -14831 184963 240516 -87898 -202778 -123020 -13695
8541 -13695 104214 92731 95021 48440 -103326 -31302 236396 181016 -169312 150009 461444
8530 461444 337109 170584 149308 132777 5405 198373 54348 1205 -147672 -404690
8520 -404690 91712 -121649 -7123 164317 186710 265414 340363 482110 108887 22745
8510 22745 108757 181630 205951 48657 178545 -134472 80020 186607 1364 114053
8500 114053 -97763 -44897 -216404 210000 115122 -105125 -172049 179450 147948 263318
8490 263318 416820 395267 265249 346432 273855 -399878 -941258 -39467 109450 -240706
8480 -240706 32199 288189 258035 101615 196787 112915 -165386 -168328 106619 -34804 328138
8469 328138 -6535 -125145 79325 190523 116604 256335 148473 -14366 -52942 -62525
8459 -62525 -44188 -82070 196400 137455 274192 268199 405784 221671 132285 122162 45181
8448 45181 234781 341787 173763 163252 100058 -92388 -53826 91510 -8739 95353
8438 95353 4030 129286 91606 177178 283607 51858 -203198 113498 -41160 -169111
8428 -169111 -62879 100131 52748 108411 62530 -14526 -49298 -287819 -194535 132249 518338
8417 518338 451024 223613 200566 210418 274170 398087 -39986 -124139 -38488 94695 65234
8406 65234 100032 29144 292863 309545 140292 26238 33139 -180343 42176 328182 129654
8395 129654 -172518 -264911 -60235 -44230 -115084 -41896 261862 217804 201667 336147 412596
8384 412596 325555 346800 245354 151658 198307 -75598 74056 15571 184805 262393 357356
8373 357356 424884 327823 117716 55228 283920 269256 140616 147113 242007 426279 383071
8362 383071 136869 180678 571194 485432 320243 352102 168331 286868 390378 414010
8352 414010 555559 284642 264530 327075 135817 419186 347163 306719 440701 320229
8342 320229 146784 14174 170717 3908 66752 125223 296365 309415 84514 -119841
8332 -119841 -33161 234958 353894 380251 501923 537646 368297 299735 433505 360823 124482
8321 124482 73053 -13756 297736 240652 162711 -82725 349628 352195 139629 60555 -16823
8310 -16823 -90835 8226 74433 47575 47373 213675 74589 14938 -46939 -9308 -107402 24269
8298 24269 227169 188247 178799 282101 401919 529887 430132 176341 399057 148873 -217001
8287 -217001 -73739 214529 -51752 93806 255548 106846 210964 137041 115493 290074
8277 290074 8443 62550 268050 182620 64932 327942 452823 621202 329630 81943
8267 81943 312499 347069 192037 307320 613978 407755 215252 369535 209501 253471
8257 253471 36432 246095 7100 94347 109342 129112 75576 -35734 30256 -45590 306449
8246 306449 190645 173543 174652 137832 356458 391993 641801 626037 403138 361643 265296
8235 265296 480443 672518 568744 88855 111710 281392 301530 344443 532681 253998
8225 253998 391186 198678 379258 337494 427655 388868 322555 580222 193219 271962 215111
8214 215111 185481 309163 114431 275138 286681 256038 279857 214237 508371 545538 384059
8203 384059 506658 10473 289203 195981 206175 462560 135744 457720 -296740 -80747
8193 -80747 -291122 -103330 912622 503254 834201 604637 458762 635545 509785 313116
8183 313116 531372 556552 194258 -114859 -9941 140493 458007 559637 630523 583041
8173 583041 263175 622390 644735 499203 544676 387933 289491 412057 772335 380946
8163 380946 -22475 238383 252464 503361 331761 758188 480128 722921 612320 601061
8153 601061 486798 290310 282070 301672 437943 262360 114221 250941 -150179 -47704
8143 -47704 391936 294547 291235 249420 354169 355186 375152 292037 356712 497188 480258 487164
8131 487164 204729 147755 299385 409123 453974 279893 443298 688407 673726 696837
8121 696837 530987 190375 376033 434517 689290 249547 399195 620913 809811 705860
8111 705860 573412 333133 350688 656881 554799 771771 932368 793823 640749 740919
8101 740919 577019 783232 527036 390916 462835 584684 980549 507652 594191 649824
8091 649824 609845 500185 418758 561851 398938 403993 582560 558711 400191 236374 255741
8080 255741 441146 631238 572217 454969 535970 503422 293091 446710 646061 570552
8070 570552 606198 822182 836886 504786 443418 501974 481575 570511 793105 819193 642424
8059 642424 661956 594712 588795 956039 846215 826978 537978 822624 644969 501213 867243
8048 867243 740302 635876 756855 717887 519309 767799 775605 517227 633193 773387
8038 773387 703039 825743 717857 916782 944630 686465 739512 686727 680818 719753 716911
8027 716911 679904 655697 568692 469282 556975 554475 622716 958474 850663 722732 524114
8016 524114 840528 500105 635240 588965 567063 951824 823325 803255 639465 428085
8006 428085 493130 823582 365229 731345 663376 712930 790739 888044 904536 1078329 1086482
7995 1086482 987118 821927 769261 799518 942247 1013418 843617 670934 676925 659961 1174285
7984 1174285 1137087 1431719 1215069 980818 993942 1049006 993890 794735 1072016 735749
7974 735749 698690 1004792 1029235 910048 1289077 1256142 1304358 1138996 1137429 780314 1006714
7963 1006714 1231518 1301597 1184404 948090 999053 1391076 1477242 1125194 1342415 1393176
7953 1393176 1258063 999039 1142551 1575023 1276220 1400695 1435520 1422909 1497061 1382673
7943 1382673 1439587 1610900 1154500 1520890 1650939 1438759 1854797 1812672 1674103 1659540
7933 1659540 1714374 1880298 1822786 2099936 2036097 1888086 2144260 2309147 2166983 2199755
7923 2199755 2577956 2576443 2328621 2330597 2348413 2541003 2491244 2059745 2160784 2309975 2125960
7912 2125960 2059852 2253297 2190668 2410096 2717241 2433519 2479576 2643139 2588308 2565657
7902 2565657 2760090 2765511 3371348 3151869 2837307 3064294 3164452 3220560 3210683 3345348
7892 3345348 3367588 3501098 3517682 3947358 3836653 3922752 3974240 3918103 3587189 3804097
7882 3804097 3949973 3789190 3873210 4283221 4300579 4166391 4123441 4074543 4449262 4468557
7872 4468557 4135718 4485511 4685732 5047888 5248855 5311051 5371879 5392584 5708111 5861180
7862 5861180 6344813 6695299 6695488 6883085 6924543 7371590 7354441 7752692 8045310 7969634 8443296
7851 8443296 8656791 9113766 9374473 9819169 10613522 11135274 11790905 12482348 13509727
7842 13509727 14250470 15247850 16477631 17606457 18636717 19792338 21196183 23007483
7834 23007483 24793847 26950880 29537059 32686100 36339812 40362651 45029262 50256612
7826 50256612 54743202 58612509 61822712 63771240 64646742 64038082 63106192 61155552 58289462
7817 58289462 54281922 50323831 46075130 42281560 39485043 36638258 34519584 33115419
7809 33115419 31409743 30180792 29156393 28352022 27370106 26654928 26006881 25262499 24768134
7800 24768134 24480683 24158183 23705015 23210934 22671545 22417934 22060605 21425317 21100578
7791 21100578 20860609 20367526 20001518 19515250 18992599 18724573 18232087 17742735 17683377 17038106
7781 17038106 16376138 16166033 15679987 15093221 14407387 14258150 14227900 13741903 13110655 12799341
7771 12799341 12246692 11506760 11062626 11020338 10381315 10126656 9737126 9412824 9100930 8774009
7761 8774009 8348592 8018835 7652249 7378964 7305135 6992800 6921046 6565963 6282764 6037917
7751 6037917 5902516 6078285 6054532 5615049 5422449 5244605 5356468 5122635 5084844 5034742
7741 5034742 4727071 4438591 4394685 4420113 4218392 4191325 4195808 3989400 3700365 3900477
7731 3900477 3944415 3780643 3787879 3722085 3745103 3494711 3682929 3577824 3388352 3348639 3414921
7720 3414921 3451386 3413921 3188696 3209649 3503742 3371314 3325761 3363972 3238187 2828862
7710 2828862 2868857 3267287 3086708 2864288 3159108 3063683 2754622 2815353 2615421 3029531
7700 3029531 2825561 2694862 2591492 2808128 2846664 3096941 2858847 2770882 2689312 2599369
7690 2599369 2658636 2773031 2607725 2434526 2508271 2632775 2889736 3160035 2710117 2935693
7680 2935693 2914338 2514268 2764584 2573647 2623231 2516735 2648726 2400478 2758818 2693735
7670 2693735 2723739 2509329 2831266 2713664 2789733 2827777 2789262 2881835 2883339 3098999 3066814
7659 3066814 2856456 2920999 2939018 2914069 3202759 2973958 2742034 2813910 2661895 2485268
7649 2485268 2430962 2537993 2733521 2847368 2649460 2628048 2698505 2679396 2613969 2810848
7639 2810848 2742109 2756287 3059787 3190609 2904989 2860626 2984509 3143317 2866755 3223851
7629 3223851 3223899 2986132 2982601 3003612 3187396 2808864 3054484 3306407 3519087 3495041 3775515
7618 3775515 3770322 3602596 3650839 3531398 3564794 3622614 3465672 2950391 3282984 3303310 3505926
7607 3505926 3568529 3192533 3354344 3508434 3332243 3521018 3529795 3358121 3466095 3727256
7597 3727256 3961457 3982959 3973964 4010357 3783332 3924017 4003187 3941008 3802503 3788937 3805602
7586 3805602 3829926 3598470 3596856 3788578 3726786 3817452 3613990 3652855 3573374 3743184 3721123
7575 3721123 3774568 3745381 3640291 3404934 3529849 3572918 3841367 3781994 3743843 3521413
7565 3521413 3718345 3644752 4038110 4078906 4364008 4024821 3808773 3978965 3799439 3788761
7555 3788761 3786483 3964506 4028071 4061883 4145538 4089872 4124434 4337371 4249282 4094116 4311491
7544 4311491 4278561 4227591 4508270 4545163 4225652 4214926 4289189 4160800 4288998 4319489 4594721
7533 4594721 4285809 4173232 4165734 4309082 4589442 4477491 4493451 4654984 4695018 4713625
7523 4713625 4704916 4741289 4760910 4674641 4818648 4440355 4633483 4554528 4622427 4869265 4807933
7512 4807933 4519156 4580760 4873991 4676808 4720735 4490828 4702054 4791431 4738475 4783692
7502 4783692 4655572 4901322 4774657 5152130 5230137 4937403 5007317 4658367 4799555 5192007
7492 5192007 5006816 5045251 5139168 4875198 5123422 5151546 5088150 4951347 5084050 5099345
7482 5099345 5051742 4802702 4904825 4936183 5046849 4966738 5051531 5071939 5019382 4948717 5235929
7471 5235929 5226054 5239953 4865168 5253223 5257235 5247405 5455589 5374631 5152996 5189988 5514078
7460 5514078 5374452 5499552 5537601 5711917 5577783 5696529 5680912 5545669 5684636 5812007
7450 5812007 5824496 5484266 5905129 5732298 6099116 6021532 6002120 6029231 5885531 5993843
7440 5993843 5871376 6036024 6279945 6438633 6233009 6070116 5950916 6356174 6333760 6323430
7430 6323430 6288168 6425690 6370785 6659906 6539782 6552924 6886870 6890220 6908104 6547026 6624678
7419 6624678 6810594 6962511 7012325 7218973 7170636 6929014 7098168 7305034 7214789 7245216
7409 7245216 7411453 7411803 7786235 8185794 8378872 8196036 8252209 8267873 8350627 8350602 8439324
7398 8439324 8268854 8253524 8169118 8187937 8260376 8301335 8263866 8232530 8492301 8339781 8460311
7387 8460311 8466360 8068749 8213948 8381335 8610438 8741410 8673368 8908622 9111650 9073314
7377 9073314 9427022 9204520 9001282 9051755 9330294 9214511 9448792 9600379 10047060 9879677
7367 9879677 9983163 10103599 10198960 10330119 10547766 10718565 10423206 10754436 11077595 11148400
7357 11148400 11160671 11445522 11693554 11647993 11704978 12080598 12094132 12391518 12914934 13045114
7347 13045114 12909647 13118012 13316098 13590184 13774077 14026330 14247728 14553451 14929048
7338 14929048 14986214 15068971 15522430 15542190 16202475 16630986 16786687 17188090 17254321 17665151
7328 17665151 17877838 18261778 18822079 19052665 19605589 20031449 20371081 20829145 21293666
7319 21293666 22022683 22431800 22847291 23540820 24129162 24629496 24933889 25399278 26453859
7310 26453859 27065576 27635722 28543100 29228917 29767397 30974942 32064766 32911064 34027440
7301 34027440 35040728 36336539 37562891 38989629 40352393 41489701 42845368 44239434
7293 44239434 45570085 47453823 49289794 51237495 52904773 54764711 56532123 58282170
7285 58282170 59847472 61175106 62653498 64370174 65919716 67919680 69951104 72032455
7277 72032455 74842666 77484908 80251669 83416806 86335054 89317848 92395440 95980458
7269 95980458 99747074 103417000 107650146 112258362 117249869 122928605 129550585 136990875
7261 136990875 145444239 154186067 163394863 172319972 179471227 184904845 188230117 189394098
7253 189394098 187384755 184366814 180699605 177252636 174206900 170750767 166026645 160938286
7245 160938286 155939031 150868629 147376815 144126301 141130999 138682434 136905004 135203820
7237 135203820 133631213 132262217 131454065 130337954 129062611 128555493 127882847 127393076 127187311
7228 127187311 126898187 127039691 127592750 128188408 128888828 129906097 131199667 132699481 133954965
7219 133954965 135157486 136539189 137740217 138658012 140128912 141314912 142097702 143228271
7211 143228271 143903498 144017804 144021405 144025427 143747984 143060381 142493391 142280934 141707879 141838640
7201 141838640 142178627 142310297 142895626 143572364 144164806 144978421 146092614 147047920 148761130
7192 148761130 150024106 151098635 152458202 154085993 155758749 157070583 158372935 160088982
7184 160088982 161460817 163363487 164869715 166313777 167881744 169284464 171029964 171915550
7176 171915550 173051706 174058910 174859220 176046203 177001034 178268744 179000816 180306787
7168 180306787 181653082 183172786 184452332 185743677 187561777 189037823 190895717 192883375
7160 192883375 194978582 197287816 199298026 201419663 203578307 205377047 207149418 209395530
7152 209395530 211403340 213543991 215577243 217384869 219400102 220985425 222586561 223927660
7144 223927660 224833572 225422001 225756170 226293373 226462645 226397590 226538005 226182308 225771623
7135 225771623 225094890 224089900 223408828 222206457 221320143 220475713 219928073 219917994 219487376
7126 219487376 219497817 220132978 220667238 221699299 222786232 223290183 224439263 225030778 225253797
7117 225253797 225585255 225665937 226023092 226301712 226369514 227194954 228038278 229302300 230416440
7108 230416440 232167772 233692851 235704982 238056957 240249510 242580547 245067757 247758693
7100 247758693 250670368 253607183 256288393 259290466 262536279 266211398 270191856 274352901
7092 274352901 278239603 282475734 287116917 291554532 296210254 300841065 305270680 309555770
7084 309555770 313561137 316939374 320304616 323134292 325742701 327811526 329645473 331732124
7076 331732124 333928930 336734401 340269079 344533637 349584353 355369243 361547763 367725728
7068 367725728 373672762 378883601 382338410 383544919 382535517 378532876 372816953 364807360
7060 364807360 354324194 343033272 330466695 316665090 302719673 288251914 273606400
7053 273606400 259693419 246419466 233759587 221396984 210122611 199294827 189013050
7046 189013050 179598394 170511348 161891639 153753359 146479021 139494978 132886340 126511635
7038 126511635 120980959 115401203 110060417 105296082 100717021 96450839 92160175 88595784
7030 88595784 84825916 81444057 78175773 75069326 72157718 69571834 66907377 64244354
7022 64244354 61798609 59175306 57392258 55563852 53724413 51419658 49473871 47741248
7014 47741248 46208492 44913288 43355498 41960154 40599806 39367945 37875118 36548279
7006 36548279 35513496 34390274 33085161 32073940 30948687 30162342 29444703 28359264
6998 28359264 27624213 26707055 25938709 25440167 24428762 24039680 23040279 22663171 21893377
6989 21893377 21460954 20962171 20253707 19539001 19209206 18764899 18034453 17545783 17144259
6980 17144259 16848083 16672650 15781817 15898682 15681148 15124566 14909292 14602063 14263367
6971 14263367 14250326 13760429 13544327 13331119 12915429 12845250 12372161 11900811 11620200 11483931
6961 11483931 11161710 10811819 10283880 10072981 10103084 10038932 9586927 9488364 9029235 8947102
6951 8947102 8801343 8808697 8597511 8478459 8416231 8472917 8042351 7955218 7933698 7871552 7506665
6940 7506665 6925860 6803098 6933581 6798809 6653279 6331956 6294351 6293090 6070035 6109759
6930 6109759 5997767 5794575 5427325 5276288 5319948 5340878 5441596 5309005 5292473 5062798
6920 5062798 5062645 4917290 4826244 4729335 4602497 4441126 4409573 4392217 4464984 4255459 4003174
6909 4003174 4024043 3834726 3999869 3827773 3784607 3676286 3738103 3582084 3642618 3321197
6899 3321197 3197741 3242584 3469209 3500883 3227996 3274419 2861195 2706728 2791291 2829410
6889 2829410 2877155 2640194 2673396 2874842 2791189 2716880 2488456 2500665 2751730 2762725 2439082
6878 2439082 2361035 2183131 2069765 2091996 2340447 2366715 2275711 2345467 2537087 2355590
6868 2355590 2076614 2076728 2124135 2001707 1961076 2050423 1995860 2201214 2322751 2317050 2161692
6857 2161692 2043373 2091058 1969239 1956205 1762308 1961457 1899747 2029402 1676071 1738699
6847 1738699 1534288 1399481 1752084 1684733 1554007 1482565 1853843 1711967 1836450 1793015
6837 1793015 1380288 1547909 1763543 1478474 1577226 1271211 1129357 1035901 1260843 1180301
6827 1180301 1390558 1416009 1515682 1180875 1316782 960742 1211275 1341838 1105068 1086499
6817 1086499 929794 1293601 1129338 1215786 1028860 952212 958522 1286133 838631 823907
6807 823907 795523 1006156 1040011 1075615 1161989 1421949 1034731 1140684 1031697 1036856 1192710
6796 1192710 940834 766152 662509 815370 938228 761710 848335 1020974 985078 867975
6786 867975 725060 720078 565376 852270 825651 679604 748278 1078385 823076 812628 922075
6775 922075 905029 928498 1109606 751819 785674 687606 588858 480397 548821 425794 531224
6764 531224 685667 710661 676193 432317 563153 482017 387591 502832 406788 298029 709209
6753 709209 845826 241189 389617 551391 488008 641792 624390 550360 535064 486831 137478
6742 137478 400324 305101 357317 190190 365314 717090 528049 596478 482115 377826
6732 377826 435512 532843 521389 560404 459074 342818 384397 407643 583958 643851 374763
6721 374763 514962 412261 661155 543637 156158 271283 593235 428807 556291 370827
6711 370827 243067 111994 161497 363931 675916 720221 652253 447847 468150 338801
6701 338801 421257 517016 142193 468303 644301 580311 316009 294549 -10508 414108
6691 414108 200857 121260 243995 213779 70239 180401 228128 -18855 127234 445340
6681 445340 570593 405639 361759 480546 315871 264524 56247 62510 241703 271864 357634
6670 357634 361375 128749 328870 104989 124006 500507 449996 -21055 -306064 188908
6660 188908 211207 -3727 -203015 -127401 -55126 -185237 133902 94261 212697 278681 187505
6649 187505 -85775 -97427 209087 176824 137767 -22094 35165 231612 168997 135646 241609
6638 241609 343655 198974 134077 250066 125649 365926 290114 141572 386249 56439
6628 56439 10148 7874 232120 32308 40037 292518 253924 349482 -45752 83053 -43791
6617 -43791 147767 493630 402034 -118939 48000 86102 18574 209991 88044 38806 -45860
6606 -45860 -52097 -70040 -71719 99353 192882 29601 23642 10568 178587 330893 60388
6595 60388 78549 109025 169173 248045 425243 76992 190047 -9541 -288736 297403 407439
6584 407439 267927 4159 -16093 -166992 18573 134291 140953 -208459 -271190 -165976
6574 -165976 -143715 -230770 -5781 76482 91170 80264 93191 -59944 -131815 184020 229978
6563 229978 -66001 -122912 -178409 -237899 -81761 -5008 218058 34340 139199 21124
6553 21124 183104 248116 200821 153024 238903 309692 377285 253221 35838 247325 58352
6542 58352 79831 305997 300277 79362 -27725 -151273 -211619 93226 98947 -176786 12993
6531 12993 203444 129024 184447 374357 178747 106110 201875 -69569 22202 -55174 5114
6520 5114 111705 123102 -68483 49650 -167541 18263 48303 36193 142941 -34874 12342
6509 12342 -13314 -129859 85249 282437 37702 335836 192554 122173 94786 218873
6499 218873 244328 262583 291418 293766 255757 460253 349272 -124773 -22632 -255815 -34489
6488 -34489 295171 7254 176383 316887 252492 -6234 34951 119222 -73538 32767
6478 32767 85205 330125 269286 -109982 -17464 230062 108714 104785 106963 128431 62590
6467 62590 80977 -156062 -81309 -42211 159242 -357226 -207836 -179791 -79939 148428 -261864
6456 -261864 -248574 -225181 -290630 -99115 199709 -15717 -145963 -59013 -11646 -51648 -111028
6445 -111028 -93488 -142443 5358 135179 49912 -54821 -78928 195814 248299 305721 -215848
6434 -215848 -314607 -136673 214055 177870 2707 -139257 -191204 -98080 207079 -186329
6424 -186329 -236277 -63456 -100683 -198337 82598 48601 -166236 13689 -111994 -172090 -107471
6413 -107471 -133449 -8880 -358269 -130566 1647 -231349 -44525 233836 144881 68923
6403 68923 39828 -71458 44365 -138044 91025 385560 -20351 -48313 -526032 -271607
6393 -271607 280705 263972 -59506 22468 60597 84948 82246 61950 -134704 -320333 -139199
6382 -139199 -184896 -296259 -429058 -10139 29819 -84049 6985 7290 -324987 214985 -7751
6371 -7751 -21217 113564 130482 123575 390489 23953 141376 111009 188275 12773 -181815
6360 -181815 -202246 -437223 -253098 -176885 -266506 -256719 -255828 -579378 -166434 -120106 -67941
6349 -67941 21419 166648 40312 -390516 -247755 112876 368141 411508 300161 37761
6339 37761 98332 72289 -266448 -327934 -148944 53856 93916 -192824 -294743 -195393 -142054
6328 -142054 -176466 -423196 -143939 89018 -124766 -24566 -35155 -221072 -285966 50760
6318 50760 -158212 114794 137419 50303 -66262 83432 189247 42661 42279 -249581 -250276
6307 -250276 -239287 -392717 -237731 -261532 -296506 -247463 -129429 -177379 -52072 -50018 -57428
6296 -57428 220819 -62651 -34941 -28199 -50633 -363386 -102875 188890 -159158 -445447 -70255
6285 -70255 -158168 -70453 -33317 -150933 -106840 -196904 -118558 -44916 45931 -261910 -215067
6274 -215067 -136343 -114641 195810 -11025 -116578 -254202 -133276 -372655 -433748 -67261
6264 -67261 -85956 -116203 45541 -241052 -327849 -78202 -205076 -217100 -135678 116244 122613
6253 122613 101106 -10726 -247187 -60531 -201671 -268103 -307569 -527227 -164591 -88742
6243 -88742 -132570 7825 -514 -197821 -594823 -199691 -248588 -269351 -116782 -124933 -165278
6232 -165278 -90219 -33029 -46426 172232 175351 504 -224034 -570058 -356008 -185877 136852
6221 136852 -106167 -10107 43815 -220611 -31479 -59721 -16728 -18947 -237154 -118791 -191807
6210 -191807 -29152 236769 281453 240331 227132 227029 -19980 -110277 -20974 -146915 -187983
6199 -187983 -31229 -54316 20373 132137 74977 -58734 189585 -89023 -80855 30957 45514
6188 45514 -71927 61945 -200686 -164947 -200886 -426351 -194930 -98475 -116267 -89279 50923
6177 50923 234738 259942 199976 -154406 -169447 -125060 -254898 -68216 299027 -153891 -146895
6166 -146895 -153088 -291503 -113498 -108015 -193942 -172435 77570 -44700 17088 76691 195363
6155 195363 -53226 -363473 -90291 203376 35220 12379 84343 -45267 -75989 -83881 -44742
6144 -44742 -427922 20118 12007 33488 22138 66208 -114686 -164366 -16980 -93871 -193955
6133 -193955 271596 160569 -163578 -191338 -346289 -334756 -116317 9421 -63985 286422
6123 286422 69260 423930 410535 125355 -68733 -337090 -229717 -183080 -44365 10623
6113 10623 39406 -128365 29223 166166 73726 42511 -45257 -131600 -140414 -97647 68848
6102 68848 56117 73850 87747 22075 -9763 -271558 68743 -282934 -272585 -46982 -28215
6091 -28215 -11539 -41422 -187842 -14278 118771 -48734 -193287 27664 -51971 -333355
6081 -333355 -55385 -11729 52499 -102771 -37856 45073 -101995 -43097 -19220 -31586 78147
6070 78147 -94613 -532177 -153314 -29294 -12684 -96835 -100280 561 90868 65280 171569
6059 171569 241873 107915 -67661 -35201 94251 125635 136223 107857 108284 -63859 -295608
6048 -295608 -260018 -276616 -267021 -194687 -92647 -409712 -212592 -342861 -198243 158529 16534
6037 16534 60546 -171807 -256377 -415590 -287423 -25675 99539 -83736 -49020 -392336
6027 -392336 -276374 -81625 127571 49736 -436526 -56798 -284603 -285968 -54629 50999
6017 50999 -321264 -250928 -151506 -64459 18802 -93254 -147072 -1252 -25802 -162689 -208717
6006 -208717 -277794 -37830 51417 -227492 -129962 -317925 -541252 -491577 -437992 -19239 78350
5995 78350 14401 -167937 -384162 -86658 -115068 -121414 -22877 168403 161223 -200559 211575
5984 211575 153583 -781 -384630 -118871 -791 -116668 -67349 -83035 -259704 26349
5974 26349 156133 -274046 -85670 18228 99816 -57057 -649226 -455450 -155279 -234830
5964 -234830 -230547 55925 92223 24594 128205 -134764 105895 161673 -60367 121533 -89078
5953 -89078 -218881 -360831 -172942 -11041 176084 59809 -16713 -25392 63291 111366 -13026
5942 -13026 -179593 -314267 -389580 -248222 -234698 26890 -171951 -204143 -168613 287732 196836
5931 196836 176448 131911 63661 47774 -66220 -192463 -115554 1466 -3626 123535 -62745
5920 -62745 7111 -223958 -187645 -203391 -83210 -111455 -234403 -217440 -102582 -93736 -14152
5909 -14152 -259801 78111 -36322 -211598 -197859 -197296 -287243 -251765 118576 226113 39070
5898 39070 -44822 -125958 -470536 -290773 -447059 -672813 -53614 -232969 -229014 -125349 68566
5887 68566 -191243 -91287 -140532 -279306 79906 47919 -189137 -238309 46522 276310 -291743
5876 -291743 -192322 275091 42463 69265 -384867 -41344 -62695 -313114 -444391 -241396
5866 -241396 -179878 44930 134652 -151218 62916 233674 -20211 -239632 -260191 -282850
5856 -282850 -368965 -183263 101012 -332192 -180721 153316 38029 -174215 -212877 -148414
5846 -148414 -122232 -251209 -412899 -302705 -291660 -68852 -339989 -36026 -62799 130615
5836 130615 69549 52523 323293 101880 14343 103464 -101092 29110 193280 107985 155412
5825 155412 137346 -280130 -444249 -306822 -331812 -51975 -266346 -372534 -401893 -106041
5815 -106041 65828 11334 193905 115775 -169616 108653 57114 -191762 -134884 -161746 -318246
5804 -318246 29737 -102577 -191349 -197766 -24083 129570 -1720 -203420 255053 492540
5794 492540 446652 294864 -4559 124199 97589 -6469 -296665 -263678 249369 -33222
5784 -33222 97450 -2434 128610 184719 -27696 -308837 -121979 -149570 6540 -143760
5774 -143760 -185101 4862 -196827 -124770 -159226 70345 115392 199666 46166 -116717 -12903
5763 -12903 16804 205582 78315 226095 154325 -94444 100000 97777 -164419 -133862 96316
5752 96316 -89000 -50568 -209362 -219159 -331678 -346741 -103300 206847 392519 122421 -188209
5741 -188209 220861 278828 400548 92617 33011 129061 -156432 152426 159536 27239 132053
5730 132053 269215 239772 135055 339910 103925 1662 109300 123558 166263 142417
5720 142417 -89206 -61617 9704 105080 150604 334242 144131 247069 123084 145169 25383
5709 25383 -11981 -7338 -56314 -126442 79600 202164 116905 129614 316486 401779 30904
5698 30904 84617 -5780 -62607 -16327 124803 36937 419398 344463 281334 -84419 -131336
5687 -131336 166124 44874 -9228 74058 70618 -48465 -143301 203563 109548 -354888 -300741
5676 -300741 -162383 -84839 -157572 -151961 -106230 -43730 -221159 -247907 -164844 -35718 188992
5665 188992 103401 -75312 33366 238642 396205 225322 102326 52306 -68604 -139255
5655 -139255 113894 -145617 267804 78346 -26391 264299 102982 243115 146766 70794
5645 70794 -66521 361489 210795 -174957 -139372 14123 -276585 -241461 53736 -165511
5635 -165511 6974 -331254 -154033 93611 186353 19264 -243010 -73517 242100 -93743
5625 -93743 -97801 82976 -203764 -129824 -219441 -241626 -339671 -250910 -168617 -217662 -87640
5614 -87640 -147534 -225222 -406637 -179247 -167792 -252771 -63227 -175848 -50892 -30556 -105805
5603 -105805 -144341 84692 66036 83447 277945 365534 240391 331409 467672 298865 260044
5592 260044 39263 453479 320666 334279 242269 -112991 -92638 -48164 -72912 35612 193577
5581 193577 -177217 -23520 -162183 -249716 56316 192177 -197358 -95642 -53302 -252004
5571 -252004 -184740 -73389 -181110 45273 119856 236504 -60196 -164376 -276308 -284857
5561 -284857 -286998 -274052 -102313 68341 -75820 37880 -33135 -158257 -63892 -11383 55861
5550 55861 -76063 -279357 -90677 -133239 -54280 -112380 83271 3295 -50664 -118718 -198252
5539 -198252 -60879 168310 278224 102086 62819 -105985 43474 62152 118830 -43139
5529 -43139 -114706 -45624 152986 282664 367290 133397 133617 -91086 97020 245236 128172
5518 128172 25190 15564 30974 -67823 -33712 -130476 -385184 -161069 26761 -203200 -402370
5507 -402370 -289211 64004 3199 -137213 -12440 45252 8803 -15415 -40656 -107169 -262084
5496 -262084 -169128 -213596 -70592 75649 186548 -282862 -40957 -73456 45278 121175
5486 121175 -85016 -175685 63786 -149450 -171629 214957 242542 186156 174703 -32246 296744
5475 296744 606193 430439 566862 372811 217525 282148 128105 36891 137886 -44120
5465 -44120 -94881 -63622 15084 -84314 -51923 -96530 -42899 39290 205370 -16079 502875
5454 502875 346982 455369 344248 454136 635712 610317 527416 772467 470678 610511
5444 610511 522782 719422 796735 826102 1156169 1041357 774071 832121 727232 788351 757913
5433 757913 778701 1093652 1093401 1038579 1081361 1307180 1380138 1228427 1272849 1384997 1425123
5422 1425123 1481827 1630755 1622478 1558761 1723403 1600070 1377439 1381827 1583641 1217477 750826
5411 750826 816511 630646 837074 1102386 687668 747174 624736 725707 827482 964225
5401 964225 719779 867484 698187 547033 696525 548324 536161 524413 737654 714378
5391 714378 523280 524384 539680 413130 179571 362761 295940 110495 359339 335525 183036
5380 183036 279933 208901 173038 185182 55561 -51184 308229 656345 591049 720165 320650
5369 320650 110581 75251 379610 224527 129999 424494 50250 -94892 161855 280793
5359 280793 188655 -139613 -252540 73751 320553 73669 323439 379588 87088 346633
5349 346633 228005 333330 255644 178172 -82647 78449 149849 100129 117060 199141 -39064
5338 -39064 105621 2779 319699 108965 86969 248002 196173 -45086 125805 165544
5328 165544 464566 484139 592563 287057 369488 262963 158186 192185 281161 251642 115948
5317 115948 578761 497265 96071 111369 657798 722988 529299 450458 545859 261650 278359
5306 278359 23738 274183 391492 369181 583397 160392 46284 391509 207533 299404
5296 299404 227644 526975 748268 628337 416778 141993 149940 616032 539852 507830 455775
5285 455775 630703 759808 487126 469599 759559 619215 753687 857132 498380 293732
5275 293732 468302 622900 405897 521791 523395 620415 867046 540879 633402 820433
5265 820433 999678 719247 794869 784728 775245 1002116 1010206 1202365 1189073 1125580 897667
5254 897667 709824 670134 1148208 1063667 887861 859428 841989 1216187 1544410 1535336 1435716
5243 1435716 1238262 1264599 1562421 1337950 1428779 1283344 1295975 1724642 1788052 1945454
5233 1945454 1755910 1804226 2101687 2376169 2434912 2266041 2507859 2749427 2749964 2940044
5223 2940044 2994048 3195202 3116194 3314933 3996794 4260240 4362484 4771883 4953630 5221067
5213 5221067 5887329 6255054 6617244 6975128 7698789 8560654 9099655 9769891 10520071 11305893
5203 11305893 12023229 12706412 13530344 14339060 15130762 15712581 16166718 16454661 16893879
5194 16893879 17443229 17617476 17946899 18695385 19274447 19957699 20981419 21851390 22476109
5185 22476109 23369018 24122448 25016658 25223541 24904834 25268182 24594074 23884044 23309074
5176 23309074 22483503 21513862 20542594 20390726 19898343 19200694 18972250 18271094 18016779
5167 18016779 17801030 17472061 17255263 16828235 16329063 15703241 14839305 14012317 13319675
5158 13319675 12438155 11290817 10662896 9933107 9078199 8708859 8313263 7923121 7241659
5149 7241659 6797092 6451165 6381763 6003912 5451732 5403885 5123279 4910975 4562189 4287631
5139 4287631 4237822 3884156 3703584 3666496 3729184 3270880 3434931 2902451 2841142 2794268
5129 2794268 2843266 2487866 2335477 2442634 2466112 2646617 2400301 2157400 2204324 2211775
5119 2211775 2035885 1755627 1525021 1474027 1432251 1189778 1523996 1249606 1492062 1712431
5109 1712431 1465556 1534490 1110889 1107130 1029100 1368313 1143540 1166668 1085268 897358 1008659
5098 1008659 891447 635070 826216 970488 969468 1010550 1169969 1054764 882068 793860
5088 793860 630378 772244 720348 640097 786062 771561 753909 586159 857478 638229
5078 638229 471097 682347 731578 797513 760155 557446 616868 802397 749727 793698 772881
5067 772881 470827 714972 599654 608447 354353 579906 754837 659206 561244 515503 473995
5056 473995 484103 126416 250880 481807 263900 107006 371356 312371 216986 510104
5046 510104 381812 317314 4190 13692 209792 242801 156760 252271 349378 333355 558698
5035 558698 702245 659924 582716 555707 452805 142441 364675 637212 558771 495300 729783
5024 729783 706837 574820 467240 334884 714709 679934 648616 792372 686008 568602
5014 568602 669083 585694 897392 969984 1033613 996647 606677 581188 565336 659883 600785
5003 600785 462347 369535 517764 474955 380122 316552 297958 313547 468824 634452 425341
4992 425341 -48634 4136 -28117 10543 161011 369069 248530 189842 111164 87686 -28864
4981 -28864 74239 57576 163705 86809 535944 479921 148538 296934 139686 176844 420899
4970 420899 443009 276761 191482 269337 219997 389321 551829 375732 246679 384189
4960 384189 442407 88050 179005 439775 437684 285803 253192 216847 272364 160375 221792
4949 221792 514332 439912 606255 447685 363707 414513 351708 6826 211686 481591
4939 481591 453850 637358 513805 409678 362829 312869 337318 517846 360081 301443 468900
4928 468900 318837 80745 293833 494156 452276 24507 206694 181014 -8325 281104
4918 281104 97450 237300 433400 352574 370958 32466 6912 338078 514271 514578 291115
4907 291115 290038 441227 270670 121761 225011 568501 480454 241434 210898 286611 266067
4896 266067 378939 368772 241344 570348 462087 284339 479372 237905 198244 337190
4886 337190 554672 354297 382026 668643 321044 223788 253760 254712 236689 629853 342174
4875 342174 348753 329464 337365 167703 163267 225660 203372 365629 406721 302485 -27229
4864 -27229 149767 179629 546742 633108 334100 170707 475655 472949 404252 271756 591759
4853 591759 670024 542604 739748 431839 410630 255977 187314 556927 252191 158718
4843 158718 289829 172685 46203 25112 96941 129398 155532 318821 125767 195036 160802
4832 160802 296924 241363 273934 173332 355545 310563 259784 341382 60894 425717 344149
4821 344149 505901 526816 625521 921801 558603 438080 471215 112094 139755 321117
4811 321117 329260 432318 270548 201221 109143 82337 171899 -100731 46059 78260 281411
4800 281411 322645 353821 393427 508001 233323 461796 552737 484111 345523 554115 571140
4789 571140 426692 266872 295297 216405 198098 522052 375534 355845 379812 348514 825048
4778 825048 710293 599015 755700 632494 380279 413799 386679 267840 407691 537120
4768 537120 533721 503873 508739 579154 621494 805193 811320 666944 914632 484974 557281
4757 557281 436626 779402 646516 867587 922887 773276 540079 641311 527908 344181
4747 344181 452966 578651 524468 558252 961614 600007 649378 937425 888215 1108344
4737 1108344 1013100 874635 686109 1084057 1149397 1311773 1202383 1141025 1201346 1120213
4727 1120213 994092 924603 697587 953569 1334006 1263814 1196931 1117103 1433069 1330638
4717 1330638 1747397 1549365 1515004 1519144 1737140 1770732 1752235 2040917 1956213 2075520 1981871
4706 1981871 2219058 2202774 2478750 2648962 2524937 2762226 2730366 2982973 3066548 3051369
4696 3051369 3082959 3258717 3463420 3695695 3856413 4169387 4479328 4687177 5103714 5307392
4686 5307392 5430349 5691031 5836212 6431996 6549386 6894156 7706017 8280084 8431026 8746232
4676 8746232 9523952 10201717 10805816 11619991 12289543 13254951 13536044 14792187 15870368
4667 15870368 16428422 17575842 18613416 18904601 19332624 19896401 20088444 20295632 20236049
4658 20236049 20585129 20846699 21501222 22337179 22883085 23987300 24934616 25719251 26355048
4649 26355048 27141258 27459571 27206984 26737095 26195333 25411626 24381452 23269214 22378247
4640 22378247 21423791 20506286 20013747 19641830 19377745 18598151 18257500 17889593 17388535
4631 17388535 16628274 16200312 15567024 14689293 14086080 13250807 12343037 11468818 10897748
4622 10897748 10067408 9549432 9060600 8259632 8014730 7226109 6792320 6520466 6363893
4613 6363893 5977559 5599795 5327453 5188046 4795356 4762935 4630279 4335937 4018794 3729740
4603 3729740 3637866 3825530 3906800 3537486 3454366 3314002 3248994 3309364 3093938 3104478 3252190
4592 3252190 3043663 2838532 2856642 2698121 2542860 2549286 2375203 2402325 2354436 2405443 2405030
4581 2405030 2305079 2172500 2063940 1887166 2171617 2167603 2028433 1897879 1921614 2294319
4571 2294319 1990325 1828617 2006461 1512853 1527790 1723776 1294620 1249554 1291055 1774418
4561 1774418 1809905 1551370 1487339 1617630 1586046 1505122 1315111 1377037 1306867 1531081 1259193
4550 1259193 1487343 1411270 1228811 1403616 1269959 1421246 1480762 1758602 1560414 1490858
4540 1490858 1690116 1552299 1417024 1541107 1642670 1538408 1162867 1494645 1463008 1278190
4530 1278190 1284869 1342253 1397937 1437089 1365185 1469314 1115957 1389512 1616423 1379256 1266319
4519 1266319 1459125 1200691 1378462 1437046 1344113 1670750 1669056 1585494 1784914 2039783
4509 2039783 2187986 2099332 2023994 1962023 2128462 2115178 2163783 2007449 2017349 2368828 2302712
4498 2302712 2327025 2111017 2095807 2140119 2153688 2500729 2507753 2336663 2574291 2694481 2686003
4487 2686003 2707098 2569990 2621050 2790078 2801032 2682941 2782176 2828751 2942535 3191724
4477 3191724 3173770 3517671 3563947 3735016 3736944 3735071 3809955 3820660 3848687 4028282 4101012
4466 4101012 4413435 4384172 4391031 4660280 4814161 5047831 5403379 5619014 5756454 6181032
4456 6181032 6579243 6602565 7086677 7680843 8021072 8444943 8739901 9372240 10040762 10708237
4446 10708237 11417164 11829360 12567604 13377743 14100577 14862170 15604291 16181238 17063435
4437 17063435 17892746 18930757 19671110 20689941 21889904 22734425 23538678 24699940 25482732
4428 25482732 26316855 27444582 28193063 28989159 30053132 31428018 32489059 33928999 35618765
4419 35618765 36825329 38327320 39744587 41082809 42222922 43150652 43931079 44624877 44709560
4410 44709560 44616420 44427888 44097604 43540346 43525021 43624304 43936236 44128187 44790260 45408393
4400 45408393 45459435 45769551 45748178 45086865 44383397 43794472 42590574 41854851 40748984
4391 40748984 39973864 38941457 37625679 36631541 35714526 35149162 34736628 34265860 34277156
4382 34277156 34063428 33877619 33620482 33701312 33741996 33742477 33607303 33553427 33407492 33326028 33294996
4371 33294996 32724967 32182092 32381631 32253778 32324067 32028915 31697613 31769960 31601752 31832065
4361 31832065 32324541 32447219 32793219 32835349 32899341 32534563 32556326 31798548 31139963 30644847
4351 30644847 29758945 28929616 28093904 27371668 26522103 26158772 25621155 24645315 23932109
4342 23932109 23388664 22971735 22481064 21646302 20862563 20146450 18961126 17869472 16868014
4333 16868014 15680619 14779423 13941258 13047893 11923155 11532898 10956597 10305758 9954928
4324 9954928 9393514 9017672 8485954 7978109 7554656 7261588 7103899 6728649 6466074 6063509
4314 6063509 5688965 5819803 5902806 5388416 5064258 4726862 4890122 5100894 4913416 4478089
4304 4478089 4230715 4088550 4109291 3904887 3561566 3707651 3998553 3792366 3546914 3523421
4294 3523421 3498337 3374544 3392269 3539473 3438345 3415753 3333792 3168966 3459725 3162747
4284 3162747 2797598 2817343 3092771 3119310 3415698 3644591 3344563 3530923 3294722 3126491
4274 3126491 3472119 3460893 3673063 3434873 3368543 3240203 3172965 3391531 3444401 3126481
4264 3126481 2995508 2798276 2578764 2524199 2555370 2334769 2264432 2146713 2083469 2286133
4254 2286133 2228616 2085811 1698056 1979647 1966651 1852239 1723242 1665460 1753321 2091655
4244 2091655 1950595 1852244 1809040 1579834 1591866 1646591 1631918 1603190 1485254 1382823 1522607
4233 1522607 1451259 1318583 1160659 1106564 1187571 1184345 1185279 1236887 1160513 1125439 1076172 950094
4221 950094 880176 978221 942240 1069244 1330194 1312849 1265490 962955 1016448 1220316 1071475
4210 1071475 916041 1077858 1275163 1219009 1263222 1283577 1312642 1080514 1352032 951820
4200 951820 866321 882631 900032 976519 965144 1131937 1078941 1306395 1375473 1238007 1256512
4189 1256512 1178926 989738 1155654 860077 971103 1252112 1179309 1074858 1238661 1127979
4179 1127979 1117375 1295857 1332939 1407547 1171478 1371516 1281700 1022594 971968 999007 675733
4168 675733 1096065 1144509 866902 948162 883118 1065076 1328374 1157016 1033713 1050720
4158 1050720 991317 1231735 1184190 1001247 825099 620808 882005 849515 652887 912628
4148 912628 949214 1083366 1180968 1274204 1124170 1108360 1018822 992193 1039184 673230 748504
4137 748504 1040442 916039 1279419 1158737 817479 974217 1200583 1245330 1117489 1204543
4127 1204543 1287255 1199909 1411326 992996 800985 809051 929032 887800 876925 812322 1098058
4116 1098058 889770 847629 1169537 1264620 878700 789090 1074410 1147294 946608 998293
4106 998293 680853 541171 545333 471319 727124 795630 928723 1081727 679481 800362
4096 800362 1058749 1004689 977003 888647 894225 577870 894364 1168518 905642 827180 1082649
4085 1082649 1234736 1080166 830512 687364 791375 720769 602708 867656 990387 1092213
4075 1092213 898561 824568 770529 913628 953444 1038000 859233 984772 1343038 960088
4065 960088 933059 1065001 1017317 910534 1013370 869851 959934 1110411 665115 1027933
4055 1027933 1234659 821895 864793 916385 777330 846280 540623 397814 652379 691554
4045 691554 678041 796836 602569 361961 581257 894527 588791 931133 1225281 1307601
4035 1307601 1172564 1211386 1354846 1278768 1469319 1123379 1078999 1323515 1083193 774233
4025 774233 1193426 1251427 1216553 1268393 1490618 1589924 1351719 1734191 1695858 1137333 1298350
4014 1298350 1467454 1323176 1571664 1341542 1837929 1652097 1582442 1831497 1535708 1398739
4004 1398739 1338797 1364368 1320380 1463225 1449719 1425572 1252927 884427 1074663 1120697 1453635
3993 1453635 1360426 1580329 1625123 1592398 1391986 1312299 1600733 1629936 1318798 1276789 1371580
3982 1371580 1496997 1575428 1368189 1752718 1673672 1561268 1251697 1562730 1594333 1712202
3972 1712202 1897197 1991983 1892629 1847621 2094307 1847900 1822610 1841739 2044638 1905474
3962 1905474 2015020 2156611 2079409 2063009 2346538 2123420 2086709 2348030 2393030 2275788
3952 2275788 2360108 2506268 2551395 2443953 2573653 2876244 2763162 2781261 2865706 3159247
3942 3159247 3196362 3339044 3587589 3759334 4032781 3838251 3990602 4306281 4261694 4194399
3932 4194399 4268076 4470011 4627654 4821622 5257460 5494630 5782948 6106139 6280768 6629265
3922 6629265 6843207 7137475 7097342 7652794 8027377 8192327 8670847 8987994 9343270 9618828
3912 9618828 9993356 10265530 10329321 10713966 11106682 11564067 11959352 12581569 12811506 12996060
3902 12996060 13298012 13760062 14292435 14801191 14859387 15199183 15455021 15754814 16022618 16420407
3892 16420407 16587657 16736444 17028549 17235005 17156892 17445101 17492606 17515627 17681882 17827905
3882 17827905 17839494 17989604 17919024 17839781 18109161 18147159 18200451 17949951 17480604 17320681
3872 17320681 17516807 17501066 17095741 17226451 16969202 16603444 16402975 16086021 15894205 15863851
3862 15863851 15355706 14914813 14514442 14356262 14395248 13737293 13350042 13090232 12898744 12585339
3852 12585339 12123409 11591097 11450732 10992370 10805963 10374340 9787184 9604027 9317048
3843 9317048 9221852 8924712 8677334 8507689 8264207 8235147 7869863 7927141 7476767 7365741
3833 7365741 7634538 7245051 6968499 6998066 7026244 6855189 6977881 6989694 7177384 7548335
3823 7548335 7403477 7487235 8132759 8847992 9109368 9616804 10194494 10828803 11681195 12437166
3813 12437166 13554551 14851205 15960032 17325215 18833175 20595653 22956878 25455354
3805 25455354 28304205 31586258 35401409 39711015 44193496 48772093 52859728 57122091
3797 57122091 61507616 66843982 72344996 77482187 81159552 83600850 86178478 89322326
3789 89322326 92580155 94948161 95250922 93798089 91084998 88469664 86283810 84168671
3781 84168671 80964063 76216926 71096127 66178925 61391701 56673395 52378417 48163046
3773 48163046 43695966 39168094 34802838 30976350 27441918 24699475 22403571 20233842
3765 20233842 18414255 16917625 15882589 14949263 14053983 13006116 12315481 11409600 10792446
3756 10792446 9869843 9598910 9013288 8459265 7949780 7505060 7106109 6674916 6530657
3747 6530657 5910774 5825530 5626340 5299698 5059084 4883799 4758289 4631704 4541155 3992208
3737 3992208 4020539 3819766 3660503 3496496 3534519 3238613 3126823 3062098 3012840 2878548
3727 2878548 2550727 2695183 2482264 2691342 2346557 2327503 2244090 2296106 2232991 2273801
3717 2273801 1847079 1830471 1796184 2139104 1823434 1630657 1823789 1761346 1496195 1514489
3707 1514489 1711972 1483084 1473102 1591401 1592278 1477217 1503061 1300201 1506799 1220878 1348792
3696 1348792 1360780 1390163 1179653 999563 1036391 1086567 1222294 1418441 1311866 1453747
3686 1453747 1480414 1389476 825798 992995 896240 1147364 1367136 1233241 1353332 1037439
3676 1037439 927589 929461 1245099 950824 943539 821045 963563 897910 545661 822585
3666 822585 1109924 1177626 1025419 1096206 981561 811109 981724 818902 729835 773613
3656 773613 749425 636132 663969 824476 785837 876136 891367 1039321 1082716 1027527 776825
3645 776825 969418 1118154 1077016 1101552 1055729 830166 1041311 1056671 1030676 800671 703943
3634 703943 735343 851944 792926 864701 786643 853841 873550 869121 875646 592141 845790
3623 845790 753898 812002 703409 1183376 837194 713502 861267 601807 669011 636837
3613 636837 394557 779667 594808 766585 1005391 690550 855788 1048832 669907 902607
3603 902607 804760 772511 783878 1019428 1070561 882586 834174 915277 1020816 1088648 1239749
3592 1239749 1116385 1460731 1030752 920457 1080703 1476038 1531278 1236214 1377398 1632295
3582 1632295 1552786 1488527 1507174 1627341 1821141 1700135 1760055 2025258 2221580 2255459
3572 2255459 2550841 2773711 2577226 2599510 2803671 3317743 3244586 3366832 3740675 3912756
3562 3912756 4234677 4597451 4790886 5310776 5610714 5682530 6087094 6669637 7331626 7789281
3552 7789281 8214880 8636131 9015875 9596294 9885255 10458455 11228406 11580650 11895156 11826409
3542 11826409 12156332 12780983 13111300 13414067 13694495 13955851 14070473 14155483 14200261 14594366
3532 14594366 14392494 14381893 14288068 14168786 13786808 13726070 13643438 13360619 13064937 12737958
3522 12737958 12298950 11782570 11546205 10993404 10365730 9933351 9711821 9152376 8828760
3513 8828760 8743823 8224873 7570219 7352285 7107221 6872063 6646604 6540593 6346105 5915947
3503 5915947 5874801 5715257 5427060 5705184 5565213 5605353 5886533 6019060 6101479 6085181
3493 6085181 6473339 6646508 7157941 7814905 8482137 9579064 10743501 12539832 14713468
3484 14713468 17248696 17970269 16853157 15327432 12877077 10560310 8774743 7650761
3476 7650761 6720931 5871027 5704044 5020745 4680260 3888838 3593811 3571184 3388629 3199543
3466 3199543 3066492 2941434 2788711 2519338 2169383 2497621 2331772 2013617 1903725 1768602
3456 1768602 1848529 1684232 1666282 1511704 1441094 1225105 1220931 1345579 1384414 1355591 1451385
3445 1451385 1420463 1206961 1452535 1437585 900665 619409 1009471 1190332 959813 1179677
3435 1179677 1119483 924318 674446 1061033 608004 452158 624465 757322 616900 660716
3425 660716 788391 589303 685880 692857 725753 608826 621207 429688 315183 392437 749766
3414 749766 842846 630760 608864 363163 398206 499963 474291 412723 330028 500837 431482
3403 431482 651845 399652 582222 373011 364607 598126 529085 529687 482148 308748 701584
3392 701584 868784 1117721 966488 920381 608721 448776 701981 650723 536451 592988
3382 592988 452609 827537 956502 1184876 1456330 944391 869967 879988 583037 804667
3372 804667 776759 745016 905504 1111900 1411493 1366600 900783 1018279 1097864 789766
3362 789766 853979 796949 715925 299313 494432 703444 785112 745500 650565 939826 814825
3351 814825 581698 702932 662156 637546 601770 822358 955058 805958 814124 909235 747055
3340 747055 991184 1142763 959955 1062224 762806 780406 609999 348447 631525 553776
3330 553776 754114 838444 665314 667766 807742 921149 757419 843854 817727 900611 715677
3319 715677 826832 541850 548890 629250 589709 743362 582626 577863 737088 798631 861041
3308 861041 737442 709871 621905 585830 892982 719002 875579 802693 823565 791571 794200
3297 794200 901124 670349 746838 780332 804259 698182 717692 926184 1120382 553254
3287 553254 564674 780107 766381 1048342 1096543 846053 726214 842369 912850 659622
3277 659622 417153 840072 1040155 1066648 1231173 1280653 995714 1141456 1062969 1289194
3267 1289194 1384717 1144921 953228 1055731 1197734 1030385 1379959 1499005 1086321 1583890
3257 1583890 1293447 1186659 1321285 1480561 1444669 1451573 1423936 1421982 1286911 1376364 1528977
3246 1528977 1585200 1842471 1487553 1474239 1639182 1592998 1670376 1647465 1710133 1753933 1875580
3235 1875580 1610060 1780415 2046700 1766744 1761143 1749866 1830850 2038715 1950178 1981393 2626724
3224 2626724 2579917 2018318 2040757 2194280 2317784 2031184 2286354 2333267 2448229 2763018
3214 2763018 2585503 2319575 2419611 2602669 2758784 2831113 2706544 2900223 3050195 2981116
3204 2981116 3325813 3378330 3315894 3441658 3764617 4059410 3999588 4480582 4709546 4745855
3194 4745855 5172077 5574564 5912571 5981639 6111446 6600313 6881779 7270965 7694339 8248891
3184 8248891 8699573 9620018 10143644 10743352 11255982 12117634 12842967 13884879 14867239
3175 14867239 16068251 17263141 18286903 19469327 20703883 22548051 23900216 25042180
3167 25042180 26539832 27812922 29016612 29970665 31067341 31601439 31874802 32386528 32172402
3158 32172402 32105033 32032866 32086135 31273256 30590629 29922262 29144404 28083469 26704352 25722480
3148 25722480 24563182 23332942 21744897 20426540 18815503 17710507 16331249 15087242
3140 15087242 14359583 13570238 12773997 12118084 11506702 11002913 10366129 9832407 9354334
3131 9354334 9074864 8648159 8537722 8354918 7895576 7483318 7069193 7285022 7104804 6522633
3121 6522633 6482287 6601968 6336560 5806688 5788522 6002770 5558168 5518907 5256169 5121934
3111 5121934 5123116 5200207 4873157 4866390 4946499 4884008 4811794 5102685 4871984 4997576 5237220
3100 5237220 5127943 5047525 4562562 4790867 4983029 5113052 5288544 5111526 5343446 5357204
3090 5357204 4956107 5427756 5481841 5640944 5866972 6186066 6096096 6563346 6848957 6885732
3080 6885732 7304696 7605702 7910975 8352163 8590228 8848039 9300571 9840434 10319515 10486948
3070 10486948 10523692 10965089 11111428 11031047 11141049 11530139 11415210 11271257 11572297 11826667
3060 11826667 12075367 12513082 12741907 12803268 13654535 14245534 14721184 15029733 16089826
3051 16089826 16953351 18147617 19122641 20301502 21523496 22981555 24240365 25797152
3043 25797152 27225660 29271574 31377081 33245540 35351203 37524874 40325260 42685688
3035 42685688 45516646 47865344 50113312 52275089 54105972 55659461 56983109 57788337
3027 57788337 58213415 58411752 58252128 58171798 57415596 56477425 55049784 53807381 52223326
3018 52223326 50246194 48485936 45939895 43649333 41109784 38486904 35961283 33711508
3010 33711508 31626036 29955602 28167409 26793310 25445711 23702928 22344807 21511239
3002 21511239 20730399 19385094 18475368 17885567 17372202 17020058 16563924 16044054 15577316
2993 15577316 15559654 15183833 14803361 14757115 14784587 14847877 14978493 15123584 15022768 15034251
2983 15034251 15166341 15551491 15531947 15617778 15758960 15571070 15501148 15332942 15157177 15446745
2973 15446745 15407024 15423971 15363562 15597829 15894017 16100407 16501878 17093644 17788436 18303294
2963 18303294 18899510 19819854 20788971 21942429 23284260 24734603 26311542 28213943 29776822
2954 29776822 31795247 34442882 36810272 39281704 42207973 45499230 48509450 51700376
2946 51700376 54615002 57372030 60127547 62764190 64494459 65800099 66732426 67453304
2938 67453304 68012554 67956759 67584572 67282122 66238910 64844817 63297750 60859607 58648082
2929 58648082 55756241 52581526 49765623 46832851 43660283 40851036 37973346 35393869
2921 35393869 32934420 30945473 28858341 27024759 25143361 23626770 22695386 21277141
2913 21277141 20068669 19242813 18059439 17413047 16764401 16138730 15551186 15064802 14771171
2904 14771171 13854055 13587824 13303270 12329145 12211752 12032795 11503142 11216757 10706801
2895 10706801 10717240 10340106 9860738 9366444 9050392 8680233 8724049 8800459 8660940 8629517
2885 8629517 8489222 8477312 8422631 8360286 8674006 8299448 8322276 8487434 8461874 8500066 8632151
2874 8632151 8417382 8497351 8513246 8782445 8740152 8562292 8520289 8433916 8088722 7883395
2864 7883395 7663592 8008231 8201130 8111641 8025443 7808445 8061395 8294802 8217327 8447781
2854 8447781 8435558 8432239 8891877 9088240 9580746 9696235 9981793 10281073 10719659 10862439
2844 10862439 11372862 12047584 12247423 13142067 14244680 15384636 16268161 17189812 18528737
2835 18528737 19768750 21026458 21763970 22844547 24154469 25045278 25888059 26759616 27377467
2826 27377467 27398258 27505265 27250396 27193160 27534927 27249912 27029087 27071805 27411481 27132740
2816 27132740 27023777 26765683 26269077 25391398 24647986 23728351 22667322 21727996 20344061
2807 20344061 19125757 17922998 16792520 15686589 14625497 13632416 12944185 12047541 11359806
2798 11359806 10989630 10342320 10021514 9665340 9020828 8701085 8236116 8008490 7605006
2789 7605006 7107667 6984307 6991613 6914545 6722547 6616784 6785265 6779516 6328368 6539266
2779 6539266 6870822 6730313 6782410 6725164 6778391 7176025 7172789 6882218 6700118 6518101
2769 6518101 6474174 6194779 6073207 6262650 6296529 6226337 5617701 5475219 5525292 5253254
2759 5253254 5044967 4674310 4557737 4399298 4412932 4319892 4265760 3912715 3493912 3641109
2749 3641109 3831469 3867461 3714351 3706066 3554069 3827853 4206263 4154655 3729052 3758463
2739 3758463 3506024 3478057 3107810 3223137 3256723 3221224 3313724 3440554 3367614 3387302 3542667
2728 3542667 3639944 3629895 3338852 3292170 3212104 3161641 3214987 3220119 3234389 3400917 3527238
2717 3527238 3423385 3231057 3820841 3648005 3371267 3470274 3673335 3565906 3501193 3800670
2707 3800670 3715295 3991102 3952156 4066721 4292283 4142699 4250933 4228117 4401455 4170553
2697 4170553 4088870 4661121 4802472 4462562 4827017 5113050 5090171 5265569 5596476 5963685
2687 5963685 6066550 6168348 5962856 6471809 6881400 7111342 7259781 7409512 8068044 8302448
2677 8302448 8684743 9369106 9978207 10506702 11391864 12435934 12964610 13758358 14683356
2668 14683356 15877653 17353132 18781731 20479200 22247287 24234184 26375408 28797455
2660 28797455 31328502 33978070 36730320 40009530 43497486 47099112 51186979 55837897
2652 55837897 61518871 67667478 74700939 82590187 91720188 101778937 112298445 123789903
2644 123789903 134444487 143160029 148563501 149662903 146120952 138863643 129334099 118629314
2636 118629314 107696135 97220406 87694204 79419696 71834333 64998669 59098116 53961981
2628 53961981 49091208 44877305 40925551 38269544 35537105 33255609 31207013 28842776
2620 28842776 27407094 26060787 24716291 23012864 21717818 20870543 19718339 18408735
2612 18408735 17267417 16327363 15601883 14659436 14007358 13474845 12733388 12158130 11736149
2603 11736149 11001276 10501655 10279473 9754664 9248468 8595147 8471710 8034043 7947108 7361897
2593 7361897 6814919 7017557 6733258 6640132 6327540 6185196 5829563 5399385 4956223 4882671
2583 4882671 4900928 5068984 4793760 4285082 4000291 3913024 4222816 3701769 3562024 3809251
2573 3809251 3433689 3718499 3482023 3011382 3007522 2882970 2701375 2692573 2588888 2386646
2563 2386646 2065027 2361266 2456655 2004662 2162298 2046173 2164318 2329289 2013810 1882193
2553 1882193 2122474 2021561 2122516 1984928 1845317 1610931 1613039 1725465 1409288 1661073
2543 1661073 1603469 1460393 1655193 1460454 1454746 1539185 1717827 1686394 1603185 1391621 1065752
2532 1065752 1065738 1112293 1209582 1318159 957026 991331 1121980 1142018 1185834 824082 749803
2521 749803 979716 1411540 940096 1273834 1174453 1194430 1059739 1086119 1113728 1068319 1229589
2510 1229589 1117653 1031931 1115236 860957 696518 663294 790245 646996 652091 746237 714575
2499 714575 811377 909478 653741 586092 572124 534179 835535 753848 774361 792728 807669
2488 807669 811791 623832 522311 582146 908967 894819 689040 802343 580333 596207 770358
2477 770358 467072 184561 563169 497949 653815 307219 388228 600813 697642 743467
2467 743467 667067 322461 599506 547286 458463 436829 428117 261714 217909 206119 449071
2456 449071 600255 433735 481817 477286 336701 514209 692490 501606 592165 161463
2446 161463 385423 686581 443514 376525 539423 604190 536063 359614 702611 967968
2436 967968 724521 709016 736168 654588 756435 1107794 1112814 845112 1197285 1074013 751126
2425 751126 578312 790743 864541 923519 886549 752017 719531 556967 602050 528624 426700
2414 426700 405207 443069 312494 317595 278584 22296 265189 495813 508052 441282 212749
2403 212749 382222 569123 433202 312506 228032 300242 472551 411452 484104 624829
2393 624829 693333 538830 341579 183122 83343 409143 219450 354104 218287 371454
2383 371454 266398 288227 164170 -43338 47720 304705 355337 -9665 80651 47404 -110629
2372 -110629 2811 261557 -8978 194159 -179361 -266323 -159065 354353 305205 230883
2362 230883 239716 118123 301494 162320 88927 31419 -34316 105836 108205 -6402 156985
2351 156985 236702 452398 323226 331286 414693 268658 9951 155280 341061 143665
2341 143665 227739 -51723 282655 543405 424353 356444 140259 74402 269227 363069
2331 363069 7667 14314 74583 -69379 110513 117147 546730 306232 101784 103722 366170
2320 366170 60912 221795 180321 205623 256398 279323 297671 148349 119135 -53075 50648
2309 50648 75332 211525 -116123 -251541 127027 132704 -222428 -230817 -369547 -38267 123281
2298 123281 135245 -139320 -26704 90631 124351 -131357 -244307 30979 388646 226883
2288 226883 327663 -159008 225883 166804 -107593 186842 372427 87105 200097 177569
2278 177569 76577 -14526 112141 113682 -138637 -314773 -131325 113772 -129635 -102701
2268 -102701 58960 129807 197571 479067 267611 196844 -57735 -93514 103178 134554 -48519
2257 -48519 -65487 -192163 125245 -70745 139080 338148 327867 156195 -67191 -211696
2247 -211696 -132314 142443 301612 537344 190236 60322 -236316 177371 284588 -216207
2237 -216207 -25669 15552 64108 445257 210724 -114041 30291 -99853 -180697 -56009
2227 -56009 228803 -210147 -275750 -76464 -107181 -5598 134715 7320 96037 179518 9396
2216 9396 -79313 160447 25516 -93865 284096 61955 -157508 26445 -190452 -24681
2206 -24681 -207345 -8948 199777 -196632 12810 -58648 37427 -121400 -175669 -218197 181865
2195 181865 227328 -5627 -15998 -189839 47050 488245 148743 101119 -58317 143057
2185 143057 102539 -192167 -40557 28292 -163621 113253 151150 -166150 -152927 53676
2175 53676 -62949 -378616 -491451 -488905 -278545 -190799 -12219 -54227 -124505 -75045 -139649
2164 -139649 58513 33112 -164249 -35617 -185639 39521 22737 93592 141140 97734 93703
2153 93703 -174384 11444 90081 -52459 -30034 100924 111277 -63302 -54743 -48064 -119129
2142 -119129 -133356 -70170 -83034 246911 -72376 164246 58166 152818 130685 207089 96785
2131 96785 238763 454332 321140 89374 136793 -34215 -17763 -46390 -20382 181311 149097
2120 149097 29288 -104939 19898 143171 145044 144650 90455 -118826 -157086 -202232 -25882
2109 -25882 261684 241075 29799 121980 19373 47130 73792 -154046 -175205 6912 -274316
2098 -274316 -103123 -13964 -209927 -97967 -80119 180058 -234724 3562 214337 14181
2088 14181 164661 376823 356784 72939 -11660 144769 100867 -5346 122311 156185 71795
2077 71795 -111273 73614 8234 158040 66461 342287 250019 238634 68859 185778 210616
2066 210616 589772 448686 554535 494231 744881 961814 1001109 1037764 1147197 1052017
2056 1052017 1355905 1358497 1327826 1055028 1167894 1087064 668323 628428 305356 467016
2046 467016 214248 319559 238584 385572 467743 1680 -650 219073 249496 447881 227137
2035 227137 173604 120942 299179 179754 183342 239249 27330 -20693 53639 85541 -60758
2024 -60758 -203577 -144609 -183019 -381865 78558 192536 241407 317865 79399 29130 -125298
2013 -125298 -53171 58228 11458 -110008 -19781 -212007 -65483 -327007 -570579 -111999
2003 -111999 -212261 2834 145197 45510 -48769 -49544 51055 88239 -54911 95013 -12191
1992 -12191 233190 161960 -81499 243442 194753 374110 251488 -215705 -131109 134946
1982 134946 197034 123119 713 128633 -91055 -17852 -86301 -67244 -162928 -128839 -211759
1971 -211759 -177401 121903 -109230 -67996 303474 -4131 -120448 -248773 -192119 -128575
1961 -128575 -135367 -123612 -152200 -142129 -247058 -86757 -145428 -282776 123539 -34477 -35382
1950 -35382 27262 49202 139472 229026 -91891 -72280 -193862 55013 34278 77143 374862
1939 374862 202471 94731 48252 185938 102863 263527 305353 208524 234897 192252 -16004
1928 -16004 72056 34672 136046 -219768 -84860 -80749 82671 -11359 111117 205335 183501
1917 183501 22703 -196342 42857 -168688 203010 240741 27039 100808 -180589 108812
1907 108812 190326 -26035 -56011 -35096 204095 -1790 -95092 18011 115529 49780 309687
1896 309687 506332 291279 172934 -27845 -76611 -198532 -246053 93733 28030 -65671
1886 -65671 -108480 -120723 -139482 813 -263100 -276097 -153032 -98676 -207090 74292 -20548
1875 -20548 -102307 20829 29454 107777 91725 213220 -11100 227509 -125323 -274112 -300552
1864 -300552 -246932 -197669 62052 149397 204915 -159959 -317249 -49646 -291531 -49127
1854 -49127 -119445 85394 -113920 -146213 -11650 -207719 -352911 -103240 165806 -74218
1844 -74218 -133346 -309742 72634 191760 252186 133006 -147327 -216197 -77631 92613
1834 92613 85765 309562 271691 -202227 20641 -32837 -297666 -101368 31126 32306 299570
1823 299570 -148531 -10936 105544 388482 -23605 -1507 189580 120678 8666 -117284
1813 -117284 240030 395482 263072 442036 443015 81866 150745 60923 18415 8354 -158398
1802 -158398 41567 -150115 -213884 -41044 27038 135508 -26438 -95275 -184396 -107282 53161
1791 53161 268082 25580 -120172 -216569 21510 -118518 59804 161071 130915 58200
1781 58200 -5939 -218998 -178599 -45493 -62979 -9818 -15815 4780 183952 19599 10221
1770 10221 151890 229456 282704 66735 -12619 86603 -78417 90744 362313 231804 -132727
1759 -132727 -9008 139098 -26781 -73921 -28641 -147453 -195024 -139899 -173791 -240745 -87278
1748 -87278 122529 220025 -69170 -117139 -102984 -23879 121461 -61536 38770 21022 -19330
1737 -19330 96720 164534 48041 39219 365624 160507 -29155 126887 680944 244565
1727 244565 132154 247049 248401 333131 86957 116566 -41280 -111556 -43934 -27005 -275469
1716 -275469 5755 165565 29500 -248842 -205366 -63792 -160055 -161592 -25113 -106168 -54345
1705 -54345 -247389 -217078 -120553 153021 -104959 -298582 -177333 -171210 -19005 -18301 19878
$$ [...]
##END NTUPLES=NMR SPECTRUM
##END=
