##TITLE=1H_EC-3330(32)
 CDCl3
 8 sc, 
 5.8.2024
##JCAMPDX= 6.0         $$ Bruker NMR JCAMP-DX V2.0
##DATA TYPE= NMR SPECTRUM
##DATA CLASS= NTUPLES
##ORIGIN= UXNMR, Bruker Analytische Messtechnik GmbH
##OWNER= root
$$ XWIN-NMR		Version 3.5
$$ Mon Aug  5 14:03:41 2024 Russian Standard Time (UT+4h)  she@DPX200
##.OBSERVE FREQUENCY= 200.1313
##.OBSERVE NUCLEUS= ^1H
##.ACQUISITION MODE= SIMULTANEOUS
##.ACQUISITION SCHEME= undefined
##.AVERAGES= 8
##.DIGITISER RES= 18
##SPECTROMETER/DATA SYSTEM= spect
##.PULSE SEQUENCE= zg30
##.SOLVENT NAME= Acetone
##.SHIFT REFERENCE= (INTERNAL, Acetone, 0, 21.5409)
##AUDIT TRAIL= $$ (NUMBER, WHEN, WHO, WHERE, WHAT)
$$ ##TITLE= Audit trail, XWIN-NMR		Version 3.5
$$ ##JCAMPDX= 5.01
$$ ##ORIGIN= Bruker BioSpin GmbH
$$ ##OWNER= she
$$ F:/spectra/data/she/nmr/H-F/1/pdata/1/auditp.txt
$$ ##AUDIT TRAIL=  $$ (NUMBER, WHEN, WHO, WHERE, WHAT)
(   1,<2024-08-05 14:02:12.89 +0400>,<she>,<DPX200>,
      <created by zg, POWCHK disabled, PULCHK disabled
       configuration hash MD5:
       00 E9 B6 7A A2 85 ED C7 34 08 36 98 17 FE 4E 26
       data hash MD5: 16K
       DB 36 54 58 45 64 68 CE A8 84 71 5D F3 E8 51 F3>)
(   2,<2024-08-05 14:02:33.00 +0400>,<she>,<DPX200>,
      <Start of raw data processing
       efp BC_mod = 2 LB = 0.24 FT_mod = 6 PKNL = 1 PHC0 = -25634.46 PHC1 = 9.987492 SI = 16K 
       data hash MD5: 16K
       A4 19 89 74 93 FC DA 67 9A 1C EA 4A 40 3D 6A 84>)
(   3,<2024-08-05 14:02:52.20 +0400>,<she>,<DPX200>,
      <pk PHC0 = -6.036458 PHC1 = 8.400001 
       data hash MD5: 16K
       33 94 2E E3 7E 99 B2 D0 2E 30 15 62 16 CE 9F D4>)
(   4,<2024-08-05 14:02:55.71 +0400>,<she>,<DPX200>,
      <abs ABSG = 5 
       data hash MD5: 16K
       E2 37 74 25 B2 08 74 28 6F B6 7A 32 04 32 6B D8>)
$$ ##END=
$$ 
$$ hash MD5
$$ E2 05 02 8A A4 19 D9 D4 00 E2 FA 9A C5 A4 07 C2
##$RELAX= 
##$RELAX= 
##$RELAX= 
##$RELAX= 
##$RELAX= 
##$RELAX= 
$$ Bruker specific parameters
$$ --------------------------
##$DU= <F:/spectra>
##$EXPNO= 1
##$NAME= <H-F>
##$PROCNO= 1
##$TYPE= <nmr>
##$USER= <she>
##$AMP= (0..31)
100 100 100 100 100 100 100 100 100 100 100 100 100 100 100 100 100 100 
100 100 100 100 100 100 100 100 100 100 100 100 100 100 
##$AQSEQ= 0
##$AQ_mod= 1
##$AUNM= <au_zg>
##$AUTOPOS= <>
##$BF1= 200.13
##$BF2= 200.13
##$BF3= 200.13
##$BF4= 200.13
##$BF5= 200.13
##$BF6= 200.13
##$BF7= 200.13
##$BF8= 200.13
##$BYTORDA= 1
##$CFDGTYP= 0
##$CFRGTYP= 5
##$CHEMSTR= <none>
##$CNST= (0..31)
1 1 145 1 1 1 1 1 1 1 1 1 1 1 1 1 1 1 1 1 1 1 1 1 1 1 1 1 1 1 1 1 
##$CPDPRG= <>
##$CPDPRG1= <>
##$CPDPRG2= <>
##$CPDPRG3= <>
##$CPDPRG4= <mlev>
##$CPDPRG5= <mlev>
##$CPDPRG6= <mlev>
##$CPDPRG7= <mlev>
##$CPDPRG8= <mlev>
##$CPDPRGB= <>
##$CPDPRGT= <>
##$D= (0..31)
0 1.2 0 0 0 0 0 0 0 0.06 0 0.03 0 0 0 0 0.0002 0 0 0 0 0 0 0 0 0 0 0 0 
0 0 0 
##$DATE= 1722852132
##$DBL= (0..7)
120 120 120 120 120 120 120 120 
##$DBP= (0..7)
150 150 150 150 150 150 150 150 
##$DBP07= 0
##$DBPNAM0= <>
##$DBPNAM1= <>
##$DBPNAM2= <>
##$DBPNAM3= <>
##$DBPNAM4= <>
$$ [...]
##$SUBNAM3= <"">
##$SUBNAM4= <"">
##$SUBNAM5= <"">
##$SUBNAM6= <"">
##$SUBNAM7= <"">
##$SUBNAM8= <"">
##$SUBNAM9= <"">
##$SW= 24.0689771365484
##$SWIBOX= (0..15)
0 0 2 0 0 0 0 0 0 0 0 0 0 0 0 0 
##$SW_h= 4816.95568400771
##$TD= 16384
##$TD0= 1
##$TE= 0
##$TE2= 300
##$TE3= 300
##$TEG= 300
##$TL= (0..7)
0 120 120 120 120 120 120 120 
##$TP= (0..7)
150 150 150 150 150 150 150 150 
##$TP07= 0
##$TPNAME0= <>
##$TPNAME1= <>
##$TPNAME2= <>
##$TPNAME3= <>
##$TPNAME4= <>
##$TPNAME5= <>
##$TPNAME6= <>
##$TPNAME7= <>
##$TPOAL= (0..7)
0.5 0.5 0.5 0.5 0.5 0.5 0.5 0.5 
##$TPOFFS= (0..7)
0 0 0 0 0 0 0 0 
##$TUNHIN= 0
##$TUNHOUT= 0
##$TUNXOUT= 0
##$USERA1= <user>
##$USERA2= <user>
##$USERA3= <user>
##$USERA4= <user>
##$USERA5= <user>
##$V9= 5
##$VALIST= <valist>
##$VCLIST= <CCCCCCCCCCCCCCC>
##$VD= 0
##$VDLIST= <DDDDDDDDDDDDDDD>
##$VPLIST= <PPPPPPPPPPPPPPP>
##$VTLIST= <TTTTTTTTTTTTTTT>
##$WBST= 1024
##$WBSW= 4
##$XGAIN= (0..3)
0 0 0 0 
##$XL= 0
##$YL= 0
##$YMAX_a= 301453
##$YMIN_a= -255690
##$ZGOPTNS= <>
##$ZL1= 120
##$ZL2= 120
##$ZL3= 120
##$ZL4= 120
##$ABSF1= 21.48805
##$ABSF2= -2.581154
##$ABSG= 5
##$ABSL= 3
##$ALPHA= 0
##$AQORDER= 0
##$ASSFAC= 0
##$ASSFACI= 0
##$ASSFACX= 0
##$ASSWID= 0
##$AUNMP= <proc_1d>
##$AZFE= 0.1
##$AZFW= 0.1
##$BCFW= 0
##$BC_mod= 2
##$BYTORDP= 0
##$COROFFS= 0
##$CY= -3
##$DATMOD= 1
##$DC= 0
##$DFILT= <>
##$DTYPP= 0
##$F1P= 0
##$F2P= 0
##$FCOR= 1
##$FTSIZE= 16384
##$FT_mod= 6
##$GAMMA= 0
##$GB= 0
##$INTBC= 1
##$INTSCL= 3.70164e-10
##$ISEN= 128
##$LB= 0.24
##$LEV0= 0
##$LPBIN= 0
##$MAXI= 10000
##$MC2= 0
##$MEAN= 0
##$ME_mod= 0
##$MI= 1.114404
##$NCOEF= 0
##$NC_proc= -6
##$NLEV= 6
##$NOISF1= 3.799351
##$NOISF2= 2.8
##$NSP= 0
##$NTH_PI= 0
##$NZP= 0
##$OFFSET= 21.54094
##$PC= 1
##$PHC0= -25640.5
##$PHC1= 18.38749
##$PH_mod= 1
##$PKNL= yes
##$PPARMOD= 0
##$PSCAL= 0
##$PSIGN= 0
##$REVERSE= no
##$SF= 200.129397502001
##$SI= 16384
##$SIGF1= 3
##$SIGF2= 2
##$SINO= 5.538805
##$SIOLD= 16384
##$SREGLST= <1H.CDCl3>
##$SSB= 0
##$STSI= 16384
##$STSR= 0
##$SW_p= 4816.95568400771
##$SYMM= 0
##$S_DEV= 0
##$TDeff= 16384
##$TDoff= 0
##$TI= <>
##$TILT= no
##$TM1= 0
##$TM2= 0
##$TOPLEV= 0
##$USERP1= <user>
##$USERP2= <user>
##$USERP3= <user>
##$USERP4= <user>
##$USERP5= <user>
##$WDW= 1
##$XDIM= 16384
##$YMAX_p= 485080373
##$YMIN_p= -550755
$$ End of Bruker specific parameters
$$ ---------------------------------
##NTUPLES= NMR SPECTRUM
##VAR_NAME=  FREQUENCY,     SPECTRUM/REAL,   SPECTRUM/IMAG
##SYMBOL=    X,             R,               I
##VAR_TYPE=  INDEPENDENT,   DEPENDENT,       DEPENDENT
##VAR_FORM=  AFFN,          ASDF,            ASDF
##VAR_DIM=   16384,         16384,           16384
##UNITS=     HZ,            ARBITRARY UNITS, ARBITRARY UNITS
##FACTOR=    0.29402158847633, 1,            1
##FIRST=     4310.97520995113, 0,            0
##LAST=      -505.980474056579, 0,           0
##MIN=       -505.980474056579, -550755,     0
##MAX=       4310.97520995113, 485080373,    0
$$ Real data points
##PAGE= N=1
##DATA TABLE= (X++(R..R)), XYDATA
$$ [...]
5236B79142L28153l6769N819p1021j06145n3575k44550N9114K745k9237j70961
5225c7285P2434O6613N5540L9693K9026j39852r3994k1538P1256J5040j39195
5214h2262J48068J5965L9675j6808N6522o2799n1510p7176j6638M4489K7457P4048
5202I9031q5555P4994j10933m9293R4035p5888J11415p8335k5329Q9041N9394
5191A02577j06572m4000p16O3533j26722k369L6792J11742k8638J21j03189J88963
5179I1522J54286j91288L5952o1183l7612J9781M1487J5330M2461K6783K4853
5168A62372r3053j79080P2655J07699Q4696M279j25371O3811J3438j9247R7857
5157A90056L790q9811L5868m2810j05324J05216p427l8104o8756p6491M241O3539
$$ y = [279142, 607295, 570526, 576345, 505324, 399179, 345604, 101054, 160168, 162913, 133676, -37285, 35149, 101762, 157302, 196995, 226021, 86169, -7825, -29363, 41893, 56933, -82262, 65806, 81771, 121446, 104638, 161160, 98361, 46851, -30325, -46963, -2474, 24983, 99031, 13476, 88470, -22463, -71756, 22279, -53609, 57806, -20529, -45858, 43183, 102577, -3995, -47995, -48711, 14822, -111900, -114269, -77477, 34265, 5627, 5748, -97441, 91522, 245808, 54520, 90472, 29289, -8323, 11458, 52945, 68275, 110736, 137519, 162372, 69319, -109761, -37106, 70593, 155289, 159568, 34197, 98008, 111446, 92199, 190056, 193846, 104035, 139903, 97093, -8231, 96985, 89558, 51454, -17302, -93793, -89552, -26013]
5145b6013R4120j36459Q494K3228J22509l3821o4703J34298l3045P9968o381l2594
5133A29601j10706L0872o2329K08052J15904k19290j3927k8903K3417j02430l1477
5122f1216R1438Q478q8781m7362J22842m8411l0984Q4997M1913o0403R9816j1233
5110A01094o3358M06l1579J41377J25194j69971N762n4739p653n0900l9724J06116
5098F2025O2428o7781o7508J44812K6611j03055j19252J78775j4896k8858K9351
5087A02652N7294k9534J98414j92453j5399J15606j50556q9635m7961J2830P6203
5076C7461J1968l514N2639o5420O4110J48526m1663J8242k9789Q8958n4787j51182
5064G5549j10619K04888j4453J26677k6171J16360j36458j32290K09262N5982
$$ y = [-26013, 68107, -68352, -59858, -36630, 85879, 52058, -12645, 121653, 88608, 168576, 162195, 129601, 18895, 49767, -12562, 195490, 311394, 92104, 78177, 49274, 72691, -29739, -61216, 30222, 38700, -50081, -97443, 25399, -23012, -53996, 31001, 72914, 12511, 112327, 101094, 37736, 38142, 6563, 147940, 273134, 103163, 108925, 54186, 46533, -4367, -44091, 62025, 124453, 56672, -10836, 133976, 160587, 57532, -61720, 117055, 102159, 73301, 102652, 159946, 130412, 328826, 136373, 120974, 236580, 86024, -3611, -51572, -38742, 37461, 49429, 45915, 98554, 33134, 97244, 245770, 204107, 222349, 192560, 281518, 226731, 75549, -35070, 169818, 155365, 282042, 255871, 372231, 235773, 103483, 312745, 368727]
5054C68727q6361J17722m3756r160J12873M716Q0163j8851k0669O958m7319N3140
5042E18183J5960l9985R0623r7070J1701M2763q1248P7570J06372K9167q6497
5031E87539o8576J70334O3163j1247N4862J30761K2264R8948n1304j58296j72885
5020F65563l2024j02175o6828k2634J1205q653n1529l7332O1909q176L8933p7034
5008C71225R5699Q3045O0312Q6258j24381r1888J6415p6331k9555j40763P5596
4997C25632j04850L129k7664O6006J8040n7753P0553k4378o0159L0952N1998J005
4985B92511l3963J91748r3859n2191P6332j38627L5870K8953Q8556r6793o894
4974B91643K0637j73910J2157K70048j2606J9767K2870p9381j0611k3170K3047
$$ y = [368727, 282366, 400088, 356332, 347172, 460045, 464761, 544924, 526073, 505404, 512362, 465043, 518183, 534143, 494158, 584781, 487711, 499412, 542175, 460927, 538497, 644869, 674036, 587539, 518963, 689297, 752460, 741213, 796075, 926836, 949100, 1048048, 996744, 838448, 665563, 633539, 531364, 464536, 441902, 453107, 444454, 392925, 355593, 417502, 409326, 448259, 371225, 466924, 549969, 610281, 696539, 572158, 480270, 496685, 420354, 390799, 250036, 325632, 220782, 223911, 196247, 262253, 280293, 222540, 293093, 268715, 208556, 239508, 291506, 292511, 258548, 450296, 356437, 304246, 380578, 241951, 277821, 306774, 395330, 298537, 291643, 312280, 138370, 150527, 420575, 407969, 427736, 450606, 371225, 360614, 337444, 360491]
4963C60491J2896r3649k5524N7045j9809j13641R3924j9389j07552O2209J07559
4952C14560O1258j4039m2273j16306K2775K02517R3351j65372o5139j11851m0213
4941A39268k1957J22378j2209p155k564o2119r6259O1794N6151L0674j488O7315
4929B73829o6232n3705R8818o5393r3452J36596J84145k0391r0256k56921J06390
4918A53428J29590m117j37278R3823p354O7159J8618J2618k7713O8990r3142j04777
4906A69845L7250N4911O8342p8707j06447k12626N2059K05531M2336l9216L7112
4895B30390P595j5215j60094N3770J86385O5474j10950L5212q3179K7999J32709
4884C70096j39523K0453J49741l6721q9349P834L9643O5205r0528K677k6949R9171
$$ y = [360491, 373387, 279738, 254214, 311259, 291450, 177809, 271733, 252344, 144792, 207001, 314560, 375818, 361779, 319506, 203200, 225975, 428492, 521843, 356471, 291332, 179481, 139268, 117311, 239689, 227480, 220325, 217761, 155642, 59383, 121177, 177328, 208002, 206514, 273829, 207597, 153892, 252710, 187317, 93865, 230461, 414606, 394215, 303959, 47038, 153428, 283018, 278901, 141623, 235446, 228092, 295251, 313869, 326487, 298774, 367764, 274622, 169845, 207095, 262006, 330348, 251641, 145194, -67432, -15373, 190158, 232494, 193278, 230390, 237985, 222770, 62676, 116446, 302831, 368305, 257355, 292567, 209388, 237387, 370096, 230573, 251026, 400767, 364046, 274697, 282531, 322174, 387379, 296851, 299528, 272579, 371750]
4872C71750o7520m3138O033k0168j5164j2222p773N6495p5908L0227J49215O0096
4860D31923r147N8116R9430k7340n7496r4651R3732n6082j9809K7168J6894J2568
4848D75306l1860M2393J66330j0708j09375L4476p8006P8823Q605J5086J99878
4837G90948j43632O6953P9367P3097Q040p4290j5549O3699O1141l4520J0262l8755
4825H46761K14919j03236K5008J93816J73794j13558L159L4331J90548O0954J74856
4814A701352M2348M0265K34079K34141J73251K25898J00826P3104j59435r7842
4804B567987k33901J86921J6324j6776Q7705o7941J9612k002K44237l3237L33855
4793C102784J81991M50371L95025M13993M41840N01917K64852n7672j33621m18803
$$ y = [371750, 304230, 261092, 267125, 246957, 231793, 219571, 211798, 268293, 192385, 222612, 371827, 431923, 422776, 480892, 580322, 552982, 495486, 400835, 494567, 438485, 418676, 445844, 462738, 475306, 443446, 485839, 652169, 641461, 532086, 566562, 488556, 567379, 575984, 591070, 790948, 647316, 714269, 793636, 866733, 874773, 800483, 784934, 848633, 909774, 875254, 885516, 846761, 1061680, 958444, 983452, 1177268, 1351062, 1237504, 1240663, 1274994, 1465542, 1526496, 1701352, 1743700, 1783965, 2018044, 2252185, 2425436, 2651334, 2752160, 2825264, 2665829, 2567987, 2334086, 2521007, 2537331, 2520555, 2608260, 2540319, 2559931, 2557929, 2802166, 2768929, 3102784, 3284775, 3735146, 4130171, 4544164, 4986004, 5487921, 5752773, 5695101, 5561480, 5142677]
4783E142677j22633l5003L8687j06224M6359J68277m4793K10453J44905J39362
4773E582067J76015K43889J90728L51444M64209M09256N60716O49383J66338M50336
4763I244381K75588M98786P79792O38185Q29533Q10514Q76282R09283J201347
4754A6063691J465501J777764J735762J280285M01239k81939j103161j097666
4746B0241476q88986o09555k71347J04471K99075N42697Q39800Q56921J583061
4737B2697613J488953K164664K587015L322520L490990L317759J392383j290599
4729C9171298l224320l727455l650386k945434k379942j867882j355023r94257
4721A9026599p13030n48212k57069K09945N44889R72095J195980J378230J178546
$$ y = [5142677, 5020044, 4985041, 5023728, 4917504, 4963863, 5132140, 5087347, 5297800, 5442705, 5582067, 5758082, 6001971, 6192699, 6544143, 7008352, 7417608, 7978324, 8627707, 8794045, 9244381, 9519969, 10018755, 10798547, 11436732, 12266265, 13076779, 13953061, 14862344, 16063691, 17529192, 19306956, 21042718, 22323003, 22724242, 22442303, 21339142, 20241476, 19352490, 18742935, 18471588, 18576059, 18875134, 19417831, 20257631, 21114552, 22697613, 24186566, 26351230, 28938245, 32260765, 35751755, 39069514, 40461897, 39171298, 35946978, 32219523, 28569137, 25623703, 23243761, 21375879, 20020856, 19026599, 18313569, 17765357, 17508288, 17718233, 18263122, 19235217, 20431197, 21809427, 22987973]
4712B2987973O42734o53187j820561k140888k380506j997986j538588j448419
4704A1650572j343276r61626r61368q33435o92025m67715l26336n50383l36320
4695E178088m04970l35633p0885l55060q5087k14216k37627l33218j18855l1898
4685B990639j85324j14874j63008n3575j50041m0774m794k55283r0824j45960
4675A786182N2574r8905j66855n6255J66263r3332M9869L0841k69203n2229P0420
4664A419370k32281j60495J32876n7517k7241k6633M2038K1005L8880M3053j47325
4653A045730n3881k06462N6376N4072q3601j50777J32481K3747Q8859j68900Q9939
4642H27583j13713j64315K14370r2853j70199Q7173o1781K00862P9336p2353l9769
$$ y = [22987973, 23630707, 22977520, 21156959, 19016071, 16635565, 14637579, 13098991, 11650572, 10307296, 9345670, 8384302, 7550867, 6858842, 6391127, 6064791, 5514408, 5178088, 4773118, 4437485, 4366600, 4011540, 3926453, 3712237, 3474610, 3141392, 3022537, 2990639, 2805315, 2690441, 2527433, 2473858, 2323817, 2283043, 2278249, 2022966, 1932142, 1786182, 1838756, 1739851, 1572996, 1516741, 1683004, 1589672, 1639541, 1670382, 1401179, 1348950, 1419370, 1187089, 1026594, 1159470, 1101953, 1074712, 1048079, 1090117, 1111122, 1150002, 1193055, 1045730, 991849, 785387, 841763, 895835, 812234, 661457, 793938, 817685, 906544, 737644, 827583, 713870, 549555, 763925, 671072, 500873, 588046, 526265, 727127, 806463, 734110, 694341]
4631F94341k17812N4133N1867m6346j54400J29503N6911o4251M7229q2033N4431
4620E23573M9390n2313j81687J98302q1346M8120P8635j65942O709O8860k5715
4609D66586l3256o5597J84322j7310n2973O7434j54461r5698J31517P4080J92258
4598F96902r5954j41622O3842J26717q2101q9024m0121p427O3161P734J9245j29379
4586C91973J18867k41935N4219J50604J33048j2214p1959o7508J85144m1451j0604
4575E88184k24591J40444M8808m9784J0233n2072K7349J06272m3400j20308J07995
4564E39130M0690J0179l3928k2103l4873M449k1861j8219q0125L7708J60276k09673
4552C71650J89960j20619j8266l3054R0344m1593J28056j62441r1359J3041j42813
$$ y = [694341, 476529, 530662, 582529, 536183, 381783, 511286, 568197, 503946, 551175, 469142, 523573, 572963, 520650, 338963, 537265, 455919, 504039, 582674, 416732, 423441, 492301, 466586, 433330, 367733, 552055, 534745, 481772, 549206, 394745, 299047, 430564, 504644, 696902, 600948, 459326, 523168, 649885, 567784, 478760, 438639, 431212, 494373, 502107, 521352, 391973, 510840, 268905, 323124, 473728, 606776, 594562, 522603, 455095, 640239, 598788, 588184, 363593, 504037, 552845, 503061, 513294, 461222, 488571, 594843, 551443, 431135, 539130, 579820, 589999, 556071, 533968, 499095, 503544, 481683, 463464, 383339, 421047, 581323, 371650, 561610, 440991, 422725, 389671, 480015, 438422, 566478, 404037, 312678, 325719, 182906]
4541A82906J02464l0064P052R5721M5330o8834r4056Q0241L1728K8775R0842k01254
4529B70851L0378m1023N3599L4451P2102j79051j5070Q4437R207J5277L5573R6811
4517D67542K8286K80j51981M9272P4119l1061p3791L4735M0064m5011J2737J5134
4505D20325j7389j27585M7957J41746o1948O9892N2771m4499o1938l5832j01692
4494B81808K44872N2444j1349R4046j65307P9081O9882j44676J9683J80663j74497
4483E26650k9692M7173n2902q0421O4788P61J43515j08346l1268k6216m3883P3438
4471D83597M8189K0527j46460Q6150M6183J17493j87417n057P8901O3528L0451
4460F36085o9457Q2784n9263l5013n8387O8222j7416L3999J40529q0437m0116
$$ y = [182906, 285370, 255306, 262358, 358079, 403409, 334575, 240519, 320760, 352488, 381263, 472105, 270851, 301229, 260206, 313805, 348256, 420358, 241307, 226237, 310674, 319881, 335158, 370731, 467542, 495828, 496108, 344127, 393399, 467518, 436457, 362666, 397401, 437465, 392454, 405191, 420325, 402936, 275351, 323308, 465054, 403106, 472998, 525769, 481270, 419332, 383500, 281808, 526680, 579124, 567775, 661821, 496514, 575595, 645477, 500801, 520484, 701147, 526650, 496958, 544131, 491229, 410808, 475596, 476357, 619872, 511526, 480258, 454042, 410159, 483597, 531786, 552313, 405853, 492003, 538186, 655679, 468262, 463205, 542106, 605634, 636085, 566628, 649412, 590149, 555136, 496749, 564971, 547555, 581554, 722083, 641646, 601530]
4449F01530J58996r6154j04144J06368l094p4062P8590J5386j44436J45914j67546
4438E17348K1426K52821j19863o9166J48062J16542n2503m0767k6257r9697l9968
4427F07978Q6434J19737L4717L7255J05180j74056J19797j03242L3903J91509
4417A059212N2641k0352N5522N3177q9706R3209R8455L9548M2686m2832J97378
4406A538938J74640l3779l5272O9916J1488Q5288M4201k9569j03275J93464k9641
4395A886399L4573J04956Q9519R1956J46621K8206K51093K53078J19121K67712
4385C273234J90137N8438J15753J31721J18475K48191L18955K51883L24084L82889
4375E413760L44828J16789q1178M5405l993K08527J57860J85959K56975K35460
$$ y = [601530, 760526, 664372, 560228, 666596, 663502, 589440, 668030, 683416, 538980, 684894, 517348, 538774, 791595, 671732, 602566, 750628, 867170, 814667, 773900, 747643, 647946, 607978, 694412, 814149, 848866, 886121, 991301, 817245, 937042, 833800, 867703, 1059212, 1111853, 1091501, 1147023, 1200200, 1110494, 1203703, 1302158, 1341706, 1384392, 1341560, 1538938, 1713578, 1679799, 1644527, 1714443, 1725931, 1811219, 1855420, 1825851, 1722576, 1916040, 1886399, 1920972, 2025928, 2115447, 2207403, 2354024, 2382230, 2633323, 2886401, 3005522, 3273234, 3463371, 3521809, 3637562, 3769283, 3887758, 4135949, 4454904, 4706787, 5030871, 5413760, 5758588, 5875377, 5794199, 5839604, 5835611, 6044138, 6201998, 6387957, 6644932, 6880392]
4365F880392K36342L87964N43096N26333N65097M99069P60207O98274J055536
4356A2152310J191241J431824J109430N92665N73442Q01372J462204J701010K288331
4347B3303829K363319J821028L71879p13114j375683j288306j311456r16257p69719
4338B1485520m89977o4091L15807P26315Q60367J372483J534121K058568K984555
4329C0783668L868573M663712L791273R21468k677486m247346m417704l883827
4321B8802331l140635k478416j993261j453291j176777q62616m26002j06183J41221
4312A7306371M08451P98411R64489J299656J191945N02238p39240j827464k189994
4303A7714863k051741j682709j442025j254834j020427q62475p14648n35171l23777
$$ y = [6880392, 7116734, 7504698, 8047794, 8574127, 9139224, 9638293, 10398500, 11096774, 12152310, 13343551, 14775375, 15884805, 16477470, 17050912, 17852284, 19314488, 21015498, 23303829, 25667148, 27488176, 27860055, 27146941, 25771258, 24482952, 23171496, 22255239, 21485520, 20995543, 20931452, 21247259, 21973574, 22833941, 24206424, 25740545, 27799113, 30783668, 34652241, 39315953, 43107226, 44028694, 41351208, 37103862, 32686158, 28802331, 25661696, 23183280, 21190019, 19736728, 18559951, 17697335, 17271333, 17165150, 17306371, 17714822, 18513233, 19477722, 20777378, 21969323, 22471561, 21732321, 19904857, 17714863, 15663122, 13980413, 12538388, 11283554, 10263127, 9400652, 8686004, 8150833, 7827056]
4294G827056k77577m54347j17850k99597m04510m36047j65900k51156l72240k70912
4284D776920k42005p8395k30244j32777o1257j36805J0462n058r8958o4550j31134
4273C606199j58032p6421k19768q9611k00425r9700q6213j52012p1202l7900K130
4262B417045J43323q6479j36350j25195n066j1668q7145O0740J30046j28691p4969
4251B095591O5458o9379M4443j0411M65J0899j50509J18628r6801j08039j41779
4240A758566R5711m0731j11170J49682j26062P3693j24773J20178K9346m69m4473
4229A779498J0411J18594J26992J36073J09637j47563J40089j15567M446l7277
4219B125333o497n7970J44912J53642j7313k97247J24235N0463J40346l5153J91260
$$ y = [7827056, 7549479, 7095132, 6977282, 6677685, 6273175, 5837128, 5671228, 5420072, 5047832, 4776920, 4534915, 4456520, 4226276, 4093499, 4032242, 3895437, 3905899, 3900841, 3801883, 3737333, 3606199, 3448167, 3371746, 3151978, 3062367, 2861942, 2762242, 2676029, 2524017, 2452815, 2414915, 2417045, 2560368, 2473889, 2337539, 2212344, 2207278, 2195610, 2108465, 2169205, 2299251, 2170560, 2095591, 2161049, 2091670, 2136113, 2125702, 2126167, 2137066, 1986557, 2105185, 2008384, 1900345, 1758566, 1854277, 1813546, 1702376, 1852058, 1725996, 1799689, 1674916, 1795094, 1824440, 1823971, 1779498, 1789909, 1908503, 2035495, 2171568, 2281205, 2133642, 2273731, 2158164, 2162610, 2125333, 2118836, 2060866, 2205778, 2359420, 2342107, 2044860, 2169095, 2219558, 2359904, 2324751, 2516011]
4208B516011P7668R6776R3520K115M7098J95707q5028o5556j11628L00749J36843
4197C204275j6959j87270m5087J91198R0486K27872n5327n3534m1631K3525M9076
4186C386624M8787o8663m5271k04402J03750J12794r195J26700J30251q5188J89469
4175C685656J77901K67685n4371l9090j96612p1687j88992j97386j06867q9775
4165C186462J12310l3633j2544J45657j02600k8423K5465j01229R2162p1894o0820
4154C150913J15028N7745k6363J9552J03262j10495J56334J99548J28180J24075
4144C917779K29977N6782k2326P9598K74096J14707P8740J58891L81389K17968
4134E487601K68889K20999L84302O3644J36239N29877K21671K48591K46618L91123
$$ y = [2516011, 2593679, 2690455, 2783975, 2786090, 2833188, 3028895, 2943867, 2878311, 2766683, 3067432, 3204275, 3187316, 3000046, 2954959, 3146157, 3236643, 3464515, 3409188, 3355654, 3314023, 3337548, 3386624, 3435411, 3366748, 3321477, 3117075, 3220825, 3333619, 3324424, 3451124, 3581375, 3496187, 3685656, 3863557, 4131242, 4076871, 4037781, 3841169, 3769482, 3580490, 3383104, 3276237, 3186462, 3298772, 3265139, 3252595, 3398252, 3295652, 3267229, 3292694, 3191465, 3283627, 3211733, 3150913, 3265941, 3323686, 3297323, 3316875, 3420137, 3309642, 3465976, 3665524, 3793704, 3917779, 4147756, 4204538, 4182212, 4261810, 4535906, 4650613, 4729353, 4888244, 5269633, 5487601, 5756490, 5977489, 6361791, 6425435, 6561674, 7091551, 7313222, 7561813, 7808431, 8199554]
4124H199554O08778M98197N85796M82946M93555N37059P54459O08545P73629J110496
4114A4653014J089432J309097J389325J487202J256401J338019J364902J456695
4106B5344087J175106J339313J352509J214004J026995P14928O88134M28343M68459
4097C3751878O39472J131844J493978K216985K510756K586960J843301R05614
4089D7080788P74442R94251J831668K535442K871287L097477L910356M601959
4081F7697670M409153L922318M666786N280612M442558K459188Q03462l7477j81882
4072I3462388j512186l706353n578746n241473m448359m492639m707345m356334
4064E9418953l720244l548207l034546k327032j455364o38596M9534K53617K85023
$$ y = [8199554, 8808332, 9306529, 9892325, 10375271, 10868826, 11405885, 12160344, 12768889, 13542518, 14653014, 15742446, 17051543, 18440868, 19928070, 21184471, 22522490, 23887392, 25344087, 26519193, 27858506, 29211015, 30425019, 31452014, 32166942, 32855076, 33283419, 33751878, 34391350, 35523194, 37017172, 39234157, 41744913, 44331873, 46175174, 47080788, 47855230, 48849481, 50681149, 53216591, 56087878, 59185355, 63095711, 67697670, 72106823, 76029141, 80695927, 85976539, 90419097, 92878285, 93681747, 93644270, 93462388, 91950202, 88243849, 82665103, 77423630, 72975271, 68482632, 63775287, 59418953, 55698709, 52150502, 49115956, 46788924, 45333560, 44694964, 44744498, 44998115, 45283138]
4055D5283138L23168P85797L74473n66616j521982k000417j879406j791389j589937
4046C7416829j187875q48344o71329m35984k69663J73857O09993J296343J864952
4037C7948779K600348L050798K201607L62976j164746k736250l752197l839864
4029C4671451l161685k487871k122463j478914j193892r47428n92940l94511p1907
4020B2219840M55791Q55951J369193J483107O85735o42955k105435k577988k461036
4011A9282203k090883j811814j852122j295245j035966q65652q24315p34788n36204
4002H235214m19697n05503m40541m13420l17590j72319l11611k63080k82996j31153
3992D977304k25223j54739k75961j39147k9736k50006j80093j02387N0202j70842
$$ y = [45283138, 45606306, 46392103, 46766576, 46199960, 44677978, 42677561, 40798155, 39006766, 37416829, 36228954, 35380610, 34709281, 34273297, 34003634, 34177491, 34787484, 36083827, 37948779, 40549127, 43599925, 45801532, 46164508, 44999762, 42263512, 38511315, 34671451, 31509766, 29021895, 26899432, 25420518, 24226626, 23279198, 22686258, 22291747, 22219840, 22675631, 23531582, 24900775, 26383882, 27069617, 26426662, 24321227, 21743239, 19282203, 17191320, 15379506, 13527384, 12232139, 11196173, 10330521, 9506206, 8771418, 8235214, 7815517, 7310014, 6869473, 6456053, 6138463, 5966144, 5654533, 5391453, 5108457, 4977304, 4752081, 4597342, 4321381, 4182234, 4152498, 3902492, 3722399, 3620012, 3670214, 3499372]
3982C499372j67535j69721p7769K4815J0212j78276j17565k592k01160j28165
3972B491616m5810m7761N7138o1282q080m14j44998J605r4501L092j22157p3316
3960A955132J7895Q928j48064j70103o712j03002J21583N1663o2621j28266l4265
3949A502168K86990j21976k10113j13160M0906m1028J16504M9475M177k02554
3939A311389n0791M7852j37313J23540j07124J8224j13018p4809o5814K23727
3929A175863j17416r6410j9508j20664N8576J33486L3454J01722o9521n2076k1163
3918A006343j21545p5980M765L1218Q7414l691j04588l7980R0040L6315m2852
3907H69459p0514l8879P206O0985j53719K3783K9261r7435O5132j13318R5798
$$ y = [3499372, 3331837, 3162116, 3084347, 3109162, 3119374, 2941098, 2823533, 2820941, 2619781, 2491616, 2445806, 2398045, 2455183, 2393901, 2385821, 2385407, 2240409, 2242014, 2147513, 2150605, 2028448, 1955132, 1973027, 1981955, 1833891, 1663788, 1657076, 1554074, 1675657, 1727320, 1664699, 1536433, 1502168, 1789158, 1667182, 1457069, 1343909, 1384815, 1343787, 1460291, 1509766, 1513943, 1311389, 1260598, 1308450, 1171137, 1294677, 1187553, 1205777, 1092759, 1017950, 952136, 1175863, 1058447, 962037, 942529, 821865, 880441, 1013927, 1047381, 1149103, 1079582, 1027506, 1006343, 884798, 808818, 813583, 844801, 932215, 928524, 823936, 785956, 875996, 912311, 869459, 798945, 760066, 767272, 828257, 674538, 698321, 727582, 630147, 695279, 581961, 677759]
3896F77759N7309R5021j02856j68420M2872q659R7055q9141j5859n7600L3466
3885E60947Q8199m6777M8049J10873K3o6941j59172k254J32584P4892J1850J7530
3873G69803j50784n2442O4776j56194N1244Q0681K6116p3187L2871P2841O5445
3862G31170j33647N608q9316P3271N1322n7421J03485P834N6486k443N7369j02750
3850G00968q2447j80k3134L2511K182O7129j00775J95423M4875P0898j76555l9922
3838F90973L2582L988j44929P5568Q067q634R9309N1846r9469K8739J8799m6986
3826G09853m4164j03654O8434m2738J24456p141K4952Q387K1021K4108m967Q0455
3814H59002j52682Q3540J25093r9430o0645L5384k16822j23652J64816J6931j41554
$$ y = [677759, 735068, 830089, 727233, 558813, 601685, 593026, 690081, 600940, 585081, 527481, 560947, 649146, 602369, 650418, 761291, 761314, 694373, 535201, 532947, 665531, 740423, 752273, 769803, 619019, 566577, 631353, 475159, 526403, 607084, 633200, 560013, 592884, 665725, 731170, 597523, 603131, 513815, 587086, 638408, 580987, 684472, 692306, 748792, 746349, 803718, 700968, 618521, 618341, 595207, 627718, 629900, 697029, 596254, 791677, 836552, 907450, 730895, 690973, 723555, 727543, 582614, 658182, 666249, 657615, 756924, 808770, 709301, 738040, 756839, 709853, 665689, 562035, 630469, 587731, 712187, 705046, 729998, 738385, 759406, 783514, 778547, 859002, 706320, 789860, 914953, 815523, 754878, 790262, 573440, 449788, 614604, 631535, 489981]
3803D89981J17980j70209P4492R4924j73220j3261O0401J07978J04470M5294n5678
3792F83152n9559q3630O0702k9486J45430j87212N2794j76113k6895R1838n368
3781D65653j22252J11124n4698k0581R5597P6165l0624J17613p642l0324L8521
3770F38552j71410J18062l7515M9810j70425m4322J87746l9675P286l3043o5261
3759D39805P4656M2174J99237o8454p8699P5441j7024P4642K417q5892j35889
3748E22414j9335J04587R3538j48591l4923P6520J7111q7316J02269R9064P9109
3737H04447P6889j14148M4930J79031Q720m080Q7636k88019l0560o0772j16566
3726E87508R0034r6183o0405N5858J6910J6780l1372j92394K6646J7758Q2230
$$ y = [489981, 607961, 437752, 512244, 607168, 433948, 420687, 481088, 589066, 693536, 738830, 683152, 623593, 539963, 600665, 571179, 716609, 529397, 582191, 406078, 379183, 471021, 465653, 343401, 454525, 399827, 379246, 474843, 551008, 520384, 637997, 630355, 600031, 638552, 467142, 585204, 547689, 597499, 427074, 382752, 570498, 530823, 538109, 505066, 439805, 514461, 556635, 755872, 687418, 608719, 684160, 667136, 741778, 744195, 658303, 522414, 503079, 607666, 701204, 552613, 517690, 594210, 611321, 524005, 626274, 725338, 804447, 881336, 767188, 812118, 991149, 999869, 995789, 1083425, 795406, 764846, 704074, 587508, 677542, 581359, 520954, 576812, 593722, 610502, 579130, 386736, 413382, 431140, 513370]
3715E13370r6642J08771j61853J14042R523j47388J25394l8563J20279j4955o9078
3704D62900p171l6180O9798p1752r0980R7935K6241Q4550r6029o6134n5581p3270
3692B44327J62405l0305K7566N0922L5185m472j06607m1064J44126j00550O5930
3681D47463L7702n0837l9279l8226J32560p6054J84840q8523J05581n4916r4881
3670D65430Q267J3377m8787Q4468J23618j3885j14772j18980j1386k6120J81548
3659E42778L4967j00865J6195J5661J9521N6029K6149R0515n1083j56790r255
3648D83822J66265J20292J2947L6120j34051q6424J25820K05826j0146j68444
3638G52027n592K1222n3228P0274J77253N6613J5842m2394r4107O0157K33212
$$ y = [513370, 416728, 525499, 363646, 477688, 487211, 339823, 465217, 426654, 546933, 531978, 462900, 455729, 419549, 489347, 417595, 326615, 424550, 450791, 535341, 439312, 373178, 317597, 244327, 406732, 376427, 403993, 454915, 490100, 485628, 379021, 337957, 482083, 381533, 447463, 485165, 434328, 395049, 356823, 489383, 413329, 598169, 509646, 615227, 560311, 465430, 473697, 487074, 438287, 522755, 646373, 632488, 517716, 398736, 387350, 361230, 542778, 577745, 476880, 493075, 508736, 528257, 584286, 610435, 700950, 649867, 493077, 483822, 650087, 770379, 783326, 819446, 685395, 598971, 724791, 930617, 920471, 752027, 746435, 767657, 714429, 784703, 961956, 1018569, 1034411, 992017, 897910, 958067, 1191279]
3627A191279k1203k4096J63553K1534j36715l4172J76101o8316j41067O8046k1071
3616A173873l0005J12687J3153J9185J62514L8429j35695J5713J06937J07502
3606A584293J02117J6586j41975R8741j0548j99815q8561M4571O7462m377J3960
3595A482454N3561o534K4232O4785J69065J26694n1148j7245L1907p9031J26940
3584A925680J12159r1592q0242O0876R651R8508m6182m8484K02989Q0461L9007
3573B262831K55290k7584P7425M8186K46577O4007J14424K02220J14075K34608
3563C592059K88345J28434J87865K37716M12318M07783M85485M84444J52683K02216
3553F579348J65800J108J86711R3227J60090K80388O34413M42094M58222M43257
$$ y = [1191279, 1170076, 1145980, 1309533, 1331067, 1194352, 1160180, 1336281, 1267965, 1126898, 1194944, 1173873, 1143868, 1256555, 1269708, 1288893, 1451407, 1489836, 1354141, 1369854, 1476791, 1584293, 1686410, 1702996, 1561021, 1659762, 1649214, 1449399, 1360838, 1405409, 1472871, 1468494, 1482454, 1536015, 1529481, 1553713, 1618498, 1787563, 1914257, 1863109, 1845864, 1877771, 1798740, 1925680, 2037839, 1946247, 1866005, 1926881, 1936532, 2035040, 1988858, 1940374, 2143363, 2223824, 2262831, 2518121, 2490537, 2567962, 2616148, 2862725, 2926732, 3041156, 3243376, 3357451, 3592059, 3880404, 4008838, 4196703, 4434419, 4846737, 5254520, 5740005, 6224449, 6377132, 6579348, 6745148, 6746256, 6932967, 7026194, 7186284, 7466672, 8101085, 8543179, 9001401, 9444658]
3543I444658N65658R24156J119249J053201J035850J025347J069197R24381Q66662
3534A8028359Q52601J070255J436880J634060K334648L054076L202841K327356
3526C3941076J107720J84368q84360j074185o56874j76917n5987L68850P57548
3517C3511239R01267R90196J221639J836503K510660L275749M179589M832948
3509E3259790M636699L953591K392380J279042J148806K692916N646250J0807738
3501H5817212J8514197K4738618j590157k0940992k0441830j5505743j0641527
3494E9949778p893297m870774l666318k109275k046800k174660l167508l271621
3486C0749525l562457k840674k564360k108826j763789j605911j391805r12637
$$ y = [9444658, 10010316, 10934472, 12053721, 13106922, 14142772, 15168119, 16237316, 17161697, 18028359, 18880960, 19951215, 21388095, 23022155, 25356803, 28410879, 31613720, 33941076, 35048796, 35233164, 34348804, 33274619, 32617745, 32440828, 32384841, 32753691, 33511239, 34412506, 35402702, 36624341, 38460844, 40971504, 44247253, 48426842, 53259790, 57896489, 61850080, 64242460, 65521502, 66670308, 69363224, 75009474, 85817212, 104331409, 129070027, 127479870, 106538878, 86097048, 70591305, 59949778, 52056481, 47185707, 43519389, 41410114, 39363314, 37188654, 34021146, 30749525, 27187068, 24346394, 21782034, 19673208, 17909419, 16303508, 14911703, 13999066]
3478A3999066j046906r33197r84290n22384n18122m31193p88410k86465m13863
3469H074236m41610m05621l51757m00217j18449l40904k29835l52866j18429l4278
3459E280270k54418l50370n6129j69654R360l21100Q722l90041k77043K9855P4063
3448C583515p79j83854j94169R6173l825k8475j61964N6260o8425j51274j24076
3437B819107J15608j5129l6133q6856O4009j25782J51794l5379j28897l532j03834
3426B614976r1657J06195j29104n2503o8476J532M2808m0522n1107Q2440j2021
3415B402561O5712n527l0244p2909q1085r0770j16186l5377j3732k1514j2912
3404A988017p3624q3440J13199l4916o3092j23268J83991r0753M3196j52524r5574
$$ y = [13999066, 12952160, 12018963, 11034673, 10512289, 9994167, 9562974, 8774564, 8488099, 8074236, 7632626, 7227005, 6875248, 6475031, 6356582, 6015678, 5785843, 5432977, 5314548, 5280270, 5025852, 4675482, 4619353, 4449699, 4459059, 4137959, 4146681, 3756640, 3479597, 3509452, 3583515, 3582736, 3398882, 3204713, 3300886, 3297061, 3268586, 3106622, 3162882, 3094457, 2943183, 2819107, 2934715, 2919586, 2883453, 2796597, 2860606, 2734824, 2886618, 2851239, 2722342, 2718810, 2614976, 2523319, 2629514, 2500410, 2447907, 2379431, 2380963, 2423771, 2383249, 2332142, 2414582, 2402561, 2468273, 2462746, 2432502, 2359593, 2278508, 2187738, 2071552, 2036175, 2022443, 2000929, 1988017, 1914393, 1830953, 1944152, 1909236, 1846144, 1722876, 1906867, 1816114, 1859310, 1706786, 1611212]
3393A611212r7391m433k9487j7173k31008R8058m914p6435K0385j5162r2264J65620
3381A327008p7527n7106n0092j14846R775k6386n6721K3797L0281R1689j3893
3370A085979j63074l1028j9835O7446j47571j35998J21022q2605P2752K17832
3360I84920J11748j92060m8508j12853J7601k8781n1658q2732N2154J74695n6607
3349G67919j8337k79956O9780J97490k36373J09891K2138r5114J27257k5828r494
3338F29373Q705J33323R0631j89690j11795J46922K0405j98947m6881J34326P4706
3327F91078n5833J9980k10647J31434N9640J14524l5334K1161L8849j63866R8339
3316G09325q2190j12064J34508P0989k9566J64043M3499j40672q9532P7992M3386
$$ y = [1611212, 1513821, 1509388, 1479901, 1462728, 1231720, 1329778, 1324864, 1248429, 1268814, 1253652, 1161388, 1327008, 1249481, 1192375, 1142283, 1027437, 1037212, 1010826, 954105, 977902, 1008183, 1099872, 1085979, 922905, 891877, 872042, 939488, 791917, 655919, 776941, 694336, 767088, 984920, 1096668, 904608, 856100, 743247, 760848, 732067, 680409, 597677, 649831, 824526, 767919, 749582, 469626, 539406, 736896, 500523, 610414, 632552, 537438, 664695, 638867, 629373, 638078, 771401, 862032, 672342, 560547, 707469, 727874, 528927, 482046, 616372, 691078, 635245, 655225, 444578, 576012, 635652, 750176, 714842, 736003, 774852, 610986, 709325, 627135, 515071, 649579, 720568, 691002, 855045, 898544, 757872, 668340, 746332, 789718]
3305G89718Q0492n2642m5265o0214N5631j42252O1456J72993m9741J6893J1969
3294H39038q7427O8905p0004o8058n7189N164J54611J5344N4738l9152k3665R6956
3282H89261J647J14573j00798O5677j655n8478J8393p5101p9762o2247J42555
3271H54065n4086J50116O9118O8937O3834k8189J43823K09603r5140P638q4374
3260A305345j76065j46822p4195J76156r9810m9668J6907p6896o2125R860Q0047
3249I02734J27162p5719r9098k9211P826J06402o4699L4365J566J20455j5260
3238A016523R6244n3882m0687M9272l2682J72614m481r9496J29460K2749j00315
3227A155319J31029K33601K5658q0207L3363J37657J83510J02257j21845j79823
$$ y = [789718, 870210, 817568, 772303, 712089, 767720, 625468, 686924, 859917, 810176, 827069, 839038, 751611, 820516, 750512, 682454, 625265, 630429, 785040, 800384, 855122, 815970, 792305, 889261, 890908, 1005481, 904683, 970360, 968705, 910227, 928620, 853519, 773757, 711510, 854065, 799979, 950095, 1019213, 1088150, 1151984, 1123795, 1267618, 1477221, 1382081, 1389719, 1305345, 1129280, 982458, 908263, 1084419, 984609, 934941, 951848, 874952, 812827, 822687, 902734, 1029896, 954177, 855079, 825868, 833694, 940096, 875397, 909762, 911328, 1031783, 1016523, 1112767, 1058885, 1018198, 1067470, 1034788, 1207402, 1202921, 1103425, 1232885, 1255634, 1155319, 1286348, 1519949, 1545607, 1465400, 1498763, 1636420, 1819930, 1922187, 1800342, 1620519]
3217A620519K12219M2651J40773L6098J80129J91287L5976J81448J81318J82053
3207C004471J80569Q6252L01059M81371K74443L03061L13575L91646K29608J58729
3197E724784M08056L45185M94573M10997L95021O42411O58318N04442Q03616O68703
3187A1056106O71999O73473P83163O87016R59134Q62572J069918R34098Q62997
3178A8560476Q58585R29796Q65261Q58488P24051P40407Q96976R71376J118929
3169B6524345N89851N09930L92062L08360j5805J2886N4972o72K20556L59481
3159B8955966J22302j88236n94207p74137j009386r08456p86285r03086p97489
3150B3116986l93945k98230o06749j032261j228955j251862j194271j191197r00708
$$ y = [1620519, 1832738, 1875389, 2016162, 2052260, 2232389, 2423676, 2459652, 2641100, 2822418, 3004471, 3185040, 3271292, 3572351, 4053722, 4328165, 4631226, 4944801, 5336447, 5566055, 5724784, 6132840, 6478025, 6972598, 7383595, 7778616, 8421027, 9079345, 9583787, 10387403, 11056106, 11728105, 12401578, 13184741, 13871757, 14830891, 15693463, 16763381, 17697479, 18560476, 19419061, 20348857, 21214118, 22072606, 22796657, 23537064, 24434040, 25405416, 26524345, 27114196, 27624126, 28016188, 28324548, 28308743, 28321629, 28376601, 28375929, 28596485, 28955966, 29078268, 28890032, 28295825, 27521688, 26512302, 25603846, 24817561, 23914475, 23116986, 22723041, 22424811, 21818062, 20785801, 19556846, 18304984, 17110713, 15919516, 15018808]
3141A5018808r27836o99582n82143n32134p38160p77775q46102o74063p33906
3132H507107o70735m86923n57096l16526n00134k88517l29570n20495k27446j60376
3122D449289k27471k11249j17543k61546j63934p4967j51649j35545j16720q8798
3112B899867N375j09774J2697j11615k7409r5854M5307j28828j74809j38655o6485
3101B109817O3805J23844n0054r1332n1903q4917r7588j10927l9083k1322M5224
3090A795564j66894J05231j6716R3405j15869p9595o5211j37221j6095r4472J17049
3079A419176j23395o8789J47056j95573Q2966j3958J410j6230J0165K0378j12276
3068A150930m7758j8459o3518M6724n3767l3372J06346n8099P5184m8289k3962
$$ y = [15018808, 14090972, 13391390, 12809247, 12277113, 11538953, 10761178, 9915076, 9241013, 8507107, 7836372, 7349449, 6792353, 6475827, 5975693, 5687176, 5357606, 4837111, 4609665, 4449289, 4221818, 4010569, 3893026, 3631480, 3467546, 3392579, 3240930, 3105385, 2988665, 2899867, 2905242, 2795468, 2808165, 2696550, 2669141, 2573287, 2618594, 2489766, 2314957, 2176302, 2109817, 2173622, 2297466, 2247412, 2156080, 2104177, 2019260, 1921672, 1810745, 1771662, 1750340, 1795564, 1628670, 1733901, 1717185, 1810590, 1694721, 1615126, 1549915, 1412694, 1396599, 1302127, 1419176, 1295781, 1226992, 1374048, 1178475, 1261441, 1247483, 1248893, 1232663, 1242828, 1263206, 1150930, 1103172, 1084713, 1021195, 1067919, 1014152, 980780, 1087126, 1029027, 1104211, 1055922, 1031960]
3057A031960M8641l6356k956k11636J40820M2174L0221r2219l7965J18789p0216
3046I61257J39184J599L8974r9195r6910J52262j1031o6421l1666R3197n7778
3035A023472J3391p4308o8533J95301j56180j26174N0591Q534m8727J01773M3689
3024I62829j39764K9713J71007K4068j08009Q6164K8547K1912L3038l6312K9112
3013A102305j4961q8917J64360J10713k09318K820K6844K0479k8236J7831L0387
3002A134307m1486o2369o9173N5843p0495J92954J06904o402m3786J09398j64444
2991A141251j2306J46889j22487Q6511j47013J04636K6266m6260R1753K3305O0503
2980A353048r6070m934Q7283p2575j34091N994R3686J17598R1118l1952j21120
$$ y = [1031960, 1080601, 1044245, 1041289, 829653, 970473, 1012647, 1042868, 950649, 912684, 1031473, 961257, 1100441, 1102040, 1141014, 1041819, 944909, 1097171, 1086140, 1019719, 988053, 1081250, 1023472, 1036863, 962555, 894022, 1089323, 933143, 806969, 857560, 866094, 817367, 919140, 962829, 823065, 852778, 1023785, 1047853, 939844, 1026008, 1054555, 1076467, 1109505, 1073193, 1102305, 1087344, 998427, 1162787, 1273500, 1064182, 1067002, 1093846, 1114325, 1086089, 1103920, 1134307, 1092821, 1030452, 961279, 1017122, 946627, 1139581, 1246485, 1240083, 1196297, 1305695, 1141251, 1128945, 1275834, 1153347, 1239858, 1092845, 1197481, 1223747, 1177487, 1269240, 1292545, 1353048, 1256978, 1252044, 1339327, 1266752, 1132661, 1138655, 1232341, 1349939, 1441057, 1409105, 1287985]
2969A287985K1531J8324n8908K6457J19483M3152J18463q2352j36711J06990j2515
2958A451899J8831J5282L6342m5531J06300M1407q6199O0183m3753J6362J65764
2947A736887m6076n2661p616J0828p371J81697K854k32592J19830J50634k7547
2936A828867N6109Q9182L7751r8979R6232Q5036L5304k0534j72038R9278O4364
2925B100572l4776J24741j59875J20063m3446o0331r128O9047Q193J34581J08529
2914B358170j47825K39604J27018j89762J17556P3983m2050J95347j35304R4037
2904B690774K4646O6468N5053k8756Q16M7883J16261n1510m8612o3624M9921P3186
2892B932506J38594n6306L1844R131n1319M5989P4890J66214l9669j76628J04957
$$ y = [1287985, 1309516, 1327840, 1268932, 1295389, 1414872, 1458024, 1576487, 1494135, 1357424, 1464414, 1451899, 1470730, 1486012, 1522354, 1476823, 1583123, 1624530, 1538331, 1598514, 1554761, 1571123, 1736887, 1690811, 1638150, 1630534, 1641362, 1633991, 1815688, 1818542, 1585950, 1705780, 1856414, 1828867, 1884976, 1974158, 2011909, 1912930, 2009162, 2094198, 2129502, 2108968, 1936930, 2036208, 2100572, 2065796, 2190537, 2030662, 2150725, 2107279, 2046948, 2037820, 2106867, 2115060, 2249641, 2358170, 2210345, 2449949, 2576967, 2387205, 2504761, 2578744, 2536694, 2732041, 2596737, 2690774, 2715420, 2781888, 2836941, 2808185, 2809001, 2856884, 2973145, 2921635, 2873023, 2809399, 2859320, 2932506, 3071100, 3014794, 3046638, 3055769, 3004450, 3050439, 3125329, 3291543, 3251874, 3075246, 3180203]
2881C180203l6135J10250M7223K431l7127R596R6068O7092R7592R286P7207n8891
2869C564795M0909J80080l6798J83520M3096J94877j1286o0905J27114k1904q7712
2858D115786N9744K10816R2090J99842K1518N5454k33443J17788R3593J68882
2848D902070n6782O1258J13386R1849L1503N7101J30236M3841Q5419J82469r5718
2837E546632K22558J91259R4397J45138m1739J24096M8096J33917J00240J67925
2827F732519J26330r455R2212K17246J92980K21752K05952l0347P714K40975K57128
2816H255006K61455J47589J87415K11301K54256L64318K24860K42506M1109J12637
2806A0302452J71975L08345M5869K75564K41850K33275J01293K13881J62968J29043
$$ y = [3180203, 3144068, 3254318, 3301541, 3303972, 3266845, 3276441, 3372509, 3439601, 3537193, 3546479, 3623686, 3564795, 3605704, 3785784, 3748986, 3932506, 3975602, 4170479, 4159193, 4098288, 4225402, 4203498, 4115786, 4175530, 4386346, 4478436, 4678278, 4699796, 4755250, 4521807, 4639595, 4733188, 4902070, 4845288, 4906546, 5019932, 5111781, 5143284, 5200385, 5330621, 5374462, 5459881, 5642350, 5546632, 5769190, 5960449, 6054846, 6199984, 6158245, 6282341, 6330437, 6464354, 6564594, 6732519, 6858849, 6849394, 6941606, 7158852, 7351832, 7573584, 7779536, 7749189, 7756903, 7997878, 8255006, 8516461, 8664050, 8851465, 9062766, 9317022, 9681340, 9906200, 10148706, 10189815, 10302452, 10474427, 10782772, 10828641, 11104205, 11346055, 11579330, 11680623, 11894504, 12057472, 12186515]
2796A2186515K31443J37241K30512K02759K42852L31193j5498K12414Q7969K05591
2786A4052991K34592L30260J37239J62263L71691J73466J34707J71385K96960
2777A6065554L19332L39938Q1017L96316K86311K99510K45414L33849J94465K12616
2767A8774322K38533L35733L69379K47909J51877L42761J37518K31592K85029
2758B1114653K83067J37352J69501R2242J98779J60814P3568J55633P2425N8119
2748B2516153K14004n6221p7553L0351K06952P9223Q9878l2811J86134K0142O4965
2737B3241217O7018Q7343J55889L3323K35038J47194J48166O5309R8639Q4624
2727B4363760K94916K03282K97774L51625K71195K18797L33600M23976M53494
$$ y = [12186515, 12417958, 12555199, 12785711, 12988470, 13231322, 13562515, 13547017, 13759431, 13847400, 14052991, 14287583, 14617843, 14755082, 14917345, 15289036, 15462502, 15597209, 15768594, 16065554, 16384886, 16724824, 16805841, 17202157, 17488468, 17787978, 18033392, 18367241, 18561706, 18774322, 19012855, 19348588, 19717967, 19965876, 20117753, 20460514, 20598032, 20829624, 21114653, 21397720, 21535072, 21704573, 21796815, 21995594, 22156408, 22229976, 22385609, 22458034, 22516153, 22730157, 22673936, 22596383, 22626734, 22833686, 22912909, 23002787, 22969976, 23156110, 23176252, 23241217, 23308235, 23395578, 23551467, 23584790, 23819828, 23967022, 24115188, 24180497, 24279136, 24363760, 24658676, 24861958, 25159732, 25511357, 25782552, 26001349, 26334949, 26758925, 27212419]
2718B7212419N17413L94830L79730L03766O14578O91335O43612P93505P15468
2709C2266656Q82356J197814J249422J464810J536210J877912K032505K278546
2701D4786231K549383K852680L503153L738530M040559M129215L957399M001199
2693G3558349L391366K995282K643578K210036J939289J358875R48575O48187
2685H9693537k53612q96930j538163j986512k179310k703521k842448k989416
2677G4303625l283924l621905m092123m339329m489679m770173m425183l985934
2669D1295375l622597l120956k682134k100934j781586j575516j245458j166254
2661B3999940j065571q81709p16611p80932m49115m34721m37103k46370l50119
$$ y = [27212419, 27729832, 28124662, 28504392, 28808158, 29422736, 30114071, 30757683, 31551188, 32266656, 33149012, 34346826, 35596248, 37061058, 38597268, 40475180, 42507685, 44786231, 47335614, 50188294, 53691447, 57429977, 61470536, 65599751, 69557150, 73558349, 76949715, 79944997, 82588575, 84798611, 86737900, 88096775, 89045350, 89693537, 89439925, 88542995, 87004832, 85018320, 82839010, 80135489, 77293041, 74303625, 71019701, 67397796, 63305673, 58966344, 54476665, 49706492, 45281309, 41295375, 37672778, 34551822, 31869688, 29768754, 27987168, 26411652, 25166194, 23999940, 22934369, 22052660, 21336049, 20555117, 20106002, 19671281, 19234178, 18987808, 18637689]
2652A8637689k98029r9881k68389j00065p2131j36780j40349J87779L7141p1112
2642A7675873J30912K09443L03811K69813K03819K89677L20239M78962M75070
2633B0357619N26512L79175N34231N15362P54069O76228P74169P64918R75664
2624B6257947R95982R17939J167883J085878J296625J445444J487937J741362
2616C6396997J796036J612214J968722K176141K346131K656914L023689L310771
2608E5287615L810853M524173M857836N590048O525728P441204Q389389R150405
2600A05577251R340210Q955510Q218198P157485O338582N572285N539889N532716
2592A62232126N805427N329386M866125L452440J487389q76223k726863m069880
$$ y = [18637689, 18339660, 18239779, 17971390, 17871325, 17799194, 17662414, 17522065, 17709844, 17746985, 17675873, 17806785, 18016228, 18320039, 18589852, 18793671, 19083348, 19403587, 19882549, 20357619, 20884131, 21263306, 21797537, 22312899, 23066968, 23743196, 24517365, 25282283, 26257947, 27253929, 28171868, 29339751, 30425629, 31722254, 33167698, 34655635, 36396997, 38193033, 39805247, 41773969, 43950110, 46296241, 48953155, 51976844, 55287615, 59098468, 63622641, 68480477, 74070525, 80596253, 88037457, 96426846, 105577251, 114917461, 123872971, 132091169, 139248654, 145587236, 151159521, 156699410, 162232126, 168037553, 173366939, 178233064, 181685504, 183172893, 182296670, 179569807, 175499927]
2584A75499927n126329n442921n825981n609657n463685n432671n510959n924713
2576A31163011o620436p036447o774062o404908n534568m638975l829253k555223
2568H7769139j524259m33831O95732J702511K539159L664719M326588M914393
2560A03654151N375568N553669N491380N524205N263098N178773M870125M174751
2552A45085720K983325K081060J190619N94030J34330q14487j838556l009383
2544A46406658m263949n004767n513457n869547n922099n855503n504019n239527
2536A03233790m774944m955956m937618n146826n166802n113456n115340n114825
2528F2908023m726508m452244l994709l356642k958900k549069k111203j632825
$$ y = [175499927, 170373598, 164930677, 159104696, 153495039, 148031354, 142598683, 137087724, 131163011, 124542575, 117506128, 110732066, 104327158, 98792590, 94153615, 90324362, 87769139, 86244880, 85811049, 86506781, 88209292, 90748451, 94413170, 98739758, 103654151, 109029719, 114583388, 120074768, 125598973, 130862071, 136040844, 140910969, 145085720, 148069045, 150150105, 151340724, 151934754, 152069084, 151254597, 149416041, 146406658, 142142709, 137137942, 131624485, 125754938, 119832839, 113977336, 108473317, 103233790, 98458846, 93502890, 88565272, 83418446, 78251644, 73138188, 68022848, 62908023, 58181515, 53729271, 49734562, 46377920, 43419020, 40869951, 38758748, 37125923]
2520C7125923j171188j142858q91329o96988m56662n02681n24415n4864m4383
2511C1640555J14390L03364J15532k585K10400P4596L2963J70877K5425O0627
2501C2746144K5765M2983K85067R4303k17744j62125k67899m64952k08123k17203
2491C1656216j14652M728J35847J17772J50827L85250P80416P55748J076343J414449
2481C6362944J715860K135771K563511K691524L167446L323761L181771L318500
2473E8461088L389554L503353L260876L091016K976327K903785K505806K048783
2465H2140588J867870J762589J375562N20151q27068k042046l222894l917620
2457G7657132m831710n048798n445333n648658n518759n162356m673837m178464
$$ y = [37125923, 35954735, 34811877, 33920548, 33223560, 32766898, 32264217, 31739802, 31684938, 31640555, 31754945, 32058309, 32173841, 32171256, 32381656, 32456252, 32489215, 32660092, 32685517, 32746144, 32771909, 32814892, 33099959, 33194262, 32976518, 32814393, 32546494, 32081542, 31873419, 31656216, 31541564, 31546292, 31682139, 31799911, 31950738, 32335988, 33116404, 33872152, 34948495, 36362944, 38078804, 40214575, 42778086, 45469610, 48637056, 51960817, 55142588, 58461088, 61850642, 65353995, 68614871, 71705887, 74682214, 77585999, 80091805, 82140588, 84008458, 85771047, 87146609, 87666760, 86839692, 84797646, 81574752, 77657132, 72825422, 67776624, 62331291, 56682633, 51163874, 46001518, 41327681, 37149217]
2449C7149217l781603l221970k492426k197491k035011j509278j339128j198265
2441A9374045q84166r33096q19222n30174o46094m50954l42072l79505k46673
2432A4142089k80988l90271k08561j67925k41887N396m0727o9647J61317j9191
2422A2889605j2352P9784P836o527j76061m19599l49241j77079l96796n46896
2412A0892674n25800m13557n33867l12339l43711k28887m40531l43831r7072k54356
2402G398723j76486j57628j06377j93341j16676M1392j65060P8191j31953r685
2392F461100J22498l4341K3453l7848n6042j08678j20826N6474J57566L8287N4065
2381F555708K36849q7582k5797P5677J89108P9712o8217j58854R7207j8037l5201
$$ y = [37149217, 33367614, 30145644, 27653218, 25455727, 23420716, 21911438, 20572310, 19374045, 18489879, 17556783, 16737561, 16207387, 15561293, 15110339, 14768267, 14388762, 14142089, 13861101, 13470830, 13262269, 13094344, 12852457, 12857853, 12817126, 12747479, 12908796, 12889605, 12877253, 12957037, 12964873, 12958346, 12782285, 12362686, 12013445, 11836366, 11439570, 10892674, 10366874, 9953317, 9419450, 9107111, 8763400, 8534513, 8093982, 7750151, 7653079, 7398723, 7222237, 7064609, 6958232, 6764891, 6648215, 6689607, 6524547, 6602738, 6470785, 6461100, 6583598, 6549257, 6572710, 6534862, 6478820, 6370142, 6249316, 6305790, 6463356, 6501643, 6555708, 6792557, 6704975, 6679178, 6754855, 6943963, 7023675, 6955458, 6796604, 6893811, 6875774, 6840573]
2370F840573R6326j30587K0893J71630j39438k16978O286j32476n9278J15073
2360F572024P9169J5074K60492K4007P7127K49651M6530J3103J14239J93584K14560
2349G859560J15157K33098J87173K19669L97521J52507K92899M65326L83112L24768
2339A0630790M66126N65978L99252N80346N93634N94814O41496P04528O49122
2330A5826086P38820Q16915R53862R96885J342341J533412J378281J791238K057145
2321B7434985K119463K272444K737545L391898L379414K515175J671974J559806
2313D7082704J798021J732928J947416K074745K589081K796779L274463L840131
2305F7136268M281765N007104N678172O666395P272579Q449675R775923J1453976
$$ y = [6840573, 6936899, 6806312, 6827205, 6998835, 6859397, 6642419, 6648705, 6516229, 6456951, 6572024, 6651193, 6666267, 6926759, 6950766, 7027893, 7277544, 7324074, 7337177, 7451416, 7645000, 7859560, 7974717, 8207815, 8394988, 8614657, 9012178, 9164685, 9457584, 9922910, 10306022, 10630790, 11096916, 11662894, 12062146, 12642492, 13236126, 13830940, 14472436, 15176964, 15826086, 16564906, 17381821, 18335683, 19332568, 20674909, 22208321, 23586602, 25377840, 27434985, 29554448, 31826892, 34564437, 37956335, 41335749, 43850924, 45522898, 47082704, 48880725, 50613653, 52561069, 54635814, 57224895, 60021674, 63296137, 67136268, 71418033, 76425137, 82103309, 88769704, 96042283, 104491958, 114267881, 125721857]
2297A25721857J3651407J5589111J8008611K2048677K8770308L8991465N2950898
2290C15732334O7091208O8150852L4105979k3588163o0235843o5642087n7164651
2283B78449629m5914800l5659399k7675862k2353918j8778938j5546857j2729577
2276I9790278j0404812q668809p342150o040072n109466m441462l786749l177508
2268E0819250k688590k400598k181480j576146j119025q17399r20104j048223
2260C8067685j735841k288068k238544k074930j876511j582694j279914j278613
2252B3712570j129318r81664r99285r18498r10616q33703n87522n91046n92509
2243A6168409o63706o26967p56862n72188m53438n91182n96567n67264j63380
$$ y = [125721857, 139373264, 154962375, 172970986, 195019663, 223789971, 262781436, 315732334, 382823542, 450974394, 485080373, 461492210, 401256367, 335614280, 278449629, 232534829, 196875430, 169199568, 146845650, 128066712, 112519855, 99790278, 89385466, 80716657, 73374507, 67334435, 62224969, 57783507, 53996758, 50819250, 48130660, 45730062, 43548582, 41972436, 40853411, 40036012, 39115908, 38067685, 36331844, 34043776, 31805232, 29730302, 27853791, 26271097, 24991183, 23712570, 22583252, 21601588, 20602303, 19683805, 18773189, 17939486, 17351964, 16760918, 16168409, 15504703, 14877736, 14120874, 13548686, 13095248, 12504066, 11907499, 11340235, 11176855]
2234A1176855l10420m55269n24770j80698l20110l17512l52302j22015j40942
2225H452817l16436k66725j60067j36601k04566j31118j61123j69039k12667k37564
2215F456911j33025o9633j57219q8175j37149Q673k85516k55000j9739N8904k09243
2204E169789k54187m5230j0450j92649q845j74067k85246J10507q7305r2513m4072
2193D085732j97394L9083n36k00092j0528r0288q5286p8455J5890M0637Q738K9657
2181C557158p3017j1985j62596N2814n0433l814l07444j19837O1293j35259j285
2170B805595m5336o229m0945r820L9137m5825p8597K12877K03663l18229l01230
2159B415061j604m690l6512k27448J08042J72220j22380j1107o5915J60671o2255
$$ y = [11176855, 10866435, 10411166, 9886396, 9705698, 9385588, 9068076, 8715774, 8593759, 8452817, 8136381, 7869656, 7709589, 7572988, 7368422, 7237304, 7076181, 6907142, 6694475, 6456911, 6323886, 6254253, 6097034, 6008859, 5871710, 5880383, 5594867, 5339867, 5320128, 5379032, 5169789, 4915602, 4870372, 4859922, 4667273, 4658428, 4484361, 4199115, 4309622, 4222317, 4129804, 4085732, 3888338, 3927421, 3926885, 3726793, 3716265, 3625977, 3540691, 3462236, 3478126, 3518763, 3527501, 3557158, 3484141, 3472156, 3309560, 3362374, 3311941, 3308127, 3000683, 2880846, 2942139, 2806880, 2805595, 2760259, 2754030, 2713085, 2703265, 2742402, 2696577, 2617980, 2830857, 3034520, 2716291, 2415061, 2413457, 2408767, 2372255, 2144807, 2252849, 2425069, 2302689, 2291582, 2225667, 2386338, 2324083]
2148B324083p3950M5694j91096k0197M0862j97114L6073q8588J1544q285o8130
2137A810896J6661j18950L5299k5179m4689L9589l0881r2342j4591m8536M9386
2126A576663J03187J6762q8337j85485N9779n4788k9626J33012n5156r6297P6384
2115A456098J14889j30304J21583M0520J3814l3479k8977j51191J10371J45833
2105A659157N5730j46796M3955j06273M0678O1566j03716P8325L2564l151Q8789
2094A700828m6642j40984J50618O2974l03n5639l1860K03110O7328r3371R8192
2083A914251J12952R3306P099J32721M39355K84697L82877J12659L1981k16832
2073C295066m41970k03874l61510j95214k01034n9246j29047l4255m7177q0723
$$ y = [2324083, 2250133, 2295827, 2104731, 2084534, 2125396, 1928282, 1964355, 1875767, 1887311, 1879026, 1810896, 1827557, 1708607, 1743906, 1718727, 1674038, 1713627, 1682746, 1590404, 1575813, 1527277, 1576663, 1679850, 1696612, 1608275, 1422790, 1482569, 1427781, 1398155, 1531167, 1476011, 1379714, 1456098, 1570987, 1440683, 1562266, 1602786, 1616600, 1583121, 1554144, 1402953, 1513324, 1659157, 1714887, 1568091, 1612046, 1505773, 1546451, 1608017, 1504301, 1582626, 1615190, 1612039, 1700828, 1654186, 1513202, 1663820, 1726794, 1726491, 1670852, 1638992, 1842102, 1909430, 1816059, 1914251, 2027203, 2120509, 2127608, 2260329, 2699684, 2984381, 3367258, 3479917, 3511898, 3295066, 2853096, 2649222, 2287712, 2092498, 1891464, 1832218, 1703171, 1668916, 1621739, 1541016]
2063A541016j6165R2037j8345k32684k68844j42098L6048J15686j01418J29333
2053A134566J6759j65813J94497q1181Q2105J7474Q685j05106m8213J22961j23629
2042A053105p3314j54499R6885M7176m9052j35423J91489L0235j2316j07753K0736
2031I07269r220r9154K2316M0316J46707r3150q7946m9490q1321L2669l2607Q2707
2019G79096N5184j35212J87641N0211m599j46929M9779K3537r2619J4289m1151
2008G39227k4775K9482o3600J21750L4789l6854j01154j484J5028M0200j19303
1997F33306L2220J13018J08372k77963J56315j242j76955j001J49941L483k5666
1986G13828j11086j83288Q6797J13615L8095n302M2939O2083j8671j18317J14615
$$ y = [1541016, 1524851, 1616888, 1598543, 1365859, 1097015, 954917, 990965, 1106651, 1005233, 1134566, 1151325, 985512, 1180009, 1098828, 1180933, 1198407, 1207092, 1101986, 1053773, 1176734, 1053105, 979791, 825292, 922177, 969353, 920301, 784878, 976367, 1006602, 994286, 886533, 907269, 898049, 798895, 821211, 861527, 1008234, 915084, 827138, 777648, 696327, 728996, 696389, 779096, 834280, 699068, 886709, 936920, 932321, 785392, 835171, 858708, 766089, 780378, 739227, 714452, 743934, 680334, 802084, 836873, 800019, 698865, 697381, 712409, 752609, 633306, 665526, 778544, 886916, 608953, 765268, 764026, 587071, 586070, 736011, 739494, 713828, 602742, 419454, 506251, 619866, 657961, 652659, 695598, 757681, 739010, 620693, 735308]
1975G35308n892k8513j68245R878p920l3895J2014O1806J21100j21930j7069J10412
1963F67054j49397M6205k1793N6333M6552O6451j72917J217M9400m5906j9820
1952E23379P9061l0772m9492J46793J7838j07117p0668K4082O4357q6883J03749
1941F14327Q4351k8489K0885j43945L381j0068L9781J02242j54394P4839J1401
1930F14311j52110J7591P3724n916M1790O0260K6118j9316o0328o0650n6329J73527
1918F52672p4603n0078M8581K7132q4535k3108J01485p1882Q8317j2690P9649
1907F80940k4387p9543j12407J14077l8040j5488k5390k3413q5521M7752K28033
1896F66613j39775k41604J62138q033M7379J68413K724p4178M3040j25474M2577
$$ y = [735308, 729416, 700903, 532658, 542536, 534616, 500721, 512735, 574541, 695641, 573711, 556642, 667054, 517657, 563862, 542069, 598402, 644954, 711405, 538488, 539705, 589105, 543199, 523379, 602440, 571668, 522176, 668969, 686807, 579690, 509022, 533104, 597461, 510578, 614327, 698678, 670189, 691074, 547129, 550510, 540442, 580223, 682465, 528071, 602910, 614311, 462201, 479792, 553516, 547600, 589390, 649650, 675768, 656452, 596124, 535474, 479145, 652672, 578069, 527991, 576572, 603704, 519169, 496061, 597546, 525664, 613981, 601291, 680940, 656553, 577010, 464603, 578680, 540640, 525152, 499762, 476349, 390828, 438580, 666613, 526838, 285234, 447372, 439339, 486718, 655131, 657855, 583677, 626717, 501243, 543820]
1885E43820p9407m857J25569j52862Q8262j05405O6255Q9165j48279M3795J4454
1874D80510r0703J2806j3647Q6777J32255K8994k74735N3920j0540K6959J4913
1863D47509l5625Q3858Q6774j2718j18014Q8338J9145j74571P2536r8161J4742
1852C73813J27048M3078k7492j0765P2640j65464K5889n4350k8661J2592r0109
1841B78219r8660J92524M7942J10176J5762j20778M0429j8711J7999J06267j74911
1830C96258Q4481m2680j54587P4273J23764o908o5256J58412l1245l920j8084
1819E14508P1481k8917p2797R079J62909n5571j0047n1316J11191j42249m6025
1808D62246N346N7878q1470K9660O227K7153O625j1441j8069k6518r5357R3606
$$ y = [543820, 464413, 459556, 585125, 432263, 520525, 415120, 481375, 570540, 422261, 466056, 480510, 389807, 402613, 388966, 475743, 607998, 636992, 362257, 416177, 405637, 432596, 447509, 411884, 495742, 582516, 569798, 451784, 540122, 559267, 384696, 457232, 359071, 373813, 500861, 543939, 516447, 505682, 578322, 412858, 438747, 384397, 355736, 368328, 278219, 179559, 372083, 420025, 530201, 545963, 425185, 465614, 446903, 464902, 571169, 396258, 480739, 438059, 283472, 357745, 481509, 474601, 409345, 567757, 536512, 532592, 514508, 585989, 557072, 484275, 493354, 656263, 600692, 590645, 539329, 650520, 508271, 462246, 467592, 525470, 444000, 473660, 479887, 507040, 513665, 502224, 484155, 457637, 362280, 455886]
1796D55886Q4937L7491j20423P6477k8592k3570O1891L1951R5978j10185q6616
1785D75225J43662n2626M6972Lp1415o0825Q5073k3026L1389L179J01301l6908
1773F42004m0839R6873R6963K07776n4161n9225J16798l093n9006N2345K64436
1762A260871j20737L1058K9526J04427K71316p0147K30271J91742J11449R2519
1752B132295K95582L93022L37596J74885M4937Q8076J27279n7686J60826J89778
1742C886590J22952J86553L78979M35129K14392M25735L64434M70649N99946P77752
1732G863111O70273M52590P04938P88115J374213J499100K314253L227493M812369
1723B3706455P683792R963259p1588p664539p115415n421374m012645l093305
$$ y = [455886, 540823, 578314, 457891, 534368, 505776, 482206, 544097, 576048, 672026, 561841, 475225, 618887, 566261, 613233, 613236, 541821, 480996, 566069, 543043, 574432, 577611, 678912, 642004, 601165, 698038, 795001, 1002777, 948616, 889391, 1006189, 1003096, 944090, 996435, 1260871, 1140134, 1171192, 1200718, 1305145, 1576461, 1506314, 1736585, 1928327, 2039776, 2132295, 2427877, 2820899, 3158495, 3333380, 3378317, 3466393, 3593672, 3535986, 3696812, 3886590, 4009542, 4196095, 4575074, 5010203, 5224595, 5650330, 6014764, 6485413, 7085359, 7863111, 8533384, 8985974, 9690912, 10479027, 11853240, 13352340, 15666593, 18894086, 23706455, 31390247, 41353506, 41281918, 33617379, 26501964, 21080590, 17067945, 13974640]
1715A3974640k160108j771540j240746q23180o56369o43800o42563q07285n39103
1706D689946m30253k23148l12179k61064j82426j03395k19262k20376k19093k15540
1696B303210q0206O7101k51389K2696k9188k48072n5906q4874r2046n4873L438
1685A499891l8956q5739j2880k5610K6442k86177J6803J21623j30923l4262Q9541
1674A139753j50631r3126p2211n6480J29183J96879j29344j57962o3467m9868
1664F92726K5803J13831J2429Q7840j75319m2156j1092j2818L7758r9109q5340
1653E44553n7039l1684J01177r447j11183J4974K3187J05342o2374l6839p7167
1642D03500J31632L5331n4472n515l0883k5546J74936K6667k28623J82792j39388
$$ y = [13974640, 11814532, 10042992, 8802246, 7979066, 7322697, 6678897, 6036334, 5229049, 4689946, 4259693, 4036545, 3724366, 3463302, 3280876, 3177481, 2958219, 2737843, 2518750, 2303210, 2223004, 2290105, 2038716, 2061412, 2032224, 1784152, 1728246, 1643372, 1551326, 1496453, 1499891, 1460935, 1375196, 1362316, 1336706, 1363148, 1076971, 1093774, 1215397, 1084474, 1050212, 1139753, 989122, 895996, 823785, 767305, 896488, 1093367, 964023, 806061, 742594, 692726, 718529, 832360, 844789, 932629, 757310, 715154, 704062, 691244, 729002, 629893, 544553, 487514, 455830, 557007, 547560, 436377, 451351, 474538, 579880, 517506, 480667, 403500, 535132, 570463, 515991, 510476, 479593, 454047, 628983, 655650, 427027, 609819, 470431]
1631D70431j43304L0530J08169l0139r6380P7831m9013L8506j35287l9312Q9952
1620C21984P1839N6620J497M1928L476j13798N6993P8706p0166j7261k15947p6479
1608A39392K09914M9758j40172J00464J60433j53432l6313L7967K5081R9417j22527
1597C69982J71462j59500L7655J18083q5472k0281j35754J06807O2999m5544k8394
1586C92043m1062j6722q7403J26904K2187k6502J485p2462j51055M1636K226J03375
1574B94650Q2489r6840J981o811j14208n381j1248P904J03166J6208J91115p2972
1562C90053K2225m9435j00259K2012N5490o0175j52853Q7103R4406q7634K9887
1551B50820N595J13508r0276j59884J34961n2324K6992o7612o1156O1256J566
$$ y = [470431, 327127, 357657, 465826, 435687, 339307, 417138, 368125, 406631, 271344, 232032, 321984, 393823, 450443, 451940, 493868, 497344, 383546, 440539, 519245, 449079, 431818, 215871, 139392, 349306, 399064, 258892, 359356, 519789, 366357, 330044, 368011, 393092, 492509, 369982, 541444, 381944, 419599, 537682, 452210, 431929, 296175, 402982, 465981, 420437, 392043, 350981, 334259, 246856, 373760, 395947, 369445, 370930, 298468, 147413, 189049, 191275, 294650, 377139, 280299, 282280, 275469, 161261, 155880, 144632, 152536, 255702, 271910, 463025, 390053, 412278, 362843, 262584, 284596, 340086, 279911, 127058, 214161, 308567, 220933, 250820, 256415, 369923, 279647, 119763, 254724, 202400, 229392, 161780, 100624, 161880, 163446]
1540A63446J74139q7661j7185n7851l6827Q5929L2310J0531L9867j3959j16240
1529A76499J88946j69492Q6109m1437K2559O5119O0926j0854n7822J02691N4693
1518D77937q6307q0438m382N8610k9301j54057J54423k9738p6830l0205N509R457
1506B14678M1493j52605L2757Q4327L2126j29594J77712K6654k76785J29707O4027
1495B44497o0197K7675J03931J31620j07663j36791k4571R9955n228j58205J06437
1484B21460l6954q0564k6108M1809K05294L0423j7397o7317O3572k6949m5626
1473B61643r4656J01140J9418r83J6856r2864j48279J28464o847n254l8210O9209
1461B09637N9792j57659J33234r9945j8160k9573J18700P2242j83201L1054n1578
$$ y = [163446, 337585, 249924, 232739, 174888, 138061, 223990, 256300, 266831, 306698, 292739, 176499, 365445, 195953, 282062, 240625, 263184, 328303, 389229, 378375, 320553, 423244, 477937, 391630, 311192, 306810, 365420, 336119, 182062, 336485, 306747, 229917, 199712, 205221, 214678, 256171, 103566, 136323, 220650, 252776, 123182, 300894, 327548, 50763, 180470, 244497, 184300, 211975, 315906, 447526, 339863, 203072, 178501, 278456, 273228, 115023, 221460, 184506, 103942, 77834, 119643, 324937, 355360, 337963, 270646, 334218, 307269, 261643, 166987, 268127, 287545, 286562, 303418, 210554, 62275, 190739, 183892, 178638, 140428, 209637, 269429, 111770, 245004, 145059, 126899, 97326, 216026, 288268, 105067, 136121, 84543]
1450H4543j23549J40727J2830J7078L367m5212L3686N682N279N3521L2698m1912
1438A78738n6201Q9542l2744m6072k4456K0257j618n9238O5617J11432m4523R3355
1426B94089O549j7958N4618j52262j53907J5688M9713R0203N2493j23309K7388
1415A43305J50751L9465j3719P5731k03178j76220Q570l9176J42811k5353r0776
1404A2211J00768l5770J20942o9159N9312j09474j7263Q5675o4933J20385j61327
1393D1367J114J679L9554J61148k46301K5246J42650p8468Q2430J0675j7772L9421
1381B02743k9976j2472n2696J5190J019J1333m0023K8995k827j0837p121K4913
1369A28241R6512K44J20790q58k29609k3716M1654j05060J91278q533o8883j46099
$$ y = [84543, -39006, 101721, 114551, 131629, 134996, 89784, 123470, 129152, 134431, 187952, 220650, 178738, 122537, 212079, 179335, 133263, 108807, 129064, 127446, 68208, 133825, 245257, 200734, 294089, 300638, 282680, 337298, 185036, 31129, 46817, 96530, 186733, 239226, 115917, 143305, 294056, 333521, 319802, 395533, 192355, 16135, 24705, -14471, 128340, 102987, 12211, 112979, 77209, 198151, 128992, 188304, 78830, 61567, 147242, 82309, 202694, 41367, 42481, 44160, 83714, 244862, -1439, 23807, 166457, 87989, 170419, 181094, 163322, 202743, 172767, 160295, 107599, 122789, 123808, 135141, 95118, 124113, 121286, 110449, 103328, 128241, 224753, 224997, 345787, 344929, 115320, 91604, 133258, 28198, 219476, 210943, 142060, -4039]
1357d039J87834R9856j15980Q072p3183P3145j9816p3592j55334m849K15785P7231
1345B15130j23471o251J1246k0363j00343O8446R9902q6574Q8150j36052M6720
1334E6540O9365L2645J36301q0303r6350J24573J9298k33193N2696l5789J17752
1323A63535J7604m1212J5099j6186J4185K2060q7177j02636m5880J13738J31535
1312A84665J5006j40219J05766J29936j44907J1770Q979N9807j31323J01579q1556
1301A19503O878J2251M2989k4700K6195j55648l8639O9407p9253J1841J33400
1290A24224q9909P3372J4618J11358j47787q8374O0440L0317o8928j0933J39947
1279A48345k4418J5315j59L9057j06842J47166L4499l3862o0065l8839J6284k8461
$$ y = [-4039, 183795, 283651, 167671, 175743, 102560, 175705, 155889, 82297, -73037, -77886, 137899, 215130, 91659, 85408, 96654, 76291, -24052, 44394, 144296, 57722, 145872, 9820, 56540, 125905, 158550, 294851, 214548, 118198, 242771, 262069, 28876, 81572, 45783, 163535, 181139, 139927, 155026, 138840, 153025, 175085, 87908, -14728, -60608, 53130, 184665, 199671, 59452, 165218, 295154, 150247, 162017, 170996, 230803, 99480, 201059, 119503, 126381, 138632, 181621, 156921, 183116, 27468, -11171, 58236, -21017, -9176, 124224, 34315, 107687, 122305, 233663, 85876, -2498, 57942, 88259, 19331, 8398, 148345, 123927, 139242, 139083, 178140, 71298, 218464, 252963, 219101, 159036, 120197, 136481, 108020]
1267A08020J52053Q2650k91245j03925J4223P445M8759K6450j1130M3378P2703
1256A49381L1203j6028n0838K9322J43338j09302j15785j27435L4339l654Q9295
1245E3836L0141j6768P321N4171j16463M1902J74747j18821M0106M3987r3696
1234A00463j2609j77180K4243O9004O7291J6463M7904L8502j26044J26526j88991
1223a4428K9040N3456K9690J0026j63140R894J67074l8923l6569j85271O7463
1212g1688l4654R9557J55775p9916P0904j68608j2870J29909J08438r4547J28557
1201B30857r2260m181M6901P0284j02114p367l8192k1639j7255j34169J50309
1190H1174k4377l3726O2242k3183J07378n538q956p2900P1172K1563l9586o31
$$ y = [108020, 260073, 342723, 51478, -52447, -38224, -30779, 17980, 44430, 33300, 76678, 149381, 180584, 164556, 113718, 143040, 286378, 177076, 61291, -66144, -31805, -35459, 53836, 83977, 67209, 74530, 128701, 12238, 54140, 228887, 110066, 150172, 194159, 100463, 87854, -89326, -65083, 3921, 71212, 87675, 135579, 174081, 48037, 174563, -14428, 14612, 68068, 97758, 107784, -55356, -45462, 121612, 82689, 46120, -139151, -71688, -106342, -6785, 148990, 69074, 139978, -28630, -41500, 88409, 196847, 102300, 230857, 138597, 134416, 181317, 251601, 149487, 142120, 103928, 82289, 65034, -69135, 81174, 56797, 23071, 85313, 62130, 169508, 163970, 155014, 82114, 153286, 174849, 135263, 134632]
1178A34632J8309k3417j22828O0308j34Q671j9530P2193p9623M8542p4989J25191
1166A47325l6882j23757J8892J34208L0973N1709j60884N8108m6418p4071J04391
1155A03594O3046l9978n1241Q3496m5985j9438j5995j21885J8377Q9043J29433
1144A92467K7060j07018q2336L8454R8209J9468j2352L4238J6164j90051R2750
1133A27053R6037Q924J9649J650j89415P1742p9400p798N4108J42908k33004j8061
1121e607R7518l5614L8009l5717M2792J32632j26430Q1138r1007l1503j1988O6337
1109A20560l1870j0359L0943o3398m3737o828R9639K7877o9004j14617j9515L5815
1097d4494L3847J03779j2565o9503J64q8175o7447M9560M9437l8349M8742L6203
$$ y = [134632, 152941, 129524, 6696, 67004, 66870, 75541, 56011, 128204, 48581, 97123, 22134, 147325, 110443, -13314, 5578, 139786, 170759, 222468, 61584, 119692, 73274, -797, 103594, 166640, 126662, 75421, 158917, 112932, 93494, 77499, -44386, -26009, 63034, 192467, 219527, 112509, 30173, 68627, 166836, 186304, 173952, 208190, 224354, 34303, 127053, 223090, 232014, 251663, 253313, 63898, 135640, 56240, 48442, 102550, 245458, 12454, -5607, 91911, 56297, 94306, 58589, 101381, 234013, 107583, 188721, 97714, 66211, 54223, 120560, 88690, 78331, 109274, 45876, 2139, -4689, 94950, 122827, 53823, -60794, -80309, -44494, -10647, 93132, 80567, 11064, 11228, -76947, -144394, -94834, -45397, -83746, -35004, 1199]
1085A199j2245M859J08772j8379K1128L4706O3580k33445J37089K060r8826r564
1073I34P4615N3057P520p5559n3022K1743J17657J4021n7967l3567o4681J50155
1061A54906j62685M5790J05763r1800j18792J79553K7683m3041n5160r0960J69576
1050A20833L4484j23833K2854R2536j63687m809m3169Q7667j13586p3299J68166
1039D157Q7993o6699L3097m1108l2737j3724J9775M2143Q4544o1642j2242m0005
1027C552l4031l3071J89875r4145M0906k519p4236J9620Q9344j26582m1216J41515
1015G9012J04292q1945l2815O559m1842J02211l8942j49743R9067j75517Q4231
1004d5432K25173r7716l604l2698k6277O7523j00128q567L3837o4157J09842j6217
$$ y = [1199, -11046, -6187, 102585, 84206, 105334, 140040, 203620, -29825, 107264, 109324, 10498, 934, 75549, 128606, 136126, 60567, 7545, 29288, 146945, 160966, 102999, 69432, 4751, 154906, -7779, 38011, 143774, 51974, -66818, 112735, 140418, 97377, 42217, -48743, 120833, 155317, 31484, 54338, 146874, -16813, -21622, -64791, 22876, -90710, -164009, 4157, 92150, 25451, 58548, 17440, -15297, -29021, -9246, 32897, 117441, 55799, 43557, 3552, -30479, -63550, 126325, 32180, 73086, 70567, -3669, 15951, 105295, -21287, -62503, 79012, 183304, 101359, 68544, 75103, 33261, 135472, 96530, -53213, 45854, -129663, -45432, 179741, 82025, 78421, 45723, 19446, 86969, -13159, -21726, 12111, -52046, 57796, 41579]
992D1579K7386M1472L7431p9745j07199p1355K1108j6456J52475M4147p2285O9696
980H8254m6530l0409P2371j80090P0735m2708M4543J6930n6533L7144J90660o9208
968I5159r1504J6964m1199n7062M5152l5577P6292m2952O2492P380K3662k8575
956C0232j12865k2374m808O2144P0005J04577n1071j30230r003J3409R7700J22033
944A69749j8617J02874k15278L6508J19000r5176j34400J24393Q3176j52310N2824
933G2743j5072m0498o1652M7114j26885J00718P0524j05705j00496J70978r5550
922h3781P4752n1034M6928q6961O1247n080n1705O4743j2993P2645j17028r3606
910a81873N7151O2283M757m1690O4292j17714P7379O1110j10983J06830O5135
$$ y = [41579, 68965, 110437, 147868, 68123, -39076, -110431, -89323, -105779, 46696, 90843, 18558, 88254, 41724, 11315, 83686, -96404, -25669, -68377, -23834, -6904, -63437, -26293, 164367, 95159, 3655, 20619, -20580, -77642, -32490, -68067, 8225, -34727, 27765, 35145, 58807, 30232, -82633, -105007, -109815, -47671, 22334, 126911, 75840, -54390, -63393, -49984, 47716, 169749, 151132, 254006, 38728, 75236, 194236, 99060, -35340, 89053, 172229, 19919, 72743, 57671, 17173, -44479, 2635, -124250, -23532, 46992, -58713, -159209, 11769, -83781, -9029, -60063, -13135, -100096, -38849, -43929, -95634, -30891, -43884, 28761, -88267, -181873, -124722, -62439, -57682, -99372, -35080, -152794, -75415, -14305, -125288, -18458, 46677]
899D6677J26095j66393O4208k9730Q5799J57885j51019j35206n3119K532j297
888e3568k0361J43320o5207K2963K528M1658j07221o4650J55681l2150m0037J23200
876A06156P2944J2400l6947m0642o2040j293J593K20310q7786k4364o4362k06320
864a10351J59923J13484o5622J2502l2650q1595N319n1223j0905P1726M5556n4848
852A316j14944N0849N2773p6589K0076Q1066q1755k1715m2292l6909J9842O8552
840g9730J60652N9455r9277n844J2705j26914M9400M9928r0910O0384j4496R9508
828G4861N8807j81811K9087o9345l6836n6802L5094r571O3028O8773R328m2278
816e7665n950R0359o0135L9211O2543l1743Q6612J681M2236O4274K544k28313
$$ y = [46677, 172772, 6379, 70587, 40857, 126656, 284541, 133522, -1684, -54803, -52271, -53568, -73929, 69391, 4184, 27147, 29675, 71333, -35888, -100538, 55143, 22993, -17044, 106156, 179100, 191500, 154553, 113911, 51871, 50578, 52171, 272481, 184695, 160331, 95969, -110351, 49572, 163056, 97434, 109936, 77286, -4309, 1010, -50213, -61118, 10608, 56164, 1316, -113628, -62779, -10006, -86595, -66519, 14547, -67208, -88923, -131215, -168124, -148282, -79730, 80922, 140377, 41100, 35256, 47961, -78953, -29553, 20375, -70535, -10151, -24647, 74861, 133668, -48143, -19056, -88401, -125237, -182039, -146945, -156516, -93488, -24715, -15387, -57665, -63615, 26744, -33391, 5820, 68363, 36620, 123232, 124913, 167149, 231423, 233967, 5654]
804E654j35320o0234R883j3017r7571J13484R5303M6439O1755l2634o6998J0771
792f2485J42720n5202k0160j2461j86559Q1613J59668J7807n5051p3070K910J26863
780F6593N250R7892j74871m0242j24303N8859L3315M2245o0074J66371j00748
769b9713J57722k5741L6556o8901k3069J01764l586m9670n1930P5433j1933n0052
757E6880k65529J37690J69373j9731r363j64810k2720J34138j25331J0540O7752
746c1111o8080J6544K9178Q0972K7012o4073m6485q6565J36768p5070p2681P5448
734g8143J37807j42048L8561n9852P1491n8802J45917j6912j39469K3187J0420
723f7843P0463O3848j38194o9297p1367o3531J95396J92634p1256k12646Q4627
$$ y = [5654, -129666, -189900, -180017, -193034, -290605, -177121, -81818, -35379, 26376, -6258, -73256, -62485, 80235, 25033, 4873, -7588, -194147, -112534, 47134, 64941, 9890, -63180, -60270, 66593, 71843, 169735, -5136, -45378, -169681, -110822, -77507, -35262, -95336, 71035, -29713, 128009, 102268, 138824, 69923, 46854, 148618, 145032, 95362, 43432, 118865, 106932, 56880, -208649, -70959, 98414, 78683, 69320, -95490, -118210, 15928, -109403, -98863, -31111, -99191, -82647, -53469, 27503, 54515, -9558, -56043, -142608, -5840, -80910, -153591, -78143, 59664, -82384, -43823, -103675, -32184, -90986, 54931, 38019, -101450, -78263, -67843, 2620, 66468, -71726, -141023, -212390, -275921, -80525, 112109, 40853, -171793, -87166]
712h7166L6856J3961m7897n3057n229J19883r9811N0254J58328n9104P5650j38717
700c6049l9635r1142N5824O6736J1635m5581n908N7265P1832j1824q2943L0706
688a9084r604q0332j8021j7004Q0515P5217m8892K2643J12787M8601l1457m7087
676F8282j20345J0381P0427m8666Q6497o0421j26389J59758R7486o7103O3551
665A33458l0271k61813M5399J23080k9101J67427o3323K3005j05152j51568J40285
654h574M4158m9716K2658k1880j07896r1802O4025J32450j8430r877Q7394J50301
642A92811j40504j23519q8518n4535J0078R067k1265k3435O7947K04823k9639
631C311m6148j79991Q1553J04972j5960L1575J8927n3939P0601K9578r8957Q1104
$$ y = [-87166, -50310, -36349, -84246, -137303, -142532, -22649, -122460, -72206, 86122, 27018, 102668, -36049, -75684, -166826, -111002, -44266, -32631, -78212, -84120, -26855, 44977, 33153, -49790, -19084, -28688, -109020, -127041, -144045, -63530, 11687, -37205, -14562, 98225, 146826, 115369, 68282, -52063, -41682, 28745, -19921, 66576, 6155, -120234, 39524, 137010, 69907, 133458, 103187, -158626, -113227, 9853, -19248, 148179, 84856, 107861, 2709, -148859, -8574, 35584, -14132, 8526, -13354, -121250, -213052, -149027, -16577, -35007, -44884, 42510, 192811, 52307, -71212, -159730, -214265, -204187, -195120, -216385, -239820, -171873, 32950, 3311, -42837, -222828, -141275, -36303, -52263, -20688, -1761, -55700, 14901, 44479, -54478, 26626]
619B6626q1441l641K5321j24587l742n8956J18244R3737P668P742j48363J6690
607a24702O8120l0317L3326J8944J37984O4159j77317p4531Q7006J09731o109
596A06294j51414n0168J71633j20817r6644J27777r7003m6025R8110P8917r8627
585g7967j39155P7224Q1482j03139M8100M2337R0057L4173p3882j5424R7325J3139
573G4270j17433j7344m1699P8539j31533J52689q889K7026m2398l6505l8982J0666
561i1593P0111j2910O9265K8967n5552k8219j6242J32672j62453J33017K6800
550I3863k31140J00966o7472M7143K2072n6199j14131l3815K35125M5468j20973
539g9093l2529O2704O8481j6567K8707J9294M2319O9965j41871o7425J42387k39241
$$ y = [26626, -54815, -58456, -33135, -157722, -161464, -220420, -102176, -8439, -771, 6971, -141392, -124702, -56582, -86899, -53573, -34629, 103355, 167514, -9803, -84334, 2672, 112403, 106294, -45120, -95288, 76345, -44472, -141116, -13339, -110342, -156367, -58257, 20660, -77967, -217122, -139898, -58416, -161555, -113455, -71118, 18939, 53112, -20770, -36194, 61131, 74270, -43163, -60507, -102206, -23667, -155200, -2511, -11400, 15626, -26772, -63277, -102259, -91593, -21482, -34392, 34873, 63840, 8288, -19931, -36173, 96499, -65954, 67063, 93863, -137277, -36311, -103783, -56640, -34568, -90767, -204898, -238713, -3588, 41880, -79093, -111622, -48918, 19563, 2996, 31703, 50997, 93316, 163281, 21410, -46015, 96372, -142869]
527a42869l284j00155P9115P1846J19964l3991n6223L2251k6219N3111M2710j62620
515a26364N7738J51079p1100o4076j6070J3236N8868j25287J5499R4063L7613
504B5199P8379K562j43824r1461q4302Q6927j41765J26943R0211P033k7371l7249
492a08718K1166N69J02567L9464m1628j7073l654N4290L6904J3909j38292l9716
480h0212N7166q2039r4754J35484J23711k38545J5656J80402k0646n168L933q7808
468i2820O833L7120j98758K7389J56826P2564P4262k48121N074Q4743Q4929j90795
456a80754Q4769K3766N2075n0354p668l3437J2815J01758j2554l6037q0205j31412
444b57238J72127n3550O0109O5140k0170m5081j820M264n29o2955J96603O3501
$$ y = [-142869, -146153, -246308, -167193, -95347, 24617, -9374, -65597, -33346, -59565, -6454, 36256, -126364, -68626, 82453, 11353, -52723, -68793, -55557, 3311, -121976, -106477, -12414, 25199, 103578, 106140, -37684, -129145, -213447, -126520, -268285, -141342, -51131, -44098, -71469, -108718, -87552, -86983, 15584, 55048, 13420, -3653, -7307, 46983, 83887, 97796, -40496, -80212, -23046, -105085, -199839, -64355, 59356, -179189, -163533, 16869, -3777, -8945, -5012, -92820, -85987, -48867, -247625, -220236, -63410, 9154, 83416, -164705, -159631, -74888, 10041, -180754, -95985, -72219, -20144, -70498, -78166, -111603, -98788, 2970, -9584, -45621, -125826, -257238, -85111, -138661, -78552, -13412, -33582, -78663, -80483, -76219, -76748, -139703, 56900, 120401]
432A20401j45164q5862q8180M7675R2357r9849M4885O4544Q7252k02605O3301
421a01245o5386l2294k1587M2494N3693j92654J88559J06110j08737o3333j450
410a95830P1951J07583r3043P6428j24515j86060J63206n1202L2328J05111m0452
399a34495j7346R2426J00033O2565L4821j98762l133k05020j0532J19792R2188
388f7463L1963j21494m1300J2372K7097N7913J9736L6923q0176P5915P5711j82457
376a55260m9522K30735O1347L7741j23055p9006O0503P9918k91736j5884R9311
365a44908N3314J803J05452j38097j24685J94675Q5220l0856k0434N3691j17809
354h2634m3197O0439J601l579m5353P5604k4815J12002n8158j96541J20715J4293
$$ y = [120401, -24763, -110625, -198805, -151130, -58773, -158622, -113737, -49193, 38059, -164546, -101245, -166631, -198925, -220512, -178018, -124325, -316979, -128420, -22310, -131047, -194380, -195830, -123879, -16296, -109339, -32911, -157426, -343486, -180280, -231482, -199154, -94043, -134495, -151841, -59415, 40618, 103183, 138004, -60758, -63891, -268911, -279443, -159651, -67463, -35500, -156994, -198294, -185922, -158825, -100912, -81176, -44253, -124429, -48514, 27197, -155260, -204782, 25953, 87300, 125041, 1986, -77020, -16517, 63401, -228335, -244219, -144908, -91594, -89791, 15661, -122436, -247121, -52446, 32774, 1918, -18516, 35175, -82634, -125831, -65392, -63791, -67370, -112723, -37119, -61934, 50068, -8090, -204631, -83916, -69623]
342f9623r1484L9986J6784J08030j43605l322R576o7176J23232p6891n8830J3939
330a99384R3914J03921j16112N3336J15888o3884j12457j31455P5414L7973j447
319a44293L9797l3469p6496P8392J76140k1487j08631J947N9333K5044j23122
308a26845n7255m0508K16539j55458r4827R8084j20232q661o0892p44J09746N7665
296a83388L9066n1669j16178R3473O2771L2526n0844Q2091J7004j98531O3633
285b10046K6986L6439L5311P8277k860r3592R1446J01561o6060q2445O0352p6660
273a01291R1065M3630k39106R7439M9897K4898m7710J34974r3430N7390m6524
262b8768j47481o5488o318Q6460p7131J9539Q8560N7711N3477K997O780m5899
$$ y = [-69623, -161107, -121121, -104337, 3693, -139912, -143234, -133658, -200834, -77602, -154493, -213323, -199384, -105470, -1549, -117661, -64325, 51563, -12321, -124778, -256233, -180819, -142846, -144293, -104496, -137965, -214461, -136069, 40071, 18584, -90047, -88100, -28767, -3723, -126845, -184100, -224608, -8069, -163527, -258354, -160270, -280502, -289163, -350055, -350799, -241053, -183388, -144322, -195991, -312169, -218696, -155925, -123399, -174243, -92152, -75148, -273679, -210046, -183060, -146621, -111310, -33033, -35893, -129485, -38039, 63522, -2538, -84983, -24631, -101291, -10226, 33404, -205702, -108263, -58366, -33468, -81178, 53796, -39634, 17756, -28768, -176249, -241737, -248055, -161595, -238726, -219187, -130627, -72916, -19439, -16442, -9662, -55561]
250e5561l6847P128J19627o5614k33815j1198R3092k3476J4442n0840Q7262P7759
238g8041m1148N9381p0934r0176M5642p4016J08966O4824N8874l7284L0360P747
226a5805m7661O9548j21342O3833m7163j8183n5175j1764J00828r5083O9752M491
214a03724j22276M1915l9642J37650j29750J01785N565L589r0417K6428L8491
203a30386L7647K7311K0868L2509L0221l24252J10956K7984N0986N8893n1922
192a09185J13643L9512j02584l528j3786j92364r843J6350n3948Q0686K60936
181B5889l8442j71973p9478O6504M7458J1706m7487q4343R8650L4890J4545M6965
169g5116N9108j06342l3777J02924m5645R90j02902K6059K1889J05839L7499j1870
$$ y = [-55561, -92408, -85280, 34347, -31267, -265082, -276280, -183188, -206664, -192222, -243062, -155800, -78041, -119189, -59808, -130742, -220918, -175276, -249292, -140326, -75502, -16628, -53912, -23552, -15805, -63466, 6082, -115260, -51427, -98590, -116773, -171948, -183712, -82884, -177967, -108215, -103724, -226000, -184085, -223727, -86077, -215827, -114042, -108477, -104888, -195305, -168877, -130386, -92739, -65428, -44560, -12051, 18170, -306082, -195126, -167142, -116156, -57263, -109185, 4458, 43970, -58614, -62142, -75928, -268292, -278135, -261785, -315733, -235047, 25889, -12553, -184526, -264004, -197500, -150042, -138336, -185823, -270166, -171516, -136626, -122081, -75116, -16008, -122350, -156127, -53203, -98848, -97858, -200760, -174701, -152812, -46973, -9474, -21344]
157b1344j72454K6891J8427L5938M1146j6986m3612o387J2614j2830O5020j02306
145a75883M8778m132K7749Q6485j04462O5338p2572J9234m9568K3689j5877l7282
133a88503p519M8941O0752l0232l4122J0457L8754j14241r928m3289M6514m1282
121b63698j2282J80818j21214J41797m6516m7031K7798J46915n139q2747k8452
110a09751R54j2216P6069L3056l7658k0709j07557O6185k9185p1475K9042Q6698
98i6547j1655K5283j42232p1669Q5289l6536J44752n2725N5650k0583n1910K7505
86a45378j51778J38396J42751r6037r2415Q6493N0920p4926o9555m1270M656k5028
74b73171o744J48760k0347l0693J1319K2990o5047P1113j604k5981o1899p6761
$$ y = [-21344, -193798, -166907, -148480, -112542, -71396, -88382, -131994, -138381, -125767, -138597, -73577, -175883, -127105, -131237, -103488, -17003, -121465, -56127, -128699, -109465, -159033, -135344, -151221, -188503, -196022, -147081, -86329, -116561, -150683, -140226, -101472, -215713, -225641, -268930, -222416, -263698, -275980, -95162, -216376, -74579, -121095, -168126, -140328, 6587, 1448, -81299, -109751, -108797, -121013, -44944, -11888, -49546, -70255, -177812, -111627, -140812, -212287, -183245, -96547, -108202, -82919, -225151, -296820, -211531, -248067, -103315, -156040, -100390, -120973, -172883, -145378, -297156, -158760, -16009, -112046, -204461, -117968, -67048, -141974, -211529, -252799, -248143, -273171, -279915, -131155, -151502, -182195, -170876, -147886, -212933, -141820, -143424, -169405, -231304, -308065]
62c08065L9069K4008J11658L3671r4958P9895Q6949j078j4593J3839o0626l7170
50a27401p2897R6124n0067J487K8549k0115M1365M6531q4504J4417J9091l3774
38a41194m7597N3645m721m5572M9692l4372n396K8819R296K6248p6245k1512o0561
25b69470j1273J27081L8502l0145j24499N3256L6419l1011N5445P2161p3849M29
13a56954O538J3218P5538J4620j7799M9414j04283j32191J04986k0732m8511n1209
1b67365R1083
0a76282
$$ y = [-308065, -268996, -244988, -133330, -99659, -194617, -114722, -27773, -28851, -43444, -29605, -90231, -127401, -200298, -104174, -154241, -152754, -124205, -144320, -102955, -56424, -140928, -126511, -107420, -141194, -188791, -135146, -139867, -185439, -135747, -170119, -175515, -146696, -137400, -111152, -187397, -208909, -269470, -280743, -153662, -115160, -145305, -269804, -216548, -180129, -211140, -155695, -83534, -157383, -156954, -150416, -137198, -61660, -47040, -64839, -15425, -119708, -251899, -146913, -167645, -216156, -267365, -176282]
$$ Imaginary data points
##PAGE= N=2
##DATA TABLE= (X++(I..I)), XYDATA
16383a965819J53966l8835M5681J0866q4845N0623N7858O7386o0340Q8753m9853
16372a724559l1763N8732N5106P5579N1186j47439P1773N3458l1532J13142l6103
16361a492420r3870J41575J4533J3540M3490Q3591m7747k2177J66517r957r9732
16350a302657K3987N327L2733P722O9885j2596Q2953j4104n0983n421Q8231M9340
16338a025583q2457O8379J7074P6833p0679j437J09564R7723N389J9284p3511
16327h59421N9289l1592J7701Q1800M8418p3390N636L3552j6867M5681O4341L9020
16315e85832j895l2077J63007j24011m3205P0275m3937J23527Q1515j02P0276
16304c22459p2502m4161O9895o1535O3048J61108n7966j09010j7641J36184J22864
$$ y = [-1965819, -1811853, -1850688, -1805007, -1794141, -1878986, -1828363, -1770505, -1703119, -1763459, -1674706, -1724559, -1756322, -1697590, -1642484, -1566905, -1515719, -1663158, -1591385, -1537927, -1569459, -1456317, -1492420, -1586290, -1444715, -1430182, -1416642, -1373152, -1289561, -1337308, -1359485, -1192968, -1202925, -1302657, -1278670, -1273343, -1240610, -1232888, -1163003, -1175599, -1092646, -1106750, -1157733, -1163154, -1074923, -1025583, -1108040, -1039661, -1022587, -945754, -1016433, -1017870, -908306, -810583, -805194, -785910, -859421, -800132, -831724, -814023, -732223, -683805, -757195, -751559, -718007, -734874, -689193, -624852, -585832, -587727, -619804, -456797, -580808, -624013, -553738, -597675, -474148, -392633, -392735, -322459, -394961, -439122, -369227, -430762, -367714, -206606, -264572, -373582, -391223, -255039, -132175]
16293a32175j41838M8326L5480Q13L2147L0221Q1539N3047j39637o1467R3545
16282i9999o6839O6737M0461N3872N1238n7142P5706l0949k8845O4557P3651l7496
16270A04952n0845O6962M4757j7538J01053m6533m9718o2326J13320q6268J47354
16259B65170O0021m1757k9869N6586M3225l3392l6196J9013R7530M5998p8896
16248C67433O2384n9645o2978J5761N0283M6455O6353M4205k0860r7289L3872
16237D45974n9073n9614K17610R9209J2863j26291M8413L1710o8770K1322L5176
16226E98529o3614J18622q4150l0369L8598P222k5310J2336P0220J85464j43756
16215F83792K68j31098J27382N0070J323P2204K9719o6783j33436J50724L9549
$$ y = [-132175, -274013, -225687, -190207, -189394, -157247, -127026, -45487, 7560, -132077, -193544, -99999, -166838, -100101, -59640, -5768, 45470, -11672, 64034, 33085, 4240, 68797, 142448, 104952, 54107, 121069, 165826, 148288, 249341, 202808, 153090, 90764, 204084, 117816, 265170, 325191, 283434, 253565, 310151, 353376, 319984, 283788, 302801, 400331, 446329, 367433, 429817, 370172, 307194, 322955, 373238, 419693, 486046, 530251, 509391, 412102, 445974, 386901, 327287, 544897, 644106, 656969, 530678, 579091, 610801, 542031, 563353, 598529, 534915, 653537, 569387, 539018, 577616, 584838, 559528, 571864, 642084, 827548, 683792, 684060, 552962, 680344, 730414, 731737, 803941, 833660, 766877, 633441, 784165, 823714]
16204H23714P1809j848Q0829P9081k26444Q3306o8706j65762J5406J74114J3416
16193H78915j28086P3830R7337J27748n7693o9493J25032q0895J19455j53954
16183I32196M0754K8827L2583J7651L1117o7142k16916K23117K93r878O8542J0212
16171A091356j15363m1836J15087J8243M8318j03254j03572J55229r4621n5630
16161I13957J30041R6064k48284L4726M3420q0994J14584J89675j5228N5201K6677
16150A259839K4557l7290k2152N6515n7540j22015O1036L7321j10977n230P7594
16139A161658k0074q547N595J82392k27629O07J29898q5717m489L9628q2147j7923
16127A073252q0422Q4667L0708J76311M1448j53780P656K2903j8176n2221Q5633
$$ y = [823714, 895523, 893675, 974504, 1053585, 827141, 910447, 841741, 675979, 691385, 865499, 878915, 750829, 824659, 921996, 1049744, 992051, 922558, 1047590, 966695, 1086150, 932196, 972950, 1001777, 1034360, 1052011, 1083128, 1015986, 799070, 1022187, 1022480, 1012602, 1081144, 1091356, 975993, 934157, 1049244, 1067487, 1115805, 1012551, 908979, 1064208, 969587, 913957, 1043998, 1140062, 891778, 926504, 969924, 888930, 1003514, 1193189, 1177961, 1233162, 1259839, 1284396, 1247106, 1224954, 1281469, 1223929, 1101914, 1162950, 1200271, 1089294, 1084064, 1161658, 1141584, 1133037, 1138632, 1321024, 1093395, 1094002, 1223900, 1138183, 1133694, 1173322, 1091175, 1073252, 992830, 1077497, 1108205, 1284516, 1325964, 1172184, 1179840, 1202743, 1184567, 1132346, 1217979]
16116A217979M9381J17038j29261r6535J65613r3803L2182q8836r21m0398K4112
16105A156551O8402n2572J57549j2618j00254P0813N7269n5870k3938j04378O8506
16094A229460K747J1066p8686j3009N7029M9112O6688M0028q500q6786n6995J05251
16082A317405n2689r1655J66392M8061p8180R5k6001m6308O2105j17435Q1101
16071A262891R5837p7989Q2927j24985J08641N9553j58661O9632l5931m5803J117
16060A237229k5007L5243J39522J00882q1407p2610O8701o4415j37209J65668
16050A366597m0140j04293m4043J39805m676k4444p4524j8436Q4669O7499o8185
16039A279829r7247J15057J31228J0397L2968o7944j51680N6315J14721m6542
$$ y = [1217979, 1267360, 1384398, 1255137, 1158602, 1324215, 1230412, 1262594, 1173758, 1172837, 1132439, 1156551, 1224953, 1172381, 1329930, 1317312, 1217058, 1287871, 1345140, 1289270, 1265332, 1160954, 1229460, 1232207, 1243273, 1164587, 1151578, 1208607, 1257719, 1324407, 1364435, 1355935, 1269149, 1212154, 1317405, 1264716, 1173061, 1339453, 1387514, 1309334, 1309429, 1283428, 1237120, 1299225, 1181790, 1262891, 1358728, 1280739, 1363666, 1238681, 1347322, 1406875, 1248214, 1317846, 1281915, 1236112, 1237229, 1212222, 1247465, 1386987, 1487869, 1406462, 1333852, 1402553, 1338138, 1200929, 1366597, 1326457, 1222164, 1178121, 1317926, 1313250, 1288806, 1214282, 1195846, 1280515, 1348014, 1279829, 1182582, 1297639, 1428867, 1439264, 1472232, 1404288, 1252608, 1308923, 1423644, 1377102]
16029A377102j01071L2109l8419N6974l445P3145p7444o3149M0236N3040J30828
16018A479906j94542l3067P1487R4659l0906r8512m866M3403J6139L6688k267
16007A378122N1855j08861N4409J914K5521M9405M0726j209j37934J1908J24396
15996A490252n3318O1037o6742q2910k9272J82407j47988r1433J95590R0755j91441
15985A356937K2628m7135M7700O6545j62586n2802J08781l1404K3696P7554j05478
15974A304436m6522M4000R6846j28142J11996J15573j4919j05983r7145M7878
15964A328018M8882l1009L0237q3330J5681m7562R4150J61625j61936j218M8808
15953A402346j47758J13605r5163P4521Q0971j6173o5445M1675K2930k4757L6179
$$ y = [1377102, 1276031, 1308140, 1269721, 1326695, 1323250, 1396395, 1318951, 1255802, 1296038, 1349078, 1479906, 1285364, 1252297, 1323784, 1418443, 1387537, 1289025, 1284159, 1327562, 1343701, 1380389, 1378122, 1429977, 1321116, 1375525, 1377439, 1402960, 1452365, 1493091, 1491882, 1353948, 1365856, 1490252, 1436934, 1497971, 1431229, 1348319, 1319047, 1501454, 1353466, 1262033, 1457623, 1548378, 1356937, 1379565, 1332430, 1380130, 1446675, 1284089, 1231287, 1340068, 1308664, 1332360, 1409914, 1304436, 1257914, 1301914, 1398760, 1270618, 1382614, 1498187, 1483268, 1377285, 1280140, 1328018, 1376900, 1345891, 1376128, 1292798, 1308479, 1260917, 1355067, 1516692, 1354756, 1353538, 1402346, 1254588, 1368193, 1273030, 1347551, 1428522, 1412349, 1346904, 1388579, 1411509, 1386752, 1422931]
15942A422931k7219N0637j34204j68330J65294J2993n440j6574J39814K6650n3583
15931A412969j36805M8697P4581p5306O9703M1768n6370j49864p1403Q7742K9673
15920A275385R5858L1527J28562p8181Q5960o9932J80581k58219l1451M4209J17968
15909A522267k3134k3122m5772l4407Q76M1789k4250l9226O4969r5437R4508p7962
15897A361099L7912K8964Q4850m4799m5334p8391P1796L2460L7873j01906j39493
15886A245031J95698q4613m1129L6193j05742K84334o5792K6497j36571k8709
15876A325197k292N3147P948R907N9965P82l8105r1803n7144J26844j54706j3453
15864A226287J29326P2459j27797J13784j10403M0144N3545m1672n3285k8539
$$ y = [1422931, 1395712, 1446349, 1312145, 1143815, 1309109, 1322102, 1316662, 1300088, 1439902, 1466552, 1412969, 1276164, 1324861, 1399442, 1324136, 1393839, 1435607, 1379237, 1229373, 1157970, 1245712, 1275385, 1371243, 1402770, 1531332, 1453151, 1539111, 1469179, 1649760, 1391541, 1360090, 1404299, 1522267, 1499133, 1476011, 1430239, 1395832, 1396708, 1438497, 1414247, 1375021, 1439990, 1344553, 1439061, 1361099, 1399011, 1427975, 1512825, 1468026, 1422692, 1344301, 1416097, 1448557, 1486430, 1384524, 1245031, 1440729, 1356116, 1314987, 1351180, 1245438, 1529772, 1463980, 1490477, 1353906, 1325197, 1322905, 1376052, 1384000, 1393907, 1453872, 1454654, 1416549, 1324746, 1267602, 1394446, 1239740, 1226287, 1355613, 1428072, 1300275, 1414059, 1303656, 1343800, 1397345, 1355673, 1302388, 1273849]
15854A273849J22004j07852M7723j27756n9218J20845P7416k6314O337m4191K7955
15843A310798j02318n4125J61911J17795Q0437J2936j38683L2816j64958J14432
15833A371041Q6873o7847N1995l2361o9897L1255J64048j48564r6023J56481M4952
15822A491953l3229j04308l9770K6409k0171R9140M6151r5333r4273R7491J12357
15811A486417j39284O715J12873J3163Q322j27611O4041K3404j19119L3332n0015
15800A312238K9503O875l107k7128o0301K6224K0103N9155j10142J00508Q9587
15789A443515p283q3225O946n692p0755q857K13743L1385m0322n4450n9873j01123
15777A264009J71621N7795r5172L0927k4444n9588L8279r2894k2610R1124J7970
$$ y = [1273849, 1395853, 1288001, 1335724, 1207968, 1148750, 1269595, 1347011, 1320697, 1327034, 1282843, 1310798, 1208480, 1154355, 1316266, 1434061, 1514498, 1527434, 1388751, 1421567, 1256609, 1371041, 1457914, 1390067, 1442062, 1409701, 1339804, 1371059, 1535107, 1386543, 1290520, 1447001, 1491953, 1458724, 1354416, 1314646, 1341055, 1320884, 1420024, 1466175, 1370842, 1276569, 1374060, 1486417, 1347133, 1353848, 1466721, 1479884, 1488206, 1360595, 1424636, 1448040, 1328921, 1362253, 1312238, 1341741, 1348616, 1345509, 1318381, 1258080, 1284304, 1304407, 1363562, 1253420, 1353928, 1443515, 1436232, 1353007, 1359953, 1354261, 1283506, 1274649, 1488392, 1519777, 1479455, 1425005, 1365132, 1264009, 1435630, 1493425, 1398253, 1429180, 1404736, 1345148, 1383427, 1290533, 1267923, 1359047, 1377017]
15766A377017r2076O2953L7350l7084p2617J36430k0750j40724J95279r4283N3128
15755A404623q0660L3146o2426R7474Q4356K5464l5257k5403j29798K4994R2044
15744A428557n2314Q9010q2477l2956O1257j45428K06674j29344J2682m3353n2423
15733A259885J59440r5355L1184k7220j47176N0091K54982N2730q5162K3802r021
15722A468180j38191k8951J3136J11489J61493k25229m9535J04017l711J225j34582
15711A279341P03P8282Q8692j96347j13296L9736K19529n6263q1324j4127R8345
15700A343271J26607n8791n4613p6567q3861L5316J53232M2102K5929r5277J17095
15689A474443j940j42454j4452O48N5892P9561l1220Q3931j38124k1195Q8327
$$ y = [1377017, 1284941, 1347894, 1385244, 1348160, 1275543, 1411973, 1391223, 1250499, 1445778, 1351495, 1404623, 1323963, 1357109, 1294683, 1392157, 1476513, 1501977, 1466720, 1441317, 1311519, 1336513, 1428557, 1376243, 1465253, 1382776, 1349820, 1411077, 1265649, 1472323, 1342979, 1355661, 1312308, 1259885, 1419325, 1323970, 1355154, 1327934, 1180758, 1230849, 1485831, 1538561, 1453399, 1477201, 1468180, 1329989, 1301038, 1314174, 1425663, 1587156, 1361927, 1312392, 1416409, 1412698, 1413923, 1279341, 1280044, 1358326, 1447018, 1250671, 1137375, 1177111, 1396640, 1340377, 1259053, 1244926, 1343271, 1469878, 1411087, 1356474, 1279907, 1196046, 1231362, 1384594, 1426696, 1452625, 1357348, 1474443, 1472503, 1330049, 1315597, 1316245, 1372137, 1451698, 1420478, 1504409, 1366285, 1345090, 1433417]
15678A433417o9429J6146P8575J082n0139O3704k2703M8993j70226M2069j84182
15667A187307J84001L4633l3411J12325j03967J8521o9591J18463q1324j34771
15657A232186L2348N99Q9872K7277J08643J2771R739r3642q1121j7578p4431M4498
15645A291161j2868J5969k5987J30197r0748n3852J5702K2582J42825l4807l2910
15634A367264J2654J0973r7698O8777j0329o4531j27398J16740J86387N71o8900
15623A394510j17242J29805R8150k0706j81255J49155k3175n0103j1404J12287
15613A480022k05430j8240K1534J05927k8043Q8384P0861O6612j31389j18612
15603A331626o8153K43182j65222j67904J49480l711O0433m6910j065M8264L9486
$$ y = [1433417, 1363988, 1380134, 1458709, 1459791, 1409652, 1473356, 1450653, 1499646, 1329420, 1371489, 1187307, 1371308, 1405941, 1372530, 1484855, 1380888, 1399409, 1329818, 1448281, 1366957, 1232186, 1264534, 1265133, 1355005, 1382282, 1490925, 1503696, 1513435, 1419793, 1338672, 1321094, 1246663, 1291161, 1278293, 1294262, 1268275, 1398472, 1307724, 1253872, 1269574, 1292156, 1434981, 1400174, 1367264, 1379918, 1390891, 1293193, 1361970, 1351641, 1287110, 1159712, 1276452, 1462839, 1463410, 1394510, 1277268, 1407073, 1505223, 1484517, 1303262, 1452417, 1429242, 1379139, 1367735, 1480022, 1274592, 1256352, 1277886, 1383813, 1355770, 1444154, 1515015, 1581627, 1450238, 1331626, 1263473, 1506655, 1341433, 1173529, 1323009, 1319298, 1379731, 1332821, 1331756, 1380020, 1419506]
15592A419506N877J0590j9710K4418n8514J8325o0908J76483j3037j06812r7219
15581A298999P1887O1985l1145j02095N9190j5066k8964P846q564n7872P2468
15570A328669N2928L6532M8125J5655j35878N4249j02972R8647m9726k23204J52982
15559A276007O5869Q2007j0200J2648K5990p0764m8020J38168n6880K775m1082
15548A376518n1588q6661l8518K30411p7025P2729k20299l0140K28748j4703R0826
15537A480298o8585q9742R0390j15486J2039K4655O8126N7260o2180j0955j05032
15526A280788J10455j01887l3726N1059J30451l9237N7219j00339r1321L20806
15516A584268K5010j54189j84215N5965J7923J49220m6425l5370j06040O5044
$$ y = [1419506, 1425383, 1435973, 1416263, 1440681, 1382167, 1400492, 1339584, 1516067, 1503030, 1396218, 1298999, 1370886, 1432871, 1401726, 1299631, 1358821, 1343755, 1314791, 1322637, 1314073, 1256201, 1328669, 1381597, 1418129, 1466254, 1481909, 1346031, 1400280, 1297308, 1395955, 1346229, 1123025, 1276007, 1341876, 1423883, 1413683, 1426331, 1452321, 1381557, 1333537, 1471705, 1414825, 1417600, 1376518, 1324930, 1238269, 1199751, 1430162, 1353137, 1425866, 1205567, 1175427, 1404175, 1389472, 1480298, 1411713, 1321971, 1412361, 1296875, 1308914, 1333569, 1401695, 1458955, 1396775, 1385820, 1280788, 1391243, 1289356, 1255630, 1306689, 1437140, 1397903, 1455122, 1354783, 1263462, 1584268, 1609278, 1455089, 1270874, 1326839, 1344762, 1493982, 1447557, 1412187, 1306147, 1371191]
15506A371191m545j8006R7337o9281j2943m422P2045j01019Q0363l1133p7251
15495A302336N190j3877J99674k92q8279L3959j49693J33258R2553j93941J80028
$$ y = [1371191, 1366646, 1348640, 1445977, 1376696, 1363753, 1359331, 1431376, 1330357, 1410720, 1379587, 1302336, 1307526, 1293649, 1493323, 1493031, 1404752, 1438711, 1289018, 1422276, 1514829, 1320888, 1500916]
$$ [...]
##END NTUPLES=NMR SPECTRUM
##END=
