##TITLE=1H_EC-3330(32)-x
 CDCl3
 8 sc, 
 3.9.2024
##JCAMPDX= 6.0         $$ Bruker NMR JCAMP-DX V2.0
##DATA TYPE= NMR SPECTRUM
##DATA CLASS= NTUPLES
##ORIGIN= UXNMR, Bruker Analytische Messtechnik GmbH
##OWNER= root
$$ XWIN-NMR		Version 3.5
$$ Tue Sep  3 13:50:08 2024 Russian Standard Time (UT+4h)  she@DPX200
##.OBSERVE FREQUENCY= 200.1318
##.OBSERVE NUCLEUS= ^1H
##.ACQUISITION MODE= SIMULTANEOUS
##.ACQUISITION SCHEME= undefined
##.AVERAGES= 8
##.DIGITISER RES= 18
##SPECTROMETER/DATA SYSTEM= spect
##.PULSE SEQUENCE= zg30
##.SOLVENT NAME= DMSO
##.SHIFT REFERENCE= (INTERNAL, DMSO, 0, 21.0017)
##AUDIT TRAIL= $$ (NUMBER, WHEN, WHO, WHERE, WHAT)
$$ ##TITLE= Audit trail, XWIN-NMR		Version 3.5
$$ ##JCAMPDX= 5.01
$$ ##ORIGIN= Bruker BioSpin GmbH
$$ ##OWNER= she
$$ F:/spectra/data/she/nmr/H-F/1/pdata/1/auditp.txt
$$ ##AUDIT TRAIL=  $$ (NUMBER, WHEN, WHO, WHERE, WHAT)
(   1,<2024-09-03 13:48:42.29 +0400>,<she>,<DPX200>,
      <created by zg, POWCHK disabled, PULCHK disabled
       configuration hash MD5:
       00 E9 B6 7A A2 85 ED C7 34 08 36 98 17 FE 4E 26
       data hash MD5: 16K
       81 F3 87 04 A6 5B 95 9E 3C 72 FE 69 C8 31 52 6B>)
(   2,<2024-09-03 13:48:44.56 +0400>,<she>,<DPX200>,
      <Start of raw data processing
       efp BC_mod = 2 LB = 0.24 FT_mod = 6 PKNL = 1 PHC0 = -25994.79 PHC1 = 13.38748 SI = 16K 
       data hash MD5: 16K
       E3 94 F1 D9 C8 86 DB C8 8E CB 3E 56 3A FA 7F E6>)
(   3,<2024-09-03 13:49:08.84 +0400>,<she>,<DPX200>,
      <pk PHC0 = 1.383226 PHC1 = -0.8 
       data hash MD5: 16K
       F1 E3 45 27 A5 54 A5 12 5B E0 C7 8E 9F 84 DA E4>)
(   4,<2024-09-03 13:49:15.03 +0400>,<she>,<DPX200>,
      <abs ABSG = 5 
       data hash MD5: 16K
       34 04 42 14 15 04 82 CB 16 C5 34 E8 74 CF C3 18>)
$$ ##END=
$$ 
$$ hash MD5
$$ 12 48 12 7D 9C FC 5D 94 B8 E0 DC 9E 12 D7 0A C8
##$RELAX= 
##$RELAX= 
##$RELAX= 
##$RELAX= 
##$RELAX= 
##$RELAX= 
$$ Bruker specific parameters
$$ --------------------------
##$DU= <F:/spectra>
##$EXPNO= 1
##$NAME= <H-F>
##$PROCNO= 1
##$TYPE= <nmr>
##$USER= <she>
##$AMP= (0..31)
100 100 100 100 100 100 100 100 100 100 100 100 100 100 100 100 100 100 
100 100 100 100 100 100 100 100 100 100 100 100 100 100 
##$AQSEQ= 0
##$AQ_mod= 1
##$AUNM= <au_zg>
##$AUTOPOS= <>
##$BF1= 200.13
##$BF2= 200.13
##$BF3= 200.13
##$BF4= 200.13
##$BF5= 200.13
##$BF6= 200.13
##$BF7= 200.13
##$BF8= 200.13
##$BYTORDA= 1
##$CFDGTYP= 0
##$CFRGTYP= 5
##$CHEMSTR= <none>
##$CNST= (0..31)
1 1 145 1 1 1 1 1 1 1 1 1 1 1 1 1 1 1 1 1 1 1 1 1 1 1 1 1 1 1 1 1 
##$CPDPRG= <>
##$CPDPRG1= <>
##$CPDPRG2= <>
##$CPDPRG3= <>
##$CPDPRG4= <mlev>
##$CPDPRG5= <mlev>
##$CPDPRG6= <mlev>
##$CPDPRG7= <mlev>
##$CPDPRG8= <mlev>
##$CPDPRGB= <>
##$CPDPRGT= <>
##$D= (0..31)
0 1.2 0 0 0 0 0 0 0 0.06 0 0.03 0 0 0 0 0.0002 0 0 0 0 0 0 0 0 0 0 0 0 
0 0 0 
##$DATE= 1725356921
##$DBL= (0..7)
120 120 120 120 120 120 120 120 
##$DBP= (0..7)
150 150 150 150 150 150 150 150 
##$DBP07= 0
##$DBPNAM0= <>
##$DBPNAM1= <>
##$DBPNAM2= <>
##$DBPNAM3= <>
##$DBPNAM4= <>
$$ [...]
##$SUBNAM3= <"">
##$SUBNAM4= <"">
##$SUBNAM5= <"">
##$SUBNAM6= <"">
##$SUBNAM7= <"">
##$SUBNAM8= <"">
##$SUBNAM9= <"">
##$SW= 24.0689170037331
##$SWIBOX= (0..15)
0 0 2 0 0 0 0 0 0 0 0 0 0 0 0 0 
##$SW_h= 4816.95568400771
##$TD= 16384
##$TD0= 1
##$TE= 0
##$TE2= 300
##$TE3= 300
##$TEG= 300
##$TL= (0..7)
0 120 120 120 120 120 120 120 
##$TP= (0..7)
150 150 150 150 150 150 150 150 
##$TP07= 0
##$TPNAME0= <>
##$TPNAME1= <>
##$TPNAME2= <>
##$TPNAME3= <>
##$TPNAME4= <>
##$TPNAME5= <>
##$TPNAME6= <>
##$TPNAME7= <>
##$TPOAL= (0..7)
0.5 0.5 0.5 0.5 0.5 0.5 0.5 0.5 
##$TPOFFS= (0..7)
0 0 0 0 0 0 0 0 
##$TUNHIN= 0
##$TUNHOUT= 0
##$TUNXOUT= 0
##$USERA1= <user>
##$USERA2= <user>
##$USERA3= <user>
##$USERA4= <user>
##$USERA5= <user>
##$V9= 5
##$VALIST= <valist>
##$VCLIST= <CCCCCCCCCCCCCCC>
##$VD= 0
##$VDLIST= <DDDDDDDDDDDDDDD>
##$VPLIST= <PPPPPPPPPPPPPPP>
##$VTLIST= <TTTTTTTTTTTTTTT>
##$WBST= 1024
##$WBSW= 4
##$XGAIN= (0..3)
0 0 0 0 
##$XL= 0
##$YL= 0
##$YMAX_a= 416221
##$YMIN_a= -416933
##$ZGOPTNS= <>
##$ZL1= 120
##$ZL2= 120
##$ZL3= 120
##$ZL4= 120
##$ABSF1= 20.99145
##$ABSF2= -3.077682
##$ABSG= 5
##$ABSL= 3
##$ALPHA= 0
##$AQORDER= 0
##$ASSFAC= 0
##$ASSFACI= 0
##$ASSFACX= 0
##$ASSWID= 0
##$AUNMP= <proc_1d>
##$AZFE= 0.1
##$AZFW= 0.1
##$BCFW= 0
##$BC_mod= 2
##$BYTORDP= 0
##$COROFFS= 0
##$CY= -3
##$DATMOD= 1
##$DC= 0
##$DFILT= <>
##$DTYPP= 0
##$F1P= 0
##$F2P= 0
##$FCOR= 1
##$FTSIZE= 16384
##$FT_mod= 6
##$GAMMA= 0
##$GB= 0
##$INTBC= 1
##$INTSCL= 3.70164e-10
##$ISEN= 128
##$LB= 0.24
##$LEV0= 0
##$LPBIN= 0
##$MAXI= 10000
##$MC2= 0
##$MEAN= 0
##$ME_mod= 0
##$MI= 1.114404
##$NCOEF= 0
##$NC_proc= -6
##$NLEV= 6
##$NOISF1= 3.799351
##$NOISF2= 2.8
##$NSP= 0
##$NTH_PI= 0
##$NZP= 0
##$OFFSET= 21.00173
##$PC= 1
##$PHC0= -25993.41
##$PHC1= 12.58748
##$PH_mod= 1
##$PKNL= yes
##$PPARMOD= 0
##$PSCAL= 0
##$PSIGN= 0
##$REVERSE= no
##$SF= 200.1300054026
##$SI= 16384
##$SIGF1= 3
##$SIGF2= 2
##$SINO= 5.538805
##$SIOLD= 16384
##$SREGLST= <1H.CDCl3>
##$SSB= 0
##$STSI= 16384
##$STSR= 0
##$SW_p= 4816.95568400771
##$SYMM= 0
##$S_DEV= 0
##$TDeff= 16384
##$TDoff= 0
##$TI= <>
##$TILT= no
##$TM1= 0
##$TM2= 0
##$TOPLEV= 0
##$USERP1= <user>
##$USERP2= <user>
##$USERP3= <user>
##$USERP4= <user>
##$USERP5= <user>
##$WDW= 1
##$XDIM= 16384
##$YMAX_p= 465338852
##$YMIN_p= -271403
$$ End of Bruker specific parameters
$$ ---------------------------------
##NTUPLES= NMR SPECTRUM
##VAR_NAME=  FREQUENCY,     SPECTRUM/REAL,   SPECTRUM/IMAG
##SYMBOL=    X,             R,               I
##VAR_TYPE=  INDEPENDENT,   DEPENDENT,       DEPENDENT
##VAR_FORM=  AFFN,          ASDF,            ASDF
##VAR_DIM=   16384,         16384,           16384
##UNITS=     HZ,            ARBITRARY UNITS, ARBITRARY UNITS
##FACTOR=    0.29402158847633, 1,            1
##FIRST=     4203.07633140142, 0,            0
##LAST=      -613.879352606295, 0,           0
##MIN=       -613.879352606295, -271403,     0
##MAX=       4203.07633140142, 465338852,    0
$$ Real data points
##PAGE= N=1
##DATA TABLE= (X++(R..R)), XYDATA
$$ [...]
$$ plain form
6006 -8511 -79141 -18855 62730 5051 -37206 -48015 -31064 -114675 -220600 -179083 -156064 -64188
5994 -64188 -101787 -210333 -192691 -124814 -181955 -82994 28719 -41596 -127533 -62617 -47916
5983 -47916 -131566 -129267 -105647 -106502 -127328 -123489 -126215 -143970 -102761 -83293 -75595 -5476 -9762
5970 -9762 -21257 -99157 -98778 -70958 -13722 -57564 -27830 3629 -58151 -106295 -47306 -38326 -144088
5957 -144088 -87577 33276 -60124 -12107 -14430 -23150 -72315 -31564 -129298 -46987 14991 -62721
5945 -62721 43345 -47232 -115878 -28956 -56349 -13548 3038 -922 -91350 -65474 -95619 -88567
5933 -88567 7816 -39401 86103 3448 -55527 11676 -28877 34576 66953 -78077 -57082
5922 -57082 -85552 -107800 -38952 -34692 -36108 -83060 -103213 -62819 -103875 -59970 -166032 -193316
$$ packed form
6006h511p0630O0286Q1585n7679m2257j0809J6951q3611j05925M1517K3019R1876
5994f4188l7599j08546J7642O7877n7141R8961J11713p0315q5937O4916J4701
5983d7916q3650K299K3620q55k0826L839k726j7755M1209J9468P698P0119m286
5970i762j1495p7900L79K7820N7236m3842K9734L1459o1780m8144N8989Q980j05762
5957a44088N6511J20853r3400M8017k323q720m9165M0751r7734Q2311O1978p7712
5945f2721J06066r0577o8646Q6922k7393M2801J6586l960r0428K5876l0145P052
5933h8567R6383m7217J25504q2655n8975O7203m0553O3453L2377j45030K0995
5922e7082k8470k2248O8848M260j416m6952k0153M0394m1056M3905j06062k7284
$$ plain form
5910 -193316 -45914 -11001 -57521 -46171 -116763 -79832 -90435 -168022 -160534 -179171 -94662 -54215
5898 -54215 -26048 -102400 -149560 -162551 -40045 -52060 -61640 -78351 -87847 -33920 -64686 -92248
5886 -92248 -32935 110451 68469 116089 10288 -91729 -149173 -6737 -15137 -74207 -9790
5875 -9790 46552 -32708 8669 1454 -75860 -74627 -120054 -63480 -75813 -67404 -43923 -68258 1440
5862 1440 47679 66188 42110 44146 -17562 -14805 1114 -21407 -49411 -37715 -47716 -34842
5850 -34842 -105164 -75034 -33871 -6725 62140 58331 38135 -16686 -72499 -58769 -3774 -23398
5838 -23398 18015 103299 76473 66948 2410 -71956 -47061 -90982 -62995 11873 94033 92586
5826 92586 93625 -399 7377 -44072 -107014 -82678 -83556 3615 -46212 26118 -5388 -88003 8640
$$ packed form
5910a93316J47402L4913m6520J1350p0592L6931j0603p7587P488j8637Q4509M0447
5898e4215K8167p6352m7160j2991J22506j2015r580j6711r496N3927l0766k7562
5886i2248N9313J43386m1982M7620j05801j02017n7444J42436q400n9070O4417
5875i790N6342p9260M1377p215p7314J233m5427N6574j2333Q409K3481k4335O9698
5862A440M6239J8509k4078K036o1708K757J5919k2521k8004J1696j0001J2874
5850c4842p0322L0130M1163K7146O8865l809k0196n4821n5813J3730N4995j9624
5838b3398M1413Q5284k6826r525o4538p4366K4895m3921K7987P4868Q2160j447
5826I2586J039r4024P776n1449o2942K4336q78Q7171m9827P2330l1506q2615R6643
$$ plain form
5813 8640 -10654 -77409 13928 -51894 -44968 -34318 -176401 -188030 -77100 -3587 -80023 -141051
5801 -141051 -106128 53370 80633 24647 -38944 -14657 -90131 32691 -26799 -137591 -105913
5790 -105913 6320 102462 96657 -54652 -30295 2008 -56914 -22336 -11774 269 -35973
5779 -35973 -6730 75480 -19599 -23587 -13763 22074 7324 20305 72593 138852 62345 42665
5767 42665 74355 -67305 -59432 -27635 -13713 26703 58846 8491 21021 -75167 -4601 53519
5755 53519 -111518 80903 95236 56004 32703 60501 37455 4835 33985 -57654 33096
5744 33096 -5065 57789 127174 65223 96372 54922 -40274 102411 68696 -22227 5547 3242
5732 3242 21495 72325 63199 122720 211995 242957 152528 148959 184176 100564 72527 53215
$$ packed form
5813H640j9294o6755R1337o5822O926J0650j42083j1629J10930P3513p6436o1028
5801a41051L4923J59498K7263n5986o3591K4287p5474J22822n9490j10792L1678
5790a05913J12233R6142n805j51309K4357L2303n8922L4578J0562J2043l6242
5779c5973K9243Q2210r5079l988R824L5837j4750J2981N2288O6259p6507j9680
5767D2665L1690j41660P873L1797J3922M0416L2143n0355J2530r6188P0566N8120
5755E3519j65037J92421J4333l9232k3301K7798k3046l2620K9150r1639R0750
5744C3096l8161O2854O9385o1951L1149m1450r5196J42685l3715r0923K7774k305
5732C242J8253N0830r126N9521Q9275L0962r0429l569L5217q3612k8037j9312
$$ plain form
5720 53215 31668 64449 8525 44537 53043 19888 139108 -12703 7467 128770 51269
5709 51269 -101 93657 150775 202970 116707 62545 187445 68302 74662 49490 79769 117559
5697 117559 160115 95096 53143 95811 11296 73005 75315 -404 -93755 -136686 21817 127991
5685 127991 120800 29859 23839 102185 -12720 -10765 -66341 -94478 -35922 -120107 -24622 -52843
5673 -52843 -61154 48711 -1466 -16521 -73440 5715 33622 -64229 33739 73222 124837 40869
5661 40869 -40789 51493 128081 138726 143064 83129 27022 -60684 -6665 -63754 -28434 77857
5649 77857 63673 -20960 -34397 31338 -38719 -8318 -44673 101093 172719 114977 7065
5638 7065 34354 76538 144101 18673 -38368 -28796 -28187 -136875 -72442 -13329 56479 73706
$$ packed form
5720E3215k1547L2781n5924L6012Q506l3155J19220j51811K0170J21303p7501
5709E1269n1370R3758N7118N2195q6263n4162J24900j19143O360k5172L0279L7790
5697A17559M2556o5019m1953M2668q4515O1709K310p5719r3351m2931J58503J06174
5685A27991p191r0941o020P8346j14905J955n5576k8137N8556q4185R5485k8221
5673e2843q311J09865n0177j5055n6919P9155K7907r7851R7968L9483N1615q3968
5661D0869q1658R2282P6588J0645M338n9935n6107q7706N4019n7089L5320J06291
5649G7857j4184q4633j3437O5735p0057L0401l6355J45766P1626n7742j07912
5638G065K7289M2184O7563j25428n7041R572O09j08688O4433N9113O9808J7227
$$ plain form
5626 73706 42246 -128066 -96793 -74132 -90784 -36544 15125 97071 37595 82042 -9251 53754
5614 53754 21512 28198 44517 -1752 -83859 -7942 14946 75652 103180 193849 278071 404347
5602 404347 331195 291009 196246 217290 180173 86385 143589 201966 152333 122900 97070 25937
5590 25937 92918 72362 -5266 63345 -43895 38771 3189 97922 68043 92895 105537 75223
5578 75223 480 -41330 -53145 -137041 -19713 -96044 112301 31031 -1158 -28952 67287
5567 67287 38072 16078 50211 12115 -18170 10552 36032 49933 23985 103077 149484 1636
5555 1636 -74096 120410 91962 40504 89942 22435 59379 -11124 -22759 10571 43683 1479
5543 1479 -22420 56838 -34724 -65744 -54953 -2962 98678 36904 59222 39578 43332 99577
$$ packed form
5626G3706l1460j70312L1273K2661j6652N4240N1669Q1946n9476M4447r1293O3005
5614E3754l2242O686J6319m6269q2107P5917K2888O0706K7528R0669Q4222J26276
5602D04347p3152m0186r4763K1044l7117r3788N7204N8377m9633k9433k5830p1133
5590B5937O6981k0556p7628O8611j07240Q2666l5582R4733k9879K4852J2642l0314
5578G5223p4743m1810j1815q3896J17328p6331K08345q1270l2189k7794R6239
5567F7287k9215k1994L4133l8096l0285K8722K5480J3901k5948P9092M6407j47848
5555A636p5732J94506k8448n1458M9438o7507L6944p0503j1635L3330L3112m2204
5543A479k3899P9258r1562l1020J0791N1991J01640o1774K2318j9644L754N6245
$$ plain form
5531 99577 -16214 -83395 17154 104390 26604 47777 38429 97674 23016 -36752 -51615 -41578
5519 -41578 26204 -76171 -26396 52379 16279 -15448 -64838 18240 53455 19682 -33338 -69359
5507 -69359 -15930 50072 3410 19600 70549 47135 62532 32493 149267 173275 -32292
5496 -32292 -102590 -120743 -69546 -23708 20219 4415 -59435 79625 86375 73955 23991 -123544
5484 -123544 -37373 14715 121324 98923 23994 27992 103302 102729 40094 -6360 -30373 46821
5472 46821 32749 8957 -67952 -7212 49916 -6889 30011 64993 44769 61518 134664 192218
5460 192218 146489 135161 471 4941 61338 116403 48132 97861 141389 176817 168791 225333
5448 225333 133615 -31816 -85658 -12696 205813 187330 30577 -10838 -34755 98843 128436
$$ packed form
5531I9577j15791o7181J00549Q7236p7786K1173r348N9245p4658n9768j4863J0037
5519d1578O7782j02375M9775P8775l6100l1727m9390Q3078L5215l3773n3020l6021
5507f9359N3429O6002m6662J6190N0949k3414J5397l0039J16774K4008k05567
5496c2292p0298j8153N1197M5838M3927j5804o3850J39060O750j2420m9964j47535
5484a23544Q6171N2088J06609k2401p4929L998P5310n73o2635m6454k4013P7194
5472D6821j4072k3792p6909O0740N7128n6805L6900L4982k0224J6749P3146N7554
5460A92218m5729j1328j34690M470N6397N5065o8271M9729M3528L5428q026N6542
5448B25333r1718j65431n3842P2962K18509j8483j56753m1415k3917J33598K9593
$$ plain form
5437 128436 88642 188994 188206 201633 216894 234637 93359 91497 71430 93055 228669 194021
5425 194021 290248 225836 146446 236258 194167 137702 127578 210068 155967 265482 332147
5414 332147 347087 324237 272093 314701 242472 293820 338527 286433 273459 320256 275472 342319
5402 342319 370676 419409 426925 585100 477016 465237 611564 532213 456088 444774 432264
5391 432264 510035 516568 496607 407397 519958 586696 457308 454488 570822 673043 589030
5380 589030 598150 583107 564215 394725 569962 399255 484529 466198 428020 532650 553572
5369 553572 568339 526658 528447 641997 563615 552637 470834 397854 396214 490317 484350 519394
5357 519394 467028 388654 456693 411057 398591 409856 436918 432803 327168 403911 462957 335020
$$ packed form
5437A28436l9794J00352p88J3427J5261J7743j41278j862k0067K1625J35614l4648
5425A94021R6227o4412p9390Q9812m2091n6465j0124Q2490n4101J09515O6665
5414C32147J4940k2850n2144M2608p2229N1348M4707n2094j2974M6797m4784O6847
5402C42319K8357M8733P516J58175j08084j1779J46327p9351p6125j1314j2510
5391D32264P7771O533j9961q9210J12561O6738j29388k820J16334J02221q4013
5380E89030R120j5043j8892j69490J75237j70707Q5274j8331l8178J04630K0922
5369E53572J4767m1681J789J13550p8382j0978q1803p2980j640R4103n967L5044
5357E19394n2366p8374O8039m5636j2466J1265K7062m115j05635P6743N9046j27937
$$ plain form
5345 335020 348880 218113 295808 267096 388323 376606 363196 351263 350275 320573 300153 336305
5333 336305 299253 306852 382555 308798 220307 315894 278002 341098 330161 378299 258651 268888
5321 268888 313474 385179 450851 267151 309811 398119 388741 250932 212108 215729 366369
5310 366369 323939 305417 407591 304267 270501 397940 332189 255198 298632 344747 317814
5299 317814 299214 186299 237950 402046 383077 368306 286383 188791 225998 242908 217166
5288 217166 214803 332564 299409 286310 390677 492237 400534 290172 284177 380416 370246
5277 370246 310112 306494 300827 242669 369918 353089 381626 373139 356791 430316 385073 469669
5265 469669 447336 475525 521463 548650 540163 499153 355207 326651 321840 292453 343437 492175
$$ packed form
5345C35020J3860j30767P7695k8712J21227j1717j3410j1933r88k9702k0420L6152
5333C36305l7052P599P5703p3757q8491R5587l7892O3096j0937M8138j19648J0237
5321B68888M4586P1705O5672j83700M2660Q8308r378j37809l8824L621J50640
5310C66369m2430j8522J02174j03324l3766J27439o5751p6991M3434M6115k6933
5299C17814j8600j12915N1651J64096j8969j4771q1923r7592L7207J6910k5742
5288B17166k363J17761l3155j3099J04367J01560r1703j10362n995R6239j0170
5277C70246o0134l618n667n8158J27249j6829K8537q487j6348P3525m5243Q4596
5265D69669k2333K8189M5938K7187q487m1010j43946k8556m811k9387N0984J48738
$$ plain form
5253 492175 559144 497484 525863 487216 594166 635494 536962 597376 624527 502060 424106
5242 424106 472191 506377 618696 512663 429166 434475 535765 593048 668216 595567 531474
5231 531474 505288 643683 587360 552068 665943 641646 672554 604579 745079 771833 788757
5220 788757 687324 670241 837995 824556 739102 801540 741204 804825 907565 937834 956555
5209 956555 985172 926252 991235 910214 908389 1039510 1112902 1036767 988980 1076038 1043130 1243007
5197 1243007 1214203 1241731 1310138 1322873 1255015 1309940 1404241 1486068 1489742 1555786 1523603 1658555
5185 1658555 1773857 1771711 1836824 1883402 1813372 1898506 2015002 1992817 2054828 2138685 2114866
5174 2114866 2231598 2256053 2283178 2371149 2584482 2599006 2605599 2766662 2908372 2947906 3150678
$$ packed form
5253D92175O6969o1660K8379l8647J06950M1328r8532O0414K7151j22467p7954
5242D24106M8085L4186J12319j06033q3497N309J01290N7283P5168p2649o4093
5231E31474k6186J38395n6323l5292J13875k4297L0908o7975J40500K6754J6924
5220G88757j01433j7083J67754j3439q5454O2438o0336O3621J02740L0269J8721
5209I56555K8617n8920O4983q1021j825J31121P3392p6135m7787Q7058l2908J99877
5197A243007k8804K7528O8407J2735o7858N4925R4301Q1827L674O6044l2183J34952
5185A658555J15302k146O5113M6578p0030Q5134J16496k2185O2011Q3857k3819
5174B114866J16732K4455K7125Q7971K13333J4524O593J61063J41710L9534K02772
$$ plain form
5163 3150678 3203643 3307866 3484044 3515157 3560409 3688571 3740499 3746121 3911595 3988302 4166105
5152 4166105 4103308 4235459 4478892 4474999 4678165 4763415 4867363 4982694 5203379 5433861
5142 5433861 5394791 5491982 5543709 5635044 5848808 5902367 5931267 6022754 6100995 6313765 6412431
5131 6412431 6604091 6674251 6842390 7053239 7251694 7387762 7602290 7920112 8062910 8239853
5121 8239853 8483851 8701538 8984965 9301642 9507442 9776111 10084908 10418501 10717397 11030971
5111 11030971 11493254 11853041 12219350 12581424 12992670 13531368 13900406 14268369 14666315
5102 14666315 15039116 15468456 15869961 16177521 16493859 16781716 17128879 17453643 17640827
5093 17640827 17873289 18105634 18445785 18667461 18741517 18781347 18764275 18778176 18786048 18699306 18618228
$$ packed form
5163C150678N2965J04223J76178L1113M5252J28162N1928N622J65474P6707J77803
5152D166105o2797J32151K43433l893K03166Q5250J03948J15331K20685K30482
5142E433861l9070R7191N1727R1335K13764N3559K8900R1487P8241K12770R8666
5131F412431J91660P0160J68139K10849J98455J36068K14528L17822J42798J76943
5121H239853K43998K17687K83427L16677K05800K68669L08797L33593K98896L13574
5111A1030971M62283L59787L66309L62074M11246N38698L69038L67963L97946
5102A4666315L72801M29340M01505L07560L16338K87857L47163L24764J87184
5093A7640827K32462K32345L40151K21676P4056L9830j7072J3901P872q6742q1078
$$ plain form
5082 18618228 18400506 18101162 17654558 17456804 17165970 16703971 16225611 15831359 15359750
5073 15359750 15007467 14623808 14174182 13519921 13093981 12758584 12292051 11730906 11336062
5064 11336062 11000584 10551797 10069789 9692534 9244165 8909909 8437092 8018877 7727857
5055 7727857 7484826 7257954 6958546 6611526 6232392 6097935 5828209 5681532 5446653 5269428
5045 5269428 5082156 4821143 4693378 4527674 4405778 4217308 4110344 3908077 3779961 3619578
5035 3619578 3495224 3484754 3335975 3252930 3143905 2999285 3005863 2932671 2811450 2704820
5025 2704820 2644878 2600823 2530259 2504057 2351891 2225864 2137664 2149266 2074783 2136082 2087668
5014 2087668 2007537 1863965 1831631 1782931 1715406 1782636 1853590 1764339 1612658 1628149 1566391
$$ packed form
5082A8618228k17722k99344m46604j97754k90834m61999m78360l94252m71609
5073A5359750l52283l83659m49626o54261m25940l35397m66533n61145l94844
5064A1336062l35478m48787m82008l77255m48369l34256m72817m18215k91020
5055G727857k43031k26872k99408l47020l79134j34457k69726j46677k34879j77225
5045E269428j87272k61013j27765j65704j21896j88470j06964k02267j28116j60383
5035C619578j24354j0470j48779q3045j09025j44620O578p3192j21221j06630
5025B704820n9942m4055p0564k6202j52166j26027q8200J1602p4483O1299m8414
5014B087668q0131j43572l2334m8700o7525O7230P0954q9251j51681J5491o1758
$$ plain form
5003 1566391 1635481 1653245 1503689 1663669 1561361 1481419 1328656 1352557 1367829 1283731 1379549
4992 1379549 1409097 1266512 1203301 1240648 1250473 1199321 1254402 1249904 1192655 1084270 1045073
4981 1045073 1013989 1016018 1118114 1132340 1128891 1079965 1078564 1133559 1015625 944584 958126 998094
4969 998094 828463 924269 929538 926821 937320 903034 842208 923600 984613 863430 855740 921615
4957 921615 1004557 942666 913567 912307 946442 1020100 906897 900702 894166 863821 878046 829338
4945 829338 869424 951632 912065 788653 716978 789723 815734 811768 795670 717850 830935
4934 830935 860285 875175 789567 836154 817369 891670 894706 782901 814477 731647 736284 806434
4922 806434 917879 799081 890401 773219 758836 823631 836454 920735 780316 848672 823442
$$ packed form
5003A566391O9090J7764j49556J59980j02308p9942j52763K3901J5272q4098R5818
4992A379549K9548j42585o3211L7347R825n1152N5081m498n7249j08385l9197
4981A045073l1084K029J02096J4226l449m8926j401N4995j17934p1041J3542L9968
4969I98094j69631R5806N269k717J0499l4286o0826Q1392O1013j21183p690O5875
4957I21615Q2942o1891k9099j260L4135P3658j13203o195o536l0345J4225m8708
4945H29338M0086Q2208l9567j23412p1675P2745K6011l966j6098p7820J13085
4934H30935K9350J4890q5608M6587j8785P4301L036j11805L1576q2830M637P0150
4922H06434J11445j18798R1320j17182j4383O4795J2823Q4281j40419O8356k5230
$$ plain form
4911 823442 811912 850883 892495 878026 788387 865766 907329 800289 818487 816580 849212 866288
4899 866288 821929 764965 839757 773667 774523 811188 864669 829338 828731 733944 830768 912135
4887 912135 946885 1002679 941246 906645 862124 883024 1020158 898659 967469 971708 1036436
4876 1036436 1063739 1040983 947988 988465 851101 979397 954722 990763 983940 1009356 1033797
4865 1033797 903245 977296 964681 1039674 1022223 989821 1079558 1224325 1152522 1164701 1176603
4854 1176603 1224467 1223143 1150392 1205004 1256071 1181339 1245029 1229314 1312978 1282087 1288937 1347694
4842 1347694 1258444 1210003 1279349 1315912 1306220 1328808 1281161 1312267 1336222 1357052 1383747 1409393
4830 1409393 1378757 1460377 1465626 1438869 1458334 1435578 1516347 1459700 1588659 1532099 1454130
$$ packed form
4911H23442j1530L8971M1612j4469q9639P7379M1563j07040J8198j907L2632J7076
4899H66288m4359n6964P4792o6090Q56L6665N3481l5331o07r4787R6824Q1367
4887I12135L4750N5794o1433l4601m4521K0900J37134j21499O8810M239O4728
4876A036436K7303k2756r2995M0477j37364J28296k4675L6041o823K5416K4441
4865A033797j30552P4051j2615P4993j7451l2402Q9737J44767p1803J2179J1902
4854A176603M7864j324p2751N4612N1067p4732O3690j5715Q3664l0891O850N8757
4842A347694q9250m8441O9346L6563r692K2588m7647L1106K3955K0830K6695K5646
4830A409393l0636Q1620N249k6757J9465k2756Q0769n6647J28959n6560p7969
$$ plain form
4819 1454130 1465369 1544990 1594256 1671602 1613109 1622285 1695631 1722131 1795248 1687419 1641592
4808 1641592 1798012 1813088 2003918 1943316 1825604 1919411 1999809 2008710 1974731 2012997 1965871
4797 1965871 2070226 2097023 2175637 2200517 2204113 2299262 2405728 2437643 2302632 2445057 2516437
4786 2516437 2522445 2474571 2430888 2568489 2703164 2736152 2603597 2834533 2916293 2972532 2980371
4775 2980371 2947856 3144527 3180476 3318530 3347984 3433247 3529534 3647657 3616825 3708297 3816888
4764 3816888 3786152 4066882 4254376 4419580 4450703 4542159 4691879 4873036 5060672 5185087
4754 5185087 5314465 5442439 5532966 5770096 5953189 6006798 6053901 6331407 6428796 6568725
4744 6568725 6742907 6962228 7301314 7372037 7539361 7844537 7986635 8181120 8440630 8778318
$$ packed form
4819A454130J1239P9621M9266P7346n8493R176P3346K6500P3117j07829m5827
4808A641592J56420J5076J90830o0602j17712R3807Q0398Q901l3979L8266m7126
4797A965871J04355K6797P8614K4880L596R5149J06466L1915j35011J42425P1380
4786B516437O008m7874m3683J37601J34675L2988j32555K30936Q1760N6239P839
4775B980371l2515J96671L5949J38054K9454Q5263R6287J18123l0832R1472J08591
4764C816888l0736K80730J87494J65204L1123R1456J49720J81157J87636J24415
4754E185087J29378J27974R0527K37130J83093N3609M7103K77506R7389J39929
4744F568725J74182K19321L39086P0723J67324L05176J42098J94485K59510L37688
$$ plain form
4734 8778318 8936473 8988843 9316982 9577418 9864264 10054372 10281546 10593255 11055204 11315507
4724 11315507 11468157 11722231 12135256 12429486 12737866 12975691 13359402 13737097 14113542
4715 14113542 14529120 14961925 15361149 15659482 16039668 16341035 16675730 17038710 17302711
4706 17302711 17724282 18037075 18361267 18706576 18985552 19212225 19497287 19699957 19755950 19975464
4696 19975464 20227807 20291709 20379754 20542104 20550438 20464889 20371600 20326395 20102541 19942331 19848047
4685 19848047 19628174 19311936 18861284 18692205 18406407 18025151 17626324 17333515 16999745
4676 16999745 16754871 16458751 16140636 15841058 15321947 15090759 14696204 14333153 13969951
4667 13969951 13758033 13441097 13105637 12845723 12466295 12236441 12154740 11970001 11716997 11495921
$$ packed form
4734H778318J58155N2370L28139K60436K86846J90108K27174L11709M61949K60303
4724A1315507J52650K54074M13025K94230L08380K37825L83711L77695L76445
4715A4113542M15578M32805L99224K98333L80186L01367L34695L62980K64001
4706A7302711M21571L12793L24192L45309K78976K26673K85062K02670N5993K19514
4696A9975464K52343O3902Q8045J62350Q334q5549r3289m5205k23854j60210r4284
4685A9848047k19873l16238m50652j69079k85798l81256l98827k92809l33770
4676A6999745k44874k96120l18115k99578n19111k31188l94555l63051l63202
4667A3969951k11918l16936l35460k59914l79428k29854q1701j84739k53004k21076
$$ plain form
4657 11495921 11358331 11062352 10897093 10885476 10739143 10632139 10549348 10591815 10567296 10587543
4647 10587543 10573605 10436375 10493345 10485330 10557981 10568604 10504560 10626158 10791205 10752529 10783238
4636 10783238 10980288 11028094 11072600 11314532 11383361 11551549 11693903 11751219 11923862 12195303
4626 12195303 12349356 12415527 12675321 12884509 13059284 13381879 13647647 13917852 14058061 14349314
4616 14349314 14607546 14912226 15177435 15431356 15657181 15989951 16247773 16552257 16711325
4607 16711325 16967939 17222145 17523828 17807541 17937176 18082140 18246401 18456346 18692126
4598 18692126 18883212 18879225 18926008 18946731 18989432 18989304 19004117 18930142 18936882 18867108 18776977 18692961
4586 18692961 18442642 18278583 18218751 17890178 17859142 17631240 17243257 16980330 16690114 16391607
$$ packed form
4657A1495921j37590k95979j65259j1617j46333j07004q2791M2467k4519K0247
4647A0587543j3938j37230N6970q015P2651J0623o4044J21598J65047l8676L0709
4636A0783238J97050M7806M4506K41932O8829J68188J42354N7316J72643K71441
4626A2195303J54053O6171K59794K09188J74775L22595K65768K70205J40209K91253
4616A4349314K58232L04680K65209K53921K25825L32770K57822L04484J59068
4607A6711325K56614K54206L01683K83713J29635J44964J64261K09945K35780
4598A8692126J91086l987M6783K0723M2701j28J4813p3975O740o9774r0131q4016
4586A8692961k50319j64059n9832l28573l1036k27902l87983k62927k90216k98507
$$ plain form
4576 16391607 16177702 15870891 15676024 15366643 15062175 14789398 14606723 14320606 14048793
4567 14048793 13768186 13718580 13412864 13058122 12930007 12556864 12342154 12144451 11912006 11679993
4557 11679993 11362126 11222228 11081189 10864915 10726833 10516247 10441177 10320850 10190692 10019685
4547 10019685 9986534 9843958 9617115 9472647 9358193 9338687 9120966 9197349 9102355 8917706
4537 8917706 8904359 9048299 9063910 8908925 8913975 8905927 8900856 8903755 8966260 8969861 9096242 9089896
4525 9089896 9158520 9179604 9257052 9579024 9619894 9717485 9888199 9981665 10080726 10334136 10496858
4514 10496858 10678392 10868151 11132014 11369186 11578875 11893658 12122067 12420660 12650661
4505 12650661 12995357 13279071 13582561 13881957 14224837 14521636 14920002 15266440 15720574
$$ packed form
4576A6391607k13905l06811j94867l09381l04468k72777j82675k86117k71813
4567A4048793k80607m9606l05716l54742j28115l73143k14710j97703k32445k32013
4557A1679993l17867j39898j41039k16274j38082k10586p5070j20327j30158j71007
4547A0019685l3151j42576k26843j44468j14454j9506k17721P6383r4994j84649
4537H917706j3347J43940J5611j54985N050q048n071K899O2505L601J26381o346
4525I089896O8624K1084P7448L21972M0870R7591J70714R3466R9061K53410J62722
4514A0496858J81534J89759K63863K37172K09689L14783K28409K98593K30001
4505A2650661L44696K83714L03490K99396L42880K96799L98366L46438M54134
$$ plain form
4496 15720574 16117536 16687257 17086983 17540204 18065917 18686618 19287326 19853844 20315544
4487 20315544 20906588 21442510 22100964 22799165 23295508 23938203 24650401 25299122 25881554
4478 25881554 26637060 27331486 28080576 28768810 29432533 30045187 30769599 31488932 32317681
4469 32317681 33066936 33714048 34466112 35117290 35751402 36435367 37024823 37511363 37904635
4460 37904635 38444989 38817863 39055499 39106352 39152175 38964051 38510742 37859265 37013850 36087496
4450 36087496 35215536 34237740 33301391 32297146 31324723 30377641 29364976 28494573 27596549
4441 27596549 26678386 25768328 24792831 23951977 23211303 22530739 21788435 21028311 20376275
4432 20376275 19661202 19130487 18456609 17882059 17301461 16603244 16093521 15523839 14998267
$$ packed form
4496A5720574L96962N69721L99726M53221N25713O20701O00708N66518M61700
4487B0315544N91044N35922O58454O98201M96343O42695P12198O48721N82432
4478B5881554P55506O94426P49090O88234O63723O12654P24412P19333Q28749
4469C2317681P49255O47112P52064O51178O34112O83965N89456M86540L93272
4460C7904635N40354L72874K37636N0853M5823j88124m53309o51477q45415r26354
4450C6087496q71960r77796r36349j004245r72423r47082j012665q70403q98024
4441B7596549r18163r10058r75497q40854p40674o80564p42304p60124o52036
4432B0376275p15073n30715o73878n74550n80598o98217n09723n69682n25572
$$ plain form
4423 14998267 14569633 13975719 13561658 13188379 12761096 12378785 12050282 11702473 11493564
4414 11493564 11139728 10645987 10393587 10144588 9701153 9370591 9247038 8919288 8516371
4405 8516371 8312878 8253425 7995422 7775345 7534968 7319470 7162285 6986347 6816190 6800293
4395 6800293 6631520 6344240 6211507 6033755 5888944 5684130 5552938 5469665 5290624 5163113
4385 5163113 5113985 5126912 4917928 4810659 4784883 4689527 4572197 4412041 4321415 4271459 4216436
4374 4216436 4336627 4067904 3960794 3907295 3832214 3774820 3681547 3737185 3603213 3434383
4364 3434383 3321491 3303300 3246902 3169414 3304806 3240611 3125194 3088036 3103606 2980654 2899952
4353 2899952 2860054 2755268 2757897 2771077 2847197 2672941 2679937 2637925 2578394 2531305 2505486
$$ packed form
4423A4998267m28634n93914m14061l73279m27283l82311l28503l47809k08909
4414A1493564l53836m93741k52400k48999m43435l30562j23553l27750m02917
4405H516371k03493n9453k58003k20077k40377k15498j57185j75938j70157j5897
4395F800293j68773k87280j32733j77752j44811k04814j31192q3273j79041j27511
4385E163113m9128J2927k08984j07269k5776r5356j17330j60156r0626m9956n5023
4374D216436J20191k68723j07110n3499p5081n7394r3273N5638j33972j68830
4364C434383j12892j8191n6398p7488J35392o4195j15417l7158J5570j22952q0702
4353B899952l9898j04786K629J3180P6120j74256O996m2012n9531m7089k5819
$$ plain form
4342 2505486 2425186 2508734 2390956 2281928 2333805 2359983 2357186 2336210 2324947 2246169 2206822
4331 2206822 2302152 2266352 2200159 2067091 2288769 2079727 1990681 1916876 1972731 2034531 1868189
4320 1868189 1867315 1941604 1873216 1910394 1961544 1806412 1779151 1725255 1863739 1895804 1849604
4309 1849604 1680657 1735572 1763930 1779035 1671060 1821871 1815432 1702472 1652996 1538500 1587464
4298 1587464 1620882 1630062 1657780 1683831 1640288 1607046 1612536 1585449 1692299 1622352 1627262 1480682
4286 1480682 1511736 1587607 1523638 1579572 1616318 1640872 1546274 1503931 1514940 1480943 1471660 1557106
4274 1557106 1607099 1573051 1483601 1600950 1574180 1507393 1500463 1617293 1541270 1598640 1516990
4263 1516990 1466150 1646852 1659147 1475448 1516202 1379581 1378980 1516657 1464843 1515873 1608777
$$ packed form
4342B505486q0300Q3548j17778j09028N1877K6178k797k0976j1263p8778l9347
4331B206822R5330l5800o6193j33068K21678k09042q9046p3805N5855O1800j66342
4320A868189q74P4289o8388L7178N1150j55132k7261n3896J38484L2065m6200
4309A849604j68947N4915K8358J5105j07975J50811o439j12960m9476j14496M8964
4298A587464L3418R180K7718K6051m3543l3242N490k7087J06850o9947M910j46580
4286A480682L1054P5871o3969N5934L6746K4554r4598m2343J1009l3997r283Q5446
4274A557106M9993l4048q9450J17349k6770o6787o930J16830p6023N7370q1650
4263A516990n0840J80702J2295j83699M0754j36621o01J37677n1814N1030R2904
$$ plain form
4252 1608777 1559341 1542397 1537986 1641545 1684137 1507211 1507448 1512088 1616570 1653359 1592744 1495514
4240 1495514 1469462 1634092 1768456 1744579 1640933 1742621 1683119 1697278 1801520 1737536
4230 1737536 1780147 1754162 1786659 1877158 1747797 1717056 1697286 1789119 1804581 1772411 1800584
4219 1800584 1729797 1868700 1871140 1824431 1810150 1877225 1876115 1779215 1782360 1911136 1806311
4208 1806311 1816227 1801464 1882960 1771715 1773490 1856988 1877497 1644932 1646146 1645250 1629025 1603828
4196 1603828 1629760 1655307 1730127 1709022 1625482 1750463 1721586 1682398 1604708 1577015 1644442
4185 1644442 1635148 1626884 1578235 1652570 1652000 1552706 1454652 1471586 1490396 1473989 1582118 1606786
4173 1606786 1559766 1565827 1526631 1507436 1510561 1449322 1429941 1442507 1456687 1465215 1616816 1618583
$$ packed form
4252A608777m9436j6944m411J03559M2592j76926K37M640J04482L6789o0615r7230
4240A495514k6052J64630J34364k3877j03646J01688n9502J4159J04242o3984
4230A737536M2611k5985L2497R0499j29361l0741j9770R1833J5462l2170K8173
4219A800584p0787J38903K440m6709j4281O7075j110r6900L145J28776j04825
4208A806311R916j4763Q1496j11245J775Q3498K0509k32565J214q96j6225k5197
4196A603828K5932K5547P4820k1105q3540J24981k8877l9188p7690k7693O7427
4185A644442r294q264m8649P4335n70r9294r8054J6934J8810j6407J08129K4668
4173A606786m7020O061l9196j9195L125o1239j9381J2566J4180Q528J51601J767
$$ plain form
4161 1618583 1511457 1575061 1560690 1422013 1448144 1501529 1588176 1590216 1604288 1631947 1695609
4150 1695609 1659954 1570842 1531741 1511455 1627008 1636901 1667423 1735333 1750884 1717347 1756407
4139 1756407 1933245 1816877 1797386 1842352 1931431 1994280 1924126 2042167 2074515 2018616 1987545
4128 1987545 2001416 2046275 2077306 2127365 2080878 2134154 2242800 2289266 2382874 2375317 2381248 2515935
4116 2515935 2454924 2424564 2572185 2605634 2548580 2660547 2686326 2807052 2882461 2903433 2981172
4105 2981172 3015048 3159307 3296584 3276767 3294719 3490768 3460681 3566398 3702913 3742081
4095 3742081 3887526 4011677 4180537 4340258 4394556 4349449 4543419 4665403 4594591 4671298
4085 4671298 4843442 4887948 5015182 5120326 5185806 5196444 5380817 5563995 5709919 6016197
$$ packed form
4161A618583j07126O3604j4371j38677K6131N3385Q6647K040J4072K7659O3662
4150A695609l5655q9112l9101k0286J15553R893L0522O7910J5551l3537L9060
4139A756407J76838j16368j9491M4966Q9079O2849p0154J18041L2348n5899l1071
4128A987545J3871M4859L1031N0059m6487N3276J08646M6466R3608p557N931J34687
4116B515935o1011l0360J47621L3449n7054J11967K5779J20726P5409K0972P7739
4105B981172L3876J44259J37277j9817J7952J96049l0087J05717J36515L9168
4095C742081J45445J24151J68860J59721N4298m5107J93970J21984p0812P6707
4085D671298J72144M4506J27234J05144O5480J0638J84373J83178J45924L06278
$$ plain form
4075 6016197 6175676 6252720 6538425 6623958 6689230 6797530 6944322 7119856 7417962 7673465
4065 7673465 7828837 8144326 8383474 8534239 8758389 8867842 9141578 9390357 9594988 9792788
4055 9792788 10066562 10323174 10611820 10807490 11138538 11465407 11650438 11876696 12118567 12303557
4045 12303557 12496597 12726232 12946231 13182793 13311216 13469261 13675703 13810176 13937629
4036 13937629 14089114 14264458 14370482 14486890 14540950 14523187 14545576 14547789 14659783 14666158 14647041
4025 14647041 14575545 14549625 14447029 14516391 14296400 14094133 13959432 13846518 13712676 13578866
4015 13578866 13497014 13410657 13014028 12863197 12755979 12397717 12120734 11925413 11724537 11543701
4005 11543701 11305037 11069058 10844378 10623756 10410365 10277930 10083152 9859983 9577776
$$ packed form
4075F016197J59479P7044K85705Q5533O5272J08300J46792J75534K98106K55503
4065G673465J55372L15489K39148J50765K24150J09453K73736K48779K04631J97800
4055I792788K73774K56612K88646J95670L31048L26869J85031K26258K41871J84990
4045A2303557J93040K29635K19999K36562J28423J58045K06442J34473J27453
4036A3937629J51485J75344J06024J16408N4060j7763K2389K213J11994O375j9117
4025A4647041p1496k5920j02596O9362k19991k02267j34701j12914j33842j33810
4015A3578866q1852q6357l96629j50831j07218l58262k76983j95321k00876j80836
4005A1543701k38664k35979k24680k20622k13391j32435j94778k23169k82207
$$ plain form
3996 9577776 9363738 9193620 9023442 8871276 8630666 8439912 8262802 8010520 7898415 7768421
3986 7768421 7629839 7479423 7295201 7074267 6924917 6693414 6511939 6478196 6400814 6359828
3976 6359828 6026286 5829910 5723929 5528160 5540654 5376109 5151432 5054536 4954567 4959309
3966 4959309 4805065 4720766 4434987 4360413 4402432 4445271 4242713 4079970 4063460 4006789 4001074
3955 4001074 3886519 3736174 3646871 3576277 3420262 3352084 3356069 3399823 3269193 3182760 3137045
3944 3137045 3235460 3144572 3082203 3046423 2913597 2885225 2899374 2946753 2997618 2998558 2857354
3933 2857354 2772060 2755129 2750448 2685580 2684098 2722947 2752488 2681085 2523552 2674936 2661080
3922 2661080 2521444 2513837 2431887 2486328 2509567 2488360 2388266 2476686 2604428 2604933 2613700 2551702
$$ packed form
3996I577776k14038j70118j70178j52166k40610j90754j77110k52282j12105j29994
3986G768421j38582j50416j84222k20934j49350k31503j81475l3743p7382m0986
3976F359828l33542j96376j05981j95769J2494j64545k24677r6896r9969M742
3966D959309j54244q4299k85779p4574M2019M2839k02558j62743j6510n6671n715
3955D001074j14555j50345q9303p0594j56015o8178L985M3754j30630q6433m5715
3944C137045R8415r0888o2369l5780j32826k8372J4149M7379N0865R40j41204
3933B857354q5294j6931m681o4868j482L8849K9541p1403j57533J51384j3856
3922B661080j39636p607q1950N4441K3239k1207j00094Q8420J27742N05Q767o1998
$$ plain form
3910 2551702 2501321 2603858 2711687 2707517 2649383 2677367 2580351 2616597 2772782 2627474 2689177
3899 2689177 2784453 2756473 2804187 2881645 2869378 2912909 3020865 3046331 3100005 3275141 3359497
3888 3359497 3416044 3416280 3457743 3623002 3734782 3835434 3932235 4069972 4168202 4419918 4591758
3877 4591758 4632002 4911339 5086878 5328781 5636527 5809449 6066675 6096252 5871401 5777602
3867 5777602 5668532 5477121 5540187 5458338 5507777 5437892 5509063 5640953 5687837 5776555 5834322
3856 5834322 6026020 6141936 6145793 6346603 6431107 6613445 6777406 6892014 7189022 7280507
3846 7280507 7375991 7684646 7883243 8029671 8200731 8342852 8655542 8739269 9173624 9457061
3836 9457061 9606467 9806344 10007965 10299776 10566334 10773339 10971027 11177746 11401701 11523826
$$ packed form
3910B551702n0381J02537J07829m170n8134K7984r7016L6246J56185j45308O1703
3899B689177R5276k7980M7714P7458j2267M3531J07956K5466N3674J75136Q4356
3888C359497N6547K36M1463J65259J11780J00652R6801J37737R8230K51716J71840
3877D591758M0244K79337J75539K41903L07746J72922K57226K9577k24851r3799
3867E777602j09070j91411O3066q1849M9439o9885P1171J31890M6884Q8718N7767
3856E834322J91698J15916L857K00810Q4504J82338J63961J14608K97008R1485
3846G280507R5484L08655J98597J46428J71060J42121L12690Q3727M34355K83437
3836I457061J49406J99877K01621K91811K66558K07005J97688K06719K23955J22125
$$ plain form
3826 11523826 11725897 11898950 11967627 12046626 12025058 12048264 11943498 11771105 11745652 11649464
3816 11649464 11514219 11313075 11085452 11007901 10811115 10548423 10335007 10033184 9892856 9534725
3806 9534725 9249171 9149555 8865444 8531686 8344543 8110654 7866094 7610375 7369170 7189675
3796 7189675 6865037 6785997 6593327 6399643 6112151 6014622 5794851 5668857 5575329 5460589
3786 5460589 5303681 5216212 5055858 4922245 4888169 4771573 4736706 4644684 4538647 4379083
3776 4379083 4153726 4039144 3991241 3837011 3685978 3528132 3563015 3511403 3345687 3379182
3766 3379182 3407701 3178038 3128356 3020002 2925837 3020069 2969749 2934080 2805782 2641334 2569225
3755 2569225 2585605 2575058 2505690 2445218 2450067 2354139 2304059 2306752 2328132 2105848 2024599 2091191
$$ packed form
3826A1523826K02071J73053O8677P8999k1568K3206j04766j72393k5453r6188
3816A1649464j35245k01144k27623p7551j96786k62692k13416l01823j40328l58131
3806I534725k85554r9616k84111l33758j87143k33889k44560k55719k41205j79495
3796G189675l24638p9040j92670j93684k87492r7529k19771j25994r3528j14740
3786E460589j56908q7469j60354j33613l4076j16596l4867r2022j06037j59564
3776D379083k25357j14582m7903j54230j51033j57846L4883n1612j65716L3495
3766C379182K8519k29663m9682j08354r4165R4232n0320l5669j28298j64448p2109
3755B569225J6380j0547o9368o0472M849r5928n0080K693K1380k22284q1249O6592
$$ plain form
3743 2091191 2072449 2119692 2091915 2117062 2098240 2012265 1918391 1989639 1970388 1911486 1893396
3732 1893396 1942347 1899261 1801813 1789396 1881041 1816531 1733717 1669537 1726420 1633612 1623907 1652114
3720 1652114 1662532 1700308 1663162 1620242 1617376 1631168 1686605 1654818 1496909 1620910 1626624
3709 1626624 1616086 1448225 1499723 1597710 1484951 1459691 1523794 1583874 1564388 1582079 1512245
3698 1512245 1562735 1549401 1453677 1490109 1504352 1513499 1613895 1767124 1702895 1561655 1563748
3687 1563748 1642898 1537243 1692592 1706442 1711537 1775559 1752694 1702193 1662999 1668202 1682309
3676 1682309 1756917 1684058 1849597 1754400 1747200 1757464 1815644 1872721 1781043 1832273 1865191
3665 1865191 1925329 1942552 2029073 1998128 2049616 2000858 2104526 2190763 2173430 2313702 2334131
$$ packed form
3743B091191j8742M7243k7777K5147j8822q5975r3874P1248j9251n8902j8090
3732A893396M8951m3086r7448j2417R1645o4510q2814o4180N6883r2808r705K8207
3720A652114J0418L7776l7146m2920k866J3792N5437l1787j57909J24001N714
3709A626624j0538j67861N1498R7987j12759k5260O4103O0080j9486J7691o9834
3698A512245N0490j3334r5724L6432J4243R147J00396J53229o4229j41240K093
3687A563748P9150j05655J55349J3850N095O4022k2865n0501l9194N203J4107
3676A682309P4608p2859J65539r5197p200J0264N8180N7077r1678N1230L2918
3665A865191O0138J7223Q6521l0945N1488m8758J03668Q6237j7333J40272K0429
$$ plain form
3654 2334131 2351435 2272085 2306434 2297368 2487571 2514447 2537589 2651781 2577466 2525677 2660213
3643 2660213 2727814 2714586 2709802 2816297 2951327 2967273 3000893 3249246 3249681 3216890 3407090
3632 3407090 3581087 3588604 3710941 3775108 3962866 4137000 4202833 4287505 4429862 4548399
3622 4548399 4783342 5035509 5222332 5406500 5583227 5889550 6087574 6321229 6594752 6909795
3612 6909795 7306891 7618921 7792267 8155680 8523241 8856801 9317341 9717973 10182388 10748553
3602 10748553 11225246 11805611 12394448 12914106 13315776 13730602 14195784 14764233 15152712
3593 15152712 15718027 16318256 16829683 17338704 17732015 18404439 18893108 19366131 19924101
3584 19924101 20310388 20943448 21458942 22072416 22771270 23599017 24346918 25424592 26712625
$$ packed form
3654B334131J7304p9350L4349r066J90203K6876K3142J14192p4315n1789J34536
3643B660213O7601j3228m784J06495J35030J5946L3620K48353M35l2791J90200
3632C407090J73997P517J22337O4167J87758J74134O5833Q4672J42357J18537
3622D548399K34943K52167J86823J84168J76727L06323J98024K33655K73523L15043
3612F909795L97096L12030J73346L63413L67561L33560M60540M00632M64415N66165
3602A0748553M76693N80365N88837N19658M01670M14826M65182N68449L88479
3593A5152712N65315O00229N11427N09021L93311O72424M88669M73023N57970
3584A9924101L86287O33060N15494O13474O98854Q27747P47901J077674J288033
$$ plain form
3575 26712625 28070976 29819022 31976827 34427453 37514781 41826666 47631948 55249556
3567 55249556 63044507 63960651 57413440 48684791 41644676 36681424 32943035 30280422
3559 30280422 27762053 25543621 23471388 21691805 20230564 18935124 17651673 16643853
3551 16643853 15666367 14807529 14185858 13829789 13413705 13070290 12793555 12431223 12073582
3542 12073582 11591198 11143885 10653240 9996166 9335258 8637512 8237750 7745869 7394265
3533 7394265 6931226 6629029 6415647 6173713 5986753 5658420 5443713 5287761 5094564 4825332
3523 4825332 4678553 4620641 4559825 4394645 4213989 4068504 4019539 3913050 3863635 3744776
3513 3744776 3610707 3497917 3356690 3355013 3356894 3108010 3032393 3082738 3075567 3102126 3029334
$$ packed form
3575B6712625J358351J748046K157805K450626L087328M311885N805282P617608
3567E5249556P794951R16144o547211q728649p040115m963252l738389k662613
3559C0280422k518369k218432k072233j779583j461241j295440j283451j007820
3551A6643853r77486q58838o21671l56069m16084l43415k76735l62332l57641
3542A2073582m82384m47313m90645o57074o60908o97746l99762m91881l51604
3533G394265m63039l02197k13382k41934j86960l28333k14707j55952j93197k69232
3523D825332j46779n7912o0816j65180j80656j45485m8965j06489m9415j18859
3513C744776j34069j12790j41227j677J881k48884p5617N0345p171K6559p2792
$$ plain form
3502 3029334 2999213 2866024 2744633 2774257 2746652 2715521 2598092 2574886 2439868 2432686 2493688
3491 2493688 2347791 2408509 2406952 2436721 2401623 2406689 2466438 2360039 2388292 2334190 2314543
3480 2314543 2332005 2385141 2408626 2324828 2250073 2302051 2259711 2185068 2267045 2263309 2254298 2290336
3468 2290336 2404163 2348883 2341768 2334828 2389098 2448448 2383914 2343214 2172305 2118544 2217896
3457 2217896 2275978 2273188 2294368 2242374 2325651 2344570 2359736 2426640 2257631 2313233 2275342
3446 2275342 2290057 2191195 2241240 2327741 2294762 2180789 2279955 2253875 2320671 2360342 2497339
3435 2497339 2547750 2388931 2567663 2436425 2439414 2562308 2486435 2428668 2483221 2612281 2674970
3424 2674970 2692732 2714331 2702148 2722060 2838853 2840151 2935795 2905387 2886709 2964025 2991145
$$ packed form
3502C029334l0121j33189j21391K9624k7605l1131j17429k3206j35018p182O1002
3491B493688j45897O0718j557K9769l5098N066N9749j06399K8253n4102j9647
3480B314543J7462N3136K3485q3798p4755N1978m2340p4643Q1977l736r011L6038
3468B290336J13827n5280p115o940N4270N9350o4534m0700j70909n3761R9352
3457B217896N8082k790K1180n1994Q3277J8919J5166O6904j69009N5602l7891
3446B275342J4715r8862N0045Q6501l2979j13973R9166k6080O6796L9671J36997
3435B497339N0411j58819J78732j31238K989J22894p5873n7767N4553J29060O2689
3424B674970J7762K1599j2183J9912J16793J298R5644l0408j8678P7316K7120
$$ plain form
3413 2991145 3034803 3037808 3137854 3139904 3110854 3096358 3162168 3242154 3337431 3352052 3531817
3402 3531817 3590418 3698681 3748630 3823175 3864876 3887050 4082741 4123977 4141957 4308080 4541585
3391 4541585 4569431 4511374 4673082 4854088 4990239 5145839 5146027 5329794 5619431 5781808
3381 5781808 5866422 6057274 6253282 6361028 6640690 6882993 7115903 7663868 8042730 8598813
3371 8598813 9040810 9332352 9433848 9591527 9748518 9734220 9649694 9571345 9580376 9421890
3361 9421890 9487706 9601103 9771522 9902648 10144765 10359559 10641282 10959200 11241215 11475474
3351 11475474 11879635 12322154 12563981 12698754 13032863 13222996 13439047 13763342 13957853
3342 13957853 14195681 14431230 14627559 14947889 15202592 15509149 15807949 16030123 16250660
$$ packed form
3413B991145M3658L005J00046K050k9050j4496O5810P9986R5277J4621J79765
3402C531817N8601J08263M9949P4545M1701K2174J95691M1236J7980J66123K33505
3391D541585K7846n8057J61708J81006J36151J55600J88J83767K89637J62377
3381E781808Q4614J90852J96008J07746K79662K42303K32910N47965L78862N56083
3371H598813M41997K91542J01496J57679J56991j4298q4526p8349R031j58486
3361I421890O5816J13397J70419J31126K42117K14794K81723L17918K82015K34259
3351A1475474M04161M42519K41827J34773L34109J90133K16051L24295J94511
3342A3957853K37828K35549J96329L20330K54703L06557K98800K22174K20537
$$ plain form
3333 16250660 16618575 16750016 17057415 17394256 17668876 17969511 18206241 18579684 18774980
3324 18774980 18963647 19137035 19189486 19460045 19670488 19718635 19739926 19699956 19838600 19886774
3314 19886774 19974071 19850500 19875137 19709674 19506582 19283602 18938021 18929746 18691131 18401340
3304 18401340 18178737 17947625 17605489 17389082 17062503 16709870 16444814 16077983 15857057
3295 15857057 15536085 15360800 15105257 14854847 14603330 14375397 14049526 13837185 13583153
3286 13583153 13429529 13250065 13104804 13074189 12877210 12632321 12429470 12326742 12138520 11941115
3276 11941115 11976133 11936826 11629411 11524038 11572587 11465575 11282322 11302930 11266450 11178309
3266 11178309 11277246 11201729 11145214 11232329 11183591 11163049 11250699 11307509 11413436 11471416 11629193
$$ packed form
3333A6250660L67915J31441L07399L36841K74620L00635K36730L73443J95296
3324A8774980J88667J73388N2451K70559K10443M8147K1291l9970J38644M8174
3314A9886774Q7297j23571K4637j65463k03092k22980l45581q275k38615k89791
3304A8401340k22603k31112l42136k16407l26579l52633k65056l66831k20926
3295A5857057l20972j75285k55543k50410k51517k27933l25871k12341k54032
3286A3583153j53624j79464j45261l0615j96979k44889k02851j02728j88222j97405
3276A1941115L5018l9307l07415j05373M8549j07012j83253K0608l6480q8141
3266A1178309R8937p5517n6515Q7115m8738k0542Q7650N6810J05927N7980J57777
$$ plain form
3255 11629193 11750946 11967368 12167520 12283497 12277298 12578532 12852141 13080174 13489380 13463873
3245 13463873 13391063 13362794 13444754 13492062 13476710 13712228 13952484 14238739 14545029 14758062
3235 14758062 15063206 15329336 15644267 15826206 16316470 16606222 17028111 17362599 17724516
3226 17724516 18157571 18593324 18990781 19381499 19842170 20315839 20806752 21267526 21594025
3217 21594025 22149745 22633388 22970739 23353190 23701686 24010557 24313669 24542043 24758013
3208 24758013 25150401 25384374 25821715 26084842 26439405 26716231 27027571 27420953 27748443
3199 27748443 28226725 28644268 29081088 29624129 30111983 30589249 31176331 31744285 32224904
3190 32224904 32827887 33309083 33714300 34251397 34634257 34954400 35258175 35498269 35742458
$$ packed form
3255A1629193J21753K16422K00152J15977o199L01234K73609K28033M09206k5507
3245A3463873p2810k8269Q1960M7308j5352K35518K40256K86255L06290K13033
3235A4758062L05144K66130L14931J81939M90264K89752M21889L34488L61917
3226A7724516M33055M35753L97457L90718M60671M73669M90913M60774L26499
3217B1594025N55720M83643L37351L82451L48496L08871L03112K28374K15970
3208B4758013L92388K33973M37341K63127L54563K76826L11340L93382L27490
3199B7748443M78282M17543M36820N43041M87854M77266N87082N67954M80619
3190C2224904O02983M81196M05217N37097L82860L20143L03775K40094K44189
$$ plain form
3181 35742458 35766564 35801687 35827265 35636425 35475496 35328844 35120716 34800838 34549630 34094073
3171 34094073 33639671 33317842 32844648 32337646 31754094 31334068 30730834 30165561 29494000
3162 29494000 28886582 28447908 28041989 27474278 26825225 26345761 25806146 25378280 24893096
3153 24893096 24342246 23858321 23407420 22923716 22471675 22188838 21751368 21261331 20850095
3144 20850095 20643302 20197870 19749939 19515952 19190184 18839976 18574561 18395052 18104438
3135 18104438 17801130 17543772 17140212 16952381 16668494 16476919 16164764 15920178 15656865
3126 15656865 15275270 15164219 14950660 14771516 14517756 14329757 14082877 13941155 13779969
3117 13779969 13695135 13523321 13352895 13214896 13061768 12967567 12901717 12826936 12721751 12582932
$$ packed form
3181C5742458K4106L5123K5578j90840j60929j46652k08128l19878k51208m55557
3171C4094073m54402l21829m73194n07002n83552m20026o03234n65273o71561
3162B9494000o07418m38674m05919n67711o49053m79464n39615m27866m85184
3153B4893096n50850m83925m50901m83704m52041k82837m37470m90037m11236
3144B0850095k06793m45432m47931k33987l25768l50208k65415j79509k90614
3135A8104438l03308k57358m03560j87831k83887j91575l12155k44586k63313
3126A5656865l81595j11051k13559j79144k53760j87999k46880j41722j61186
3117A3779969q4834j71814j70426j37999j53128r4201o5850p4781j05185j38819
$$ plain form
3107 12582932 12415047 12218742 12249296 12176200 12033607 11953392 12009981 11926768 11892597 11845318 11768133
3096 11768133 11783971 11745267 11724764 11735062 11792287 11850439 11842181 11884548 11979059 11947065 12146274
3085 12146274 12183335 12223780 12407103 12478763 12654806 12743172 12804515 13086826 13214784 13381138
3075 13381138 13759695 13804336 14021744 14230146 14518019 14777440 15013558 15403051 15704804 16059941
3065 16059941 16376783 16907972 17210363 17640054 18050872 18499772 19026900 19438160 19894408
3056 19894408 20378044 20833127 21438950 21895466 22328320 22960076 23397439 24101257 24582244
3047 24582244 25008138 25495684 26012884 26499744 27174544 27832571 28411622 29070392 29721282
3038 29721282 30423493 31156190 31983204 32829449 33657083 34805051 35883394 37075018 38373170
$$ packed form
3107A2582932j67885j96305L0554p3096j42593q0215N6589q3213l4171m7279p7185
3096A1768133J5838l8704k0503J0298N7225N8152q258M2367R4511l1994J99209
3085A2146274L7061M0445J83323P1660J76043Q8366O1343K82311J27958J66354
3075A3381138L78557M4641K17408K08402K87873K59421K36118L89493L01753L55137
3065A6059941L16842N31189L02391M29691M10818M48900N27128M11260M56248
3056A9894408M83636M55083O05823M56516M32854O31756M37363P03818M80987
3047B4582244M25894M87546N17200M86860O74800O58027N79051O58770O50890
3038B9721282P02211P32697Q27014Q46245Q27634J147968J078343J191624J298152
$$ plain form
3029 38373170 39760439 41189597 42599814 44056176 45596106 47372706 49072368 50956215
3021 50956215 53031942 55118771 57308714 59870765 62497941 65190508 67887549 70955901
3013 70955901 74152340 77403042 80604341 84077046 87413835 90584471 93753474 96800098
3005 96800098 99576321 102221937 104596306 106996557 109301984 111670368 114006909 116224301
2997 116224301 118507874 120870897 123293047 125850556 128616435 131579925 134658429 137821494
2989 137821494 141279816 144598064 147734371 150677935 153474898 156362548 159397465 162562648
2981 162562648 165527525 168542823 171623162 174639329 177663838 180860591 184445604 188588413
2973 188588413 193355832 198762890 204783304 211539552 218918505 226525781 234429786 242175495
$$ packed form
3029C8373170J387269J429158J410217J456362J539930J776600J699662J883847
3021E0956215K075727K086829K189943K562051K627176K692567K697041L068352
3013G0955901L196439L250702L201299L472705L336789L170636L169003L046624
3005I6800098K776223K645616K374369K400251K305427K368384K336541K217392
2997A16224301K283573K363023K422150K557509K765879K963490L078504L163065
2989A37821494L458322L318248L136307K943564K796963K887650L034917L165183
2981A62562648K964877L015298L080339L016167L024509L196753L585013M142809
2973A88588413M767419N407058O020414O756248P378953P607276P904005P745709
$$ plain form
2965 242175495 250054089 258677133 268270867 278974050 291426190 305793843 322453137
2958 322453137 341370837 362414687 384868026 407384170 428235734 446015867 459053783
2951 459053783 465338852 463517960 454165264 438587825 418978813 397884464 377508304
2944 377508304 358733555 341096182 324075683 307365152 291040195 275075668 259522772
2937 259522772 244485368 229845610 215867693 202656850 190342480 178658828 167661962
2930 167661962 157505255 148233351 139602333 131917549 124949085 118588861 112728146 107513254
2922 107513254 102634887 98023701 93776164 89739688 86020217 82541259 79230313 76280340
2914 76280340 73666607 71248908 69101338 66961549 65019749 63232854 61557240 60040623
$$ packed form
2965B42175495P878594Q623044R593734J0703183J2452140J4367653J6659294
2958C22453137J8917700K1043850K2453339K2516144K0851564J7780133J3037916
2951D59053783O285069j820892r352696j5577439j9609012k1094349k0376160
2944C77508304j8774749j7637373j7020499j6710531j6324957j5964527j5552896
2937B59522772j5037404j4639758j3977917j3210843j2314370j1683652j0996866
2930A67661962j0156707r271904q631018p684784o968464o360224n860715n214892
2922A07513254m878367m611186m247537m036476l719471l478958l310946k949973
2914G6280340k613733k417699k147570k139789j941800j786895j675614j516617
$$ plain form
2906 60040623 58628377 57429948 56317541 55334459 54528513 53627688 53082242 52534187 51912138
2897 51912138 51520562 51305268 51231684 51361958 51533834 51801695 52272915 52838487 53412110 54088612
2887 54088612 54781098 55408193 55810792 56142745 56272955 55970039 55373417 54517373 53248306
2878 53248306 51858939 50310644 48701635 47055353 45284264 43629218 42098093 40518980
2870 40518980 39010103 37563386 36043943 34554276 33302016 31884281 30481827 29287991
2862 29287991 28098881 26840466 25919194 24932701 23835227 22875422 22068557 21334049 20505616
2853 20505616 19895910 19277488 18729984 18196682 17614908 17221360 16824117 16334916 15953819
2844 15953819 15591920 15065784 14857999 14680526 14319268 13953091 13621405 13400781 13221973
$$ packed form
2906F0040623j412246j198429j112407r83082q05946r00825n45446n48055o22049
2897E1912138l91576k15294p3584J30274J71876K67861M71220N65572N73623O76502
2887E4088612O92486O27095M02599L31953J30210l02916n96622q56044j269067
2878E3248306j389367j548295j609009j646282j771089j655046j531125j579113
2870D0518980j508877j446717j519443j489667j252260j417735j402454j193836
2862B9287991j189110j258415r21272r86493j097474r59805q06865p34508q28433
2853B0505616o09706o18422n47504n33302n81774l93548l97243m89201l81097
2844A5953819l61899n26136k07785j77473l61258l66177l31686k20624j78808
$$ plain form
2835 13221973 13084925 12919555 12579901 12575035 12427206 12303408 12147351 12016597 12055704 11927606
2825 11927606 11903420 11833953 11739460 11607914 11545166 11563066 11422727 11382471 11287051 11180265 11242310
2814 11242310 11208662 11157837 11291378 11370582 11356017 11305776 11346789 11301236 11249532 11371962 11474579
2803 11474579 11567181 11454797 11539226 11517806 11609923 11694258 11734474 11729734 11710972 11847295 12003428
2792 12003428 12076858 12128064 12250426 12484990 12596308 12616971 12767839 12952161 13067992 13168613
2782 13168613 13338371 13382921 13709417 13920824 14183956 14407235 14590594 14943308 15154214 15412398
2772 15412398 15714799 16074437 16443877 16898828 17227187 17697731 18068417 18457662 19062834
2763 19062834 19488851 20024461 20661737 21278164 21958851 22679924 23548211 24253643 24974020
$$ packed form
2835A3221973j37048j65370l39654m866j47829j23798j56057j30754L9107j28098
2825A1927606k4186o9467r4493j31546o2748J7900j40339m0256r5420j06786O2045
2814A1242310l3648n0825J33541P9204j4565n0241M1013m5553n1704J22430J02617
2803A1474579R2602j12384Q4429k1420R2117Q4335M0216m740j8762J36323J56133
2792A2003428P3430N1206J22362K34564J11318K0663J50868J84322J15831J00621
2782A3168613J69758M4550L26496K11407K63132K23279J83359L52714K10906K58184
2772A5412398L02401L59638L69440M54951L28359M70544L70686L89245O05172
2763A9062834M26017N35610O37276O16427O80687P21073Q68287P05432P20377
$$ plain form
2754 24974020 25811189 26600821 27421189 28328418 29361908 30394229 31465048 32550336 33672776
2745 33672776 34955538 36323176 37725374 39121847 40613230 42183653 43962228 45761472
2737 45761472 47715358 49761033 51824458 54009994 56282510 58722890 61425732 64371103
2729 64371103 67533731 70928625 74629104 78674955 83082930 87958819 93399556 99202623
2721 99202623 105610763 112468950 120040467 128477398 137679837 147412776 157906817 168626914
2713 168626914 179087055 188762220 196554992 201870084 205130702 207308072 209630676 212095228
2705 212095228 214815811 217849527 221309179 224901608 229074941 234161290 240388327 247797806
2697 247797806 256659292 266851655 278930307 293953174 312966024 336497354 364022506
$$ packed form
2754B4974020Q37169P89632Q20368R07229J033490J032321J070819J085288J122440
2745C3672776J282762J367638J402198J396473J491383J570423J778575J799244
2737D5761472J953886K045675K063425K185536K272516K440380K702842K945371
2729F4371103L162628L394894L700479M045851M407975M875889N440737N803067
2721I9202623O408140O858187P571517Q436931R202439R732939J0494041J0720097
2713A68626914J0460141R675165P792772N315092L260618K177370K322604K464552
2705B12095228K720583L033716L459652L592429M173333N086349O227037P409479
2697B47797806Q861486J0192363J2078652J5022867J9012850K3531330K7525152
$$ plain form
2690 364022506 389669934 397949129 385342518 362643141 340027678 321548474 307445487
2683 307445487 297910884 291632152 287473307 284241147 281261149 277785827 273509370 268741258
2675 268741258 263502556 257907910 252241541 247265773 242959887 239485958 236497159 233415502
2667 233415502 228698170 221164050 210547972 198104125 185067447 172578770 161205855
2660 161205855 150935042 141587836 133342866 125598570 118250843 111045688 104066527 97476842
2652 97476842 91452583 85890837 80746391 76119125 71921295 67939002 64464415 61158408
2644 61158408 58084686 55283247 52641657 50217699 47847230 45711380 43794805 41867148
2636 41867148 40171620 38588508 37057681 35768396 34433123 33080464 31929812 30858149
$$ packed form
2690C64022506K5647428Q279195j2606611k2699377k2615463j8479204j4102987
2683C07445487r534603o278732m158845l232160k979998l475322m276457m768112
2675B68741258n238702n594646n666369m975768m305886l473929k988799l081657
2667B33415502m717332p534120j0616078j2443847j3036678j2488677j1372915
2660A61205855j0270813r347206q244970p744296p347727p205155o979161o589685
2652I7476842o024259n561746n144446m627266m197830l982293l474587l306007
2644F1158408l073722k801439k641590k423958k370469k135850j916575j927657
2636D1867148j695528j583112j530827j289285j335273j352659j150652j071663
$$ plain form
2628 30858149 29799214 28809032 27763424 26766208 25927753 25102456 24279536 23476440 22728184
2619 22728184 22144108 21379939 20681767 20111468 19380221 18726017 18314285 17868964 17144411
2610 17144411 16615448 16250994 15830718 15292659 14755877 14391001 13980118 13615353 13086449
2601 13086449 12779445 12524394 12068514 11638865 11479131 11079803 10807778 10484227 10179346
2592 10179346 9947544 9729849 9563261 9277586 9061155 8786682 8570735 8390741 8262603
2583 8262603 8052825 7829446 7639925 7381552 7296568 7076340 6800964 6690279 6641387 6468835
2573 6468835 6317996 6229807 6160607 6052024 5956636 5915138 5675102 5625500 5553289 5439046 5378564
2562 5378564 5226658 5209541 5093401 5051198 5009511 4925823 4815779 4733523 4694834 4572304 4547200
$$ packed form
2628C0858149j058935r90182j045608r97216q38455q25297q22920q03096p48256
2619B2728184n84076p64169o98172n70299p31247o54204m11732m45321p24553
2610A7144411n28963l64454m20276n38059n36782l64876m10883l64765n28904
2601A3086449l07004k55051m55880m29649j59734l99328k72025l23551l04881
2592A0179346k31802k17695j66588k85675k16431k74473k15947j79994j28138
2583H262603k09778k23379j89521k58373q4984k20228k75376j10685m8892j72552
2573F468835j50839q8189o9200j08583r5388m1498k40036m9602p2211j14243o0482
2562E378564j51906j7117j16140m2203m1687q3688j10044q2256l8689j22530k5104
$$ plain form
2551 4547200 4555786 4558927 4470396 4642904 4568576 4398597 4231887 4196971 4223848 4210264 4056752
2540 4056752 3897495 3891344 3917121 3827374 3720912 3725937 3802104 3722681 3620934 3659185 3676370
2529 3676370 3525104 3410185 3449352 3359839 3386076 3492292 3376909 3286708 3294186 3336875 3337557
2518 3337557 3165946 3276076 3315836 3227865 3079197 3084290 3154001 3052462 3037883 3107830 3043637
2507 3043637 3027777 2966546 3061839 3157455 3076593 3159358 3207930 3238444 3399775 3341955 3333703
2496 3333703 3222099 3129048 3158989 3188249 3048360 3099294 3118482 3081742 3063209 3114622 3141340
2485 3141340 3240377 3157069 3171531 3294989 3377837 3537992 3598273 3870971 4009589 3903410
2475 3903410 3742141 3615792 3449226 3258733 3070320 2934228 3014434 2967814 2899055 2906999
$$ packed form
2551D547200Q586L141q8531J72508p4328j69979j66710l4916K6877j3584j53512
2540D056752j59257o151K5777q9747j06462N025P6167p9423j01747L8251J7185
2529C676370j51266j14919L9167q9513K6237J06216j15383r0201P478M2689O82
2518C337557j71611J10130L9760q7971j48668N093O9711j01539j4579O9947o4193
2507C043637j5860o1231R5293R5616q0862Q2765M8572L0514J61331n7820q252
2496C333703j11604r3051K9941K9260j39889N0934J9188l6740j8533N1413K6718
2485C141340R9037q3308J4462J23458Q2848J60155O0281K72698J38618j06179
2475C903410j61269j26349j66566j90493j88413j36092Q0206m6620o8759P944
$$ plain form
2465 2906999 2841935 2807062 2859189 2853040 2731463 2745552 2731841 2574637 2483653 2577109 2665953
2454 2665953 2607768 2488224 2416261 2442936 2258741 2062913 2040866 1954991 1835699 1796076 1731474
2443 1731474 1710776 1693302 1569083 1484268 1452388 1517580 1617134 1541968 1622930 1532892 1477901
2432 1477901 1274675 1175868 1242944 1150166 1112550 1076056 1230633 1186530 1145036 1037278 1080874
2421 1080874 1154829 1244058 1057080 936913 982337 1035222 1028014 949688 841840 899325 837085
2410 837085 858957 874145 894147 874177 837066 789862 851423 863816 746665 830748 831408 839884
2398 839884 767269 714486 751364 765163 720766 705168 670907 686097 766316 801901 783929 763816
2386 763816 743410 760251 694201 616098 659082 661335 729742 759303 759039 582427 559496 609502
$$ packed form
2465B906999o5064l4873N2127o149j21577J4089j3711j57204r0984R3456Q8844
2454B665953n8185j19544p1963K6675j84195j95828k2047q5875j19292l9623o4602
2443A731474k0698j7474j24219q4815l1880O5192R9554p5166Q0962r0038n4991
2432A477901k03226r8807O7076r2778l7616l6494J54577m4103m1494j07758M3596
2421A080874P3955Q9229j86978j20167M5424N2885p208p8326j07848N7485o2240
2410H37085K1872J5188K0002j9970l7111m7204O1561J2393j17151Q4083O60Q476
2398H39884p2615n2783L6878J3799m4397j5598l4261J5190Q0219L5585j7972k0113
2386G63816k0406J6841o6050p8103M2984K253O8407K9561k64j76612k2931N0006
$$ plain form
2374 609502 653841 520172 585537 543252 548299 499041 487210 462447 466821 464749 408599 452471
2362 452471 464661 512415 451140 537564 673046 551751 480776 536822 540244 562205 481700
2351 481700 468399 450640 510574 454487 514654 481338 334512 347613 437685 373744 369047 500177
2339 500177 401953 478292 344495 415615 445778 532261 549533 403764 426292 471412 447982
2328 447982 388258 417260 360590 451567 360258 280398 365696 389137 340867 285350 352576 430144
2316 430144 387636 430558 518108 398776 415092 424997 382551 346235 275573 394815 282609
2305 282609 378520 371658 374482 251344 242919 268744 326868 364337 450818 412871 353392 365148
2293 365148 375961 394663 366120 366436 402016 335723 282966 270606 265742 310591 414160 339620
$$ packed form
2374F09502M4339j33669O5365m2285N047m9258j1831k4763M374k072n6150M3872
2362D52471J2190M7754o1275Q6424J35482j21295p0975N6046L422K1961q0505
2351D81700j3301j7759N9934n6087O0167l3316j46826J3101R0072o3941m697J31130
2339E00177r8224P6339j33797P1120L0163Q6483J7272j45769K2528M5120k3430
2328D47982n9724K9002n6670R0977r1309p9860Q5298K3441m8270n5517O7226P7568
2316D30144m2508M2922Q7550j19332J6316R905m2446l6316p0662J19242j12206
2305B82609R5911o862K824j23138q425K5825N8124L7469Q6481l7947n9479J1756
2293C65148J0813J8702k8543L16L5580o6293n2757j2360m864M4849J03569p4540
$$ plain form
2281 339620 263887 237510 285634 377812 393754 281733 353955 287523 221383 263359 288346
2270 288346 290527 207055 320325 251891 353696 366793 349487 296065 221391 241228 233616 298415
2258 298415 432184 280651 162218 163415 383879 393245 295362 358401 186950 232739 181079
2247 181079 228314 272532 197086 231925 277696 246110 259555 237705 298388 203693 239110 201956
2235 201956 169267 227629 104009 118804 191026 141986 193198 199149 261634 262369 270520 280268
2223 280268 273581 221986 167292 267798 263856 259934 126534 139225 283236 262023 226999 198980
2211 198980 167865 263518 306155 211939 268288 313271 164666 272422 295116 317086 215427
2200 215427 170914 136309 167551 222747 240064 291689 255123 272664 279921 319583 248969 231430
$$ packed form
2281C39620p5733k6377M8124R2178J5942j12021P2222o6432o6140M1976K4987
2270B88346K181q3472J13270o8434J01805J3097j7306n3422p4674J9837p612O4799
2258B98415J33769j51533j18433J197K20464R366r7883O3039j71451M5789n1660
2247A81079M7235M4218p5446L4839M5771l1586J3445k1850O0683r4695L5417l7154
2235B01956l2689N8362j23620J4795P2222m9040N1212N951O2485P35Q151R748
2223B80268o687n1595n4694J00506l942l922j33400J2691J44011k1213l5024k8019
2211A98980l1115R5653M2637r4216N6349M4983j48605J07756K2694K1970j01659
2200B15427m4513l4605L1242N5196J7317N1625l6566J7541P257L9662p0614j7539
$$ plain form
2188 231430 224872 335029 326764 371042 447624 345935 304655 294516 335822 319483 311901 283415
2176 283415 314745 200016 294980 357322 361651 304817 361239 331069 347450 396976 345947 256375
2164 256375 293505 222609 295775 233589 225975 267753 275956 369239 345053 360412 398523 404817
2152 404817 379991 332811 312978 439771 539950 489633 514223 601987 552816 454053 533852
2141 533852 611382 626276 612165 588603 678039 656514 662104 809333 826910 767720 854834 1005628
2129 1005628 1050269 989391 1036669 1087313 997258 1082737 1121118 1244636 1394480 1423441 1436649
2118 1436649 1528160 1707744 1741378 1808824 2081508 2170433 2176318 2231768 2388301 2582075 2644764
2107 2644764 2854058 3158251 3343828 3555191 3932483 4299845 4740408 5151694 5732951 6278352
$$ packed form
2188B31430o558J10157q265M4278P6582j01689m1280j0139M1306j6339p582k8486
2176B83415L1330j14729R4964O2342M329n6834N6422l0170J6381M9526n1029q9572
2164B56375L7130p0896P3166o2186p614M1778Q203R3283k4186J5359L8111O294
2152D04817k4826m7180j9833J26793J00179n0317K4590Q7764m9171r8763P9799
2141E33852P7530J4894j4111k3562Q9436k1525N590J47229J7577n9190Q7114J50794
2129A005628M4641o0878M7278N0644r0055Q5479L8381J23518J49844K8961J3208
2118A436649R1511J79584L3634O7446K72684Q8925N885N5450J56533J93774O2689
2107B644764K09294L04193J85577K11363L77292L67362M40563M11286N81257N45401
$$ plain form
2097 6278352 6884285 7658568 8747213 9873529 11414721 13733480 16582473 20524909 22876792
2088 22876792 20983700 17107100 13561581 11094048 9389852 7979729 6924507 6291529
2080 6291529 5732299 5492742 5110901 4525619 4058704 3708285 3344615 3059692 2718107 2624363
2070 2624363 2536601 2362376 2121736 2044672 1963072 1783397 1623094 1555883 1419879 1281287
2060 1281287 1205801 1081274 1124844 1061612 1063000 964065 920927 931789 906287 810042 817679 795944
2048 795944 721204 646048 757909 763074 636271 594035 565765 642806 493512 555787 646714
2037 646714 538510 594374 576029 459432 449310 436356 415620 477422 449631 362025 310008
2026 310008 358067 278301 259315 320265 292740 372029 406765 478881 358474 222852 191120
$$ packed form
2097F278352O05933P74283J088645J126316J541192K318759K848993L942436K351883
2088B2876792j893092l876600l545519k467533j704196j410123j055222o32978
2080F291529n59230k39557l81841n85282m66915l50419l63670k84923l41585r3744
2070B624363q7762j74225k40640p7064q1600j79675j60303o7211j36004j38592
2060A281287p5486j24527M3570o3232J388r8935m3138J0862k5502r6245P637k1735
2048G95944p4740p5156J11861N165j26803m2236k8270P7041j49294O2275R0927
2037F46714j08204N5864j8345j16597j0122j2954k0736O1802k7791q7606n2017
2026C10008M8059p9766j8986O0950k7525P9289L4736P2116j20407j35622l1732
$$ plain form
2015 191120 134751 227616 329969 297092 300302 357828 333038 239870 244665 229598 251659 210757
2003 210757 193835 93733 115676 135075 188329 184583 192582 216767 95813 135997 139147 167177
1991 167177 56684 78433 80310 90933 5983 29814 85796 110806 151426 124415 119058 89761
1979 89761 165776 103607 185783 123084 62341 -12375 37481 36805 65065 149472 38243 76506
1967 76506 141650 142657 20982 7306 -40310 -46296 19360 -28166 18605 -30449 -22612 60891
1955 60891 31278 105474 11343 92668 29492 82055 15247 -1608 5333 -44844 1741 5080
1943 5080 -16147 -33278 23150 91476 47870 -12994 -81658 -105257 7287 1815 -28991 58639
1931 58639 13008 87534 113530 48431 -21918 -41020 -51061 -19210 -20654 -19267 184346 47982
$$ packed form
2015A91120n6369R2865J02353l2877L210N7526k4790r3168M795j5067K2061m0902
2003B10757j6922j00102K1943J9399N3254l746P999K4185j20954M0184L150K8030
1991A67177j10493K1749J877J0623q4950K3831N5982K5010M0620k7011n357k9297
1979H9761P6015o2169Q2176o2699o0743p4716M9856o76K8260Q4407j11229L8263
1967G6506O5144J007j21675j3676m7616n986O5656m7526M6771m9054P837Q3503
1955F0891k9613P4196r4131Q1325o3176N2563o6808j6855O941n0177M6585L339
1943E080k1227j7131N6428O8326m3606o0864o8664k3599J12544n472l0806Q7630
1931E8639m5631P4526K5996o5099p0349j9102j0041L1851j444J387K03613j36364
$$ plain form
1919 47982 -50287 48795 -27182 -6237 -32460 55442 25580 30397 -54796 91926 78069 22938
1907 22938 906 -60751 13831 -30737 -12033 41662 52944 44116 98598 19944 20695 121418
1895 121418 5846 16114 70263 136789 196737 173148 108549 96196 152915 104122 104052 106502
1883 106502 97451 106957 31779 -1921 94725 -29257 7953 54357 123833 -48731 -45222 22785
1871 22785 52392 45533 20647 1310 -50105 -5949 5969 -53983 34695 51757 -38839 -72211
1859 -72211 -10643 -65836 -18671 -42618 -11478 -57165 -13854 21133 42851 -147120 -97047 -4467
1847 -4467 17744 52939 32279 -10760 -18751 -54127 9530 23888 43153 51947 9478 16054 -64357
1834 -64357 -5863 -50492 -6235 -33916 -84078 -73283 -22367 -65224 -62513 -157808 -54060 -81438
$$ packed form
1919D7982r8269R9082p5977K0945k6223Q7902k9862M817q5193J46722j3857n5131
1907B2938k2032o1657P4582m4568J8704N3695J1282q828N4482p8654P51J00723
1895A21418j15572J0268N4149O6526N9948k3589o4599j2353N6719m8793p0K450
1883A06502r051R506p5178l3700R6646j23982L7210M6404O9476j72564L509O8007
1871B2785K9607o859k4886j9337n1415M4156J1918n9952Q8678J7062r0596l3372
1859g2211O1568n5193M7165k3947L1140m5687M3311L4987K1718j89971N0073R2580
1847d467K2211L5195k0660m3039p991l5376O3657J4358J9265Q794m2469O576q0411
1834f4357N8494m4629M4257k7681n0162J0795N0916m2857K711r5295J03748k7378
$$ plain form
1822 -81438 -44643 45238 27919 26178 34262 8997 -7540 50594 116880 -54382 -118737 416
1810 416 -167143 -42562 11971 49363 15613 25747 -28956 29810 112346 -4895 5072 -12773
1798 -12773 3400 100221 80024 107755 67474 -28251 -11183 -79767 -15083 -33643 91440 21211
1786 21211 -47654 -71572 -107764 -53326 -161732 -16827 166106 75129 80373 -47624 -145240
1775 -145240 -108063 -78955 -84503 -11120 25012 32052 -76169 -66095 -46735 3253 67979 92776
1763 92776 116112 2265 -234775 -138413 -4707 -34479 72661 130292 46100 -31317 -127184
1752 -127184 -105999 -99808 -112980 27826 77028 140419 13818 -47553 41913 53984 -127905
1741 -127905 63713 55896 -113573 -46374 43398 -58126 -124814 116276 110308 45977 31648
$$ packed form
1822h1438L6795Q9881j7319j741Q084k5265j6537N8134O6286j71262o4355J19153
1810D16j67559J24581N4533L7392l3750J0134n4703N8766Q2536j17241R967j7845
1798a2773J6173R6821k0197K7731m0281r5725J7068o8584O4684j8560J25083p0229
1786B1211o8865k3918l6192N4438j08406J44905J82933r0977N244j27997r7616
1775a45240L7177K9108n548P3383L6132P040j08221J0074J9360M9988O4726K4797
1763I2776K3336j13847k37040R6362J33706k9772J07140N7631q4192p7417r5867
1752a27184K1185O191j3172J40806M9202O3391j26601o1371Q9466J2071j81889
1741a27905J91618p817j69469O7199Q9772j01524o6688K41090n968o4331j4329
$$ plain form
1730 31648 -11386 -126064 53473 71670 59433 -71484 -195884 -123773 -124049 -21004 -71097
1719 -71097 2466 -31852 -46058 4543 -12649 -14459 -48105 -77173 -114716 -167415 -16189 42100
1707 42100 37704 -88742 -83860 -42319 -106013 -5941 13406 -18481 51904 -17150 -39481 30914
1695 30914 59416 50578 -5947 19651 -33760 9756 -50546 -78922 -143660 -35153 -54377 -80306
1683 -80306 -95439 -83117 -12218 15376 -90786 -103927 -29764 -92718 -101206 -33866 -55617 -61932
1671 -61932 -58308 -92419 -44605 -21671 -56755 -19747 -73691 -63416 5687 118980 42374 56014
1659 56014 77026 -57148 -70533 -106684 192 -121863 -17890 66437 46570 -67408 -151337
1648 -151337 57468 164740 33239 -34700 -73451 27043 14343 -19389 41518 58448 -56921
$$ packed form
1730C1648m3034j14678J79537J8197j2237j30917j24400P2111k76J03045n0093
1719g1097P3563l4318j4206N0601j7192j810l3646k9068l7543n2699J51226N8289
1707D2100m396j26446M882M1541o3694J00072J9347l1887P0385o9054k2331P0395
1695C0914K8502q838n6525K5598n3411M3516o0302k8376o4738J08507j9224k5929
1683h0306j5133J2322P0899K7594j06162j3141P4163o2954q488O7340k1751o315
1671f1932L624l4111M7814K2934l5084L7008n3944J0275O9103J13293p6606J3640
1659E6014K1012j34174j3385l6151J06876j22055J03973Q4327j9867j13978q3929
1648a51337K08805J07272j31501o7939l8751J00494j2700l3732O0907J6930j15369
$$ plain form
1637 -56921 -50994 -68023 -59206 -41251 40205 58069 -32218 16971 -57907 -40006 -53758 -79366
1625 -79366 -165125 -132042 -83318 45273 33290 126503 79214 -7461 -26281 -9711 43715 32250
1613 32250 51420 -38973 -25667 -106345 -23235 16342 128959 10787 -46711 -87831 -153697
1602 -153697 -62278 -45746 -48463 -8700 14780 18351 -31593 -150618 -127890 -88678 -98156 62330
1590 62330 81771 -2009 -123041 6275 -2862 86827 -66406 -64349 -25539 -39300 -95159 -4415
1578 -4415 -66159 -95296 -88790 -106392 35859 61000 22628 -67352 5311 -94670 85867 131211
1566 131211 101910 8048 30909 24571 39181 34195 -48287 20386 89739 21616 -53688 -70594
1554 -70594 14930 -61857 -101266 -106073 -34269 38468 95433 -387 -43242 5573 -44364 -102671
$$ packed form
1637e6921N927j7029Q817J7955Q1456J7864r0287M9189p4878J7901j3752k5608
1625g9366q5759L3083M8724J28591j1983R3213m7289q6675j8820J6570N3426j1465
1613C2250J9170r0393J3306q0678Q3110L9577J12617j18172n7498m1120o5866
1602a53697R1419J6532k717L9763K3480L571m9944j19025K2728L9212r478J60486
1590F2330J9441q3780j21032J29316r137Q9689j53233K057L8810j3761n5859R0744
1578d415o1744k9137O506j7602J42251K5141l8372q9980P2663r9981J80537M5344
1566A31211k9301r3862K2861o338J4610m986q2482O8673O9353o8123p5304j6906
1554g0594Q5524p6787l9409m807P1804P2737N6965r5820m2855M8815m9937n8307
$$ plain form
1542 -102671 -35456 -26579 -88627 -39363 -117863 -147283 -130 106999 -932 -4157 31692
1531 31692 -19562 12574 70302 70300 56518 106580 62431 41450 -73687 -171386 -230626 -178036
1519 -178036 -89294 31327 -23642 -59181 -81768 -49746 34463 -48152 -37056 -68604 -87135
1508 -87135 -152998 -271403 -221780 -102334 -19799 -140318 -75598 57416 61340 -85388 58948
1497 58948 89973 -6843 -137511 -99779 12494 6773 -26566 -22204 -30025 -143993 -196972 -72868
1485 -72868 6796 -73633 -94783 -68209 -191531 -199849 -141961 -53107 -48305 -45905 -160494 -129456
1473 -129456 -97462 -54568 -5717 -668 21230 -63968 -37128 -35252 14056 -2386 -116659 -209080
1461 -209080 -149917 -112823 -41446 7325 63720 -66805 20338 -144148 -159181 -110657 -29301
$$ packed form
1542a02671O7215Q877o2048M9264p8500k9420J47153J07129j07931l225L5849
1531C1692n1254L2136N7728kj3782N0062m4149k0981j15137r7699n9240N2590
1519a78036Q8742J20621n4969l5539k2587L2022Q4209q2615J1096l1548j8531
1508h7135o5863j18405M9623J19446Q2535j20519O4720J33014L924j46728J44336
1497E8948L1025r6816j30668L7732J12273n721l3339M362p821j13968n2979J24104
1485g2868P9664q0429k1150K6574j23322q318N7888Q8854M802K400j14589L1038
1473a29456L1994M2894M8851N049K1898q5198K6840J876M9308j6442j14273r2421
1461b09080N9163L7094P1377M8771N6395j30525Q7143j64486j5033M8524Q1356
$$ plain form
1450 -29301 12070 -33128 -70445 87219 22519 42023 -70597 -33861 -46525 54230 29902
1439 29902 -91935 9964 -27090 -23709 -89179 -89597 -17058 -29318 -88758 -92071 -121817 -25331
1427 -25331 -89379 -30184 87056 -38046 14542 56538 26277 76199 8303 -54890 6535
1416 6535 -91304 -95815 -11049 -21365 -47769 -67053 26202 4980 -45969 -77000 7463 -57680
1404 -57680 -127970 -100705 -71923 -101903 -42597 -30060 30718 110770 37056 -35303 33305 144687
1392 144687 136025 115713 15668 -42085 17685 -1744 -16257 31174 50304 25271 -8229 -133327
1380 -133327 -46573 70610 -38964 -28478 -75088 -62656 -83939 -9188 -39641 -79951 -69371
1369 -69371 -24978 -26886 14672 73534 -74290 75168 -5739 -26126 33579 -42795 -88733 -88090
$$ packed form
1450b9301M1371m5198l7317J57664o4700J9504j12620L6736j2664J00755k4328
1439B9902j21837J01899l7054L381o5470m18P2539j2260n9440l313k9746R6486
1427b5331o4048N9195J17240j25102N2588M1996l0261M9922o7896o3193O1425
1416F535r7839m511Q4766j0316k6404j9284R3255k1222n0949l1031Q4463o5143
1404e7680p0290K7265K8782k9980N9306J2537O0778Q0052p3714p2359O8608J11382
1392A44687q662k0312j00045n7753N9770j9429j4513M7431J9130k5033l3500j25098
1380a33327Q6754J17183j09574J0486m6610J2432k1283P4751l0453m0310J0580
1369f9371M4393j908M1558N8862j47824J49458q0907k0387N9705p6374m5938O43
$$ plain form
1357 -88090 -33188 -52761 12275 -27826 -38740 4930 -64252 -10133 -140409 -65775 8844 -122675
1345 -122675 -78862 -58255 146867 5684 -64346 7883 -28513 -75509 -29411 -25099 -15079
1334 -15079 -61156 -11838 -16102 29121 1695 -28817 -82937 -31943 22731 32940 -1038 -12287
1322 -12287 10750 -39520 33754 -19691 72995 48841 91347 37384 19186 -4283 -93848 -41443
1310 -41443 -9008 -22064 -3746 28503 56648 -9680 78282 100702 91847 5365 126602 57071
1298 57071 33643 -35341 4871 -36519 -55656 63130 44421 8014 -37630 -56916 44912
1287 44912 -19412 -28072 -69531 -108631 -64924 -95080 -35307 3052 -73214 -33177 -108239 -121077
1275 -121077 -14672 32741 -6484 -33226 1221 -54292 71640 -77945 8215 36410 -101029
$$ packed form
1357h8090N4902j9573O5036m0101j0914M3670o9182N4119j30276P4634P4619j31519
1345a22675M3813K0607K05122j41183p0030P2229l6396m6996M6098M312J0020
1334a5079m6077M9318m264M5223k7426l0512n4120N0994N4674J0209l3978j1249
1322a2287K3037n0270P3274n3445R2686k4154M2506n3963j8198k3469q9565N2405
1310d1443L2435j3056J8318L2249K8145o6328Q7962K2420q855q6482J21237o9531
1298E7071k3428o8984M0212m1390j9137J18786j8709l6407m5644j9286J01828
1287D4912o4324q660m1459l9100M3707l0156N9773L8359p6266M0037p5062j2838
1275a21077J06405M7413l9225k6742L4447n5513J25932j49585Q6160K8195j37439
$$ plain form
1264 -101029 -157068 -77321 -66001 8873 45423 -73567 -70977 -12661 -78546 -219292 -169936
1253 -169936 -153573 -117762 -96190 -86276 -31140 -22994 86424 97173 -19011 -129862 -148679
1242 -148679 -21859 56320 44353 -98457 -145223 -134051 -3800 38732 -57687 -38285 75684
1231 75684 85814 28863 25594 -68816 -105717 -64357 -24660 -3098 41147 -2833 -2823 39716 -41739
1218 -41739 -11040 -1712 -39179 -24904 -249134 -109479 -68090 -89177 -154862 -81812 30885
1207 30885 -58106 -126 78386 31552 -27604 -77213 -118855 -122871 -87593 -34402 -27919 -37599
1195 -37599 -103189 -82785 -76989 -112752 -144502 -13248 -13994 14945 -27109 -65266 139210 44796
1183 44796 2823 -56711 -103714 -128159 -84288 16645 102825 40769 -43724 80274 45436
$$ packed form
1264a01029n6039P9747J1320P4874L6550j18990K590N8316o5885j40746M9356
1253a69936J6363L5811K1572R914N5136Q146J09418J0749j16184j10851j8817
1242a48679J26820P8179j1967j42810m6766J1172J30251M2532r6419J9402J13969
1231G5684J0130n6951l269r4410l6901M1360L9697K1562M4245m3980J0M2539q1455
1218d1739L0699R328l7467J4275k24230J39655M1389k1087o5685P3050J12697
1207C0885q8991N7980P8512m6834n9156m9609m1642m016L5278N3191O483r680
1195c7599o5590K0404N796l5763l1750J31254p46K8939m2054l8157K04476r4414
1183D4796m1973n9534m7003k4445M3871J00933Q6180o2056q4493J23998l4838
$$ plain form
1172 45436 -43575 -23896 -52632 -121220 -17842 -2741 -5817 64713 687 -98194 -193141 -44567
1160 -44567 -22844 73292 111001 112462 83451 -44171 29139 -7680 -4303 -86097 -119991 -126631
1148 -126631 -108369 -172717 -46232 -21553 -102712 -123231 -92667 -48690 -32056 -48546 -149813
1137 -149813 -105078 -7915 99142 34670 -47150 -99088 33683 113391 27357 -79558 -114382
1126 -114382 34690 34927 -11525 45504 19348 -7718 -16596 -29445 -13002 21720 -26425 -40582
1114 -40582 20907 77573 241101 50052 -8813 148347 -33293 13344 38513 35884 11218
1103 11218 -56942 -44276 -26873 -100033 -2270 -6710 76937 42448 -15746 -27541 46345 7779
1091 7779 -35903 43480 -42369 -10549 42494 -45304 -10858 36938 83592 103485 78317 79917
$$ packed form
1172D5436q9011J9679k8736o8588J03378J5101l076P0530o4026r8881r4947J48574
1160d4567K1723R6136L7709J461k9011j27622P3310l6819L377q1794l3894o640
1148a26631J8262o4348J26485K4679q1159k0519L0564M3977J6634j6490j01267
1137a49813M4735R7163J07057o4472q1820n1938J32771P9708q6034j06915l4824
1126a14382J49072K37m6452N7029k6156k7066q878j2849J6443L4722m8145j4157
1114d0582O1489N6666J63528j91049n8865J57160j81640M6637K5169k629k4666
1103A1218o8160J2666J7403p3160R7763m440Q3647l4489n8194j1795P3886l8566
1091G779m3682P9383q5849L1820N3043q7798L4446M7796M6654J9893k5168J600
$$ plain form
1079 79917 44346 -32153 -28453 -99808 -100374 -73545 -68113 3636 27092 41178 -101909 -24492
1067 -24492 -3171 41578 -32379 -40240 -63617 -75750 -29860 32543 -3385 58560 88600 -18823
1055 -18823 -134534 -20686 -89658 -71174 -13609 86194 -15257 95240 40103 -96000 -174172
1044 -174172 -121092 -88119 61068 154219 94674 65274 7105 -8896 35008 55336 -24717
1033 -24717 -92334 -97110 -95219 -131402 -86161 -16334 94848 56049 -36005 -103505 -14792 -25042
1021 -25042 -110735 -57605 -56999 40627 50337 -60575 10770 -61441 8702 26065 -1929 -106207
1009 -106207 -95854 -54003 -58576 -46657 -115646 -181039 -107501 -177727 -186592 -48220 16604 12580
997 12580 -72071 -179012 -46400 -2654 -186937 -139586 -103971 -148692 -113430 -85626 -167788
$$ packed form
1079G9917l5571p6499L700p1355n66K6829N432P1749K3456J4086j43087P7417
1067b4492K1321M4749p3957p861k3377j2133M5890O2403l5928O1945L0040j07423
1055a8823j15711J13848o8972J8484N7565R9803j01451J10497n5137j36103p8172
1044a74172N3080L2973J49187R3151n9545k9400n8169j6001M3904K0328q0053
1033b4717o7617m776J891l6183M5241O9827J11182l8799r2054o7500Q8713j0250
1021b5042q5693N3130O06R7626R710j10912P1345p2211P0143J7363k7994j04278
1009a06207J0353M1851m573J1919o8989o5393P3538p0226q865J38372O4824m024
997A2580q4651j06941J32612M3746j84283M7351L5615m4721L5262K7804q2162
$$ plain form
986 -167788 -108275 -80601 -53152 -72514 -65827 55736 15662 -60575 -34639 1987 -37700 48129
974 48129 48567 -111184 -77906 47980 21130 -77249 30741 24123 15059 14598 -76730 17523 -25850
961 -25850 96159 52015 -23827 -58956 61085 19179 -24047 46601 112351 71291 -1024 16724
949 16724 83914 42623 -17944 79941 -74907 -172402 -65476 -4428 32260 49833 27506 35757
937 35757 22796 -61863 -96003 -63877 -3514 4535 24079 48113 29734 7408 -612 -34843
925 -34843 105616 -21956 -9289 39746 -27346 -88693 -56554 -59967 -74622 -141392 -100280 -40896
913 -40896 -35117 60300 72014 103577 -34338 18215 -132309 -53187 -57003 -23410 70045 54778
901 54778 -113548 -71634 -40902 -123623 -7798 -66877 -8380 -55486 31280 -92885 -81987
$$ packed form
986a67788N9513K7674K7449j9362O687J21563m0074p6237K5936L6626l9687Q5829
974D8129M38j59751L3278J25886k6850r8379J07990o618r064m61r1328R4253m3373
961b5850J22009m4144p5842l5129J20041m1906m3226P0648O5750m1060p2315J7748
949A6724O7190m1291o0567R7885j54848r7495J06926O1048L6688J7573k2327Q251
937C5757j2961q4659l4140L2126O0363Q049J9544K4034j8379k2326q020l4231
925c4843J40459j27572J2667M9035o7092o1347L2139l413j4655o6770M1112N9384
913d0896N779R5417J1714L1563j37915N2553j50524P9122l816L3593R3455j5267
901E4778j68326M1914L0732q2721J15825n9079N8497m7106Q6766j24165J0898
$$ plain form
890 -81987 44048 -19946 -37642 31163 99293 48052 -8177 9678 7371 27769 7045 -40924
878 -40924 -45885 -73612 -24257 -66841 -60075 -48792 -48662 9263 -54134 -106410 -147627 -51958 101930
865 101930 61063 -25775 -52860 -47009 22778 72928 3536 29388 33088 -30318 -47972 16145
853 16145 -66121 38936 42313 66854 -23451 -50638 368 -85494 -72289 30400 30554 35875
841 35875 68292 -33142 -43469 17425 118512 55883 -16347 10946 44611 54382 -57310 -24081
829 -24081 1469 42393 61514 15660 54796 89493 -22310 45771 -76296 -95472 67688
818 67688 -27071 -77795 40251 19485 100205 136596 -2932 2527 77199 77098 127911 204246
806 204246 -83258 -56476 -27701 5801 1130 29058 -2059 -2856 74613 -89405 34520 55412
$$ packed form
890h1987J26035o3994j7696O8805O8130n1241n6229J7855k307K0398k0724m7969
878d0924m961k7727M9355m2584O766J1283J30N7925o3397n2276m1217R5669J53888
865A01930m0867q6838k7085N851O9787N0150o9392K5852L700o3406j7654O4117
853A6145q2266J05057L377K4541r0305k7187N1006q5862J3205J02689J54N321
841C5875L2417j01434j0327O0894J01087o2629p2230K7293L3665R771j11692L3229
829b4081K5550M0924J9121m5854L9136L4697j11803O8081j22067j9176J63160
818F7688r4759n0724J18046k0766Q0720L6391j39528N459P4672j01N0813P6335
806B04246k87504K6782K8775L3502m671K7928l1117p97P7469j64018J23925K0892
$$ plain form
794 55412 -30782 46487 -27588 22233 5519 -123828 -10815 -43223 -141527 -97412 -97532 -93963
782 -93963 -16970 -128142 -94507 -87669 32079 -31950 -17122 73413 70960 -2687 35588 -23727
770 -23727 -41421 58741 1704 73580 54384 34897 60668 -84597 -106573 58023 54354 54078
758 54078 2340 -48205 70898 90739 -17664 78720 62758 49273 22166 3301 -89021 -22017
746 -22017 -5597 34258 69536 52324 26960 -38588 -8009 -35165 5434 76354 76097 27153
734 27153 26087 -16268 -15149 28968 -89939 -24818 19425 -47421 -93664 61644 43976 169273
722 169273 124358 -34894 39562 -34382 -1131 70127 -46469 -114005 -70812 73277 99979
711 99979 77464 -44524 43103 -22813 -106455 -24652 -8942 5923 -71337 11786 -44653 -23057
$$ packed form
794E5412q6194P7269p4075M9821j6714j29347J13013l2408r8304M4115j20L569
782i3963P6993j11172L3635O838J19748o4029J4828R0535k453p3647L8275n9315
770b3727j7694J00162n7037P1876j9196j9487K5771j45265k1976J64596l669k76
758E4078n1738n0545J19103J9841j08403R6384j5962j3485k7107j8865r2322O7004
746b2017J6420L9855L5278j7212k5364o5548L0579k7156M0599P0920k57m8944
734B7153j066m2355J119M4117j18907O5121M4243o6846m6243J55308j7668J25297
722A69273m4915j59252P4456p3944L3251P1258j16596o7536M3193J44089K6702
711I9979k2515j21988Q7627o5916q3642Q1803J5710J4865p7260Q3123n6439K1596
$$ plain form
699 -23057 -26114 33909 81961 32826 11851 -16445 92435 91207 100980 72393 28140 4820
687 4820 54244 178198 34377 -23946 42713 7505 52180 127615 165836 93546 145995 116582
675 116582 32172 44317 92346 43649 99252 71248 91060 170055 47417 47464 33078 -7992
663 -7992 80770 228816 141848 41227 61976 -32359 -36410 58657 24627 67847 -2810 -11311
651 -11311 112648 58755 -157277 -163267 12890 70124 36096 144980 -7235 2326 -62714
640 -62714 -66197 -71258 -36675 124424 32791 53854 91495 99182 10999 -110424 -74241 18050
628 18050 -41176 -42283 99106 179909 113884 40747 -5888 89118 96233 130333 91053 -5145
616 -5145 -115484 -104117 -21292 -85901 73648 -2418 4529 -5961 -57294 -68336 -23435 73160
$$ packed form
699b3057l057O0023M8052m9135k0975k8296J08880j228R773k8587m4253k3320
687D820M9424J23954j43821n8323O6659l5208M4675P5435L8221p2290N2449k9413
675A16582q4410J2145M8029m8697N5603k8004J9812P8995j22638M7j4386m1070
663g992Q8762J48046q6968j00621K0749r4335m051R5067l4030M3220p0657q501
651a1311J23959n3893k16032n990J76157N7234l4028J08884j52215R561o5040
640f2714l483n061L4583J61099r1633K1063L7641P687q8183j21423L6183R2291
628A8050n9226j107J41389Q0803o6025p3137m6635R5006P115L4100l9280r6198
616e145j10339J1367Q2825o4609J59549p6066O947j0490n1333j1042M4901R6595
$$ plain form
604 73160 40237 -8517 67636 107054 17931 88639 167186 116979 210331 103057 163099 194452
592 194452 152643 81464 139748 114131 66136 85650 31746 50131 -50474 23240 53291 -84505
580 -84505 -26816 24212 46161 -42296 36806 70384 18511 -37644 -76619 1893 6740 -15926
568 -15926 -56098 49469 65542 -9493 -23626 -73059 68925 108022 -12635 81830 25406
557 25406 60704 23655 4185 -42096 -130394 -42795 5922 -87107 65873 111846 113141 -87758
545 -87758 -114163 2489 20676 -33686 12180 14464 86953 92336 -43889 12811 102277 82595
533 82595 121684 73174 52081 96192 57130 41603 -32068 -3905 39111 105362 29749 98961
521 98961 103450 -36739 -58728 77176 190911 54322 -12497 7402 25569 131517 80039
$$ packed form
604G3160l2923m8754P6153L9418q9123P0708P8547n0207R3352j07274O0042L1353
592A94452m1809p1179N8284k5617m7995J9514n3904J8385j00605P3714L0051j37796
580h4505N7689N1028K1949q8457P9102L3578n1873n6155l8975P8512M847k2666
568a5926m0172J05567J6073p5035j4133m9433J41984L9097j20657R4465n6424
557B5406L5298l7049j9470m6281q8298Q7599M8717r3029J52980M5973J295k00899
545h7758k6405J16652J8187n4362M5866K284P2489N383j36225N6700Q9466j9682
533H2595L9089m8510k1093M4111l9062j5527p3671K8163M3016O6251p5613O9212
521I8961M489j40189k1989J35904J13735j36589o6819J9899J8167J05948n1478
$$ plain form
510 80039 91572 110383 143956 172159 108618 108200 102723 31627 154438 110852 28680 96917
498 96917 53241 62319 74534 38437 106469 91376 42199 81366 109162 83659 44516 -36657
486 -36657 68897 143438 -1807 22813 -15687 -39666 -30249 92404 -11486 66509 -53340
475 -53340 -84165 48138 7177 -110338 -37881 7136 -42614 -11883 -1145 121188 128777 82152
463 82152 83090 11180 72776 88133 70248 75862 53133 50193 28769 30432 -51628 -5388 91726
450 91726 63839 -9004 -143677 -114894 -31260 -45042 -70450 105969 70063 39385 17001 -22435
438 -22435 41760 87054 81805 94523 48404 35208 16151 -16077 44149 -38890 43844 52718
426 52718 25756 71386 146257 102469 42549 -19840 -21112 -35920 145073 81219 21696 -4382
$$ packed form
510H0039J1533J8811L3573K8203o3541m18n477p1096J22811m3586q2172O8237
498I6917m3676R078J2215l6097O8032j5093m9177L9167K7796k5503l9143q1173
486c6657J05554P4541j45245K4620l8500k3979R417J22653j03890P7995j19849
475e3340l0825J32303m0961j17515P2457M5017m9750L0731J0738J22333P589m6625
463H2152R38p1910O1596J5357j7885N614k2729k940k1424J663q2060M6240R7114
450I1726k7887p2843j34673K8783Q3634j3782k5408J76419l5906l0678k2384l9436
438b2435O4195M5294n249J2718m6119j3196j9057l2228O0226q3039Q2734Q874
426E2718k6962M5630P4871m3788n9920o2389j272j4808J80993o3854n9523k6078
$$ plain form
414 -4382 -30229 17687 -7381 51321 107664 48893 -1516 -16969 -48931 26473 58109 6687
402 6687 -13309 -24893 16614 42040 131727 27136 5996 -19737 69057 136501 55999 -52880
390 -52880 45867 39908 -21162 4531 58565 88667 -56407 -146444 15607 75526 94397 117580
378 117580 61043 13042 104979 145489 18607 -8323 -1903 33204 114897 -27051 -43962 -51631
366 -51631 -58773 23502 12093 41167 121706 30030 -49318 116675 106512 -22610 -70906 22920
354 22920 89015 63482 -13750 -47071 25724 70216 123054 -4363 -7914 14875 -18119 -8696
342 -8696 35886 -17841 -60846 44825 136145 75419 74356 96791 -55349 -117052 -31267 58647
330 58647 45785 61438 36618 132331 -4612 -34118 68165 155395 36124 -6695 -142923
$$ packed form
414d382k5847M7916k5068N8702N6343n8771n0409j5453l1962P5404L1636n1422
402F687j9996j1584M1507K5426Q9687j04591k1140k5733Q8794O7444q0502j08879
390e2880R8747n959o1070K5693N4034L0102j45074r0037J62051N9919J8871K3183
378A17580n6537m8001R1937M0510j26882k6930O420L5107Q1693j41948j6911p669
366e1631p142Q2275j1409K9074Q0539r1676p9348J65993j0163j29122m8296R3826
354B2920O6095k5533p7232l3321P2795M4492N2838j27417l551K2789l2994R423
342h696M4582n3727m3005J05671R1320o0726j063K2435j52140o1703Q5785Q9914
330E8647j2862J5653k4820R5713j36943k9506J02283Q7230j19271m2819j36228
$$ plain form
319 -142923 -12658 59510 58348 43055 94829 143354 38624 39434 21254 -35745 5011 28763
307 28763 -2240 12454 -10629 -48247 -734 78866 148339 -23421 -29045 12884 15912 -16008
295 -16008 13667 1971 64919 29102 -106710 24736 65428 59927 164156 35367 30061 48404
283 48404 95737 61785 -67477 -13353 6217 -27124 54365 133512 115297 135320 99968 66655
271 66655 -20026 -52374 42677 42794 28113 -23888 1486 19014 -998 -25890 51389 27424
259 27424 -13640 15497 95764 104221 19994 6974 18057 2558 -73672 46488 114747 78152
247 78152 20632 54228 -30678 34565 82389 20155 -14348 20143 74491 97991 143968 107496
235 107496 85886 107579 -12191 9158 -43363 -10905 26293 -16929 -50444 -12764 110799
$$ packed form
319a42923J30265P2168j162j5293N1774M8525j04730Q10j8180n6999M0756K3752
307B8763l1003J4694k3083l7618M7513P9600O9473j71760n624M1929L028l1920
295a6008K9675j1696O2948l5817j35812J31446M0692n501J04229j28789n306J8343
283D8404M7333l3952j29262N4124J9570l3341Q1489P9147j8215K0023l5352l3313
271F6655q6681l2348R5051J17j4681n2001K5374J7528k0012k4892P7279k3965
259B7424m1064K9137Q0267Q457q4227j3020J1083j5499p6230J20160O8259l6595
247G8152n7520L3596q4906O5243M7824o2234l4503L4491N4348K3500M5977l6472
235A07496k1610K1693j19770K1349n2521L2458L7198m3222l3515L7680J23563
$$ plain form
224 110799 123165 45821 160302 22678 140597 76218 -5244 92691 114295 101177 70356
213 70356 124846 66900 -36831 -75282 4404 -26830 -16656 3653 -42501 16000 85956 93543
201 93543 5766 6752 32637 151191 153074 -46170 -60051 66329 -29083 -55859 26849 118619
189 118619 183502 208003 116643 128477 39603 69084 48074 40950 91784 14793 71595 125890
177 125890 249906 146073 70075 12030 30435 14111 -4228 10747 12782 35258 11279 16619
165 16619 50214 166917 149569 53467 54695 85050 3516 70073 -71790 -71627 -50424 29872
153 29872 83393 -126103 42332 109777 57499 11708 -35822 -48087 7879 13910 14100 42032
141 42032 18325 34811 43112 -79126 8632 8055 26780 58470 -64447 -91032 -21095 14546
$$ packed form
224A10799J2366p7344J14481j37624J17919o4379q1462R7935K1604j3118l0821
213G0356N4490n7946j03731l8451P9686l1234J0174K0309m6154N8501O9956P587
201I3543q7777R86K5885J18554J883j99244j3881J26380r5412k6776Q2708R1770
189A18619O4883K4501r1360J1834q8874K9481k1010p124N0834p6991N6802N4295
177A25890J24016j03833p5998n8045J8405j6324j8339J4975K035K2476k3979N340
165A6619L3595J16703j7348r6102J228L0355q1534O6557j41863J63K1203Q0296
153B9872N3521k09496J68435O7445n2278m5791m7530j2265N5966O031J90K7932
141D2032k3707J6486Q301j22238Q7758n77J8725L1690j22917k6585O9937L5641
$$ plain form
129 14546 160058 117471 77120 -55039 61402 16342 37532 -25866 49388 78225 -20905
118 -20905 26455 45692 53523 42699 64890 84941 113220 130329 102180 83524 69302 25439
106 25439 38984 40509 98713 66164 19570 25480 103855 28708 37502 43070 58071 19767 37565
93 37565 -6738 -1341 127 19847 99090 95776 25332 76211 103467 119084 121297 70917 73998
80 73998 47145 8891 93452 175110 141325 140550 32400 16226 15258 58876 53706 64608 115975
67 115975 -2946 10164 64608 28045 43733 48215 45396 24641 26424 -19705 2799 71837
55 71837 90976 106306 51529 4878 68771 -15800 31227 66194 37103 28709 109223 83793
43 83793 27661 -8545 -8599 1482 109913 144784 44216 136762 162051 119268 121675 131913 96774
$$ packed form
129A4546J45512m2587m0351j32159J16441m5060K1190o3398P5254K8837r9130
118b0905M7360J9237P831j0824K2191K0051K8279J7109k8149j8656j4222m3863
106B5439J3545J525N8204l2549m6594N910P8375p5147Q794N568J5001l8304J7798
93C7565m4303N397J468J9720P9243l314p0444N0879K7256J5617K213n0380L081
80G3998k6853l8254Q4561Q1658l3785p75j08150j6174r68M3618n170J0902N1367
67A15975j18921J3110N4444l6563J5688M482k819k0755J783m6129K2504O9038
55G1837J9139J5330n4777m6651O3893q4571M7027L4967k9091q394Q0514k5430
43H3793n6132l6206n4J0081J08431L4871j00568R2546K5289m2783K407J0238l5139
$$ plain form
30 96774 85353 49007 30422 60106 34237 24186 21239 -33315 1358 -46820 103483 83669
18 83669 -12053 61703 -39744 -43442 27732 56556 123059 70213 67846 47164 79455 -12453
6 -12453 25349 86099 55589 121230 87072 66306
0 66306
$$ packed form
30I6774j1421l6346j8585K9684k5869j0051k947n4554L4673m8178J50303j9814
18H3669r5722P3756j01447l698P1174K8824O6503n2846k367k0682L2291r1908
6a2453L7802O0750l0510O5641l4158k0766
0F6306
$$ Imaginary data points
##PAGE= N=2
##DATA TABLE= (X++(I..I)), XYDATA
$$ plain form
16383 -2387894 -2434302 -2446134 -2340833 -2342106 -2337804 -2180415 -2151048 -2178483 -2117171 -2052609 -2100098
16372 -2100098 -2037423 -2057556 -2042744 -1965255 -1940329 -1913233 -1884853 -1844825 -1848843 -1791277 -1798627 -1785861
16360 -1785861 -1715247 -1718563 -1659546 -1625492 -1671613 -1671396 -1645667 -1601594 -1587533 -1461258 -1447421 -1470842
16348 -1470842 -1406371 -1304363 -1360217 -1367983 -1300449 -1367852 -1354727 -1297276 -1209507 -1282974 -1218572
16337 -1218572 -1136824 -1177573 -1145585 -1130994 -1095219 -1022525 -1064463 -1086244 -974632 -986574 -934417
16326 -934417 -935868 -895895 -955701 -937597 -887621 -847327 -706092 -712572 -724327 -773851 -786134 -767308
16314 -767308 -740386 -771497 -679798 -585276 -583029 -476821 -456060 -480825 -503264 -468779 -442429
16303 -442429 -445123 -341394 -260461 -329959 -320093 -188315 -213184 -164307 -258012 -278869 -211832
$$ packed form
16383b387894m6408j1832J05301j273M302J57389K9367k7435O1312O4562m7489
16372b100098O2675k0133J4812P7489K4926K7096K8380M0028m018N7566p350J2766
16360a785861P0614l316N9017L4054m6121K17K5729M4073J4061J26275J3837k3421
16348a470842O4471J02008n5854p766O7534o7403J3125N7451Q7769p3467O4402
16337a218572Q1748m0749L1988J4591L5775P2694m1938k1781J11612j1942N2157
16326i34417j451L9973n9806J8104M9976M0294J41235o480j1755m9524j2283J8826
16314g67308K6922l1111R1699R4522K247J06208K0761k4765k2439L4485K6350
16303d42429k694J03729Q0933o9498R866J31778k4869M8877r3705k0857O7037
$$ plain form
16292 -211832 -254269 -286223 -143978 -73140 -146972 -141778 -93576 -62104 44662 -59797 -7138
16281 -7138 75290 133324 77042 106074 168219 143144 198888 128620 264649 256402 210535 166974
16269 166974 248828 225695 293549 285180 222671 275093 295882 395858 456281 455640 389688 492945
16257 492945 505372 536517 531159 623374 549810 603758 760877 697166 721817 656408 677270
16246 677270 698110 720396 799930 760679 773587 791841 755844 750987 832210 835587 910630 924778
16234 924778 901166 923938 893991 984641 983604 876416 949242 915024 927056 882198 995506
16223 995506 1066835 1042962 1036567 968406 1016834 974219 1016311 1035785 1136142 1114975 1046440
16212 1046440 1121857 1152253 1116299 1098077 1192606 1270849 1223714 1184516 1287239 1211780 1208514
$$ packed form
16292b11832m2437l1954J42245P0838p3832N194M8202L1472J06766j04459N2659
16281g138Q2428N8034n6282K9032O2145k5075N5744p0268J36029q247m5867m3561
16269A66974Q1854k3133O7854q369o2509N2422K0789R9976O0423o41o5952J03257
16257D92945J2427L1145n358R2215p3564N3948J57119o3711K4651o5409K0862
16246F77270K0840K2286P9534l9251J2908J8254l5997m857Q1223L377P5043J4148
16234I24778k3612K2772k9947R0650j037j07188P2826l4218J2032m4858J13308
16223I95506P1329k3873o395o8161M8428m2615M2092J9474J00357k1167o8535
16212A046440P5417L0396l5954j8222R4529P8243m7135l9198J02723p5459l266
$$ plain form
16201 1208514 1294851 1282472 1219492 1269823 1319383 1252946 1335217 1430748 1434301 1289858 1282992
16190 1282992 1400453 1418079 1351461 1289194 1298791 1396619 1447619 1432789 1384576 1406614 1486471
16179 1486471 1542710 1520671 1449430 1469911 1507840 1538046 1601819 1420676 1547267 1632859 1601929
16168 1601929 1582367 1528465 1517876 1522673 1489802 1487378 1591872 1684843 1558633 1554412 1703985
16157 1703985 1784058 1749780 1779540 1578221 1653936 1728970 1668812 1658153 1585915 1561203 1650557
16146 1650557 1665455 1667007 1695031 1681207 1704280 1755961 1847512 1737647 1694529 1839025 1837905
$$ packed form
16201A208514Q6337j2379o2980N0331M9560o6437Q2271R5531L553j44443o866
16190A282992J17461J7626o6618o2267R597R7828N1000j4830m8213K2038P9857
16179A486471N6239k2039p1241K0481L7929L0206O3773j81143J26591Q5592l0930
16168A601929j9562n3902j0589M797l2871k424J04494R2971j26210m221J49573
16157A703985Q0073l4278K9760k01319P5715P5034o0158j0659p2238k4712Q9354
16146A650557J4898J552K8024j3824K3073N1681R1551j09865m3118J44496j120
$$ [...]
##END NTUPLES=NMR SPECTRUM
##END=
