##TITLE=1H_EC-3330(31)
 CDCl3
 8 sc, 
 5.8.2024
##JCAMPDX= 6.0         $$ Bruker NMR JCAMP-DX V2.0
##DATA TYPE= NMR SPECTRUM
##DATA CLASS= NTUPLES
##ORIGIN= UXNMR, Bruker Analytische Messtechnik GmbH
##OWNER= root
$$ XWIN-NMR		Version 3.5
$$ Mon Aug  5 14:19:22 2024 Russian Standard Time (UT+4h)  she@DPX200
##.OBSERVE FREQUENCY= 200.1313
##.OBSERVE NUCLEUS= ^1H
##.ACQUISITION MODE= SIMULTANEOUS
##.ACQUISITION SCHEME= undefined
##.AVERAGES= 8
##.DIGITISER RES= 18
##SPECTROMETER/DATA SYSTEM= spect
##.PULSE SEQUENCE= zg30
##.SOLVENT NAME= Acetone
##.SHIFT REFERENCE= (INTERNAL, Acetone, 0, 21.5439)
##AUDIT TRAIL= $$ (NUMBER, WHEN, WHO, WHERE, WHAT)
$$ ##TITLE= Audit trail, XWIN-NMR		Version 3.5
$$ ##JCAMPDX= 5.01
$$ ##ORIGIN= Bruker BioSpin GmbH
$$ ##OWNER= she
$$ F:/spectra/data/she/nmr/H-F/1/pdata/1/auditp.txt
$$ ##AUDIT TRAIL=  $$ (NUMBER, WHEN, WHO, WHERE, WHAT)
(   1,<2024-08-05 14:18:03.96 +0400>,<she>,<DPX200>,
      <created by zg, POWCHK disabled, PULCHK disabled
       configuration hash MD5:
       00 E9 B6 7A A2 85 ED C7 34 08 36 98 17 FE 4E 26
       data hash MD5: 16K
       16 7E 57 75 5F 23 8B E5 80 45 77 6F CB 27 CD DC>)
(   2,<2024-08-05 14:18:06.53 +0400>,<she>,<DPX200>,
      <Start of raw data processing
       efp BC_mod = 2 LB = 0.24 FT_mod = 6 PKNL = 1 PHC0 = -25637.26 PHC1 = 13.98749 SI = 16K 
       data hash MD5: 16K
       CD 34 52 94 F7 DF 14 C5 43 A1 B5 52 AA 89 95 28>)
(   3,<2024-08-05 14:18:25.20 +0400>,<she>,<DPX200>,
      <pk PHC0 = 1.033637 PHC1 = -1.8 
       data hash MD5: 16K
       1B 32 B2 27 49 2B 86 A7 13 D3 B7 1E 10 E1 EF 47>)
(   4,<2024-08-05 14:18:29.21 +0400>,<she>,<DPX200>,
      <abs ABSG = 5 
       data hash MD5: 16K
       2B 6C 83 AF 14 98 82 67 68 EC 1D A2 A0 DB 4B 52>)
$$ ##END=
$$ 
$$ hash MD5
$$ A6 D4 56 B2 72 10 50 FD D3 26 AE FD 82 50 02 5C
##$RELAX= 
##$RELAX= 
##$RELAX= 
##$RELAX= 
##$RELAX= 
##$RELAX= 
$$ Bruker specific parameters
$$ --------------------------
##$DU= <F:/spectra>
##$EXPNO= 1
##$NAME= <H-F>
##$PROCNO= 1
##$TYPE= <nmr>
##$USER= <she>
##$AMP= (0..31)
100 100 100 100 100 100 100 100 100 100 100 100 100 100 100 100 100 100 
100 100 100 100 100 100 100 100 100 100 100 100 100 100 
##$AQSEQ= 0
##$AQ_mod= 1
##$AUNM= <au_zg>
##$AUTOPOS= <>
##$BF1= 200.13
##$BF2= 200.13
##$BF3= 200.13
##$BF4= 200.13
##$BF5= 200.13
##$BF6= 200.13
##$BF7= 200.13
##$BF8= 200.13
##$BYTORDA= 1
##$CFDGTYP= 0
##$CFRGTYP= 5
##$CHEMSTR= <none>
##$CNST= (0..31)
1 1 145 1 1 1 1 1 1 1 1 1 1 1 1 1 1 1 1 1 1 1 1 1 1 1 1 1 1 1 1 1 
##$CPDPRG= <>
##$CPDPRG1= <>
##$CPDPRG2= <>
##$CPDPRG3= <>
##$CPDPRG4= <mlev>
##$CPDPRG5= <mlev>
##$CPDPRG6= <mlev>
##$CPDPRG7= <mlev>
##$CPDPRG8= <mlev>
##$CPDPRGB= <>
##$CPDPRGT= <>
##$D= (0..31)
0 1.2 0 0 0 0 0 0 0 0.06 0 0.03 0 0 0 0 0.0002 0 0 0 0 0 0 0 0 0 0 0 0 
0 0 0 
##$DATE= 1722853083
##$DBL= (0..7)
120 120 120 120 120 120 120 120 
##$DBP= (0..7)
150 150 150 150 150 150 150 150 
##$DBP07= 0
##$DBPNAM0= <>
##$DBPNAM1= <>
##$DBPNAM2= <>
##$DBPNAM3= <>
##$DBPNAM4= <>
$$ [...]
##$SUBNAM3= <"">
##$SUBNAM4= <"">
##$SUBNAM5= <"">
##$SUBNAM6= <"">
##$SUBNAM7= <"">
##$SUBNAM8= <"">
##$SUBNAM9= <"">
##$SW= 24.0689771365484
##$SWIBOX= (0..15)
0 0 2 0 0 0 0 0 0 0 0 0 0 0 0 0 
##$SW_h= 4816.95568400771
##$TD= 16384
##$TD0= 1
##$TE= 0
##$TE2= 300
##$TE3= 300
##$TEG= 300
##$TL= (0..7)
0 120 120 120 120 120 120 120 
##$TP= (0..7)
150 150 150 150 150 150 150 150 
##$TP07= 0
##$TPNAME0= <>
##$TPNAME1= <>
##$TPNAME2= <>
##$TPNAME3= <>
##$TPNAME4= <>
##$TPNAME5= <>
##$TPNAME6= <>
##$TPNAME7= <>
##$TPOAL= (0..7)
0.5 0.5 0.5 0.5 0.5 0.5 0.5 0.5 
##$TPOFFS= (0..7)
0 0 0 0 0 0 0 0 
##$TUNHIN= 0
##$TUNHOUT= 0
##$TUNXOUT= 0
##$USERA1= <user>
##$USERA2= <user>
##$USERA3= <user>
##$USERA4= <user>
##$USERA5= <user>
##$V9= 5
##$VALIST= <valist>
##$VCLIST= <CCCCCCCCCCCCCCC>
##$VD= 0
##$VDLIST= <DDDDDDDDDDDDDDD>
##$VPLIST= <PPPPPPPPPPPPPPP>
##$VTLIST= <TTTTTTTTTTTTTTT>
##$WBST= 1024
##$WBSW= 4
##$XGAIN= (0..3)
0 0 0 0 
##$XL= 0
##$YL= 0
##$YMAX_a= 572711
##$YMIN_a= -467224
##$ZGOPTNS= <>
##$ZL1= 120
##$ZL2= 120
##$ZL3= 120
##$ZL4= 120
##$ABSF1= 21.54094
##$ABSF2= -2.528267
##$ABSG= 5
##$ABSL= 3
##$ALPHA= 0
##$AQORDER= 0
##$ASSFAC= 0
##$ASSFACI= 0
##$ASSFACX= 0
##$ASSWID= 0
##$AUNMP= <proc_1d>
##$AZFE= 0.1
##$AZFW= 0.1
##$BCFW= 0
##$BC_mod= 2
##$BYTORDP= 0
##$COROFFS= 0
##$CY= -3
##$DATMOD= 1
##$DC= 0
##$DFILT= <>
##$DTYPP= 0
##$F1P= 0
##$F2P= 0
##$FCOR= 1
##$FTSIZE= 16384
##$FT_mod= 6
##$GAMMA= 0
##$GB= 0
##$INTBC= 1
##$INTSCL= 3.70164e-10
##$ISEN= 128
##$LB= 0.24
##$LEV0= 0
##$LPBIN= 0
##$MAXI= 10000
##$MC2= 0
##$MEAN= 0
##$ME_mod= 0
##$MI= 1.114404
##$NCOEF= 0
##$NC_proc= -5
##$NLEV= 6
##$NOISF1= 3.799351
##$NOISF2= 2.8
##$NSP= 0
##$NTH_PI= 0
##$NZP= 0
##$OFFSET= 21.54388
##$PC= 1
##$PHC0= -25636.23
##$PHC1= 12.18749
##$PH_mod= 1
##$PKNL= yes
##$PPARMOD= 0
##$PSCAL= 0
##$PSIGN= 0
##$REVERSE= no
##$SF= 200.129396914291
##$SI= 16384
##$SIGF1= 3
##$SIGF2= 2
##$SINO= 5.538805
##$SIOLD= 16384
##$SREGLST= <1H.CDCl3>
##$SSB= 0
##$STSI= 16384
##$STSR= 0
##$SW_p= 4816.95568400771
##$SYMM= 0
##$S_DEV= 0
##$TDeff= 16384
##$TDoff= 0
##$TI= <>
##$TILT= no
##$TM1= 0
##$TM2= 0
##$TOPLEV= 0
##$USERP1= <user>
##$USERP2= <user>
##$USERP3= <user>
##$USERP4= <user>
##$USERP5= <user>
##$WDW= 1
##$XDIM= 16384
##$YMAX_p= 356651520
##$YMIN_p= -874265
$$ End of Bruker specific parameters
$$ ---------------------------------
##NTUPLES= NMR SPECTRUM
##VAR_NAME=  FREQUENCY,     SPECTRUM/REAL,   SPECTRUM/IMAG
##SYMBOL=    X,             R,               I
##VAR_TYPE=  INDEPENDENT,   DEPENDENT,       DEPENDENT
##VAR_FORM=  AFFN,          ASDF,            ASDF
##VAR_DIM=   16384,         16384,           16384
##UNITS=     HZ,            ARBITRARY UNITS, ARBITRARY UNITS
##FACTOR=    0.29402158847633, 1,            1
##FIRST=     4311.56380418302, 0,            0
##LAST=      -505.391879824693, 0,           0
##MIN=       -505.391879824693, -874265,     0
##MAX=       4311.56380418302, 356651520,    0
$$ Real data points
##PAGE= N=1
##DATA TABLE= (X++(R..R)), XYDATA
$$ [...]
5283D6290l6126L5602J0508j9058n5918j0678N9806n5255O6365o3528k1904K7340
5271a6556j3208l1504K86J0678K0974j8347o397K6782P0220m5809M3041P8437
5259A18597j34829j1492p974L7636J5007r92N799k5133L6146k1939o304K2454
5247B6976L6932n451n4240k8590J04874k0915n3856L3950n1623P1443M7913n1108
5235E6305j349K3317K815j5777j0221J8628j3556K8127P404q2454J06262l5396
5223H4105K7596J24981m6470m1061L29l2138j5821j1151p3948P8167O5840n0560
5211A09869n1750J8482m8378l3912N1804l3728N3016M9276o4462m6459k7851m415
5199b8508N9774l2770o5297K8583L6429j1007K1129k2608J6965p2570P0343r265
$$ plain form
5283 46290 10164 45766 56274 37216 -18702 -29380 30426 -24829 41536 -21992 -43896 -16556
5271 -16556 -29764 -61268 -60982 -50304 -29330 -47677 -54074 -27292 42928 -2881 40160 118597
5259 118597 -16232 -27724 -35698 1938 16945 15953 21752 -3381 32765 10826 4522 26976
5247 26976 63908 58457 4217 -24373 80501 59586 5730 39680 -11943 59500 107413 56305
5235 56305 54956 78273 81088 65311 55090 73718 60162 88289 95693 13239 119501 84105
5223 84105 111701 236682 190212 149151 149480 117342 101521 90370 16422 94589 160429 109869
5211 109869 58119 76601 28223 -5689 46115 12387 65403 114679 50217 3758 -24093 -28508
5199 -28508 31266 -1504 -66801 -38218 -1789 -12796 8333 -14275 2690 -69880 463 -8802
5187h802n6229J6753P6650K06r1663P5876O4671l5535j710j1322N4553L5102k118
5174A16432j23867J8684L6233J1302q3666j04419J16874k304j6440J8825P8945
5163F6599M0414l9054j6664m4068J3478J3300Q3347o3643k2496M4469j5727l3368
5151B6587J5513p438N1670K8820J1534k1501n8925M8174o2395p8919k78Q0361
5139C3203N7867J2575n6699j7458K5729K2264m1731N9047m3102n6055l461N4098
5127D6277K9423K5801l1025l4735Q4261o8387l6972J4056m2131K8261J1947L2145
5115E8921m9953r153K3020J4492n4185N3120K8976n1112M1164K8418j0171l9791
5103C3746j6801K5122o3311M5308M0465Q590n749l1831J1806L5708J6144K2167
$$ plain form
5187 -8802 -65031 -48278 28372 28578 -63085 12791 77462 41927 40217 28895 83448 118550 116432
5174 116432 -7435 11249 47482 58784 -24882 -129301 -12427 -14731 -31171 -12346 66599
5163 66599 107013 67959 51295 7227 20705 34005 117352 53709 31213 75682 59955 26587
5151 26587 42100 34662 86332 115152 126686 105185 46260 94434 32039 -46880 -47158 33203
5139 33203 91070 103645 46946 29488 55217 77481 35750 94797 51695 -4360 -7821 46277
5127 46277 75700 101501 70476 35741 120002 51615 14643 28699 -13432 14829 26776 58921
5115 58921 8968 -185 22835 37327 -16858 36262 65238 14126 55290 83708 73537 33746
5103 33746 16945 42067 -21244 24064 64529 73119 67370 35539 47345 83053 99197 121364
5091A21364J7862J385J4718l3320o0126m2893J10389Q711l1576j5135O8212j5131
5079A44460R609k0454n6223k6292L6550l5267J6071K6387j03854k4415N5670J0768
5067C3010N1915N8044m8234n023k1265M7304P6761m0242j6806k0080n1409l6247
5055B7728Q9061O4067n365K4464p2751R4155q4180J9648R1994j1833j4881o2828
5043A59279k8909L9092j3930J2155k5112K4144l5573O3242Q4410k6177J9117K1996
5031B93734p2825M1173J3004j1023o8253J07626N3041j049Q2918p6011j76O2613
5019D24772M6733q637k3530j4618J02009m53K7652L9495P9715m1640m3751R4755
5007F82502R7812Q143J60134K4772K5762m5906l0097n025q0310M3283k224J6939
$$ plain form
5091 121364 139226 140611 155329 122009 61883 18990 129379 138090 106514 91379 159591 144460
5079 144460 154069 133615 77392 51100 87650 52383 68454 94841 -9013 -33428 22242 33010
5067 33010 84925 142969 94735 89712 68447 115751 192512 152270 135464 115384 63975 27728
5055 27728 116789 180856 175491 199955 127204 221359 137179 156827 248821 236988 222107 159279
5043 159279 130370 169462 155532 167687 142575 166719 131146 194388 278798 252621 271738 293734
5031 293734 220909 262082 275086 264063 195810 303436 356477 355428 438346 362335 362159 424772
5019 424772 471505 462868 439338 424720 526729 526276 553928 593423 673138 631498 587747 682502
5007 682502 780314 788457 948591 973363 999125 953219 923122 918097 837787 881070 878846 895785
4995H95785p6697p2424R6191N854Q7357O6923O6926J10949N7618R0754Q6412P7764
4983A493412K5462k4932q7062q1332j33562j16378j54182p2656o216J7560N0508
4972I10622j43231m8349R1601l878Q3331P8265J9625N0189K7448j6832p4435p7870
4960H96486M862o1708p9997j18140l4075L9060j22245M7364j9166m3670J067J0187
4948E20025J6782N4744j3624k3542j4929p6581k7945K21P969M5562O2434k9442
4936E21674m8069j5732k5384O9984L7332M3702r231o17o9239K368M2044q506l6130
4923E04196q466P6584n7467p0931K2020O9922j03435P769Q7970k4101l3206L0333
4911E01188L5361k1803p5858Q036m8748j1214l5625P2519N3332r1841m3126P6605
$$ plain form
4995 895785 819088 746664 842855 848709 936066 1002989 1069915 1180864 1238482 1329236 1415648 1493412
4983 1493412 1518874 1493942 1406880 1325548 1191986 1075608 921426 848770 842554 860114 910622
4972 910622 767391 719042 810643 806765 890096 968361 987986 1038175 1065623 1048791 974356 896486
4960 896486 901348 839640 759643 641503 607428 646488 524243 571607 552441 508771 509838 520025
4948 520025 536807 591551 577927 554385 539456 462875 434930 435151 443120 488682 551116 521674
4936 521674 473605 457873 432489 502473 539805 583507 574276 573659 504420 506788 548832 540326 504196
4923 504196 495730 572314 514847 443916 465936 535858 432423 440192 528162 504061 470855 501188
4911 501188 536549 514746 438888 446924 398176 386962 351337 423856 477188 385347 342221 418826
4899D18826M3321k696l1888n4457p689M0951j2577Q5508k1841m9219l3362k2039
4887C52838R1400N9188j2031K109o6063n8705P003J6027O3555m1800o0066M5944
4875C99399J7413L9561K1235l6304k5009J2443O2318m5638P065M5342J7475P460
4863E22760n4667J5870L4055j5732R7818q718o2918l4989J0345q742O0038j8172
4851E36948k7923r726Q0400l9155k4392O9880j5405j144M5160M0102n4770M5213
4839F45188Q2636j4449N866k611m4610j9873P7749K7278J7042N0095r6077n0061
4827F78173O1243M3031N1559q262L0355N6761K4452J6767j3243l559N4455K2862
4815A014594j06981J64016P0115m4715K0346N3715O1999N9238J1939P080J00856
$$ plain form
4899 418826 462147 459451 427563 373106 365417 406368 393791 479299 457458 408239 374877 352838
4887 352838 444238 503426 491395 493504 427441 368736 375739 391766 455321 413521 353455 399399
4875 399399 416812 456373 477608 441304 416295 428738 491056 445418 452483 497825 515300 522760
4863 522760 468093 483963 518018 502286 600104 591386 528468 493479 503824 495082 555120 536948
4851 536948 509025 499299 579699 540544 516152 586032 570627 569483 614643 654745 599975 645188
4839 645188 727824 713375 719241 716630 672020 652147 729896 757174 774216 824311 728234 678173
4827 678173 739416 782447 834006 825744 856099 912860 937312 954079 940836 937277 991732 1014594
4815 1014594 907613 1071629 1141744 1097029 1117375 1171090 1233089 1292327 1304266 1311346 1412202
4804A412202K8388K4210J54550P2259P3406N2700O0321J13938J24919J44071J90625
4793B451589K67461K00736K99597K14563J86369j08568j45617j36765j20727m9993
4783C058645o543J7596m549J336J21511J19959J28104K14342K48256K71195K98396
4772D468248M84390N20179N67704N13884K25206j45613l97643n15767l79844k40302
4762E100442j05078j87006p4592K5450L6962N3467J85875K17514K15220K79790
4752E748044K68846L02134L13664K93102K51783M9945k5946j32036r6661j22551
4742F850324K1078J15116J38821K11270J71049K96532L77891M75008N49660M86057
4732I692806M39842L30401K87398M20882M16885N88267O45531O63099R65711J104802
$$ plain form
4804 1412202 1440590 1464800 1619350 1691609 1765015 1817715 1878036 1991974 2116893 2260964 2451589
4793 2451589 2719050 2919786 3219383 3433946 3620315 3511747 3366130 3229365 3108638 3058645
4783 3058645 3052102 3069698 3065149 3066485 3187996 3307955 3436059 3650401 3898657 4169852 4468248
4772 4468248 4952638 5472817 6040521 6554405 6779611 6633998 6236355 5720588 5340744 5100442
4762 5100442 4995364 4808358 4733766 4759216 4796178 4849645 5035520 5253034 5468254 5748044
4752 5748044 6016890 6319024 6632688 6925790 7177573 7227518 7201572 7069536 6972875 6850324
4742 6850324 6871402 6986518 7125339 7336609 7507658 7804190 8182081 8657089 9206749 9692806
4732 9692806 10132648 10463049 10750447 11171329 11588214 12176481 12822012 13485111 14450822 15555624
4722A5555624J251680J580697J925953K155472K227676K214410J562215N77438
4714B9051165k53349p30165r66218q88004o17395m87339j09272K54874O63232
4705B5917529J040225J442652J922853K425140K985303L527723L976311L986918
4697D7224654L055255R70510j560536l464952m099905l955059l437076k901335
4689C1831556k293415j717336j162436o84749l03040j00582L51987N18108R80596
4680B7420689J297340J241781Q98403M9832j070517k099017k543829k586073k307699
4671B0300910k105729j787853j518130j370395j187112r04470r20692q32963p57225
4662H916341o69361n37077n87149m93640l77924l21958l44383k92556l09185k47243
$$ plain form
4722 15555624 16807304 18388001 20313954 22469426 24697102 26911512 28473727 29051165
4714 29051165 28797816 28067651 27101433 26213429 25596034 25108695 24999423 25254297 25917529
4705 25917529 26957754 28400406 30323259 32748399 35733702 39261425 43237736 47224654
4697 47224654 50279909 51250419 49689883 46224931 42125026 38169967 34732891 31831556
4689 31831556 29538141 27820805 26658369 25973620 25670580 25569998 25921985 26440093 27420689
4680 27420689 28718029 29959810 30858213 30908045 29837528 27738511 25194682 22608609 20300910
4671 20300910 18195181 16407328 14889198 13518803 12331691 11427221 10506529 9673566 8916341
4662 8916341 8246980 7709903 7122754 6629114 6251190 5929232 5584849 5292293 4983108 4735865
4652D735865k66784j90596j35850j80052k10125j13643j63762j38834j47893j27914
4642C060412r2180j42740r7668j77659k4973n2740r3292j6509j12981j55440k3170
4631B071060j06234n0798j12716n2532o2417l7297M343r7608O3816P07N0869j49903
4619A521290q9198L4701j06668m5680M8817m661q8788L454l3713j3767p6285J6591
4607A166093j23522l7739K0884O5468o0194O5529J2339j55182N5748q938j6055
4596I84431k2667m5579n5458L4792m7322j2346L9731n9411k3381P8318J9160j0061
4584H80207j2947p174n4800K277j738L6912l9373k2130L0600k238m6954l5042
4572G27600j40j0788J04759R602M0226p2086R962L5264P0418K199j01828K4055
$$ plain form
4652 4735865 4469081 4278485 4142635 3962583 3752458 3638815 3475053 3336219 3188326 3060412
4642 3060412 2968232 2825492 2727824 2550165 2525192 2472452 2379160 2362651 2249670 2094230 2071060
4631 2071060 1964826 1914028 1801312 1748780 1686363 1649066 1653409 1555801 1619617 1620324 1671193 1521290
4619 1521290 1432092 1466793 1360125 1314445 1363262 1358601 1269813 1273267 1239554 1225787 1149502 1166093
4607 1166093 1042571 1004832 1025716 1091184 1030990 1096519 1108858 953676 1009424 1000486 984431
4596 984431 961764 916185 860727 895519 848197 835851 875582 816171 792790 871108 890268 880207
4584 880207 867260 860086 805286 807563 805825 842737 803364 781234 811834 809596 762642 727600
4572 727600 727460 716672 821431 831033 871259 799173 809135 844399 914817 917016 815188 839243
4560H39243l6973O9739l7697L5283n019p3265L2830j17718l4685J8005O644m6770
4548F49617J44907K8151k0435K1140M5448n7158l514k2785p9991M1552l4616l2008
4536F80308O379K0650O4526m0672p1417j8457j7664O0265n4795l1378Q6592k9320
4524F55017k0454l4334j8342O4640J3789r828k6980K2930l9274O9112m7287M5179
4512F74168p1894L1277n3394M6680L6808m868K6530o7903m55M6389l3256k510
4500F27572K6862m2091J6478n2604N1466l5443M2959M1141j0858q278L2185J06584
4488G95973K4746l1103r314k1778k922P8067n9944j0539j8449N465M5798K660
4476G98660k0388J0260N6452J2681j4627L2718J4408j0451K5739O7367l3804O8510
$$ plain form
4560 839243 802270 872009 834312 869595 864576 791311 824141 706423 671738 689743 696387 649617
4548 649617 794524 822675 802240 823380 868828 811670 808156 785371 705380 746932 712316 680308
4536 680308 686687 707337 771863 731191 659774 641317 623653 683918 629123 597745 684337 655017
4524 655017 634563 600229 581887 646527 660316 650488 623508 646438 607164 676276 628989 674168
4512 674168 602274 633551 580157 626837 663645 658777 685307 617404 616949 663338 630082 627572
4500 627572 654434 612343 628821 576217 627683 592240 635199 676340 665482 657204 689389 795973
4488 795973 820719 789616 780302 758524 755602 833669 773725 763186 744737 750202 796000 798660
4476 798660 778272 788532 844984 857665 843038 875756 890164 879713 905452 972819 939015 1007525
4464A007525Q4631K69o9196N0154L2842p6928L9640M404j2230M2057o1565j0795
4452A030808m5772l6920M3599L5266K6719n3876K6811M3703N3422L4443J5422
4441A173625o148O1572j09746k1761k7244L4700O9556M6614o2247k0441j5284
4430A123196O3020L5967j275P60m4265L129k5727L8271N8133m4316J06603j5957
4418A297539m988K3662j2168P578n1882M8834O2865Q762J8863M2680R4229M7552
4406A583526n799N1046k0596N252P0325P3876o061m343J18891M2476L8295N4971
4394B001859J6544Q3371M1679L6175J56237R9251P9705J83300J06583J68456J16721
4383C089881R3466M3481k2154N7690J6777J37071Q8911N9708J31537Q6236K04647
$$ plain form
4464 1007525 1092156 1092425 1023229 1073383 1106225 1029297 1068937 1073341 1061111 1103168 1041603 1030808
4452 1030808 985036 948116 991715 1026981 1053700 999824 1026635 1070338 1123760 1158203 1173625
4441 1173625 1167477 1229049 1119303 1097542 1070298 1104998 1174554 1221168 1158921 1138480 1123196
4430 1123196 1186216 1222183 1220908 1221668 1177403 1180532 1154805 1193076 1251209 1206893 1313496 1297539
4418 1297539 1292551 1316213 1304045 1311623 1259741 1308575 1371440 1380202 1399065 1441745 1535974 1583526
4406 1583526 1577727 1628773 1608177 1613429 1683754 1757630 1751569 1747226 1866117 1908593 1946888 2001859
4394 2001859 2018403 2101774 2143453 2179628 2335865 2435116 2514821 2698121 2804704 2973160 3089881
4383 3089881 3183347 3226828 3204674 3262364 3279141 3416212 3505123 3564831 3696368 3782604 3987251
4372C987251K28238J76607J81303K40742K77319M26109M77809M68983N44037N38355
4362G546753L06603J05991j30334k23874k39458j05661J09397M4005Q3964K10112
4352G707498J94829J78216M33761L59933M89448O26669P47041R43927R43930R85468
4342A3610720R32819P97077M26361M3926m3382J11975J70160M97491P07841R59260
4332A8214248J191006J458490J926122K347318K650774L030365K931797K064222
4324C5814342Q28258n07247j198547j387589j383115j194854r90674p13527k83285
4315B8983762J08957N67112J121032J697721K328975L184516L965777M656246
4307D6614098M791372L323211K43690k765685m277501m506308m127043l687021
$$ plain form
4372 3987251 4215489 4392096 4573399 4814141 5091460 5517569 5995378 6464361 7008398 7546753
4362 7546753 7853356 7959347 7829013 7605139 7365681 7260020 7369417 7413422 7497386 7707498
4352 7707498 7902327 8080543 8514304 8874237 9363685 9990354 10737395 11681322 12625252 13610720
4342 13610720 14543539 15340616 15766977 15810903 15767521 15879496 16049656 16547147 17254988 18214248
4332 18214248 19405254 20863744 22789866 25137184 27787958 30818323 33750120 35814342
4324 35814342 36642600 36135353 34936806 33549217 32166102 30971248 29980574 29267047 28983762
4315 28983762 29092719 29659831 30780863 32478584 34807559 37992075 41957852 46614098
4307 46614098 51405470 54728681 54972371 52206686 47929185 43422877 39295834 35608813
4299C5608813l130182k616643k068157j507233j095014o74157k06083N9405M81202
4290B4851951Q23604J207961J255546R81354J89133r97499j932176k271905k191080
4281B1916889k108073j948309j661151j350988j211790j080174q23692o59409
4273A1073303n28117m23043l66026k59153j92895k63202k86310l36352l76108
4264H042097l66724l74764l93106l12213k50995k02540j96842k19213r2576l0576
4254E602548p3930L5493q9484j84565j38669j45166j95901k13326r8231k10146
4244D288623j41081o0519j14857j56402n8947p6324K6283n2385m6636o4753r5303
4233C447699L1134j20200M5438j6015j7810M8331j35599N0365r3131n1183l0790
$$ plain form
4299 35608813 32478631 29861988 27793831 26286598 25191584 24517427 24311344 24370749 24851951
4290 24851951 25675555 26883516 28139062 29120416 29309549 28312050 26379874 24107969 21916889
4281 21916889 19808816 17860507 16199356 14848368 13636578 12556404 11732712 11073303
4273 11073303 10545186 10122143 9756117 9496964 9304069 9040867 8754557 8418205 8042097
4264 8042097 7675373 7300609 6907503 6595290 6344295 6141755 5944913 5725700 5633124 5602548
4254 5602548 5528618 5564111 5474627 5290062 5151393 5006227 4810326 4597000 4498769 4288623
4244 4288623 4147542 4087023 3972166 3815764 3756817 3680493 3706776 3654391 3607755 3543002 3447699
4233 3447699 3478833 3358633 3404071 3388056 3370246 3418577 3282978 3333343 3240212 3189029 3158239
4222C158239n5956k275l2467L6048M4284k4503k3573P0259N2510L6792N1765L0092
4210C341215O3194O4807N0896J35915K5347K6133R321k9975n2480q6248K9273
4199C577398R1717P7063o533Q0049O4272J67220K02409J73334Q9904N9149l5583
4188D540399J5728l0213n0308m0403O3947P6653J00837P6779K02971J46148L07584
4177E410122J87331O2486P8723R7425m4725k5375p7044j41668j04423k30462q9927
4166E122463n1133l1864l4262J5683J52863J33578J50133j7494j03877j04684
4156E231406j18827j29519j49265m6247r3863M6083j805k724j12818j0703j144
4145D610574J00761Q0388O843P7630J19026J43062O4836N2534K16815J49402J66750
$$ plain form
4222 3158239 3102283 3100008 3067541 3103589 3147873 3123370 3099797 3170056 3222566 3259358 3311123 3341215
4210 3341215 3404409 3469216 3520112 3656027 3681374 3707507 3716828 3686853 3634373 3548125 3577398
4199 3577398 3669115 3746178 3739645 3819694 3883966 4051186 4253595 4426929 4516833 4575982 4540399
4188 4540399 4556127 4525914 4475606 4435203 4499150 4575803 4676640 4753419 4956390 5102538 5410122
4177 5410122 5597453 5659939 5738662 5836087 5791362 5765987 5688943 5547275 5442852 5212390 5122463
4166 5122463 5071330 5039466 5005204 5020887 5173750 5307328 5457461 5439967 5336090 5231406
4156 5231406 5112579 4983060 4833795 4787548 4693685 4739768 4737963 4735239 4622421 4611718 4610574
4145 4610574 4711335 4791723 4798566 4876196 4995222 5138284 5203120 5255654 5472469 5621871 5788621
4134E788621J75182J95824J48351J90753J85630K62476J97311K66389K27368L66383
4124H004288L52097K68564M25306L46674L01567M72290M64169M83973M01665O55109
4114A2175702N41687O69584Q18073P53388P80982P61546P88911Q35909J012926
4105A9138708J117919J168492J356918J512857J701794J866607J833491J765669
4097C1462455J758873J536739J249141J238943J085521Q72998P25426P07825Q43581
4088D1481502R48648J027239J102675J307508J554059J790734K338453K837592
4080E4388410L142196L010923K901716L128924L668667M121870M414851M693841
4072H3471398N153540N852699O631673P016021O998083O969168P106327N827216
$$ plain form
4134 5788621 5963803 6159627 6307978 6498731 6684361 6946837 7144148 7410537 7637905 8004288
4124 8004288 8356385 8624949 9050255 9396929 9698496 10170786 10634955 11118928 11520593 12175702
4114 12175702 12717389 13386973 14205046 14958434 15739416 16500962 17289873 18125782 19138708
4105 19138708 20256627 21425119 22782037 24294894 25996688 27863295 29696786 31462455
4097 31462455 33221328 34758067 36007208 37246151 38331672 39204670 39930096 40637921 41481502
4088 41481502 42430150 43457389 44560064 45867572 47421631 49212365 51550818 54388410
4080 54388410 57530606 60541529 63443245 66572169 70240836 74362706 78777557 83471398
4072 83471398 88624938 94477637 101109310 108125331 115123414 122092582 129198909 135026125
4064A35026125L351553P35094j618795m201132o602570p833302p564427p390500
4056A03902046p505236p149476o251806n271213m410380l127921j881264o00614
4048F7704136L57115Q74943M42736n98524j853315k965731l130091k697512k140655
4039E5993102j751580j359126j087262q43758m55942k23651K08635R28200J645463
4030E3054081K478880L055493K918006J750464k79669k243891l556586m572996
4022E2603782m538728l940291l260500k469785j970613j531172j262857r76526
4014C2653310n08327l5438M36255R63595J247307J111719K22485j313522k744052
4005C2033332l216444l067331k767197k383579k135444j734051j396509j142693
$$ plain form
4064 135026125 138377678 139112772 137493977 133292845 126690275 118856973 111292546 103902046
4056 103902046 96396810 89247334 82995528 77724315 73313935 70186014 68304750 67704136
4048 67704136 68061251 68936194 69378930 68780406 66927091 63961360 60831269 58133757 55993102
4039 55993102 54241522 52882396 51795134 50951376 50495434 50271783 50480418 51408618 53054081
4030 53054081 55532961 58588454 61506460 63256924 62977255 60733364 57176778 52603782
4022 52603782 48065054 44124763 40864263 38394478 36423865 34892693 33629836 32653310
4014 32653310 32144983 32109545 32545800 33509395 34756702 35868421 36090906 34777384 32033332
4005 32033332 28816888 25749557 22982360 20598781 18463337 16729286 15332777 14190084
3997A4190084j043702q81606p90684o86845n90786n11865n05405n05816n04158
3988H169217m24418k86814l17748l13495l48262k53900j96848k20246j70984j75434
3978E461068k61999j12068j39917j59796j89945j77561j18002k05057p2957q7018
3968C936748j83789K5605q0635j89802p7651k7163j15238j02474m2569j00309
3958C042723l229j18149j11403J6889q5421o0838j7653j51729j5248m1974j29312
3947B324656K8749o8947j15392L2709L773q6724m2464L988J6535k1244o3316k2252
3935A990071L785j4939j1801j13032N6493m1745j39665m1969k3518K5490k2604
3924A666566q0153n8231m2280q8080n148l2714n9470m5880k640O7115j423R570
$$ plain form
3997 14190084 13146382 12264776 11474092 10787247 10196461 9684596 9179191 8673375 8169217
3988 8169217 7744799 7457985 7140237 6826742 6478480 6224580 6027732 5807486 5636502 5461068
3978 5461068 5199069 5087001 4947084 4787288 4597343 4419782 4301780 4096723 4023766 3936748
3968 3936748 3752959 3778564 3697929 3508127 3430476 3403313 3288075 3185601 3143032 3042723
3958 3042723 3039494 2921345 2809942 2826831 2741410 2680572 2662919 2511190 2495942 2453968 2324656
3947 2324656 2353405 2284458 2169066 2201775 2205548 2118824 2076360 2080348 2096883 2075639 2012323 1990071
3935 1990071 1993856 1978917 1967116 1854084 1910577 1868832 1729167 1687198 1663680 1689170 1666566
3924 1666566 1586413 1528182 1485902 1397822 1392674 1359960 1300490 1254610 1251970 1319085 1317662 1327232
3912A327232p8091j579K648p7253j5290j20541j06994K8637J5246L9835q494l0009
3900I75347l2454q343l1911L3292m4359n6487K0954k2156k3620L6411K4568o8059
3888H03183k2283N026J1743m9906j5999J2959k101j0387j7246L533j8200O6656
3876G66978l4369o2287N397L0744m0345K9077K4352r8762l3466m3674R8282Q982
3864F50909P8767K3307q067l6022M6603k9290p6192J0206n1511N3394M8403J5277
3852G25784P530J1291q0272L7456O7130K1148N784j8673j2854J393L9082k0705
3840G84094J5583q537m1271k731R6659n770m4594L157L2228J1092K1667L5224
3828H96801j1578J2635K2603k6914j6025J587n7884m0930L2874j44K8275L9944
$$ plain form
3912 1327232 1249141 1247562 1250210 1172957 1157667 1037126 930132 958769 974015 1013850 1005356 975347
3900 975347 942893 934550 902639 935931 891572 835085 856039 833883 810263 846674 871242 803183
3888 803183 780900 785926 797669 747763 731764 744723 742622 732235 714989 718522 700322 766978
3876 766978 732609 670322 675719 706463 666118 695195 719547 620785 587319 543645 641927 650909
3864 650909 729676 752983 744916 708894 755497 726207 650015 660221 608710 662104 710507 725784
3852 725784 733314 744605 664333 701789 768919 790067 795851 777178 764324 765717 804799 784094
3840 784094 799677 791140 749869 747138 843797 838027 793433 796590 828818 839910 861577 896801
3828 896801 885223 897858 920461 893547 877522 879109 821225 780295 813169 813025 841300 881244
3816H81244k1806k2953M4986O4685r8381n723k8443m7222J0380M3927J5839j9676
3804H16857o2757K9790k5920N19P1803r4783K0106k2312l7588J2557j0179l7242
3792F60851J2549K6111k7836K2744L262R73K5119M8854n3941m8841N2239j267
3780G20817q9232n1538l2220J1057L6653j409K2664m4730l1203j6057j1144k0208
3768D93450L4128j2466k435O3003J8679q6488j8628k8864M3933L0491m9588J5148
3756E00363K5988k8496l6292Q1140o206j9586j4232Q5049K123m4020J3718J00691
3744F60240J2683M688M2652P6j1943q777j7094K0979O6577L2033m0348L6913j26623
3731F72056K0426L7875p4228J7138R69L5225k5725K1923L180Q396j04483J781
$$ plain form
3816 881244 859438 836485 881471 946156 847775 842052 813609 766387 776767 820694 836533 816857
3804 816857 754100 783890 757970 758489 830292 735509 755615 733303 695715 708272 698093 660851
3792 660851 673400 699511 671675 694419 697681 698654 723773 772627 718686 669845 722084 720817
3780 720817 631585 580047 547827 558884 595537 594128 616792 572062 540859 524802 513658 493450
3768 493450 527578 515112 512677 575680 594359 507871 489243 460379 504312 534803 485215 500363
3756 500363 526351 497855 461563 542703 536497 516911 502679 587728 589851 545831 559549 660240
3744 660240 672923 677611 720263 720339 708396 699619 682525 703504 770081 802114 761766 798679 672056
3731 672056 692482 730357 656129 673267 674236 709461 683736 705659 708839 717235 612752 614533
3719F14533O5591L4653j9745l0735Q625J149j1897k2010l623N674k9864K2626
3707F34977j4320J7513M2039l2895m0924L6211q6968K6149l2871M9823j2189J359
3695E87904R664l0684j10404J12562J8218r4059N6303p07r08l4998j1123K1437
3683E23205L2897q1575O0971k5241K1958M2776n4444M2027J03177o8551l5627
3672E61573k533l0850j8336R6098L5622k7885J0049K1805k4523n5725J3369O5163
3660F43827Q6505j3355o9212O8363m5809o7304N4004M6633K1874l562L4201M0359
3648G96524j0794K4828n9471o317j1684L2721O6899N3362o9089K8193N3305K6545
3636I25022O624L3976j9720k8352L9248L8599P3049o11m610K2140r749M5486K2287
$$ plain form
3719 614533 680124 714777 695032 664297 672922 674071 662174 640164 636541 642215 612351 634977
3707 634977 620657 638170 680209 647314 606390 642601 555633 581782 548911 598734 586545 587904
3695 587904 597568 566884 456480 569042 587260 493201 549504 548797 547889 512891 501768 523205
3683 523205 556102 474527 535498 510257 532215 574991 520547 562574 665751 597200 561573
3672 561573 559040 528190 509854 605952 641574 613689 623738 645543 621020 565295 578664 643827
3660 643827 730332 716977 647765 716128 670319 603015 657019 703652 725526 721964 756165 796524
3648 796524 785730 810558 751087 744770 733086 765807 832706 886068 816979 845172 898477 925022
3636 925022 931646 965622 945902 917550 956798 995397 1068446 1067835 1063225 1085365 1075616 1121102 1143389
3623A143389L0913J11747m9109K7861Q1557M1536k4441k6822l1167L1757N3555
3612A390776j9225L4454m7742R067N3730j02192Q4269P8618m5429M0909J1596
3601A488831R0363Q982n7365R900J5946M7621n0089r85M6399M34k4033J07130
3589A683134k1605N735k3492M1164M4888O3823N6587K3915J24722k2864K8857
3578B004864J0577M8262L0790L268M4363P9411J50142J13017J02034J28295L1393
3567B746416J21755Q1052O8655J24398J42303J15830J67875J11180J27552K32386
3557D039402J69538J77363K01591K45674K89242L68971K48679M99035N05992M61207
3547G206694M59698K20261K11886J14563P7808J67359K37353L26237L38563M86478
$$ plain form
3623 1143389 1174302 1286049 1236940 1264801 1346358 1387894 1363453 1336631 1305464 1337221 1390776
3612 1390776 1371551 1406005 1358263 1367330 1421060 1318868 1403137 1481755 1436326 1477235 1488831
3601 1488831 1579194 1588176 1530811 1540711 1556657 1604278 1554189 1553204 1599603 1600037 1576004 1683134
3589 1683134 1661529 1667264 1643772 1684936 1729824 1793647 1850234 1874149 1998871 1976007 2004864
3578 2004864 2015441 2063703 2094493 2097761 2142124 2221535 2371677 2484694 2586728 2715023 2746416
3567 2746416 2868171 2949223 3017878 3142276 3284579 3400409 3568284 3679464 3807016 4039402
3557 4039402 4208940 4386303 4587894 4833568 5122810 5491781 5740460 6239495 6745487 7206694
3547 7206694 7666392 7886653 8098539 8213102 8290910 8458269 8695622 9021859 9360422 9846900
3537I846900M98457N42204N95880P75466Q62895R62515R93743J109762J130718
3528A7318540Q35456Q37090P30120P79280J066927J494789J852903K324646K719881
3519B9959632K934001K570036J380953j88484j173489j379206j136634p87652
3511C2179157m52202o0404K1034J12371K69117O48969J326694K190397K876448
3502C9111581L509417L674381L066757J682299l09029k325194l655598l855652
3494D0898962l463418k846626k179646j501152r73082n26982n1420N93039J635273
3485C1584948K062888J194547m34436p13413n18170j402107k390174l057296l151165
3476B3175622k808984k352769k038709j688262j459261j154289j043315q89746
$$ plain form
3537 9846900 10345357 10887561 11483441 12258907 13121802 14084317 15078060 16187822 17318540
3528 17318540 18153996 18991086 19721206 20500486 21567413 23062202 24915105 27239751 29959632
3519 29959632 32893633 35463669 36844622 36656138 35482649 34103443 32966809 32179157
3511 32179157 31726955 31666551 31687585 31799956 32069073 32718042 34044736 36235133 39111581
3502 39111581 42620998 46295379 49362136 51044435 50735406 48410212 44754614 40898962
3494 40898962 37435544 34588918 32409272 30908120 29935038 29408056 29356636 29949675 31584948
3485 31584948 33647836 34842383 34407947 33694534 33176364 31774257 29384083 26326787 23175622
3476 23175622 20366638 18013869 15975160 14286898 12827637 11673348 10630033 9740287
3468I740287p64428o11028n59779n18425m80899l44051l10203l18718k91432k56702
3458E284622k46441k02976k24997j63061j64962j96399j80974j35896j5098j59924
3448C593894j09613j55185o7288q2434j36361j13156m234q0107j24228m6542p9441
3437B595305r7459K0435n4173l2423j5709n769r8211L5443O762M6964j9886l9175
3425B342104k4191m7216M1591K6760R8164J8607P4539J48391J03635j2011Q2683
3414B853056q5592p3569l1703m6299p2197k5757k2710j18670Q286J50818J538
3403B537201P8300Q5192p225J12492K1275n4206k4217q6929o0119j50754p3058
3392B377952n5907q7659n2534j12444m976k6411m25P308j6716O1975o3879K3203
$$ plain form
3468 9740287 8975859 8364831 7805052 7286627 6805728 6461677 6151474 5832756 5541324 5284622
3458 5284622 5038181 4835205 4610208 4447147 4282185 4085786 3904812 3768916 3753818 3593894
3448 3593894 3484281 3329096 3261808 3179374 3043013 2929857 2925623 2845516 2721288 2674746 2595305
3437 2595305 2497846 2518281 2464108 2431685 2415976 2410207 2311996 2347439 2354201 2401165 2381279 2342104
3425 2342104 2317913 2270697 2312288 2339048 2437212 2455819 2530358 2678749 2782384 2770373 2853056
3414 2853056 2767464 2693895 2662192 2615893 2543696 2517939 2495229 2376559 2384845 2535663 2537201
3403 2537201 2615501 2700693 2693468 2805960 2827235 2773029 2748812 2661883 2601764 2451010 2377952
3392 2377952 2322045 2234386 2181852 2069408 2064432 2038021 2037596 2044904 2028188 2090163 2026284 2049487
3380B049487q7507j15738q1467j84526p5101l2790j53364j0731m5089K8436L599
3369A295209o8982m9635m4351l0806o2668l640l7090o9858n1279N9457q3444j7774
3357H35139O7970J5661p5624n58n1726R473j6954N075n04m4412m1068m2186N6258
3344G16544J0146N9663p9141L16K523P33m454j8285l3801L7833L1695p0487k3881
3331F29404N222N0658J5145j6456L0165o547m7410J1106P0423k2099m7432Q0417
3319G52596j16054K5510L0637L6458l6434k0901k5550K3507Q819j7297K2237m2902
3307F40626l2894M9881Q7191m818k3663J4089k0434J12457m1908n9720L7146N7921
3295H15874m7461L2557L8965Q2391l0869l7942R5726r195k2131m3333k5457L7789
$$ plain form
3380 2049487 1961980 1846242 1764775 1580249 1505148 1472358 1318994 1308263 1263174 1291610 1295209
3369 1295209 1226227 1176592 1132241 1101435 1038767 1035127 998037 928179 876900 936357 852913 835139
3357 835139 903109 918770 843146 842588 790862 800335 783381 788456 787952 743540 702472 660286 716544
3344 716544 726690 786353 707212 707528 710051 710784 706330 688045 654244 692077 723772 653285 629404
3331 629404 634626 685284 700429 683973 714138 707591 660181 671287 741710 719611 672179 752596
3319 752596 636542 662052 692689 729147 692713 671812 646262 669769 678588 661291 683528 640626
3307 640626 607732 657613 744804 739986 716323 730412 709978 822435 780527 720807 757953 815874
3295 815874 768413 800970 839935 922326 891457 853515 949241 940046 917915 874582 849125 886914
3283H86914K3018p1230j3942M1939k6154N3508J23031q7379P952J4840k0864L6812
3271I68445L4238J41J3171l3513N8224m7086q3425M0120K4378m6913M2402N4620
3259A024802k439n1791M1053k5558P4143O5363j9771n4440J5613M3829J001j6078
3247A095727J3541l399J433J9020j5449K1273M8120m8810J7551N0291J7611L8108
3235A255017L338M2612l9804l5993N8330M7077N8876o574l866k48N2846J07523
3223A539134N7474j9194J15809O1782N7707p703j5706J37085K3060J51713J19093
3212B220254L9344M939J01000M5262J37785Q7773J21385J46995J26464J04693
3202C135894J08852J02736J31392J76739J85524J98749K23055L19645K41687K63552
$$ plain form
3283 886914 909932 838702 824760 866699 840545 894053 1017084 929705 937657 952497 931633 968445
3271 968445 1002683 1002824 1015995 982482 1040706 993620 910195 950315 974693 927780 970182 1024802
3259 1024802 1022363 970572 1011625 986067 1060210 1125573 1105802 1051362 1066975 1110804 1111805 1095727
3247 1095727 1109268 1105869 1107302 1126322 1110873 1132146 1180266 1131456 1149007 1199298 1216909 1255017
3235 1255017 1258355 1300967 1261163 1225170 1283500 1330577 1389453 1382879 1379013 1378765 1431611 1539134
3223 1539134 1596608 1577414 1693223 1755005 1812712 1805009 1789303 1926388 1949448 2101161 2220254
3212 2220254 2259598 2264537 2365537 2410799 2548584 2636357 2757742 2904737 3031201 3135894
3202 3135894 3244746 3347482 3478874 3655613 3841137 4039886 4262941 4582586 4824273 5087825
3192E087825K85127K99818L10941M21426M40275L23651L77500M85500N19833O75792
3182I227688O55192P15609O65076O02002O58919O15316O97717P26850P77398Q21555
3172A6163322R83736R57501R41888R17012O65186M98586L99956L19429M93749
3163B2340365N19586O21038O23048P50179N83892L32050k6213l08840l90086n26556
3153B4518463m36839k45922j77413l12039j82453k73280m16725p46354r77984
3144B0749454r94331j065942r89817q01702p02526o40243o78511n99955p94134
3135A3482293p76765q76261q16241p32336o90773n08361n42108n53752m85271
3126G500425l95195m04725m23779l34668l59656k81534k64896k92148k30479j93396
$$ plain form
3192 5087825 5372952 5672770 5983711 6405137 6845412 7169063 7546563 8032063 8551896 9227688
3182 9227688 9882880 10598489 11263565 11865567 12524486 13139802 13837519 14564369 15341767 16163322
3172 16163322 17147058 18104559 19046447 19963459 20628645 21127231 21527187 21846616 22340365
3163 22340365 22859951 23480989 24104037 24854216 25438108 25770158 25743945 25435105 25045019 24518463
3153 24518463 24081624 23835702 23658289 23346250 23163797 22890517 22473792 21727438 20749454
3144 20749454 19755123 18689181 17699364 16897662 16195136 15554893 14876382 14276427 13482293
3135 13482293 12705528 11829267 11013026 10280690 9589917 9081556 8539448 7985696 7500425
3126 7500425 7105230 6700505 6276726 5942058 5582402 5300868 5035972 4743824 4513345 4319949
3116D319949m7791j15251j70283j10054p0876j33824n0916n2804l1689p1947j14309
3105C350205m5005m1156r8365m6271k4781M2782L7806k9909p1504j042j10481
3094B962279l7584j03928r6926k2874m6800n930j9998j9957o679n1934r6153p0709
3082B382807k5555p1782n7095J6719J7771o4118o1212N257l6559M764l6888n3976
3070B020133m0397k310p0573Q9344j04r9423Q020l2301J5870P303p48o717n0168
3057A837929J378m0717k6067J12511j0635J7674O605r4941o0855O3755L9577l4786
3045A811428N3251j4487o2755J06938L3325n1114O3555j3469Q136L8802M5999
3034B019609k0814k4788o4417M4631N8328l617R046R6643J0761o3201k6098l1874
$$ plain form
3116 4319949 4272158 4156907 3986624 3876570 3805694 3671870 3620954 3568150 3536461 3464514 3350205
3105 3350205 3305200 3264044 3165679 3119408 3094627 3137409 3175215 3145306 3073802 3072760 2962279
3094 2962279 2924695 2820767 2723841 2700967 2654167 2648237 2628239 2608282 2601603 2549669 2453516 2382807
3082 2382807 2357252 2285470 2228375 2245094 2262865 2198747 2137535 2142792 2106233 2110997 2074109 2020133
3070 2020133 1979736 1977426 1906853 1996197 1996093 1896670 1904690 1872389 1888259 1895562 1894814 1888097 1837929
3057 1837929 1839307 1798590 1772523 1885034 1874399 1892073 1898678 1803737 1742882 1806637 1846214 1811428
3045 1811428 1864679 1850192 1787437 1894375 1927700 1876586 1940141 1926672 1934808 1973610 2019609
3034 2019609 1998795 1974007 1909590 1954221 2012549 2008932 2017978 2114621 2125382 2062181 2036083 2004209
3022B004209Q2520O4036M9570n02J9555M8106M9552J1494l4837M7347M0696N0951
3010B432697m0211o890Q0983l857J0692O0451O4461J0332K5964N817K0058P3004
2998B733501K0676L9383L1433M1803m400M773l0913J35441O0192M0684J4089J9133
2986C105795J18736O9229k3066N0660L5786Q8983N3079n9308Q7505P0380P1150
2975C668929j233O3748J42822K6823L5277J08502L5298P6534Q6571N5711J07776
2964D406758N3770l33Q2030P9682M9259M4522J52512N2714M3760J48415J9608
2953E132697J32899J61850M4004N7848J22662Q9760J60442J70169M9122R1610
2943F213063J51820J36202N6290J58915J18106J58465J31969J08412J23192J84965
$$ plain form
3022 2004209 2086729 2150765 2200335 2199833 2219388 2267494 2317046 2328540 2293703 2341050 2381746 2432697
3010 2432697 2392486 2385596 2466579 2462722 2473414 2533865 2598326 2608658 2634622 2640439 2660497 2733501
2998 2733501 2754177 2793560 2824993 2866796 2862396 2867169 2836256 2971697 3031889 3072573 3086662 3105795
2986 3105795 3224531 3293760 3270694 3321354 3357140 3446123 3499202 3439894 3527399 3597779 3668929
2975 3668929 3667696 3731444 3874266 3901089 3936366 4044868 4080166 4156700 4243271 4298982 4406758
2964 4406758 4460528 4460195 4542225 4621907 4671166 4715688 4868200 4920914 4964674 5113089 5132697
2953 5132697 5265596 5427446 5471450 5529298 5651960 5741720 5902162 6072331 6121453 6213063
2943 6213063 6364883 6501085 6557375 6716290 6834396 6992861 7124830 7233242 7356434 7541399
2933G541399J22687K10076J31845J50224J12305J57025K27733J83955Q4047J86150
2923I107446J62702J76689J97426K07941K21137J40768R7562K74307J72603P1346
2913A0829927K67320K41102K11912J86370K74842K02146J75917J70586J94338
2904A2754460J80469K38058J93425K41166J48206K18694K48697P7945J83724J94250
2894A4679094J35603J64999J95029P7134P9475J13834M1938J34846m256J0615
2884A5628311M0628J68442J922p5000K4470m8145j3657j1021k2273o9057n7975
2873A5566645r3492J2627j08484j73274j05637j81007j37407j87736j40101j13267
2863A4338867k32605j71845j18122j67005j48053k18201k36646j45821j52892
$$ plain form
2933 7541399 7664086 7874162 8006007 8156231 8268536 8425561 8653294 8837249 8921296 9107446
2923 9107446 9270148 9446837 9644263 9852204 10073341 10214109 10311671 10585978 10758581 10829927
2913 10829927 11097247 11338349 11550261 11736631 12011473 12213619 12389536 12560122 12754460
2904 12754460 12934929 13172987 13366412 13607578 13755784 13974478 14223175 14301120 14484844 14679094
2894 14679094 14814697 14979696 15174725 15251859 15331334 15445168 15487106 15621952 15617696 15628311
2884 15628311 15668939 15837381 15839303 15764303 15788773 15740628 15726971 15715950 15693677 15624620 15566645
2873 15566645 15473153 15485780 15377296 15204022 15098385 14917378 14779971 14592235 14452134 14338867
2863 14338867 14106262 13934417 13816295 13649290 13501237 13283036 13046390 12900569 12747677
2854A2747677k13478j50076j59594j56902k18526j99139j57063j84070j80380
2845A1128449k23319j87388j12750q5038k21035k42932j99196m4011j33946j50060
2835I528774j52589j42041j31179j65941j66944j15595q2506k20017q9467j63316
2825H099179q3575r5427q5229j00948j58054l0766r3410j30608n4982k5050n7501
2814G183629p6666j63441k640o963j30202O9973l9607q005J9677m8014o2782j1410
2802F723549M5044j0327j31335o1256N3509r7431j04336J7853m6738j8852m8818
2791F320862l6495o3401j12310l6986j39070k2233p0295o2499j08886m7915P183
2780E627955j38957L8640q105o9396L2886j4601N49m3149n544K749O6712n1155
$$ plain form
2854 12747677 12534199 12384123 12224529 12067627 11849101 11649962 11492899 11308829 11128449
2845 11128449 10905130 10717742 10604992 10519954 10298919 10055987 9856791 9812780 9678834 9528774
2835 9528774 9376185 9234144 9102965 8937024 8770080 8654485 8571979 8351962 8262495 8099179
2825 8099179 8015604 7920177 7834948 7734000 7575946 7545180 7451770 7321162 7266180 7241130 7183629
2814 7183629 7106963 6943522 6940882 6933919 6803717 6873690 6834083 6826078 6845755 6797741 6734959 6723549
2802 6723549 6768593 6758266 6626931 6565675 6619184 6521753 6417417 6435270 6388532 6369680 6320862
2791 6320862 6284367 6220966 6108656 6071670 5932600 5910367 5840072 5777573 5668687 5620772 5627955
2780 5627955 5488998 5527638 5519533 5450137 5483023 5468422 5468971 5425822 5420278 5423027 5489739 5438584
2768E438584K5567O1762P5500P0760m2986O2050k3925J685Q0243K3305q388O7066
2756E831223P2676J14828P114O632M1233R0706O8587N0445L8407L6628L6473P4576
2744F469528Q1129L0175J7731Q3867R2840J24349O9709J03840K15405J75062J33975
2733G597610N4600J50563J76611J47365K07490K38902K56836K18417K49059K48596
2723I546049J99066K30389K44832L01323L20981K98370K97883L87799L71783L91824
2713A2590299L49316M36849N15175N16885N37475P23211P54905P63407R06960
2704A8094482J003641J150736J299632J433595J600110J745564K098890K279689
2696C0706339K529466K792953L030110L419523L673383L939366M160257M005033
$$ plain form
2768 5438584 5464151 5525913 5601413 5672173 5629187 5691237 5667312 5668997 5749240 5772545 5764157 5831223
2756 5831223 5903899 6018727 6025841 6032473 6073706 6164412 6232999 6283444 6321851 6358479 6394952 6469528
2744 6469528 6550657 6580832 6598563 6682430 6775270 6899619 6969328 7073168 7288573 7463635 7597610
2733 7597610 7652210 7802773 7979384 8126749 8334239 8573141 8829977 9048394 9297453 9546049
2723 9546049 9745115 9975504 10220336 10521659 10842640 11141010 11438893 11826692 12198475 12590299
2713 12590299 12939615 13376464 13891639 14408524 14945999 15669210 16424115 17187522 18094482
2704 18094482 19098123 20248859 21548491 22982086 24582196 26327760 28426650 30706339
2696 30706339 33235805 36028758 39058868 42478391 46151774 50091140 54251397 58256430
2688E8256430L555872K787122J988988J076157M63407q8554l80115k52172o2734
2679F7344401R98O149m24892j113655j850535k628888l272372l914670l970568
2670E0175968l939836l657158l415829l166951k824747k498342k187468k265395
2662B6220242j915652j548866j400828j195637r71159q06160p97216n81827n91100
2653A6411797m60358l50731k96262l12694j59934r6626r8263p9249L69R0766L2311
2642A4681126O8148J26705K29864J33395K58673L43507K02225K75046L71228L77428
2632A7067345L53619M34362K67291M83856M86804L85229M38747M25455N13381
2623B0856089N13174M15695M51694N93500O26168P37204P12971P68858Q77585
$$ plain form
2688 58256430 61812302 64599424 66588412 67664569 68127976 68039422 67659307 67407135 67344401
2679 67344401 67345399 67351548 66926656 65813001 63962466 61333578 58061206 54146536 50175968
2670 50175968 46236132 42578974 39163145 35996194 33171447 30673105 28485637 26220242
2662 26220242 24304590 22755724 21354896 20159259 19188100 18381940 17584724 17002897 16411797
2653 16411797 15951439 15600708 15304446 14991752 14831818 14735192 14636929 14557680 14558049 14648815 14681126
2642 14681126 14749274 14875979 15105843 15239238 15497911 15841418 16043643 16318689 16689917 17067345
2632 17067345 17420964 17855326 18122617 18606473 19093277 19478506 19917253 20342708 20856089
2623 20856089 21369263 21784958 22236652 22830152 23456320 24193524 24906495 25675353 26552938
2614B6552938J001959J029013J215266J298861J437421J641134J806742K034394
2606C8017728K253185K628787K889577L225531L544799M178999M618295N251069
2598F6607970O042587O867636P718405Q639150R300720R661667R248047Q154085
2590A32240267O584922M562124K891421J321070M15353J67165M35281Q70500R75905
2581A50464008P96814j20418j622926l306653n108822o508583p409312p805805
2573A19378303p649678o980174o193547n366049m590958l962146l358609k700878
2565G8576264k166526j385477o73832J33033Q27169J702571K451868L244888M037284
2556H6747242M720523N308669N661094N700695N520791N170552M610505L933066
$$ plain form
2614 26552938 27554897 28583910 29799176 31098037 32535458 34176592 35983334 38017728
2606 38017728 40270913 42899700 45789277 49014808 52559607 56738606 61356901 66607970
2598 66607970 72650557 79518193 87236598 95875748 105176468 114838135 124086182 132240267
2590 132240267 138825189 143387313 146278734 147599804 148015157 148182322 148617603 149488103 150464008
2581 150464008 151260822 151140404 149517478 146210825 141102003 134593420 127184108 119378303
2573 119378303 111728625 104748451 98554904 93188855 88597897 84635751 81277142 78576264
2565 78576264 76409738 75024261 74350429 74483462 75310631 77013202 79465070 82709958 86747242
2556 86747242 91467765 96776434 102437528 108138223 113659014 118829566 123440071 127373137
2548A27373137L055238K001069J044288J11555p24679j382263j913335j963673
2540A27601337k320452k887662l426859l994876m654281n299069n896222o299630
2532I2822286o366813o286860o019907n433092n120457m537297m050901l489231
2524E1517728l084855k680730k411641k114257j868394j743816j749155j740372
2516C4124508j448252j210302q47364o99578l68762k35534k12228o2155j11649
2507B8928684p0065N2613P7047J07381J65123J36641K82428J23229J9913o0761
2497B9762233j20598l39710m46222l64877m56320n08113n90148n76335n10797
2488B5849113m61601m58441k43262q2677j0146J22881L11374M01044O27198P99053
$$ plain form
2548 127373137 130428375 132429444 133473732 133585287 132860608 131478345 129565010 127601337
2540 127601337 125280885 122393223 118966364 114971488 110317207 105018138 99121916 92822286
2532 92822286 86455473 80168613 74148706 68715614 63595157 59057860 55006959 51517728
2524 51517728 48432873 45752143 43340502 41226245 39357851 37614035 35864880 34124508
2516 34124508 32676256 31465954 30618590 29919012 29550250 29314716 29102488 29040333 28928684
2507 28928684 28858619 28911232 28988279 29095660 29260783 29397424 29679852 29803081 29822994 29762233
2497 29762233 29641635 29301925 28855703 28490826 28034506 27526393 26936245 26359910 25849113
2488 25849113 25387512 24929071 24685809 24603132 24592986 24715867 25027241 25428285 26055483 26854536
2478B6854536R39653J125175J365244J622461J914937K245070K567762K787090
2470D1421928L279156L424067L532072L539101L356454L259849K954630K483121
2462F7250378J980734J259982O90743K56671m2220l18474q65524j287870j771474
2453F7152946k360435l090176l589506l968924m177093m091294l951963l725657
2445C8197898l443623l110899k771765k374536k201902j842295j656278j408743
2437A9387857j222208j039242q57502o92454o54074n41733l84561l79114k70238
2428A3346731l09339k19246j84577j77612j87830j27910l779n4371j35943k9319
2418A1916805N4062j591R6925K5800J3002J8952j1593j58888j84168k26582l01419
$$ plain form
2478 26854536 27794189 28919364 30284608 31907069 33822006 36067076 38634838 41421928
2470 41421928 44701084 48125151 51657223 55196324 58552778 61812627 64767257 67250378
2462 67250378 69231112 70491094 71181837 71438508 71396288 71077814 70212290 68924420 67152946
2453 67152946 64792511 61702335 58112829 54143905 49966812 45875518 41923555 38197898
2445 38197898 34754275 31643376 28871611 26497075 24295173 22452878 20796600 19387857
2437 19387857 18165649 17126407 16268905 15576451 14922377 14380644 13996083 13616969 13346731
2428 13346731 13037392 12818146 12633569 12455957 12268127 12140217 12136438 12082067 11946124 11916805
2418 11916805 11970867 11969276 12066201 12092001 12105003 12123955 12112362 11953474 11769306 11542724 11241305
2407A1241305n13471l98308m04356m33822m42817m17507l45658l10225k68251
2398G706890l11032k52548k02675j17198k67416o1827p2331n0234m8053m2738
2388F280838o4964m5233r9259q384J1805O578M0212M5347n6634L7916P8912O2237
2376F289371N9873O6378O9052k6834O1813Q2811O6390Q7077k2310J05613R1694
2365F930928J12803M5196j2325O2123K2858q720j0801L8463p629M77K6673L2616
2353G232662O4247O31J03719J14528M8552J26701K65340O8038K07158K15828K31555
2342H678959K61364K74601L70561M14564M26151M04727M90606N64476O21297O88155
2332A3195461O87798P55930P98785Q03806P02198Q68580Q09875P39991Q41256
$$ plain form
2407 11241305 10727834 10329526 9925170 9491348 9048531 8631024 8285366 7975141 7706890
2398 7706890 7395858 7143310 6940635 6823437 6556021 6494194 6421863 6371629 6323576 6280838
2388 6280838 6215874 6170641 6071382 6062998 6074803 6081381 6121593 6166940 6110306 6148222 6227134 6289371
2376 6289371 6349244 6415622 6484674 6457840 6519653 6602464 6668854 6755931 6733621 6839234 6930928
2365 6930928 7043731 7088927 7076602 7138725 7161583 7152863 7142062 7180525 7172896 7173373 7200046 7232662
2353 7232662 7296909 7297540 7401259 7515787 7564339 7691040 7956380 8024418 8231576 8447404 8678959
2342 8678959 8940323 9214924 9585485 10000049 10426200 10830927 11321533 11886009 12507306 13195461
2332 13195461 13883259 14639189 15437974 16241780 16943978 17812558 18622433 19362424 20203680
2323B0203680R08487R08508R22876R91919Q96805P39015N01671O23864N33947
2314B7230772N53384P59678R66101J030694J194784J283123J420862J528758J825879
2305C7794035J923777K267931K560977K930652L166341L443154L946768M315628
2297F2349263M924865N587868O356033P114461Q109562R154632J0407993J2132994
2289A26137671J4308026J7241703K1309663K6478469L2593961L8895699M0361047
2282C17326239L0762224Q563057j5746808l1913012l9288439l8965245l3768385
2275A96969631k7938758k2749110j8684428j5394292j2839515j0804440r061796
2268G9497292p684126o311363n456390m543008l843593l246115k726578k301907
$$ plain form
2323 20203680 21112167 22020675 22943551 23935470 24832275 25571290 26072961 26696825 27230772
2314 27230772 27784156 28543834 29509935 30540629 31735413 33018536 34439398 35968156 37794035
2305 37794035 39717812 41985743 44546720 47477372 50643713 54086867 58033635 62349263
2297 62349263 67274128 72861996 79218029 86332490 94442052 103596684 114004677 126137671
2289 126137671 140445697 157687400 178997063 205475532 238069493 276965192 317326239
2282 317326239 348088463 356651520 340904712 308991700 269703261 230738016 196969631
2275 196969631 169030873 146281763 127597335 112203043 99363528 88559088 79497292
2268 79497292 71813166 65501803 60045413 55502405 51658812 48412697 45686119 43384212
2260D3384212j855230j476202j061897o89396l50041j74506m98411j141776j858521
2251C4278232k343846k245766k061722j902080j591033j290976j273913j166662
2243B0402234j007819r86476r22197p58371o37857o34382n73060n53876o74122
2234A3654074o59113o66601p06580n11476m95836n04286m81450m82394l53722
2225H792616k11694l82222l24247k73067k89560k68753k80349k40675k28888r9598
2215F193563j59139k67277j58263j56759j43480j35034j86066j15133j00553j86097
2205D585762n918p6349j40277j08285j73843p6677n8227j06784p2124j42346p4678
2194C550254n9105j17492m3182j21918j22784p0004J2269j67833q0535k0345l8357
$$ plain form
2260 43384212 41528982 40052780 38990883 38301487 37951446 37776940 37278529 36136753 34278232
2251 34278232 31934386 29688620 27626898 25724818 24133785 22842809 21568896 20402234
2243 20402234 19394415 18407939 17485742 16727371 16089514 15455132 14882072 14328196 13654074
2234 13654074 12994961 12328360 11621780 11110304 10614468 10110182 9628732 9146338 8792616
2225 8792616 8580922 8198700 7874453 7601386 7311826 7043073 6762724 6522049 6293161 6193563
2215 6193563 6034424 5767147 5608884 5452125 5308645 5173611 4987545 4872412 4771859 4585762
2205 4585762 4579844 4503495 4363218 4254933 4081090 4004413 3946186 3839402 3767278 3624932 3550254
2194 3550254 3491149 3373657 3330475 3208557 3085773 3015769 3028038 2860205 2779670 2759325 2720968
2183B720968j28210m8324j17339p2836k4809j6106M077j26922p8257q78n342j7032
2171B088990m0504q1529k5637q6236K9880l1923p9974m2005q3407R2966o5254
2160A675367q6401L6673o9520n0293q837L2482R5M3610o3563J9869K6176k8791
2148A526867r7380k9767q1645l2463l0554q342j07714J1738n7228n1267l914j27072
2136I11259r522M6621p213k9604N923j9413o6078o369J5529m2768P0436l4941
2124H33860k6589L435J087j8236O4264p0374j7341j0992O6150J0007k4836Q099
2112H18534n0737m3156m431K138J5170M1811l1990l7511l0462L4937M7447j9150
2100G42600j6448q358n001O5877n819p577l5803j3756O2397R068m5023j5519Q1459
$$ plain form
2183 2720968 2592758 2544434 2427095 2354259 2329450 2313344 2317421 2190499 2112242 2111364 2106022 2088990
2171 2088990 2048486 1966957 1941320 1855084 1884964 1853041 1773067 1731062 1647655 1740621 1675367
2160 1675367 1588966 1625639 1556119 1505826 1496989 1529471 1529566 1573176 1509613 1529482 1555658 1526867
2148 1526867 1429487 1399720 1318075 1285612 1255058 1246716 1139002 1150740 1093512 1042245 1038331 911259
2136 911259 901737 948358 941145 911541 917464 898051 831973 825604 841133 798365 868801 833860
2124 833860 807271 810706 811793 793557 857821 787447 770106 759114 825264 835271 810435 818534
2112 818534 767797 724641 720210 722348 737518 779329 747339 709828 679366 714303 761750 742600
2100 742600 726152 717794 712793 778670 772851 765274 729471 715715 778112 787180 742157 726638 808097
2087H08097O396L7875n4169l578O5765J8924L2008L2062J38008K3697P1809J06132
2075A283026Q7406M7068J50623J28846K72612J25654K7904q2127j01613j11441
2065A827958j95426j77565j28473j47023o9060j14940j09877m4310q1555J7060
2055G76789J3103j04624l8292m3782p2006L7935m2591L2504n3773j5917L6337
2044E25683k5134J2721l5680n5376j5840j9676L9739J5289o0911l8587j0879l836
2032C27513m088M23n1419L237N9213m3830O8299r7566j9574N8733p873n0861J4125
2019B56332n7274J657j3382N6426n1916P6812n4205m9978M6713o6703N7522l7915
2007A64089N7100K6922k8445M5144o2426r621l7293K5872J4815k9239q6N8170
$$ plain form
2087 808097 814493 852368 798199 794621 860386 879310 911318 943380 1081388 1105085 1176894 1283026
2075 1283026 1370432 1417500 1568123 1696969 1969581 2095235 2123139 2041012 1939399 1827958
2065 1827958 1632532 1454967 1326494 1179471 1110411 995471 885594 841284 759729 776789
2055 776789 789892 685268 646976 603194 531188 569123 526532 559036 505263 489346 525683
2044 525683 500549 513270 477590 422214 406374 386698 426437 441726 380815 342228 331349 327513
2032 327513 323425 323848 272429 275666 334879 291049 359348 261782 242208 300941 293068 242207 256332
2019 256332 199058 200715 187333 243759 191843 268655 214450 164472 211185 144482 202004 164089
2007 164089 221189 248111 219666 264810 202384 192763 155470 181342 196157 166918 166832 225002
1995B25002m9592m6219K8989l8398L5404M305J3613l3618o151k7228M3437M1211
1983A90755k9991l4823J8261j9368M5996L5082m9373m0972p979O973P9632Q249
1971B02442r2422o505L2505o8426J5748J6610l756j3289L7030j0813Q396l9252
1959G8268P3491K7552m3898n324m4754O3627l8880k7814J5524n0514J4569O83
1947F2530j9463R3386o9804k9329M3021o043q179o94J786j2555K0753k2750O501
1934E9160M0613n4848N855O6229m2965j0889m2763P9515J6486K394J6103l260
1922A31630L7677m2029l4321l6323K9458L688J2835n6220K1871J6668N150K7109
1910A17193o3396o2033K1654N0772Q322l2448N0696M3923j0314n5813j28490Q157
$$ plain form
1995 225002 175410 129191 158180 119782 155186 159491 173104 139486 133335 106107 149544 190755
1983 190755 160764 125941 144202 124834 170830 205912 156539 115567 107588 114561 194193 202442
1971 202442 110020 103515 136020 67594 83342 99952 96196 82907 119937 109124 117520 78268
1959 78268 151759 179311 135413 130089 85335 148962 110082 82268 97792 47278 61847 62530
1947 62530 43067 136453 66649 37320 80341 74298 66119 65425 67211 54656 75409 52659 59160
1934 59160 99773 44925 50780 117009 74044 63155 20392 99907 116393 118787 134890 131630
1922 131630 169307 127278 92957 56634 86092 89780 102615 46395 68266 84934 90084 117193
1910 117193 53797 -8236 13418 64190 72512 40064 90760 134683 124369 68556 -59934 -51777
1898e1777P7682r710l352L9622k994L4076j0m325k7194K4466L3958p0189K0973
1885F1226O282k9494J8709m9134k4113J4075n0339N0518o745M8401n19j4390J25013
1872A49490r3649L7486l7735o7021o4011J3184J24670m6808l8073L7501M7531
1861F2565l5947p3274L6826j280k4153L9607M9007n6k1416J8968J0061K0581m0562
1848D0927K0478R195L4282p014p3869n771o120P6409n6089n3370N3133L7906j6197
1835E3900K8590m174k827o7542m3488O3993o313M3005K5600P4230j02598J6407
1823G8783O2081j19013n9304P0363K6904J3353O3783k7523n2593j4017K6549N496
1811G4862k0181k7422k398J0418K3528K6798l5308n8847M6917J4544M8486p024
$$ plain form
1898 -51777 25905 16195 12843 52465 49471 83547 83537 79212 52018 76484 110442 40253 61226
1885 61226 67508 38014 56723 7589 -16524 -2449 -52788 -2270 -9015 39386 38867 24477 149490
1872 149490 55841 93327 55592 -11429 -75440 -62256 62414 15606 -22467 15034 62565
1861 62565 26618 -46656 -9830 -11110 -35263 4344 53351 53295 31879 50847 60908 81489 40927
1848 40927 61405 70600 104882 97868 23999 18228 12108 88517 32428 -20942 32191 70097 53900
1835 53900 82490 78316 75489 7947 -35541 28452 22139 65144 90744 164974 62376 78783
1823 78783 140864 21851 -37453 32910 59814 73167 136950 109427 56834 42817 69366 74862
1811 74862 54681 27259 24861 35279 58807 85605 50297 -8550 38367 52911 101397 94373
1799I4373p4534L9473p302o2420N6844K5823J6959R458q5437l488M9785J5926
1787G5460j8426N5159L3456m6792M2724M8252o1494M1011L7433J4601m1477m6927
1775A32980J6298O5200q84L8635Q0499l2093J00473o1273k3473O5537n3313L7243
1763C65829P1562L3810j2192j5373N2490N8843M8843K8233L3969L035j3406Q1573
1751G37216L5012P0615K5848k319M5747L1934P2815Q3591J8970P5526P8005P7290
1739A350250J45003J69853J50329R0296J47614J98955K53497K48946K56104L27390
1729C338237K96565K72096L42689M41097N89802Q62851J191592J422547K242260
1720A0999736K829862K670312k80270l146411k592448j874587j613921j294570
$$ plain form
1799 94373 19839 59312 52010 -10410 46434 72257 89216 98674 13237 9749 59534 75460
1787 75460 57034 112193 145649 98857 141581 189833 128339 169350 206783 221384 179907 132980
1775 132980 149278 214478 213594 252229 332728 300635 401108 339835 316362 381899 328586 365829
1763 365829 437391 471201 459009 443636 496126 554969 603812 632045 666014 669049 655643 737216
1751 737216 772228 842843 868691 866372 912119 944053 1016868 1100459 1119429 1194955 1272960 1350250
1739 1350250 1495253 1665106 1815435 1905731 2053345 2252300 2505797 2754743 3010847 3338237
1729 3338237 3634802 3906898 4249587 4690684 5280486 6143337 7334929 8757476 10999736
1720 10999736 13829598 16499910 16219640 13073229 10480781 8606194 6992273 5697703
1712E697703q33172o82191n03402m25095k58670l57757l05662k62511j89682j49179
1702A730382j58213j67289j11773j15127j08128m2653j42383j7881J9722l5878
1692H50779r5293l4008n1555n9759j25779j2683M3474r5472Q7241p3457k5266
1681D08222J8889l0182k9076l0156j0149m4042k8891l8847L5660k631M6278o4236
1669B30839J3039J6099p2069k3756K0943n4529K172L6940K5752K4073k2802k2398
1657A74303l1807m8758K547M9257k1709K3648l8031p1339O1581j1088J7394O2137
1645A68135K1545m0154j8401p8829N4567l1931k7989O0927l1485p316J2681k2016
1633E9734j5534p6584J2183L5739k2783M3670M2607j05295j2188J4199m03O492
$$ plain form
1712 5697703 4864531 4182340 3678938 3253843 2995173 2637416 2331754 2069243 1879561 1730382
1702 1730382 1572169 1404880 1293107 1177980 1069852 1027199 884816 866935 886657 850779
1692 850779 755486 721478 669923 610164 484385 471702 515176 419704 506945 433488 408222
1681 408222 427111 396929 367853 337697 327548 283506 254615 215768 251428 248797 295075 230839
1669 230839 243878 259977 187908 164152 185095 130566 132738 169678 195430 219503 196701 174303
1657 174303 142496 93738 96285 145542 123833 147481 109450 38111 99692 88604 105998 168135
1645 168135 189680 149526 131125 52296 106863 74932 46943 107870 76385 69069 81750 59734
1633 59734 44200 -32384 -20201 15538 -7245 36425 79032 -26263 -38451 -24252 -24655 -18163
1621a8163r1530L964O516j3712P0411K0040J0563n080m4848N5076J0663j5918
1609a2018l7281l1800L9227n634L2764j1984P640M5238n3445m1854K7842M6523
1597E218J1250k5318K3593j2037n04K0905Q26K984p1158J6939k9149j6208N7683
1584a4976k111m0271L8146K8331R940p4939j7441N557L2899l4270o0124L6267
1572i2992K3918K5485k0527n92L0957j0527m3443K9674j6830M916k5821O4062
1560c1720M599K1321K422m7421r583k4749N1651l812L9477l6187r3812J8006P5180
1547c4628o2095J5331M2788O856n3897M9310K5733p4094L882j6206N0760N3147
1535F887q3337o930n0111R8502M8309n4058k570n3690K0991L933j0254j497R705
$$ plain form
1621 -18163 -109693 -105729 -99213 -112925 -42514 -22474 -11911 -16991 -61839 -6763 3900 -12018
1609 -12018 -49299 -81099 -41872 -47506 -14742 -26726 -19086 26152 -27293 -69147 -41305 5218
1597 5218 16468 -8850 14743 2706 2202 23107 23933 26917 -44241 -27302 -56451 -72659 -14976
1584 -14976 -17087 -57358 -19212 9119 19059 -55880 -73321 -67764 -34865 -69135 -129259 -92992
1572 -92992 -69074 -43589 -64116 -64708 -33751 -44278 -87721 -58047 -74877 -69961 -95782 -31720
1560 -31720 -27121 -5800 -3378 -50799 -60382 -85131 -33480 -37292 2185 -34002 -127814 -109808 -34628
1547 -34628 -96723 -81392 -38604 -31748 -85645 -36335 -10602 -84696 -80814 -97020 -46260 6887
1535 6887 -76450 -83380 -133491 -34989 13320 -40738 -43308 -96998 -76007 -72074 -82328 -83825 -74120
1522g4120M7287k8994J2222O3593J19213o6852p8058j8273M1544L9121o0521l9663
1510d3501l1618R0078l8670j10506J1658R2044m325j8984M3620j1884j7647K0922
1498a8813K4845L357K4731n1946L128o680r4276N1489O171q6466j1911P8404J9045
1485e8922r488K3934j3599Q059N9200l0604j058p2962m8862R2923k4155k1169
1473i6703k8946L2229L8194k7400l3974K2409L8673n2632J8786j6209M6222j7448
1461g6799J3515k6827O299J7904K1352m2119M1925q6964L9178O2721J3771k0337
1449c6381q1209P0132k0826k5235o1059Q8945J6198l115j5692o8763M3928p853
1437a00930j4154R1455J1855J5056j0059K1965q5923K5295j7586P0199k8080o0993
$$ plain form
1522 -74120 -26833 -55827 -43605 19988 139201 72349 -5709 -23982 17562 56683 -3838 -43501
1510 -43501 -75119 14959 -23711 -134217 -122559 -30515 -34840 -53824 -10204 -22088 -39735 -18813
1498 -18813 6032 9389 34120 -17826 -14698 -21378 -115654 -64165 -57994 -144460 -156371 -77967 -58922
1485 -58922 -68410 -44476 -58075 -50016 9184 -21420 -22478 -95440 -144302 -51379 -75534 -96703
1473 -96703 -125649 -93420 -55226 -82626 -116600 -94191 -55518 -108150 -89364 -105573 -59351 -76799
1461 -76799 -63284 -90111 -83812 -65908 -44556 -86675 -44750 -131714 -92536 -29815 -16044 -36381
1449 -36381 -117590 -47458 -68284 -93519 -154578 -65633 -49435 -52550 -68242 -137005 -93077 -100930
1437 -100930 -115084 -23629 -11774 3282 -6777 15188 -70735 -45440 -63026 7173 -20907 -81900
1425h1900N8374l8535l5738L2938M3666m0277N6669l8342j372L5925J328k0107
1413b7371l9118N6025L3524o0532m3904n1376M2634J3834k6674p089J4690P739
1401h7618P7022j26813L2360M9234N2840M6007n2590o6879M6549k3160j4913R4341
1389B6380j7044K274l7657o2089n6161J6875k6468N7110N0212k7517R973N7409
1377f703p0462N0723L5607k4885o5233M0890N915K1677q6315L9273L3951m3559
1365f9121j2059m0498L4389L132N1947j8185n182K5783J0054q2325K1658N0515
1353b9892j8554o9017L7149j65M0254o678P616k9626l9335l391k7302O0301n4048
1340a32688L0350O844K5434K9631k3552M1832J8747M4636j4880n824o1861K817
$$ plain form
1425 -81900 -23526 -62061 -97799 -64861 -21195 -61472 -4803 -43145 -44517 -8592 -7264 -27371
1413 -27371 -66489 -10464 23060 -37472 -81376 -132752 -90118 -76284 -102958 -110047 -95357 -87618
1401 -87618 -10596 -137409 -105049 -55815 -2975 43032 -9558 -76437 -29888 -53048 -67961 26380
1389 26380 9336 11610 -26047 -88136 -144297 -127422 -153890 -96780 -46568 -74085 -64112 -6703
1377 -6703 -77165 -26442 9165 -15720 -80953 -40063 -34148 -12471 -98786 -59513 -25562 -69121
1365 -69121 -81180 -121678 -87289 -84157 -32210 -50395 -55577 -29794 -19740 -102065 -80407 -29892
1353 -29892 -48446 -117463 -80314 -80479 -40225 -46903 -39287 -68913 -108248 -111639 -138941 -78640 -132688
1340 -132688 -102338 -95494 -70060 -40429 -63981 -22149 -3402 41234 26354 20530 -41331 -38514
1328c8514P8509k336k4032k5518k8293J839k7318P94N2901k0679K4360j7030l3552
1315e8869K6570Q935q0696M488J8405L6565K4333j851k0272l0096m702M2122k9990
1302f5058J4722J198k1145r9403J0516J05328l4599J4589J7381J4575L9036J8750
1290A5890J3225j8948P346k3406m6408L6723R41j5596M48J1910j06618N1845k1342
1277i3990p9175Q3247M6390n8109Q1961K9819l3664j01252j7775J07133p3244
1266a08659n4826J05261L1405k5710J6391j9729R2792n0125N136M3183k4377l8372
1254b7630j1128M9030J2475k6437k5524N4003K6436q5570m3196r981O1887R7728
1242G2093o1012o7043j1482N0546m5529o1539N8303M0649P875p9937O6457L3696
$$ plain form
1328 -38514 39995 37659 13627 -11891 -40184 -38345 -65663 -64869 -11968 -32647 -8287 -25317 -58869
1315 -58869 -32299 -23364 -104060 -99572 -81167 -44602 -20269 -22120 -42392 -72488 -77190 -35068 -65058
1302 -65058 -50336 -49138 -70283 -169686 -159170 -53842 -88441 -73852 -56471 -41896 -2860 15890
1290 15890 29115 10167 17513 -5893 -52301 -15578 -14637 -30233 -29785 -17875 -124493 -72648 -93990
1277 -93990 -173165 -89918 -43528 -101637 -19676 10143 -23521 -124773 -142548 -35415 -108659
1266 -108659 -163485 -58224 -26819 -52529 -36138 -55867 36925 -13200 -8064 35119 10742 -27630
1254 -27630 -38758 10272 22747 -3690 -29214 24789 51225 -34345 -77541 -87522 -25635 72093
1242 72093 11081 -55962 -67444 -16898 -62427 -123966 -65663 -25014 -17139 -97076 -30619 3077
1230C077j6667m340q2983M2394L1007n1275J2373K4474k2577K3440J9173J1271
1218a0633j11855n9849J30105N3434q3417J3289j4863k4616K8436n584L46j3277
1206i8484o1050P8856k6412K2328K2224l8143L3839j3632l534L9677R940o2730
1194i7121M3139k4675R183J8742l862m9587k210J7026L6823L1206j4233k9014
1182f4583L9229Q103o079r91q7489p4423O8300R0159M6798j18236o448N0140P1931
1169A6411p598j01099m836J583M9093m3525K7284K7152r9829Q6401Q0500o8462
1157c6925n3633k006J5203N3506N13J8597O1472j04056L0637m1372J036n961n2890
1144a15879M3914O351l0320M6723j3646J2638L4262K2175l0848k240j2938q4115
$$ plain form
1230 3077 -13590 -17930 -100913 -58519 -27512 -78787 -66414 -41940 -64517 -41077 -21904 -10633
1218 -10633 -122488 -182337 -52232 1202 -82215 -68926 -83789 -108405 -79969 -85553 -85207 -98484
1206 -98484 -159534 -80678 -107090 -84762 -62538 -100681 -66842 -80474 -84008 -44331 -34391 -97121
1194 -97121 -53982 -78657 -69474 -50732 -54594 -104181 -106391 -89365 -52542 -21336 -35569 -64583
1182 -64583 -25354 -17251 -23330 -24321 -111810 -186233 -117933 -27774 19024 -99212 -105660 -55520 16411
1169 16411 8813 -92286 -97122 -95539 -46446 -89971 -62687 -35535 -135364 -48963 31537 -36925
1157 -36925 -90558 -92564 -77361 -23855 -23342 -4745 56727 -47329 -16692 -58064 -57028 -62989 -115879
1144 -115879 -71965 -65614 -95934 -49211 -62857 -50219 -15957 6218 -24630 -26870 -39808 -123923
1132a23923O2997l6077k719j2564l9783P7398N267O9933l571k7270l8311M5614
1120b3009K1463K044k6748L0885l500m082l912J7030j04411M6824n3218n6240
1108a56874P3740l1211O8359o8587J08743k5459r4408O058M9617o1916L5743K7453
1096f8742M005K1904L3712K082j3819m346M9003o8125m4683N478K2910N1702l3700
1083d2619n9060N2374P8049l1647n3501M1318k4797Q954k3645j2343J953l6947
1071a01911R1898l194n202K6361K0868j14421l650K6620j7629J6708J6401O2994
1059A5843l0651j8178q1356Q0422J6386o7534J5453Q8687N3720j6992q4186P4758
1047D6372O147j08436K8079R59N9138J1937k0696j12644N9761j1145n7270L7050
$$ plain form
1132 -123923 -60926 -97003 -99722 -112286 -152069 -74671 -69404 529 -3042 -30312 -68623 -23009
1120 -23009 -1546 498 -26250 4635 1135 -2947 -6859 10171 -94240 -47416 -100634 -156874
1108 -156874 -83134 -114345 -45986 -114573 -5830 -31289 -125697 -119639 -70022 -131938 -96195 -68742
1096 -68742 -64737 -42833 -9121 -7039 -20858 -25204 23799 -44326 -89009 -83531 -60621 -8919 -42619
1083 -42619 -101679 -49305 28744 -2903 -56404 -15086 -39883 -30929 -54574 -66917 -64964 -101911
1071 -101911 -10013 -13207 -18409 7952 28820 -85601 -89251 -62631 -80260 -63552 -47151 15843
1059 15843 -14808 -32986 -114342 -33920 -17534 -85068 -69615 19072 72792 55800 -28386 46372
1047 46372 52519 -55917 -27838 -26879 32259 44196 23500 -89144 -29383 -40528 -97798 -60748
1035f0748M6357L6404m0516J5453M6353J9300p7031m8065P5696l6944M5301j4135
1023G425R081n7749M6221K315r003o397m7271J3586k7557K1597N3637m5109J9591
1010a9633o6649N6460J5511j5718J5487q6179J8074K5072L9472o15k5366M7443
998C359J974m4701q1258L1316P3618K2560J7112l4853M3472m806J3401m8734k7473
985c5013k2512J0146L8946p208j0870o2094q757o026n9749J05666M558k0559N2081
972b1391K4359j08948k552K7277K2296l7254K6090j406L9129o3400O26M9957L3342
959a1875k4392k8915N9825o7431R3658k4868p2109J6203l0240M2966J4002l3182
947f6358Q4670m916j1143J0910L4860q0679l0601K6387m8090Q3855J265k4632
$$ plain form
1035 -60748 -14391 22013 -18503 -3050 43303 62603 -14428 -62493 13203 -23741 21560 7425
1023 7425 16506 -41243 4978 7293 -1710 -8107 -55378 -41792 -69349 -47752 5885 -39224 -19633
1010 -19633 -86282 -29822 -14311 -30029 -14542 -100721 -82647 -57575 -18103 -18718 -44084 3359
998 3359 5333 -39368 -120626 -89310 -15692 6868 23980 -10873 32599 27793 41194 -7540 -35013
985 -35013 -57525 -47379 -8433 -15641 -26511 -88605 -97362 -103388 -163137 -57471 -52913 -73472 -21391
972 -21391 2968 -105980 -108532 -81255 -58959 -96213 -70123 -71529 -32400 -95800 -95174 -45217 -11875
959 -11875 -36267 -65182 -5357 -72788 20870 -3998 -76107 -59904 -90144 -47178 -33176 -66358
947 -66358 18312 13396 2253 13163 48023 -32656 -63257 -36870 -84960 -1105 160 -24472
935b4472m9540r883K7316N0462l8022r511J03035n5535r7316J06546J3455q5802
923f9267N6807P5885R38k481o0364k9792l2298O0511n5727L1566O015l1106L4232
910a5081m7379M7515N1658K5929o1069j1258r910L9551n4485n3209j0757N9999
898c8496M8706p8576j102K3075k0428R2784n6540K2048J02365j10538k3736J8007
886b2431P839J6851l1415L5016o4430l3462O4021j4842R551P9009j8472q3356
874e6121M0285R40k0932j3037L1906P8204j08752K6950j6858K4050J7368o4120
862f0117O1179r809j9006j656m5502L6653K8970j3101K7703O0673P307l6385P026
849D3935n0045j3858L5629K1189l615m7565k9223J8048L095l6559N3281m748O3464
$$ plain form
935 -24472 -74012 -83895 -56579 -6117 -44139 -53650 49385 -6150 -103466 3080 16535 -69267
923 -69267 -12460 63425 64363 61882 1518 -28274 -60572 -61 -55788 -24222 -18207 -49313 -15081
910 -15081 -62460 -14945 36713 62642 1573 -9685 -19595 19956 -34529 -87738 -98495 -38496
898 -38496 10210 -68366 -69468 -46393 -66821 25963 -30577 -8529 93836 -16702 -40438 -22431
886 -22431 -14592 2259 -29156 5860 -58570 -92032 -28011 -42853 -33302 45707 27235 -56121
874 -56121 -15836 -14896 -35828 -48865 -16959 61245 -47507 -20557 -37415 -13365 4003 -60117
862 -60117 1062 -8747 -27753 -29409 -74911 -38258 -9288 -22389 5314 65987 73294 36909 43935
849 43935 -6110 -19968 15661 36850 33235 -14330 -43553 -25505 -22410 -58969 -5688 -10436 53028
836E3028L7134l7109q0741n0795n3130Q6087N2768j7139m5510k2901O7225j3433
824b4516N7505m2531l9945j2431j1876R4331L176o9411j222L3959r3044L4660
812g1345K3231M0558M7049n6919k2448L8471O1602j7335q5361m9554L1829q183
800f8405M3304L044O0110J2209k9229p2822J6268N8110K0346n7926O266k0091
788b8816j7503P7576M395j1661L661j9148N4830j4994o3841l4981N2489Q82q45
775B044P139P672K294j5641j98Q175m7657l3927M8705M6503J0125j4932j0868
762I434K2623j5273m1754j5871K5257M5578J8357q0045r002K3043j4534p3704
750a05891O5645N0770l2845L9949J6573l1560p3067R1981O538o5365J3972J8278
$$ plain form
836 53028 90162 53053 -27688 -78483 -131613 -45526 7242 -9897 -55407 -78308 -11083 -24516
824 -24516 32989 -9542 -49487 -61918 -73794 20537 23713 -45698 -46920 -12961 -106005 -71345
812 -71345 -48114 -7556 39493 -17426 -39874 -1403 60199 42864 -42497 -92051 -60222 -68405
800 -68405 -25101 -22057 38053 50262 21033 -51789 -35521 22589 42935 -14991 -8725 -28816
788 -28816 -46319 31257 35652 23991 27652 8504 63334 48340 -15501 -50482 2007 2889 2044
775 2044 9183 16855 19149 3508 3310 11485 -36172 -70099 -21394 25109 35234 20302 9434
762 9434 32057 16784 -24970 -40841 -15584 29994 48351 -31694 -40696 -17653 -32187 -105891
750 -105891 -40246 10524 -22321 17628 34201 2641 -70426 21555 28093 -37272 -23300 -5022
738e022J4916m0063N2996l7995j6573M4918P832l2418L7369k5019k2814J6888
726d985r416N0779r9514M4818Q0975K2987p4141k333J3862j7107n4963L1457K2789
713E208L6329J7427m681o8396o895L7022L322J6525l8944k1920M9670M2343n2739
700A4271k365M574K868l920J211N8339k8391j6377K3222n5974M2088k39n9207
687a9900q129k8829j050O2581M8574L480J00609o5318l0783n5493j9054K2155
675H843N7515k2930r609k390l8029K0334N702j7465o5272P9652j8908M0272k0728
662A6987j0329O1766r488r905P8323l3087m2581j9283k6915p1440K9349q387j6360
649f1350L7260L9574j971L906p2991K8839R4197n1366o2954n0447J30287q6444
$$ plain form
738 -5022 9894 -30169 22827 -15168 -31741 13177 21009 -11409 25960 941 -21873 -4985
726 -4985 -14401 36378 -63136 -18318 62657 85644 11503 9170 23032 5925 -49038 -17581 5208
713 5208 41537 58964 54283 -14113 -21008 16014 19336 35861 -3083 -25003 24667 67010 14271
700 14271 11906 16480 19348 15428 16639 74978 46587 30210 53432 -2542 39546 39307 -19900
687 -19900 -28029 -56858 -57908 4673 53247 56727 157336 92018 61235 5742 -13312 8843
675 8843 66358 43428 33819 31429 -6600 13734 19436 1971 -63301 16351 -2557 37715 16987
662 16987 6658 68424 58936 49031 127354 94267 51686 32403 5488 -65952 -36603 -44990 -61350
649 -61350 -24090 15484 13513 17419 -55572 -26733 67464 16098 -46856 -97303 32984 -53460
637e3460L0116k941J09474l1204n4144j3064K086L3976j10351l532P7093J26410
625A10459j01846l6550o7274J7932M5511K7071j8120K5175J5443j2651k6309j7901
613c9060R9430l8509p0424q744J9647j1240Q7950j4292q4627K6520o0419O076
601h7692J3049K2948R2523J5656L193j26137M5843L6960n338n8825j8391P8982
589A2771o870J2142J0189n5051O6165j107q1303m9268P5292O9488r8633L9021
577g164R3675j1986j00401M8394M7572l4776J9975N548m1935N0093K7650O621
565A03266k6332P624o8541K7052n0660M3622N2178l3424K4343k5275m0110l7823
553b4080J15q367O040N9414k5742k0823q469M0059L7668m5606L0793O731k3658
$$ plain form
637 -53460 -23344 -26285 83189 51985 -2159 -15223 -13137 20839 -89512 -93044 -15951 110459
625 110459 8613 -27937 -95211 -77279 -31768 -4697 -22817 2358 17801 5150 -21159 -39060
613 -39060 60370 21861 -48563 -57307 -37660 -48900 39050 24758 -59869 -33349 -93768 -87692
601 -87692 -74643 -51695 40828 56484 59677 -66460 -20617 16343 11005 -47820 -66211 12771
589 12771 5901 18043 28232 -26819 39346 38239 -43064 -92332 -17040 52448 -46185 -7164
577 -7164 86511 74525 -25876 22518 70090 35314 55289 60837 18902 68995 96645 103266
565 103266 76934 84558 16017 43069 -7591 36031 88209 54785 79128 53853 13743 -24080
553 -24080 -23965 -32332 -26292 33122 7380 -13443 -21912 18147 55815 10209 41002 47733 24075
540B4075P8069Q084K230m8078l3272n2342N801O1627j4354q6535J531Q7152o2921
527b8933M8306l914N817L4247p7527K0548j4601P351O1874k6702j1616L7797n3104
514d57n6496Q3668M1216N402K9421n6287k9650O497j9207K3225l855J5283k0646
501A8114P8772k3188m732J39739r1562P073l6013q8360J2234o1829M1395j8575
489b6932J14088r906k4788k5088o4415L0193J21598l3337k3546K9880l2515l5669
477A9563n2211L1289K7554q8508Q8838L4507j4110l9621n127L8837J4551n8281
465b719p8060N4627Q5076L0394m0880K0622J3346K3806l5517j8507k4540J0526
453C8174l5050L6141l5862q439o811K4040J28144q7746p1695N9562k0852o1511
$$ plain form
540 24075 102144 110228 112458 64380 31108 -21234 -15433 46194 31840 -54695 -53164 33988 -28933
527 -28933 19373 15459 21276 55523 -22004 -1456 -16057 -8706 53168 26466 14850 52647 -457
514 -457 -56953 26715 67931 73333 102754 46467 16817 23314 4107 27332 23477 38760 18114
501 18114 96886 73698 68966 208705 117143 124216 88203 -157 12077 -49752 -8357 -26932
489 -26932 87156 77250 52462 27374 -37041 -6848 114750 81413 57867 87747 55232 19563
477 19563 -32648 -1359 26195 -62313 26525 61032 46922 7301 2174 41011 55562 -2719
465 -2719 -80779 -26152 58924 89318 48438 69060 82406 106212 70695 52188 27648 38174
453 38174 3124 39265 3403 -5036 -11847 12193 140337 52591 -19104 40458 19606 -41905
441d1905N9756L3j4818R9946j4500p3481K4375n1922r068r705Q7358m8801k0876
428a3608O1100j05769P4632J00808j5951m2135o049l055l642j6728J7413m4082
416B934K1754l3983J2757O4863n4704L6411M6735k5797l6794J1384R9968p2323
404G3205K8464l4558J2271j504n433M9738m3952m2625L9111P034m3770Q0884j34446
391a5581J0219o043k1300O4583L6047K9065m0251M0552j07240m126l249o2679
379h0003Q2740K6197m1463Q5145M0556m3269j062o6120n2316K7886P2457L2196
367H2944k6378K4445l3737j023q379K1458n2990l6120L9535K7217K7801N994j2114
354E8653k968j3408k5470L7874l464k2238n287N3178N5400m2239k1420M0669m3466
$$ plain form
441 -41905 17851 17884 3066 103012 88512 15031 39406 -12516 -21584 -31289 56069 7268 -13608
428 -13608 47492 -58277 16355 117163 101212 59077 53028 49973 46331 29603 47016 2934
416 2934 24688 -9295 3462 68325 13621 50032 96767 70970 34176 45560 145528 73205
404 73205 101669 67111 79382 77878 72445 122183 78231 35606 74717 81751 37981 118865 -15581
391 -15581 -5362 -11405 -32705 31878 67925 96990 56739 97291 -9949 -14075 -17324 -80003
379 -80003 2737 28934 -12529 72616 113172 69903 68841 2721 -49595 -21709 50748 82944
367 82944 56566 81011 47274 46251 37872 59330 6340 -29780 9755 36972 64773 70767 58653
354 58653 55685 42277 16807 54681 51217 28979 23692 76870 132270 90031 68611 109280 65814
341F5814n022k8178l3139K2149o238m5735K7958O6810L0486p3276K8274L1887
329H1790p5844R8M2784p9894K7754N333j5585Q9434k8477l6840P631N5604R2938
316A66726l472r454k2474r6411L9357j1408L4488L652K187L7389l8378k4185j34265
303e6248O5639N6962k3705L2866J6161n3450L7617K8918k4500J6213J4824m9013
291F2284K5427n6938P0875M6937j40612j6354M5011j4255n5395Q9243J197r245
279D8175o8452O8304J8183l3139K0458M7732O679p1708j27036Q2775L7977J8798
267D8746j5971N0590k9099k7251M0163J7369j6174M8319l1949q7055J13560l3057
255G8191n1336j7041N6342n3808k5112K8038n1131K3261L198k6099O1794k2126
$$ plain form
341 65814 60792 32614 -525 21624 15386 -30349 -2391 64419 94905 21629 49903 81790
329 81790 5946 6044 48828 -31066 -3312 2021 -13564 75870 47393 10553 18184 73788 166726
316 166726 163254 153800 131326 34915 74272 62864 97352 101004 103191 140580 102202 78017 -56248
303 -56248 9391 66353 42648 75514 91675 38225 75842 104760 80260 96473 111297 62284
291 62284 87711 30773 101648 148585 7973 -8381 36630 22375 -33020 56223 57420 48175
279 48175 -20277 48027 66210 33071 53529 101261 107940 36232 -90804 -8029 29948 48746
267 48746 32775 83365 54266 27015 67178 84547 68373 116692 84743 -2312 111248 78191
255 78191 26855 9814 66156 12348 -12764 15274 -35857 -12596 -9398 -35497 26297 4171
243D171M467J6236N6033p4524O6042K6484K0435j36494K3733J8990O353M1919
231G3845k0506k2838J38L831m451L063P2720j2590o167K6365k0077M5260j25663
218A2930k0282J542K0963n2483j6534J04655o66j7173l066m3272o548L1111K6614
205C7791M8890n9022K8739J6542n5000P9600m4174k8218N7667L8746l8879n0274
193C2408k1619k0791L2518L1205p4506L4342n3008J9967K0716q6568N1344J16451
181H2459k2076o4002k1247p4032J05679R1135p3700j7070m236l5125O113K7247
169A145n839O7180J5417M91O751o9667J1064L8686j8614j0633J4506q040j1334
156C1113k0377J3208R7239j1357r5622j0028P7938o7696m1036j3335Q6434N511
$$ plain form
243 4171 8638 24874 80907 6383 72425 98909 119344 -17150 6583 25573 31926 73845
231 73845 53339 30501 30639 34470 30019 33082 105802 93212 87045 113410 93333 138593 12930
218 12930 -7352 -5810 15153 -37330 -53864 50791 50125 32952 29886 -13386 -19934 11177 37791
205 37791 86681 27659 56398 72940 17940 97540 53366 25148 82815 121561 82682 32408
193 32408 10789 -10002 22516 53721 -20785 13557 -39451 -19484 1232 -85336 -33992 82459
181 82459 60383 -3619 -24866 -98898 6781 97916 24216 7146 2910 -32215 -26102 1145
169 1145 -4694 62486 77903 78394 85145 15478 26542 65228 46614 35981 50487 42447 31113
156 31113 10736 23944 121183 109826 14204 4176 82114 14418 -26618 -39953 46481 51992
144E1992Q89n6112K531K8215J7358o2303l2202L2736j9564M6277N8704k3715l7406
131G400k9500p7462N2465L6574l9067M5005J3696m4201K9872k3233M2328N3674
119F7551n9838j166L0180r1695J1962K0674j6008J2482J4645k8042L4519j0253
107a4989q0324J28292K7406k4970j3626k083l3663N0180K1686k8089L5145m4871
95B0094J5974m53r208j6842l1030r990m925K8553m7419J5971L5819j0313J5355
82A586j07617J8423K5998P0325p398k407j1040J4328N935m9513o953M600J3426
69c0307O6537j8717k0773J9188O558Q511L5147k9762q3618J6201m3791O0058L627
56a1141o1098J4370R45j78j6897N2362J5867l2118n1417N8213J7404J99n0972
$$ plain form
144 51992 52881 -3231 -700 27515 44873 -17430 -49632 -16896 -36460 9817 68521 44806 7400
131 7400 -22100 -99562 -47097 -10523 -49590 -4585 9111 -35090 -5218 -28451 13877 67551
119 67551 7713 6547 36727 -54968 -43006 -22332 -38340 -25858 -11213 -39255 -4736 -14989
107 -14989 -95313 32979 60385 35415 21789 19706 -13957 36223 57909 29820 64965 20094
95 20094 36068 35615 26407 9565 -21465 -31455 -36380 -7827 -55246 -39275 -3456 -13769 1586
82 1586 -106031 -87608 -61610 8715 1317 -1090 -12130 2198 8133 -41380 -48333 -43733 -30307
69 -30307 36230 17513 -3260 15928 22486 30997 66144 36382 -47236 -31035 -74826 -14768 -11141
56 -11141 -72239 -57869 -56924 -57102 -73999 -21637 -5770 -37888 -89305 -31092 -13688 -13489 -64461
43f4461ok2528J4742O218m7012J8805M1173N030j4153l4283O566J6683L6098K0692
29a6436k6614k8868j5926J3796k2046J7438K8474j7161l9452m6136J9233N1749
17h1949q3590L0375n6204K7889M2983L1385k4758N3831J3883n4133K1253k6375
5a05410l1717K7377n717k6452p28
0a42647
$$ plain form
43 -64461 -64467 -86995 -72253 -66035 -113047 -94242 -53069 -48039 -62192 -96475 -89909 -73226 -37128 -16436
29 -16436 -43050 -71918 -87844 -74048 -96094 -78656 -50182 -67343 -106795 -152931 -133698 -81949
17 -81949 -165539 -135164 -191368 -163479 -120496 -89111 -113869 -60038 -46155 -100288 -79035 -105410
5 -105410 -137127 -109750 -115467 -141919 -142647
0 -142647
$$ Imaginary data points
##PAGE= N=2
##DATA TABLE= (X++(I..I)), XYDATA
16383a758813N9882k0486l9331N5891N6953P419J1948L1775R542J04507n9338
16372a540051l3582P7580j8998N9726M3113k4958L1973K3133J001L5138P15m7709
16360a392919N9606K613Q5217L9444N861m1346M1940M7583q697P5053m8910O7677
16348a066878n6810K7149N4611l345P82K5034j97K0317N9571K1952M8466m8627
16336i17975K3942j776L1511L4285k910M0557P3393M292p6255P418M5301O3204
16324f75013M434J4483J7805K3910O95N1661n483J3872J8202J3992N4463m6027
16312e13006r632J03982K9569J900k3836J0509j0356N8116j3074K9487M1880l8872
16300c33333n928K0876P2064R568O625j0956j1731J3890K3751N6310J7424M6845
$$ plain form
16383 -1758813 -1698931 -1719417 -1758748 -1702857 -1645904 -1638485 -1626537 -1594762 -1585220 -1480713 -1540051
16372 -1540051 -1573633 -1496053 -1515051 -1455325 -1412212 -1437170 -1405197 -1382064 -1381063 -1345925 -1345210 -1392919
16360 -1392919 -1333313 -1330700 -1245483 -1206039 -1200178 -1241524 -1199584 -1152001 -1160698 -1085645 -1134555 -1066878
16348 -1066878 -1123688 -1096539 -1041928 -1045273 -1044491 -1019457 -1019654 -999337 -939766 -917814 -869348 -917975
16336 -917975 -894033 -895809 -864298 -830013 -832923 -792366 -718973 -714681 -790936 -783518 -738217 -675013
16324 -675013 -670579 -656096 -638291 -614381 -613686 -562025 -567508 -553636 -535434 -521442 -466979 -513006
16312 -513006 -522638 -418656 -389087 -387187 -411023 -400514 -410870 -352754 -365828 -336341 -294461 -333333
16300 -333333 -339261 -318385 -246321 -236753 -230128 -241084 -252815 -238925 -215174 -158864 -141440 -94595
16288i4595O5129k1270p597M348O101O4948L389k7275l885K157R7761J7777o7747
16275C9241L2201M2946L7686l3728k3826M714R0617Q611J5574K3858K842M0578
16263B81314k40R563k9459J0184L4931j3166K4088O2280l6040K9524M4431m8498
16251C68912k9987k167k2684P1587N2173J0346n4170M1935P8877j3493k0429N4183
16239E35083k7410L4367N1204L170k2647M4495L731m9443L9178m5654J3540k4428
16227E55186J6347P4869M5354L351r2594J8146K821J2397J6857Q3214K9811J981
16215G67740j7405j2775j9824O854L539M0698O3445o2468J6302L235J5028J168
16203H05537K9522L9854l7937O0002o2576k3392L4209M1502m3594R0980M1744
$$ plain form
16288 -94595 -29466 -50736 -58333 -53985 -47884 17064 20453 -6822 -10707 -8550 89211 106988 39241
16275 39241 71442 114388 152074 118346 94520 99234 189851 198462 214036 237894 240736 281314
16263 281314 281074 290637 261178 271362 306293 293127 317215 379495 343455 372979 417410 368912
16251 368912 338925 336758 314074 385661 437834 448180 394010 435945 514822 501329 480900 535083
16239 535083 507673 542040 593244 596414 573767 618262 621993 572550 611728 566074 579614 555186
16227 555186 571533 646402 691756 695107 602513 620659 623480 635877 652734 735948 765759 767740
16215 767740 750335 737560 717736 724590 728129 768827 832272 769804 786106 789341 804369 805537
16203 805537 835059 874913 836976 896978 834402 811010 845219 886721 843127 934107 975851
16192I75851o9504L8763k5221m6998l3995O2399R5998j7297m1098L7160L9300
16181A015358k5102J2779K0460l162j2084L6331l3084N5428M3991k130R664p6945
16169A041504j7975q0524K375R6052M3570n819K4443L6678l1413J9363K9581J0935
16157A168770k8640j1874JP275J3895o7055N2463J1182n704L6633J8765J6079
16145A211790n0139K2629Q698k4550N0719R343J6086q9341m6108O5045M1927j8806
16133A197293P7295j9488j273J4278K3274k5772Q478j9955n3236O2553l6787j6262
16121A210398k6391m709j054o498J02896j7544j3732P8053n648l0471m2493N051
16109A247858K5135p3128Q8191m417J5025j0743j9629M6088l3070q851m4544r107
$$ plain form
16192 975851 906347 945110 919889 872891 838896 901295 997293 979996 938898 976058 1015358
16181 1015358 990256 1003035 1023495 1020333 1008249 1044580 1011496 1066924 1110915 1108785 1118449 1041504
16169 1041504 1023529 943005 945380 1041432 1085002 1079183 1103626 1140304 1108891 1128254 1157835 1168770
16157 1168770 1140130 1128256 1128257 1135532 1149427 1082372 1134835 1146017 1140313 1176946 1195711 1211790
16145 1211790 1161651 1184280 1192978 1168428 1219147 1228490 1244576 1155235 1109127 1174172 1216099 1197293
16133 1197293 1274588 1255100 1253827 1268105 1291379 1265607 1274085 1254130 1200894 1263447 1226660 1210398
16121 1210398 1184007 1179298 1178244 1171746 1274642 1257098 1243366 1321419 1315771 1285300 1242807 1247858
16109 1247858 1272993 1199865 1288056 1283639 1298664 1287921 1268292 1314380 1281310 1272459 1227915 1218808
16097A218808N1874M5553K406j2193O077M9498Q656m858L8359J3911m8714n1931
16085A317446L740L0925o6936k3850O1297L1870j4403J5517R9508q5228j05594
16074A264292K9981O1809o1094k9314j184j7370O1048M8653k1994j4456j874P7634
16062A396131m4079K7319m3725L0866k6327k6570L1787N1699m4036n2118L6172
16051A337119j1676l4271m9177L4288N5170n6430R729J13283o8349j1954L8194
16040A355926Q1735J3040o2608k3490l2463K140M6815J1841n6684N796j6099J5042
16028A340991O4786j5271L3029q7707j4741l7733Q4280J6716q479q290N244p2113
16016A300712J37525K9274q0217k1954n3953k0605J8212L4793J00636j9280p9662
$$ plain form
16097 1218808 1270682 1316235 1318641 1306448 1312525 1362023 1370679 1365821 1404180 1418091 1369377 1317446
16085 1317446 1321186 1352111 1285175 1261325 1322622 1354492 1340089 1355606 1455114 1369886 1264292
16074 1264292 1294273 1356082 1294988 1265674 1264490 1247120 1308168 1356821 1334827 1320371 1318497 1396131
16062 1396131 1352052 1379371 1335646 1366512 1340185 1313615 1345402 1397101 1353065 1300947 1337119
16051 1337119 1325443 1291172 1241995 1276283 1331453 1275023 1284752 1398035 1329686 1317732 1355926
16040 1355926 1437661 1450701 1388093 1364603 1332140 1334280 1381095 1392936 1336252 1342048 1325949 1340991
16028 1340991 1405777 1390506 1423535 1335828 1321087 1283354 1367634 1384350 1375871 1367581 1372825 1300712
16016 1300712 1438237 1467511 1387294 1365340 1311387 1290782 1308994 1343787 1444423 1425143 1345481
16005A345481l582M0072Q405j9762K3561l1092J6652J0796j9196J1476k757O0010
15993A440064j9202m6585k4592k4286K3031J7889l9616L9359K8888j3501O288
15982A387737K1208p0698K9772O8998j00436n5991O6211j098M7704M5150k1363
15971A417194r083k4809N3384l1456k7954j1407L4152J2667p6900L6179m405M3796
15959A411358L4330r0566Q178j1521l9681n715K1695K4819j27330L3224J25142
15948A383933k1501j1062n9782k2188Q6737N5155l0823J2515R274K3400K2466
15937A448124q0385j15886M9278q59O6744j0175K0210m8599p9205R62Q3466P5446
15925A409121m2135M8876m6898j0483O9039K6232o2170l437J2602l2240L1057
$$ plain form
16005 1345481 1341899 1381971 1390376 1370614 1394175 1363083 1379735 1390531 1371335 1382811 1380054 1440064
15993 1440064 1420862 1374277 1349685 1325399 1348430 1366319 1326703 1366062 1394950 1381449 1387737
15982 1387737 1408945 1338247 1368019 1437017 1336581 1280590 1346801 1345703 1393407 1438557 1417194
15971 1417194 1408111 1383302 1436686 1405230 1377276 1365869 1400021 1412688 1335788 1371967 1367562 1411358
15959 1411358 1445688 1355122 1363300 1351779 1312098 1306383 1328078 1352897 1225567 1258791 1383933
15948 1383933 1362432 1351370 1291588 1269400 1356137 1411292 1380469 1392984 1402258 1425658 1448124
15937 1448124 1367739 1251853 1301131 1300272 1367016 1356841 1377051 1328452 1249247 1250209 1333675 1409121
15925 1409121 1366986 1415862 1368964 1358481 1427520 1453752 1391582 1388145 1400747 1368507 1399564
15914A399564N5947q389n4530M2966K3806n4278J4420M777m9448N1037m2948L2826
15902A415750j4222K2609o690m1750l0714k4319N9173O9453M984J7889j4044n9720
15890A398399m4095Q8126l6792r5527M6095L3615o6297J10422n175J9151k3819
15879A424103n697l1601n6531J6056K6604m1004j8108N7003J0390Q7128q934k6024
15867A433385Q41M2514o7411m623N144L1594k562K7205m7062l7062m3792L9333
15855A377504j3037r665j7984L8442R691p2070N4767n2061N2525J01383m0348
15844A429147J7176r4432J6153R8423L1431k8499K541j34761M8991O6468M033
15833A456671l6854M441o9101k7590K5956K7557J06610n2589n0139L8667l9603
$$ plain form
15914 1399564 1455511 1447122 1392592 1435558 1459364 1405086 1419506 1424283 1374835 1425872 1382924 1415750
15902 1415750 1401528 1424137 1417447 1375697 1344983 1320664 1379837 1449290 1454274 1472163 1458119 1398399
15890 1398399 1354304 1442430 1405638 1310111 1356206 1389821 1323524 1433946 1428771 1447922 1424103
15879 1424103 1418406 1386805 1330274 1346330 1372934 1331930 1313822 1370825 1381215 1468343 1459409 1433385
15867 1433385 1434226 1476740 1409329 1404706 1409850 1441444 1438882 1466087 1419025 1381963 1338171 1377504
15855 1377504 1364467 1354802 1336818 1375260 1384951 1312881 1367648 1315587 1368112 1469495 1429147
15844 1429147 1446323 1351891 1368044 1466467 1497898 1469399 1471940 1337179 1386170 1452638 1456671
15833 1456671 1419817 1424258 1355157 1327567 1353523 1381080 1487690 1435101 1384962 1423629 1384026
15822A384026M5109o481m6738O5705n4463P6638n1159k1224J3670L9331L4587
15811A479001q8552L299L1169k2875j8539p924J12198q1141J5471p225L7633K0406
15799A472921O111n5254p2164L3193M3324L6954r781n0449Q824j0117n8017M9468
15787A395013m6512J10529O4064r8046q409M8M3191K003l6122p2768o480K5352
15775A371863K945O6257r551m6943M2598Q122m2302J0101M4005R503j6769m5793
15763A394036J0221l5964K1757L2893q3982M6811N3322J0324M5242o0672o3396
15752A370592j5335P283K9562j6354k9281m193L9268j3458K9594K8752j8518l9717
15740A368195Q568O8037K4914q0350j3220K5288L6298n2977l3968K4443m6341
$$ plain form
15822 1384026 1429135 1422654 1375916 1441621 1387158 1463796 1412637 1391413 1405083 1444414 1479001
15811 1479001 1390449 1393748 1424917 1402042 1383503 1375579 1487777 1406636 1422107 1414882 1452515 1472921
15799 1472921 1479032 1423778 1351614 1384807 1428131 1465085 1455304 1404855 1413679 1403562 1345545 1395013
15787 1395013 1348501 1459030 1523094 1425048 1416639 1416687 1459878 1461881 1425759 1352991 1346511 1371863
15775 1371863 1374808 1441065 1431514 1384571 1427169 1435291 1392989 1403090 1447095 1456598 1439829 1394036
15763 1394036 1404257 1368293 1390050 1422943 1338961 1385772 1439094 1449418 1494660 1433988 1370592
15752 1370592 1355257 1362540 1392102 1375748 1346467 1342274 1381542 1368084 1397678 1426430 1407912 1368195
15740 1368195 1376763 1444800 1469714 1389364 1376144 1401432 1437730 1384753 1350785 1375228 1328887
15729A328887O9265o4174N7704O4593m9422j4117k1334Q5142j4053R501l6986
15718A415006L7420j2478k3350o9510L6433k6109K6848Q5676k8985l8264m70j6783
15706A385434k5333O6988j2585P7580L0032o2026P288p4845p8306R9400o783J3929
15694A420773j5199m8513Q3310o3153N9264L8495n924k6152n3866k3114Q402K4382
15682A398705N3660J1346J8502n7993k2980J8299j3870m842l1455R214M9644M2261
15670A470491m3830J5289m2154l3999K0065j068Q3206p075n6807J7103j2843l0285
15658A378093K3522k2462N452P0578l6530l3203j3792L6518N736J0895j8170r16
15646A405721J8112K8905p0429J9108J1077m8976M7832L6560j4029K286k6646
$$ plain form
15729 1328887 1398152 1333978 1391682 1456275 1406853 1392736 1371402 1456544 1442491 1451992 1415006
15718 1415006 1452426 1439948 1416598 1347088 1383521 1357412 1384260 1469936 1440951 1402687 1402217 1385434
15706 1385434 1360101 1427089 1414504 1492084 1522116 1460090 1467378 1392533 1314227 1413627 1406844 1420773
15694 1420773 1405574 1357061 1440371 1377218 1436482 1474977 1469053 1442901 1389035 1365921 1374323 1398705
15682 1398705 1452365 1463711 1482213 1424220 1401240 1419539 1405669 1400827 1369372 1378586 1428230 1470491
15670 1470491 1426661 1441950 1399796 1365797 1385862 1384794 1468000 1460925 1404118 1421221 1408378 1378093
15658 1378093 1401615 1379153 1384605 1455183 1418653 1385450 1371658 1408176 1413912 1424807 1406637 1405721
15646 1405721 1423833 1452738 1382309 1401417 1412494 1363518 1411350 1447910 1433881 1436167 1409521
15635A409521L7880l1560K3638M5964q6662P1509m2231N0968J6759J4970q9311
15624A421445j1541L2030R869k4529o0272N6084M403l5769K9957L4940k3390R933
15612A443160m7200L3190l4656j7312N015m4721Q1149j8964l8231R4060l566M471
15600A456395j65124O4006L9564N6117l7230J2143K6362J2204m0117m1785K798
15589A385333K2940k0072N3914l2390m6280O6387P367O7998k6488n8150n9181
15578A361378M1243M5143l3432o8186M2761N3550n224J1736M6604l9956m9084
15567A406533R4629n4469m5074M1370j7047K8859q1174m9267M0366J7789K3545
15556A406060m3426j3681J6579N8697J0044m0057j350J1355j5145O218l222k9593
$$ plain form
15635 1409521 1447401 1415841 1439479 1485443 1398781 1470290 1428059 1479027 1495786 1510756 1421445
15624 1421445 1409904 1441934 1451803 1427274 1367002 1423086 1427489 1391720 1421677 1456617 1433227 1443160
15612 1443160 1395960 1429150 1394494 1377182 1382197 1337476 1418625 1399661 1361430 1455490 1451924 1456395
15600 1456395 1291271 1355277 1394841 1450958 1413728 1425871 1452233 1464437 1424320 1382535 1385333
15589 1385333 1408273 1388201 1442115 1409725 1363445 1429832 1437199 1505197 1478709 1420559 1361378
15578 1361378 1402621 1447764 1414332 1346146 1388907 1442457 1437233 1448969 1495573 1455617 1406533
15567 1406533 1501162 1446693 1401619 1442989 1425942 1454801 1373627 1324360 1364726 1382515 1406060
15556 1406060 1362634 1348953 1365532 1424229 1434273 1394216 1392866 1404221 1389076 1395294 1392072 1362479
15544A362479P5457M368L4517K0626j9904m4935L095m5700L4737L6196k4244L788
15532A440480K5680j1662k1658l1913J6456M2544n7323M8704o9428O7310L4528
15521A483718J8059j5950q0308L0131K6614n76K3948m0120k6133P3472L0574l8554
15509A484875l8420P8424N7181j26501o0693J21935p2724k1659q4454N3235M8392
15498A439591k284m0181J6242K4486Q2436m3876P573n7569Q147j1819J2045K6597
15486A461388j5591K13q0168K3449J00229M6334n6864j6183n7487m0652R4764
15475A459432Q319k7921k7828k9220K4350j5366Q9811p0298q986O3226k6211K312
15463A441620P8560k5195q8922J5611k9516l5382O2686K7690n8630M6819o729
$$ plain form
15544 1362479 1437936 1442304 1476821 1497447 1477543 1432608 1435703 1390003 1424740 1460936 1436692 1440480
15532 1440480 1466160 1454498 1432840 1400927 1417383 1459927 1402604 1451308 1381880 1449190 1483718
15521 1483718 1501777 1485827 1405519 1435650 1462264 1461688 1485636 1445516 1419383 1492855 1523429 1484875
15509 1484875 1446455 1524879 1582060 1455559 1394866 1516801 1444077 1422418 1337964 1391199 1439591
15498 1439591 1437307 1397126 1413368 1437854 1520290 1476414 1483987 1426418 1434565 1422746 1434791 1461388
15486 1461388 1445797 1446010 1365842 1389291 1489520 1535854 1478990 1462807 1405320 1364668 1459432
15475 1459432 1467751 1439830 1412002 1382782 1407132 1391766 1481577 1411279 1402293 1465519 1439308 1441620
15463 1441620 1520180 1494985 1406063 1421674 1392158 1356776 1419462 1447152 1388522 1435341 1428612
15452A428612j8112P006L3907n9701j1265P4792j6763m4215o3708O7354K9906
15441A427813n0731J2203L5590N8638J4564j8165m8822J0562l95m6288k9829K239
15429A367379K3828k1601Q0809N8336J3740q8616p328L6267l6606l256l5O0554
15417A483471k5940K1809j3483K4819M8985n1570m2727m9899L4015m5020L638
15406A388098J16276J3655l9255j8910j5495N9793m601l368n610J5429k5723j9645
15394A460644l80K3165j034j2635p8699O672k2771M5302k3786M7450l971k1793
15382A418164q7374k9947J29650k7294L0672J2029o3461N4978L58K4561L4112
15371A496448P898j0178k1511K36p7208N5177o711r475n2655P746P4573n5535
$$ plain form
15452 1428612 1410500 1417506 1451413 1391712 1380447 1455239 1438476 1394261 1330553 1397907 1427813
15441 1427813 1377082 1389285 1424875 1483513 1498077 1479912 1431090 1441652 1441257 1394969 1365140 1367379
15429 1367379 1391207 1369606 1450415 1508751 1522491 1433875 1426547 1462814 1426208 1422952 1422917 1483471
15417 1483471 1457531 1479340 1465857 1490676 1539661 1488091 1445364 1395465 1429480 1384460 1388098
15406 1388098 1504374 1518029 1478774 1459864 1444369 1504162 1499561 1496193 1490583 1506012 1480289 1460644
15394 1460644 1460264 1483429 1482395 1469760 1391061 1397733 1374962 1420264 1396478 1443928 1439957 1418164
15382 1418164 1330790 1300843 1430493 1403199 1433871 1445900 1382439 1437417 1437775 1462336 1496448
15371 1496448 1504346 1494168 1472657 1472893 1395685 1450862 1444151 1434676 1382021 1389767 1464340 1408805
15359A408805J8712N3972K9896O970n643n5810M860J562o2479M8913K3264k0644
15347A452378M4371r5056O6138L0134Q627N1049p5707N868N021J375L2429p3175
15335A453452j7770q919o1900M7595N4977J4213m7998O8706K433R713k351r3754
$$ plain form
15359 1408805 1427517 1481489 1511385 1518355 1512712 1456902 1461762 1463324 1400845 1449758 1473022 1452378
15347 1452378 1496749 1401693 1467831 1497965 1506592 1557641 1481934 1487802 1492823 1494198 1526627 1453452
15335 1453452 1435682 1426763 1364863 1412458 1467435 1481648 1433650 1502356 1504789 1514502 1512151 1418397
$$ [...]
##END NTUPLES=NMR SPECTRUM
##END=
