##TITLE=1H_EC-3330(3)
 CDCl3
 8 sc, 
 2.8.2024
##JCAMPDX= 6.0         $$ Bruker NMR JCAMP-DX V2.0
##DATA TYPE= NMR SPECTRUM
##DATA CLASS= NTUPLES
##ORIGIN= UXNMR, Bruker Analytische Messtechnik GmbH
##OWNER= root
$$ XWIN-NMR		Version 3.5
$$ Fri Aug  2 13:53:39 2024 Russian Standard Time (UT+4h)  she@DPX200
##.OBSERVE FREQUENCY= 200.1314
##.OBSERVE NUCLEUS= ^1H
##.ACQUISITION MODE= SIMULTANEOUS
##.ACQUISITION SCHEME= undefined
##.AVERAGES= 8
##.DIGITISER RES= 18
##SPECTROMETER/DATA SYSTEM= spect
##.PULSE SEQUENCE= zg30
##.SOLVENT NAME= Acetone
##.SHIFT REFERENCE= (INTERNAL, Acetone, 0, 22.0551)
##AUDIT TRAIL= $$ (NUMBER, WHEN, WHO, WHERE, WHAT)
$$ ##TITLE= Audit trail, XWIN-NMR		Version 3.5
$$ ##JCAMPDX= 5.01
$$ ##ORIGIN= Bruker BioSpin GmbH
$$ ##OWNER= she
$$ F:/spectra/data/she/nmr/H-F/1/pdata/1/auditp.txt
$$ ##AUDIT TRAIL=  $$ (NUMBER, WHEN, WHO, WHERE, WHAT)
(   1,<2024-08-02 13:52:20.15 +0400>,<she>,<DPX200>,
      <created by zg, POWCHK disabled, PULCHK disabled
       configuration hash MD5:
       00 E9 B6 7A A2 85 ED C7 34 08 36 98 17 FE 4E 26
       data hash MD5: 16K
       D9 A0 0B 3A AD A7 3E 81 3E B6 1B 89 A2 37 D9 9A>)
(   2,<2024-08-02 13:52:25.25 +0400>,<she>,<DPX200>,
      <Start of raw data processing
       efp BC_mod = 2 LB = 0.24 FT_mod = 6 PKNL = 1 PHC0 = -25633.25 PHC1 = 7.587489 SI = 16K 
       data hash MD5: 16K
       87 98 8E 11 8C 47 FC E3 C2 8B C5 23 9E A2 AA E5>)
(   3,<2024-08-02 13:52:49.84 +0400>,<she>,<DPX200>,
      <pk PHC0 = -2.806283 PHC1 = 4.8 
       data hash MD5: 16K
       F2 22 61 30 90 1B F7 09 6D B4 12 F2 50 DF 86 9E>)
(   4,<2024-08-02 13:52:53.17 +0400>,<she>,<DPX200>,
      <abs ABSG = 5 
       data hash MD5: 16K
       D6 E2 77 8A 18 66 4B BD 36 76 1A 7D 64 4A BE 8C>)
$$ ##END=
$$ 
$$ hash MD5
$$ 5B BD 09 A0 1B C3 61 A4 4B 79 0E 22 5E 61 82 C4
##$RELAX= 
##$RELAX= 
##$RELAX= 
##$RELAX= 
##$RELAX= 
##$RELAX= 
$$ Bruker specific parameters
$$ --------------------------
##$DU= <F:/spectra>
##$EXPNO= 1
##$NAME= <H-F>
##$PROCNO= 1
##$TYPE= <nmr>
##$USER= <she>
##$AMP= (0..31)
100 100 100 100 100 100 100 100 100 100 100 100 100 100 100 100 100 100 
100 100 100 100 100 100 100 100 100 100 100 100 100 100 
##$AQSEQ= 0
##$AQ_mod= 1
##$AUNM= <au_zg>
##$AUTOPOS= <>
##$BF1= 200.13
##$BF2= 200.13
##$BF3= 200.13
##$BF4= 200.13
##$BF5= 200.13
##$BF6= 200.13
##$BF7= 200.13
##$BF8= 200.13
##$BYTORDA= 1
##$CFDGTYP= 0
##$CFRGTYP= 5
##$CHEMSTR= <none>
##$CNST= (0..31)
1 1 145 1 1 1 1 1 1 1 1 1 1 1 1 1 1 1 1 1 1 1 1 1 1 1 1 1 1 1 1 1 
##$CPDPRG= <>
##$CPDPRG1= <>
##$CPDPRG2= <>
##$CPDPRG3= <>
##$CPDPRG4= <mlev>
##$CPDPRG5= <mlev>
##$CPDPRG6= <mlev>
##$CPDPRG7= <mlev>
##$CPDPRG8= <mlev>
##$CPDPRGB= <>
##$CPDPRGT= <>
##$D= (0..31)
0 1.2 0 0 0 0 0 0 0 0.06 0 0.03 0 0 0 0 0.0002 0 0 0 0 0 0 0 0 0 0 0 0 
0 0 0 
##$DATE= 1722592339
##$DBL= (0..7)
120 120 120 120 120 120 120 120 
##$DBP= (0..7)
150 150 150 150 150 150 150 150 
##$DBP07= 0
##$DBPNAM0= <>
##$DBPNAM1= <>
##$DBPNAM2= <>
##$DBPNAM3= <>
##$DBPNAM4= <>
$$ [...]
##$SUBNAM3= <"">
##$SUBNAM4= <"">
##$SUBNAM5= <"">
##$SUBNAM6= <"">
##$SUBNAM7= <"">
##$SUBNAM8= <"">
##$SUBNAM9= <"">
##$SW= 24.0689651099613
##$SWIBOX= (0..15)
0 0 2 0 0 0 0 0 0 0 0 0 0 0 0 0 
##$SW_h= 4816.95568400771
##$TD= 16384
##$TD0= 1
##$TE= 0
##$TE2= 300
##$TE3= 300
##$TEG= 300
##$TL= (0..7)
0 120 120 120 120 120 120 120 
##$TP= (0..7)
150 150 150 150 150 150 150 150 
##$TP07= 0
##$TPNAME0= <>
##$TPNAME1= <>
##$TPNAME2= <>
##$TPNAME3= <>
##$TPNAME4= <>
##$TPNAME5= <>
##$TPNAME6= <>
##$TPNAME7= <>
##$TPOAL= (0..7)
0.5 0.5 0.5 0.5 0.5 0.5 0.5 0.5 
##$TPOFFS= (0..7)
0 0 0 0 0 0 0 0 
##$TUNHIN= 0
##$TUNHOUT= 0
##$TUNXOUT= 0
##$USERA1= <user>
##$USERA2= <user>
##$USERA3= <user>
##$USERA4= <user>
##$USERA5= <user>
##$V9= 5
##$VALIST= <valist>
##$VCLIST= <CCCCCCCCCCCCCCC>
##$VD= 0
##$VDLIST= <DDDDDDDDDDDDDDD>
##$VPLIST= <PPPPPPPPPPPPPPP>
##$VTLIST= <TTTTTTTTTTTTTTT>
##$WBST= 1024
##$WBSW= 4
##$XGAIN= (0..3)
0 0 0 0 
##$XL= 0
##$YL= 0
##$YMAX_a= 527256
##$YMIN_a= -393194
##$ZGOPTNS= <>
##$ZL1= 120
##$ZL2= 120
##$ZL3= 120
##$ZL4= 120
##$ABSF1= 22.05786
##$ABSF2= -2.011347
##$ABSG= 5
##$ABSL= 3
##$ALPHA= 0
##$AQORDER= 0
##$ASSFAC= 0
##$ASSFACI= 0
##$ASSFACX= 0
##$ASSWID= 0
##$AUNMP= <proc_1d>
##$AZFE= 0.1
##$AZFW= 0.1
##$BCFW= 0
##$BC_mod= 2
##$BYTORDP= 0
##$COROFFS= 0
##$CY= -3
##$DATMOD= 1
##$DC= 0
##$DFILT= <>
##$DTYPP= 0
##$F1P= 0
##$F2P= 0
##$FCOR= 1
##$FTSIZE= 16384
##$FT_mod= 6
##$GAMMA= 0
##$GB= 0
##$INTBC= 1
##$INTSCL= 3.70164e-10
##$ISEN= 128
##$LB= 0.24
##$LEV0= 0
##$LPBIN= 0
##$MAXI= 10000
##$MC2= 0
##$MEAN= 0
##$ME_mod= 0
##$MI= 1.114404
##$NCOEF= 0
##$NC_proc= -5
##$NLEV= 6
##$NOISF1= 3.799351
##$NOISF2= 2.8
##$NSP= 0
##$NTH_PI= 0
##$NZP= 0
##$OFFSET= 22.05511
##$PC= 1
##$PHC0= -25636.06
##$PHC1= 12.38749
##$PH_mod= 1
##$PKNL= yes
##$PPARMOD= 0
##$PSCAL= 0
##$PSIGN= 0
##$REVERSE= no
##$SF= 200.129394601636
##$SI= 16384
##$SIGF1= 3
##$SIGF2= 2
##$SINO= 5.538805
##$SIOLD= 16384
##$SREGLST= <1H.CDCl3>
##$SSB= 0
##$STSI= 16384
##$STSR= 0
##$SW_p= 4816.95568400771
##$SYMM= 0
##$S_DEV= 0
##$TDeff= 16384
##$TDoff= 0
##$TI= <>
##$TILT= no
##$TM1= 0
##$TM2= 0
##$TOPLEV= 0
##$USERP1= <user>
##$USERP2= <user>
##$USERP3= <user>
##$USERP4= <user>
##$USERP5= <user>
##$WDW= 1
##$XDIM= 16384
##$YMAX_p= 454910096
##$YMIN_p= -450798
$$ End of Bruker specific parameters
$$ ---------------------------------
##NTUPLES= NMR SPECTRUM
##VAR_NAME=  FREQUENCY,     SPECTRUM/REAL,   SPECTRUM/IMAG
##SYMBOL=    X,             R,               I
##VAR_TYPE=  INDEPENDENT,   DEPENDENT,       DEPENDENT
##VAR_FORM=  AFFN,          ASDF,            ASDF
##VAR_DIM=   16384,         16384,           16384
##UNITS=     HZ,            ARBITRARY UNITS, ARBITRARY UNITS
##FACTOR=    0.29402158847633, 1,            1
##FIRST=     4413.8759985723, 0,             0
##LAST=      -403.079685435408, 0,           0
##MIN=       -403.079685435408, -450798,     0
##MAX=       4413.8759985723, 454910096,     0
$$ Real data points
##PAGE= N=1
##DATA TABLE= (X++(R..R)), XYDATA
$$ [...]
7237 33933 -41354 -31598 21271 16925 51804 5524 -40050 -11417 -3426 30550 -762 -39069
7225 -39069 -58258 -59403 -40950 13287 31297 -17089 9468 -7461 -36415 -32681 -96504 -39615
7213 -39615 69333 9786 232 -28981 -680 -39669 -75693 -51744 -36447 16329 11970 -10914
7201 -10914 -10598 75946 98567 54648 3115 -38430 -3645 1303 22447 -12013 -5449 43840 12227
7188 12227 -29237 17528 13301 40565 40108 33735 35679 38760 128692 52641 25723 -38425 44398
7175 44398 55533 93666 120391 131991 196159 143501 180134 196302 183598 199506 160501 164316
7163 164316 205618 203283 175653 255575 263594 292130 288138 213144 169403 154876 94358 92949
7151 92949 154976 160174 152863 119109 91838 62605 56662 113845 59753 91833 99546 57672 35966
7138 35966 75577 97011 46007 77101 94238 123171 61444 47177 20522 58309 58609 37087
7126 37087 37978 27321 54658 66489 95190 138805 86566 53726 29390 42299 78495 61744
7114 61744 119080 95310 17222 112165 84928 48375 50540 103236 53060 10183 -29686 22242
7102 22242 58722 42607 116299 132778 110726 82142 63274 59214 50562 87293 123560 94915
7090 94915 60765 88693 91313 18486 -233 53462 60677 55096 72238 38884 40143 59895 81441
7077 81441 98758 145147 57265 14835 43869 46574 71278 54768 75067 43003 43550 109612
7065 109612 143463 48619 75448 56221 -30994 41382 62827 100465 133912 88260 104050 67531
7053 67531 104656 101471 120574 142646 204201 133013 76528 102725 90462 145199 79217 109620
7041 109620 42494 67895 54916 145106 161006 87658 87790 123186 108776 119928 154516 164534
7029 164534 169599 132445 107017 86866 141853 229168 212857 171503 58939 111913 138202 85896
7017 85896 81765 59580 114445 125946 139486 95325 169937 168761 162808 185236 118101 108303 71924
7004 71924 113051 199236 156762 194002 237080 247489 174020 102986 118178 146946 184245 162143
6992 162143 137420 138023 208355 165299 222143 221535 206242 227455 214829 281467 291762 260279
6980 260279 235186 298018 297313 319766 365920 308494 244087 290040 285189 307790 355528 355204 378411
6967 378411 424172 379778 372979 360830 402026 417180 415006 445829 361335 334779 381426 390191
6955 390191 395218 467457 470425 439818 453343 502741 556613 595964 633582 656292 734483 721136
6943 721136 697446 690911 726436 794963 789382 846882 921239 948629 944759 1072877 1177024 1339017
6931 1339017 1372031 1482786 1581449 1716831 1909336 1858501 1884862 1957848 2005321 2094281 2143569
6920 2143569 2214064 2218969 2232843 2381822 2443166 2533469 2696342 2847096 3175164 3467340 3839955
6909 3839955 4191605 4605868 4994725 5359273 5634840 5960134 6428725 6894228 7365246 7850362
6899 7850362 8252029 8695389 9307631 9998039 10765271 11698367 12663832 13892042 15404130
6890 15404130 17338122 19774810 22940280 26945620 32450558 37947002 42289986 44166165
6882 44166165 43605377 42593879 42097778 43477985 44372070 43891163 40437012 35215917 29686423
6873 29686423 24638313 20764646 17811335 15464375 13571128 12090919 10943155 9972151
6865 9972151 9227350 8592611 8129257 7762808 7503767 7321155 7237872 7187417 7019195 7075142
6855 7075142 7013296 6820243 6476153 6184656 5812505 5391839 4916952 4577861 4293245 4102229
6845 4102229 3838701 3637283 3448867 3301384 3233663 3119067 3031083 2964076 2961087 2951347 2832216
6834 2832216 2715015 2622464 2470769 2410134 2336846 2297733 2141824 2026830 1917037 1768416
6824 1768416 1692839 1538460 1541654 1487171 1455255 1423521 1469819 1458435 1432760 1481833 1556526
6813 1556526 1619814 1534302 1549439 1566577 1653447 1629957 1497272 1416547 1268367 1112854 1042889
6802 1042889 940281 926963 989222 902392 862131 823443 785440 710449 753716 762335 692456
6791 692456 711460 720408 746470 784456 755670 689211 629764 578776 540189 488996 483287 486964
6779 486964 445679 503388 492133 438908 502621 471630 414122 483628 468598 459507 452978 460009
6767 460009 489127 482479 474718 511627 544550 521331 478006 547846 548017 468030 408109 440176
6755 440176 472856 424361 386268 401545 340812 306648 263576 222988 253205 294576 347887 313108
6743 313108 305839 294932 313134 321296 200248 191861 193593 290455 249903 256779 275282 300419
6731 300419 231752 221458 263150 293996 220194 183078 240693 198391 206686 225092 203355 201667
6719 201667 197992 168581 244702 171740 183802 255853 162493 143181 184332 136591 209303 198111
6707 198111 266895 219624 252913 196033 143555 198542 199013 151042 233892 218101 292961 220287
6695 220287 256984 261598 245689 222276 202489 247041 241427 248768 297459 333685 371997 342468
6683 342468 330892 372420 286047 345338 280674 294714 310979 230278 269637 294324 340194 274020
6671 274020 235026 269312 319810 309913 238310 277640 286192 299082 309500 304492 276770 323924
6659 323924 367116 413934 437595 474259 468106 514835 468679 464967 514160 522520 590328 595857
6647 595857 541247 552319 518700 434562 466759 421338 469150 487099 447407 481205 459248 428852
6635 428852 404559 438231 443333 504192 484773 572705 513812 500674 533359 615656 678051 805222
6623 805222 882340 888413 946440 877286 920070 948491 957956 1016988 1008971 970479 949846 851272
6611 851272 762369 665615 716219 682005 590581 553386 624894 636731 580807 535336 655225
6600 655225 645073 584708 649671 687075 640460 648434 647715 628131 662295 591222 576391 550064
6588 550064 551363 504596 527026 562095 628354 576258 512802 528008 574546 556567 594981 572367
6576 572367 592589 585855 600849 654102 595437 538340 550913 615513 617736 692100 688262 679625
6564 679625 643819 710585 847381 830447 730400 695749 766622 876222 914744 975393 1016286
6553 1016286 1095238 1122371 1169020 1190286 1240528 1325198 1427116 1486729 1507723 1629761 1794490
6542 1794490 1942924 2075205 2240573 2517523 2677108 2832922 3065802 3216560 3361080 3467542
6532 3467542 3801512 3989997 4136223 4293293 4548874 4793975 5124272 5500117 5946667 6421492
6522 6421492 6989751 7732648 8768947 9953764 11483639 13530614 16353466 18822627 19559841
6513 19559841 19183796 18362141 18228397 19051122 20581698 21088819 19916939 17939507 15906030
6504 15906030 14370117 13239107 12430144 11772739 11238295 10908645 10759624 10829778 10921323
6495 10921323 11087682 11336380 11726307 12338653 13244305 14631156 16357141 18691395 21897729
6486 21897729 25857155 28335376 28415928 27010245 25743503 25692620 27010356 28729288 28228399
6477 28228399 25564751 21810148 18540773 16150554 14179746 12659000 11379312 10291414
6469 10291414 9462636 8866277 8387184 8012281 7556897 7244727 7036630 6903182 6801612
6460 6801612 6774234 6832495 6951273 7106070 7400490 7980695 8362879 8498626 8633643 8682913
6450 8682913 8383194 7904771 7487844 7195350 7079154 7189097 7419492 7810782 8204442 8453191
6440 8453191 8606353 8695330 8541754 8085491 7545569 7064894 6474808 5837580 5149520 4652330
6430 4652330 4299132 4040127 3743674 3608771 3411316 3213206 3034301 2949870 2905653 2831116
6420 2831116 2699506 2759958 2657729 2558987 2607592 2652121 2676711 2611945 2572120 2622878 2643903
6409 2643903 2614854 2612205 2598566 2597744 2615053 2610461 2615853 2688669 2712488 2814364 2895666 3069826
6397 3069826 3242695 3508073 3721358 3967418 4214920 4550156 4797375 5105620 5267541 5466564
6387 5466564 5736145 6100405 6482843 6915796 7273070 7698648 8132746 8591747 9174369 9849585
6377 9849585 10528055 11342895 12367747 13773154 15568733 18018641 21288463 25595225 31000056
6368 31000056 35912060 38960917 38608667 35264172 30813309 26268462 22563457 19636258
6360 19636258 17435299 15864536 14812020 14101773 13710462 13450232 13414761 13441295 13333854
6351 13333854 12997569 13017662 13119249 13284695 13558155 14085071 14711859 15723261 17060381
6342 17060381 18906367 21433525 24732849 28663301 31944953 33531822 33051116 30906081
6334 30906081 28525962 26688033 26079542 26686903 28865860 32585901 39105514 43351105
6326 43351105 39257600 32807922 26793604 21953281 18343453 15908041 13904613 12348603
6318 12348603 11155731 10177221 9399167 8943365 8465101 7901871 7320069 6891362 6437403
6309 6437403 6003624 5693821 5433731 5255498 5079459 5031163 5059662 5073262 5034348 4870562
6299 4870562 4750248 4618565 4313117 4110993 3971305 3816035 3713430 3642097 3674868 3734499
6289 3734499 3721661 3930066 3913063 3834010 3664699 3347486 3031437 2875447 2688176 2595144
6279 2595144 2618324 2649553 2666061 2745590 2796137 2696028 2681426 2627021 2536344 2375201 2211132
6268 2211132 2096652 2050048 1845008 1802162 1791088 1716047 1699307 1752085 1770020 1669246 1548165
6257 1548165 1424833 1308572 1179760 1165500 1138757 1005104 952225 913868 888163 906072 846429
6246 846429 836151 773506 778099 842186 813039 708664 655728 681516 677360 658263 685837 654205
6234 654205 678121 663764 605328 657267 623310 631180 591697 557675 639227 611252 592385 531768
6222 531768 617919 537006 531840 495305 525228 447122 421020 474229 410603 440033 442210 407082
6210 407082 374231 403404 384874 369102 364434 355820 372908 397706 392639 471836 486766 446169
6198 446169 454527 385569 410476 349884 350508 374510 439474 427947 315077 288250 258828 217702
6186 217702 172157 196041 303269 262539 232796 270802 347219 317812 226354 322660 286089
6175 286089 257365 197725 244523 218810 166688 130886 159051 182064 168166 225411 150885 200390
6163 200390 246769 256121 219435 251378 295386 207908 178305 126531 103865 163995 160303 108792
6151 108792 132363 79998 74437 59402 20326 63982 97847 63700 134547 91515 109486 92919
6139 92919 79838 95387 101892 119019 133763 166377 123127 62621 113082 124638 107417 85684
6127 85684 82695 116812 91459 73355 98588 165369 154323 149266 130151 124345 136831 77730
6115 77730 107694 152599 73789 -28858 36894 122613 172520 170116 123501 141194 114617 138583
6103 138583 133504 148857 159020 100057 44125 116219 143519 177409 198736 176418 187298 193604
6091 193604 191055 193056 182747 115664 119188 74491 118002 74436 87079 139439 204767 202190
6079 202190 127082 126659 110363 107693 111752 176666 147071 98728 71119 82705 97881 138514
6067 138514 107965 83569 109138 226133 193367 226737 219199 209348 196331 153177 163877 158135
6055 158135 156037 14465 -105402 12710 47283 18590 44895 60826 -14852 -2155 43713
6044 43713 42985 71703 51914 -95 53231 16428 11347 33920 -10313 -43789 16251 -859
6032 -859 22061 25740 7279 42648 -33372 -577 -18296 10223 32892 46735 21382 -59410
6020 -59410 -72552 -15516 8977 121031 84223 13866 33181 2567 -70061 -8513 -43562 -20318
6008 -20318 -41098 8874 69668 78989 39622 -48576 -59724 -18221 -9411 -19655 11679 -22269
5996 -22269 -21509 -23449 -21878 -69 -36085 -15082 65793 67041 36881 41214 41838 -11660 -17920 1982
5982 1982 1606 -2803 11211 -27675 -6564 32318 97989 132814 71570 81152 97546 103924 119727
5969 119727 203787 172045 203168 159794 162979 113166 17809 47110 55895 -9321 28376 73692
5957 73692 44949 58839 14685 -3511 -12123 -47179 -15223 14128 5544 -26551 -25172 37593
5945 37593 8832 -6464 26350 -11261 -3734 1134 -48392 -84430 947 -36815 -61463 10433
5933 10433 -9750 -23151 -33885 56360 5031 86573 108632 106789 79033 -13948 -23323 -28468
5921 -28468 -16098 -59471 -62152 -45573 -20865 59600 34687 -45146 -83375 -43275 -14899 53084
5909 53084 44642 3412 26238 -10568 17345 35231 11005 -12310 -22162 36684 -42488 -35086
5897 -35086 -39040 -140884 -75583 -29444 -47241 18443 -353 -31951 -26142 -18550 52552 20966
5885 20966 -16037 -13949 -132744 -90323 -50763 -38314 28321 -54000 -100902 -57425 -97381 -91942
5873 -91942 -53132 -47263 -31681 45048 3791 -39790 19186 -32803 -70109 -92581 -137245 -41862
5861 -41862 -38911 -79873 -56447 -47856 -124879 -83026 -72962 9204 -19052 -43727 -32238 -76093
5849 -76093 10708 -50404 -122034 -143712 -75484 -36602 -42302 -59992 -35021 -30206 -44610 -51893
5837 -51893 -114456 -79782 -17611 12848 -7419 -45830 -58776 12077 -31952 -76818 -1757 -45007
5825 -45007 -65495 -5504 14380 -23495 -84092 -49995 -33101 -99079 -61077 41908 43515 -11454
5813 -11454 113556 -18233 -100654 -45481 -68084 -125773 -52272 -41520 -80973 -74845 -62509 -92511
5801 -92511 -3023 -103 43631 27569 37689 -62644 -77314 -7428 -13859 -80253 28222 68956
5789 68956 -56341 -17734 -22788 -64600 -94153 -53865 -34600 -89806 -36240 44511 41836 48504
5777 48504 26821 -101302 -116094 -34674 -66940 -4539 -66306 -109350 -91417 3794 -10096 -6271
5765 -6271 15835 3337 -114357 -78529 -36890 -15831 -38367 -125665 -114464 -119018 -55000 -63217
5753 -63217 -125399 -114743 -111995 -120752 -99143 -57573 -43305 -51882 -59358 -133914 -76580 32635
5741 32635 56698 52352 51708 -28626 -57940 -48266 -17569 -70088 -33492 -50330 -64044 -57845 156
5728 156 -62004 -110786 8288 -15325 -51776 2708 35044 -4267 -40511 -37004 -20403 -5574
5716 -5574 14128 48707 -31098 -97835 -39197 6352 -7086 -62052 -54558 -83410 -61781 -78065
5704 -78065 -99606 -136913 -44499 -31700 -18230 -62326 -111901 -74558 -6902 -18956 -7202 21918
5692 21918 -39079 -51867 -18514 18457 9692 2605 1545 -83920 -74843 -75558 -35068 -6273 -63605
5679 -63605 -75840 -19078 21406 14142 -70835 -80554 -48215 24890 -90022 -63789 29855 -26072
5667 -26072 -61408 -144498 -28024 -8126 -7022 -52521 -61861 -24892 -86008 -21719 8103 7116
5655 7116 3352 54064 22127 -42994 -49262 -33202 -76352 -63706 -90614 -149674 -76662 -85403 -74276
5642 -74276 -42704 -6392 12281 11796 -29439 -30448 -60903 -93351 -157732 -71759 -47527 -4430
5630 -4430 -16026 10829 12470 -66925 -49795 -105446 -27765 -30007 -615 -72891 -91650 -93241 -60530
5617 -60530 34857 -8392 -28408 -87722 -88876 -113534 -65064 -59002 -90577 -22183 -27777 -60592
5605 -60592 -90705 -139042 -81608 -128659 -106516 -59615 -82991 -95500 -64476 -26514 18497 13439
5593 13439 -41813 -51967 -23407 -30205 -90690 -111865 -110624 -103263 -27225 22209 33139 29274 184
5580 184 18409 -19449 -38355 -12794 -28230 -20625 -17347 -57317 -67592 -23333 -18326 -69586 -88468
5567 -88468 -92442 -64736 -800 -13373 -6068 361 -54702 -107852 -49333 -70648 -40084 -25129
5555 -25129 -16589 -57140 -84284 -107173 -174472 -128730 -85675 -40246 -60717 -69626 -2122 11701
5543 11701 -66688 -131590 -135236 18687 9146 20921 -44765 -64488 -53562 -18260 -30322 -117432
5531 -117432 -76910 -88236 -36600 41644 -16620 -48929 -63297 -23838 28950 17642 -28208 1630
5519 1630 -12007 -70321 -27942 -50653 -71245 -94647 -80506 -102353 -80286 -37490 -16898 -60877
5507 -60877 -69444 -34989 -57926 -59698 -88292 -72829 -103639 -138146 -28176 -45666 18234 -1430
5495 -1430 -82644 -108874 -69508 -45789 -17836 -91744 -72827 -65482 -124746 -110258 -99050 -9151
5483 -9151 -66320 -132127 -129119 -93371 -94307 -53606 -82340 -98762 -78171 -51179 -122644 -101193 -70268
5470 -70268 -52919 -4715 -29363 -23647 -91435 -55629 -11882 -67402 -42601 -12092 -80928 -102070
5458 -102070 -12019 -60256 -109731 -105941 -26019 4707 -52255 -56508 -53961 -40715 33975 -21629
5446 -21629 -54228 -8105 -79220 -133505 -106398 -75168 34111 61225 6241 -48330 -71832 -56144
5434 -56144 37115 12423 -23616 2694 -14428 -50878 -31152 -44832 -95539 -76043 -102971 -57037
5422 -57037 -31766 -79163 -53033 -12217 -105551 -39299 -17437 -78031 -79656 15729 15026 -77757
5410 -77757 -127050 -122025 -74908 -78440 -49337 -36278 -52947 -121914 -129573 -123347 -59119 -66184 -82877
5397 -82877 -59114 -27494 -70914 -72929 -138186 -138704 -34141 -75140 -53941 -59496 2090 -70645
5385 -70645 -197009 -143040 -124087 -115996 -103480 -84872 18049 -69916 -83856 -65553 -53479 -77221
5373 -77221 -123506 -55443 -36943 -20224 -44172 -140852 2380 14111 -10421 -43856 -117601 -42705
5361 -42705 -64499 -82441 -34153 -117645 -87464 -20810 -70868 -43178 1415 20619 70566 10791
5349 10791 -17927 -60571 -69328 -112723 -68522 -22215 9209 54294 -73389 -46947 20711 -32442
5337 -32442 -11690 -10359 34239 44932 49580 -2348 16313 -6458 -67859 -45844 -143421 -112822
5325 -112822 -151279 -27948 -14580 -101853 -84557 -32211 -39915 -2899 -15954 -8504 -59546 11674
5313 11674 20422 -23220 4664 -59985 -101016 -132378 -137852 -39059 -70343 -38982 -44136 -16060
5301 -16060 -34052 -106990 -171074 -155193 -8392 -4046 -20419 -23277 -27852 -92840 -121920 -140610
5289 -140610 -88788 -6958 -84226 -24512 -82106 -70288 -123200 -115757 -14248 -84261 -103972 -142793
5277 -142793 -66966 -30555 5562 2859 31325 -35538 -20447 74550 9796 -66314 -29525 -30876
5265 -30876 21978 -52865 -22404 8276 -59854 12294 -81008 -69370 11312 -682 -28362 34588
5253 34588 -58931 -10407 59595 17545 15467 -10373 -74262 -94131 1471 11425 -35472 -52330
5241 -52330 -69217 -109496 -63627 -24419 -83525 -4196 43356 -68799 -83916 -113897 -62813 -56123
5229 -56123 -61062 -36928 -92471 -67792 -46302 -73477 -53989 -106224 -49819 -56607 -103080 -42444
5217 -42444 -29536 -40064 -73581 -48354 -71540 -57033 -28588 -58872 -5061 -66127 5929 -88850
5205 -88850 -62080 -88286 -36826 -6381 -83561 -85073 -24764 -133627 -101785 -48683 -72851 -126022
5193 -126022 -82491 -14030 -36912 -62306 -117993 -91744 -64896 -117794 -52496 -62891 -105226 -13165
5181 -13165 -4110 -56421 -42513 -71311 -90404 -90854 -58433 -19370 -107001 -89266 -62999 22162
5169 22162 -54692 -28892 42675 31503 -42912 15162 24658 -29024 -4513 -47848 -122785 -128102
5157 -128102 -35935 -8801 -21573 -2429 -79680 -40681 -94167 -87072 -55287 -26007 -58709 -15999
5145 -15999 19749 21139 -38369 -71358 7005 72776 -5933 -27055 -19588 -14658 -5089 -44981 -33164
5132 -33164 -26801 -70641 -95023 -72385 -48596 -90328 40594 -69319 -88103 -32007 16733 -13723
5120 -13723 -95904 10374 -42524 8941 -46584 -128107 -40054 -59417 -89754 -80139 -102613 -75534
5108 -75534 -56735 -50184 -66387 -72805 -79304 -60711 -10522 -2019 -28093 -9858 13566 42257 -21375
5095 -21375 -23636 -7123 34365 -32005 -61406 -88510 -143089 -31078 -53148 -18621 -7813 -52838
5083 -52838 -48271 -41180 -81133 -18609 -1091 -46290 -32565 -42489 -76240 -99697 -102293 -65000 -84568
5070 -84568 -49176 -6533 -37732 -36002 11000 39311 11053 74837 50890 40127 -27655 -77539
5058 -77539 -23707 -11756 1799 -36516 -14499 27330 28896 65868 23317 -50520 -6657 -46354
5046 -46354 -2799 29762 54009 109729 40104 39024 -537 60229 91995 5198 50832 79204
5034 79204 129097 49425 27774 151889 67971 107436 17234 102702 167379 159027 104517 94794
5022 94794 52974 50398 25258 63228 63881 75551 107020 23787 -34328 -43983 -15423 -42944 13672
5009 13672 19206 38857 38608 13040 79422 -44837 5750 42315 152428 150376 73728 28128
4997 28128 12108 -37443 -16081 -57692 -8291 -1921 -48168 -55625 -58096 -71993 -34416 18026
4985 18026 -20532 -30664 -19992 -61283 -100028 -62560 -126607 -103110 -108552 -58895 31415 17514
4973 17514 -102286 -51748 -57221 52488 -41396 -79190 -50997 -7270 24950 -35788 -95415 -21425
4961 -21425 -49708 -7059 -39553 4659 -14191 -38834 -85557 -59301 -47162 -101891 -151686 -34056
4949 -34056 8779 -20267 3451 -40949 -76556 -110212 -74757 -68333 -19786 -72574 -22727 53882
4937 53882 19869 4254 -37564 -87886 -63298 -61441 -29256 -7710 -17428 -23371 -98007 -129185
4925 -129185 -96993 -101393 -103065 -99905 -58900 -28336 -41433 -41988 -52640 -80302 -69241 -129425 -109569
4912 -109569 -43723 -16451 -109666 -171193 -85446 -5088 15550 -88849 -101780 4322 -45006
4901 -45006 -65007 -46663 -7830 13829 6471 27641 10702 47234 -23340 15315 3375 -30267
4889 -30267 -14825 7794 21041 7881 101769 144891 167911 174628 157836 114305 29504 -31792
4877 -31792 -19080 30569 -10769 -58242 -9815 65917 16264 15175 27400 11690 -36805 -55663
4865 -55663 27319 -48268 1870 -65253 -55415 3906 -2688 -33224 12150 28221 4675 -18766
4853 -18766 -8698 -58459 -1614 -32150 -152288 -132337 -19716 -71637 -109395 17318 21718
4842 21718 -42886 -67077 -114506 -182428 -124859 -122412 -76348 -81717 -112384 -53820 -42212 -90268
4830 -90268 -46122 -25825 3395 -58937 -97748 -54858 -29679 -58606 -21116 -74783 -78789 -98089
4818 -98089 -72166 38371 -16748 -9935 -39658 -67867 -37561 -24410 -44975 -71906 -83784 26120
4806 26120 -3773 -65979 -64021 -83668 -41374 -62519 -67052 -53499 13089 -5276 19814 -85329
4794 -85329 -78833 -100536 -105085 -48725 -108374 -97950 -77403 -38071 -77417 -102204 -78712 -99253
4782 -99253 -58584 -2984 11211 34400 -34943 -56736 -24707 -11102 -19410 -19605 -11510 -25418 -80735
4769 -80735 -39766 -50202 -70424 -60037 -72098 -91666 -27015 -2583 20838 69376 14194 -31326
4757 -31326 39339 -47971 -90764 -70547 -83427 -26958 -40880 -132402 -68976 -57908 -116418 -72454
4745 -72454 -40040 3375 -43215 -27433 -35966 3044 -46256 35312 60114 -34755 2311 87292
4733 87292 22347 -23774 35267 -1006 -74852 -135757 -24874 -5926 -26061 -72582 1735 -22685
4721 -22685 -85810 -58066 -34791 9951 -29130 45341 112103 203626 146774 72936 96165 28347
4709 28347 -61229 -28920 6873 118750 99049 87146 107719 87162 104238 133933 148399 125639
4697 125639 78204 157197 172737 138087 162956 83682 236421 294124 244092 285467 330339
4686 330339 271431 330509 387795 434912 424303 417793 370704 384229 358511 362655 261736 273924
4674 273924 322301 271438 297633 317798 342948 348569 395668 451581 502220 595255 639795 705423
4662 705423 644875 681726 699443 620487 553401 541892 449341 431261 386175 373825 401605 305518
4650 305518 341069 322181 339008 324191 409065 357505 338003 392388 400790 424068 441879 372117
4638 372117 308863 292287 282001 193395 211460 238636 139553 127596 158983 180516 188176 135791
4626 135791 164999 170196 183968 162150 212621 147259 90351 110843 112820 78522 111797 135245
4614 135245 188336 126515 131951 94219 112730 107164 85619 141291 197349 205242 175590 202040
4602 202040 162152 183698 186453 206033 177185 196659 155717 106402 122272 118888 103928 72784
4590 72784 43010 24462 48635 52663 93028 91626 149691 190430 120073 114044 111076 149374 131313
4577 131313 160362 152118 51097 30959 22498 20910 75140 111659 115560 141336 102724 98815
4565 98815 28341 65879 78573 117170 136481 35579 76063 42011 53137 92517 27600 49758
4553 49758 114447 94862 84552 118170 140533 107014 48317 74899 129625 92918 147107 185105
4541 185105 122824 67129 75824 54822 22427 78589 94961 139202 92026 122909 170713 107043
4529 107043 183018 91081 93235 66888 80705 60611 121450 90270 16458 66859 101404 117400
4517 117400 111996 59335 89697 116397 97287 110680 136244 151283 93868 138712 204201 142969
4505 142969 175128 253114 206229 224640 220276 125109 133876 122238 134875 169083 248560 303912
4493 303912 254090 239566 236828 238227 312983 271212 217326 232703 298873 307001 312459 369661
4481 369661 331894 351594 381902 403551 433047 416392 412055 428410 400677 395146 491250 523339
4469 523339 525463 546700 640164 629525 685122 737961 743405 818866 901989 950511 1026201 1057875
4457 1057875 1182760 1334499 1468069 1704845 1790429 1882850 1808323 1719639 1654623 1591142 1586147
4446 1586147 1506396 1450387 1564311 1611331 1729363 1728405 1853827 1973562 2063403 2235541 2463125
4435 2463125 2748233 3080173 3373904 3689000 3843419 3727864 3552477 3296603 3094798 2956539
4425 2956539 2861373 2819918 2782756 2864511 3011733 3133674 3142258 3241560 3371523 3559813 3787418
4414 3787418 3906076 4136024 4422903 4697429 4780626 4909377 4991750 4986063 5105479 5388049
4404 5388049 5591176 5912093 6317082 6759470 7220980 7706182 8209989 8806311 9533846 10463506
4394 10463506 11592644 12751490 14047295 15232332 16089641 16361078 16073141 15433613 14781191
4385 14781191 14242283 13871218 13690986 13735113 13949164 14409175 14948665 15692607 16801063
4376 16801063 18135392 19849312 22079902 24548364 27038799 28872243 29401414 28393716
4368 28393716 26269244 23761776 21351559 19283089 17524546 16219928 15260622 14483758
4360 14483758 14007194 13657754 13562915 13810648 14229434 14950527 15832156 16700157 17359176 17450236
4350 17450236 16889296 15589815 14109901 12629205 11145731 9906350 8862812 7958188
4342 7958188 7175061 6467779 5884448 5432548 5014040 4581914 4236896 3976458 3696888 3379296
4332 3379296 3236549 3095432 2902485 2817672 2619527 2473223 2350770 2338399 2142744 2045469
4322 2045469 1924476 1892557 1867061 1705437 1563531 1530543 1502067 1447016 1402298 1310543 1196992
4311 1196992 1204630 1161893 1111071 1101292 1112577 1126192 1064277 1016755 889480 827929 815454 829795
4299 829795 806952 831584 750359 685969 725658 725975 683912 650563 635949 666363 561380 550617
4287 550617 596791 569926 629051 544585 462652 471073 486012 499407 483198 393250 396118 443375
4275 443375 403333 425462 400445 344719 395182 369696 400882 427512 435681 385963 395331 380438
4263 380438 360145 338394 266533 309861 293674 268546 288840 296667 281243 298881 265311 310184
4251 310184 325939 320036 310294 278150 276701 298196 287653 328460 352929 250960 300637 283525
4239 283525 298194 337437 305516 243087 287598 288110 289965 247790 220078 208387 210978 277348
4227 277348 303266 349397 350172 344570 258527 240398 261631 294398 277267 233144 215790 267856
4215 267856 388673 371095 318698 303907 369279 424353 345985 304492 263582 239231 254082
4204 254082 320179 301036 197019 220572 316157 262613 251589 258839 236086 195528 113162 214937
4192 214937 214163 214602 258041 197966 254377 238604 207895 238277 196082 161015 91268 133944
4180 133944 173223 210266 166083 174496 200345 146393 178384 165928 230715 191107 192746 218913
4168 218913 202056 189370 105599 142054 120416 142960 176009 194274 228120 160230 170487 177399
4156 177399 199148 203311 251680 280912 263225 251150 259264 257405 239320 268745 263387 295689
4144 295689 257867 280342 259523 237146 238018 283158 268745 293662 363255 346109 308849 272604
4132 272604 289354 225333 224581 216422 192683 214487 214811 218049 260238 237632 283479 226649 232463
4119 232463 251246 297818 355337 313356 298825 384383 312132 187784 195718 242983 271926 324508
4107 324508 323180 345998 287240 291932 277429 202734 228646 313878 255428 292383 370806 356369
4095 356369 379467 365898 318222 245087 301605 345959 321329 323685 302192 353422 377776 379325
4083 379325 462993 396448 424002 380400 344564 437197 383467 449380 428904 464126 518264 477735
4071 477735 552231 582066 575235 550677 558119 593131 624738 593712 617285 654746 705593 683287
4059 683287 684138 712489 776877 785761 810456 861128 1000301 987711 1022663 1162517 1175384 1242813
4047 1242813 1229222 1283252 1245372 1238231 1222421 1209893 1252124 1358232 1382501 1488467 1548778
4036 1548778 1578443 1736917 1834253 1911572 2038082 2271092 2423053 2560214 2679609 2815635
4026 2815635 2910920 3003565 3249568 3534804 3622018 3754046 3787304 3762302 3811754 3840957 3908760
4015 3908760 4049110 4140566 4366396 4487589 4830544 5042396 5241363 5565828 5931140 6379542
4005 6379542 6855948 7359744 8006890 8727697 9350821 9835112 10294531 10686666 11245639 12114403
3995 12114403 13072660 14290573 15768412 17491983 19177713 20171321 20295410 19699465 18719394
3986 18719394 17784919 16880634 16103715 15697984 15598472 15670996 16022436 16455523 17148382 18240093
3976 18240093 19635466 21539310 23981175 26960542 29990473 31799648 31489612 29489628
3968 29489628 26629618 23719559 21173358 18904283 17136412 15686116 14667283 13868907
3960 13868907 13310782 13009085 12956869 13259686 13694707 14361204 15191401 16017918 16517814 16427181
3950 16427181 15640875 14323967 12904173 11501758 10261942 9292814 8436146 7700905 7068167
3941 7068167 6537244 6188247 5853986 5615454 5379948 5201988 4994140 4847982 4635620 4361277
3931 4361277 4137675 3863359 3750793 3560420 3409356 3318747 3079288 2989680 2993765 2953759
3921 2953759 2911459 2847430 2776912 2770231 2711615 2573001 2442278 2387206 2323965 2270535 2249802
3910 2249802 2320215 2295080 2125841 2060113 1954367 1917270 1836894 1757888 1712831 1636700 1643613
3899 1643613 1662852 1642046 1608429 1684448 1586018 1561747 1632707 1643378 1600775 1620970 1686883
3888 1686883 1799487 1882926 1999810 2104945 2008366 1911373 1859351 1749643 1630900 1482543
3878 1482543 1525901 1488755 1426513 1405623 1457470 1509675 1538978 1547409 1694261 1741862 1795129
3867 1795129 1809507 1775529 1901631 1984770 2142690 2322567 2322263 2354490 2201701 2009265 2056849
3856 2056849 1989464 1938443 1931657 1884110 1866019 1967739 2020502 2120493 2199633 2204051 2182836 2245143
3844 2245143 2296736 2358243 2326402 2309769 2360541 2381109 2554125 2669545 2716513 2802626 2897269
3833 2897269 2929464 2865202 2835458 2789985 2806674 2867043 2803170 2762911 2870629 2940176 2980912
3822 2980912 3091706 3275683 3238204 3248411 3215515 3164887 3071304 3019851 2859813 2808272 2759817
3811 2759817 2720880 2617086 2546984 2462509 2501287 2441497 2424801 2360034 2303478 2347269 2325285
3800 2325285 2306829 2376508 2437503 2427888 2497435 2486913 2564852 2711760 2826150 2856326 2899111
3789 2899111 2918156 3036310 3171809 3301362 3436263 3512037 3587710 3774267 3971817 4109594
3779 4109594 4281685 4408645 4680894 4920366 5043605 5359692 5639112 5862095 6143704 6526081
3769 6526081 6960734 7346581 7752183 8173515 8589501 9209345 9933279 10679527 11457133 12343859
3759 12343859 13335241 14315125 15434506 16471508 17427170 18331510 19260256 20201415 21083767
3750 21083767 21766010 22430186 23150371 23654370 24151094 24678800 25451407 26480294 27885962
3741 27885962 29597391 31622553 33336131 34503133 35157659 35698770 36604889 38071360 40023171
3732 40023171 42387865 45160987 48501813 52116405 55612344 59102362 62931357 66875678
3724 66875678 69963452 71647870 72150113 71826550 70615069 68081476 64417227 60350475
3716 60350475 56624539 53050886 49333243 45771497 42639977 39796129 37425730 35617289
3708 35617289 34437646 33934836 33964661 34220225 34267905 34435884 34707673 34981982 34765516 33838051
3698 33838051 32530906 31101287 29806003 28606864 27618027 26828165 26263140 25928406 25756793
3689 25756793 25932334 26369564 27089720 28314034 30157733 32302883 34023736 34692378 34112914
3680 34112914 32387551 29850759 27020229 24497687 22402581 20734440 19523197 18532860
3672 18532860 17775847 17337915 16899093 16835015 17025057 17524444 18355070 19344093 20052108 19919455
3662 19919455 18723519 17027460 15156578 13332826 11860337 10689438 9679439 8670315
3654 8670315 7906478 7259693 6763020 6319772 5960659 5625548 5312467 5003427 4722613 4429235
3644 4429235 4266402 4150562 3938674 3661739 3543695 3454969 3289539 3124623 2984635 2858331
3634 2858331 2758851 2621905 2563840 2455832 2342407 2259979 2168376 2138830 2111662 2093833 2027695
3623 2027695 1994537 1873082 1855163 1849748 1850036 1739721 1654600 1577038 1612480 1600233 1533014 1527822
3611 1527822 1487209 1434015 1374194 1349834 1357869 1325574 1267855 1287671 1239677 1255578 1162454 1170255
3599 1170255 1137023 1172010 1117264 1112358 1135844 1106417 1108580 934569 926403 886905 966438 938956
3587 938956 916664 922975 856970 876318 867431 789086 782987 764952 829374 725739 743352 715476
3575 715476 743252 758677 762575 757975 706952 674451 678497 623067 596358 567659 587730 633292
3563 633292 562099 538602 544777 527432 556739 609085 558469 517587 464675 533406 497202 509804
3551 509804 421201 443236 437555 468108 469287 429642 456499 488280 444743 423832 429612 427241
3539 427241 416815 426613 419688 366523 428350 444977 408358 427161 365278 363561 428935 355257
3527 355257 273540 350853 373717 411176 416792 402843 340204 306583 266038 317912 270942 376401
3515 376401 371821 304391 309719 376033 420822 396183 370901 350351 465714 462836 457199 413615
3503 413615 366035 392388 400327 368718 393738 396456 365156 356623 437292 407005 425210 444586
3491 444586 358720 379215 444189 434119 443443 491717 528365 460096 491811 440721 378921 423775
3479 423775 436234 427466 441734 450667 440050 448990 444904 474731 448035 463673 534693 455576
3467 455576 469823 473540 454043 516972 514920 527176 584898 565239 585973 599795 547617 543790
3455 543790 469214 399658 360930 293018 308119 328213 301502 349887 351135 367442 405095 386919
3443 386919 359195 360044 416552 354853 335311 322312 289119 285669 312140 264137 240099 260789
3431 260789 314736 315646 242873 305735 287056 263782 277026 262245 356436 361582 326800 360860
3419 360860 347278 221041 220228 252127 289119 268531 198486 244595 246172 258663 262096 174906
3407 174906 190223 252696 288080 308052 282429 341098 337641 294261 422657 474347 464704 395741
3395 395741 361892 307726 329813 341656 289632 226715 309843 350165 313563 292757 374580 392713
3383 392713 434372 500289 523303 571260 651752 690905 593677 570291 450407 449377 427894 398740
3371 398740 374025 356249 356555 352334 331044 276326 289957 237978 231516 301752 300191 277264 249014
3358 249014 296433 264732 311581 344424 230156 280140 222617 149167 192790 246624 243428 225388
3346 225388 279868 291238 300122 181647 211725 212013 154284 215764 253174 249752 196580 217627
3334 217627 231977 171972 210139 185483 161410 142168 245307 225080 203530 196211 236607 174596
3322 174596 213897 252646 189455 216811 268308 300365 274861 230619 312709 336731 281616 304548
3310 304548 376301 295803 352070 342924 297226 307561 369061 276766 242935 325454 389325 341479
3298 341479 377821 355737 327086 372884 342903 480563 491552 432921 432431 502562 433127 433832
3286 433832 465478 429260 469092 507770 532623 589627 620710 631259 704922 735900 795144 713540
3274 713540 726550 807078 747136 780933 764530 791374 801987 832042 856482 901021 902664 908336
3262 908336 904072 999573 1020787 1048986 1214674 1190588 1202836 1209470 1176086 1195072 1088342 1092107
3250 1092107 1035340 1079064 1069625 1016234 1012331 1011799 1027558 1086542 1108061 1070637 1097943 1156373
3238 1156373 1267271 1313419 1295758 1323805 1290746 1289222 1279676 1264764 1201528 1269766 1347060 1376174
3226 1376174 1314227 1401411 1382069 1422851 1452138 1528451 1642575 1640954 1631360 1769961 1841172
3215 1841172 1892649 2037666 2106115 2270018 2420741 2523678 2793774 2911157 3127815 3429672
3205 3429672 3763273 4024856 4201873 4267687 4395813 4541052 4681685 4779204 4941086 5149452
3195 5149452 5441684 5653989 5970650 6322098 6751090 7259439 7799938 8498919 9227179 9841712
3185 9841712 10440014 11007345 11503167 12013774 12645500 13465651 14524149 15931252 17569078
3176 17569078 19494251 21574787 23365174 24381750 24525478 24383544 24201587 23700192 23324749
3167 23324749 23186991 23332818 23689080 24106244 24724202 25637462 27006171 28850081 31269059
3158 31269059 34230824 37542341 40633883 42957511 44168532 44261455 44191446 44895972 47127710
3149 47127710 51312804 58127523 69515852 84353130 88117598 78775868 65135614 53913457
3141 53913457 45937328 40135393 36523643 33878262 31755765 29433891 26747155 23796931
3133 23796931 21105373 18725332 16699494 14896730 13442692 12307055 11379926 10424367
3125 10424367 9660222 8965948 8354784 7813089 7402133 6930154 6575909 6215586 5883656
3116 5883656 5583045 5325281 5016435 4881280 4650801 4443115 4258966 4039551 3855926 3708868
3106 3708868 3512712 3301463 3224159 3136339 3006380 2922957 2837205 2746219 2687686 2564447 2537988
3095 2537988 2464221 2324428 2292401 2314211 2194414 2130959 2110008 2105555 2069519 2051844 2056667
3084 2056667 2046832 2057808 1968659 2013429 2036100 2064475 2079864 2076526 1995492 1973793 1983902 1891920
3072 1891920 1831451 1753149 1772089 1774406 1731331 1754976 1765805 1764541 1763575 1845263 1794193 1790321
3060 1790321 1768911 1744613 1729664 1659070 1604555 1518985 1438933 1422197 1413547 1388542 1360538 1310882
3048 1310882 1229096 1314673 1348559 1352417 1315530 1284009 1277818 1292509 1199485 1148939 1091117 1055118
3036 1055118 954912 942124 923548 884833 841028 831784 764925 751195 791511 700585 720402
3025 720402 753568 786649 714383 749471 758626 728529 761002 612945 666592 715562 624594 560415
3013 560415 560560 564740 543380 539098 526522 555927 499505 473033 539390 521704 478301 411953
3001 411953 384732 465935 428609 395135 366502 462774 494676 454270 441540 372967 325351 371884
2989 371884 407342 447052 400513 358482 289636 310548 370368 352176 361167 334565 297821 325721
2977 325721 402761 438408 406195 447973 415936 303322 314586 344287 406933 337435 373685
2966 373685 402234 386818 353646 396477 385427 405268 406084 406872 423753 380446 332577 393536
2954 393536 395255 415141 415259 490821 390620 438562 581907 463009 447394 444851 460103 468311
2942 468311 414878 405923 429086 384830 459331 423170 379121 423370 470638 428876 479911 547904
2930 547904 552158 571070 577979 564239 564193 560504 584306 553864 576778 577136 587918 584454 564575
2917 564575 587756 600983 656875 664424 804363 805982 860501 987715 887141 917109 804880
2906 804880 767040 697016 734054 724938 797461 745491 722830 673974 663502 642906 614714 690744
2894 690744 741207 669096 659915 704203 783183 753876 731202 696445 737242 815710 787891 798469
2882 798469 828356 838980 932135 912977 936052 998776 1004717 1019464 1002153 1061745 1064697 1093689
2870 1093689 1176949 1183625 1226275 1240288 1337523 1405184 1531310 1619625 1661527 1765623 1846071
2859 1846071 1963938 2073433 2170232 2277167 2485187 2603616 2804608 3015728 3281594 3483709
2849 3483709 3761472 3993810 4369320 4657042 4917223 5245349 5646356 6088083 6560219 7003222
2839 7003222 7600555 8200465 8797009 9390693 10051048 10864462 11576832 12404456 13235618 14142234
2829 14142234 15018661 15872316 16685490 17477860 18297723 19165117 19983746 20789842 21801072
2820 21801072 22808628 23857039 24690551 25216767 25638072 25882773 26047953 26175394 26325502
2811 26325502 26667793 27021615 27581935 27950233 28032810 27623509 26933327 25851769 24890860
2802 24890860 24067003 23346256 22804934 22630839 22386275 22004388 21273512 20227442 19052151
2793 19052151 17633717 16303583 15140098 14240056 13449819 12872739 12391497 11910274 11250039
2784 11250039 10437826 9535426 8691264 7970067 7260360 6693209 6237650 5825124 5555319
2775 5555319 5277207 4971052 4672296 4339487 4059216 3824816 3528595 3368287 3226464 3050262
2765 3050262 2897744 2798956 2701625 2608332 2497276 2415676 2342931 2256578 2227541 2161788 2055124
2754 2055124 2030424 1988274 1848488 1844371 1877634 1824382 1688894 1618564 1611975 1548701 1552880 1546460
2742 1546460 1490936 1434975 1465229 1300592 1199594 1263946 1244061 1224704 1208636 1197571 1121917
2731 1121917 1023200 972776 890209 884369 853671 831770 845935 808827 793927 770961 778515 796067
2719 796067 690230 651658 651527 643745 638473 686590 624214 633565 666668 606075 576711 612584
2707 612584 541135 511453 583576 598409 585545 569472 517448 533794 528332 505066 581352 546235
2695 546235 488032 584920 551471 547396 549680 552133 509256 460998 544342 482496 412239 436754
2683 436754 454065 492285 499183 483446 477551 522817 449073 437896 485065 496998 446336 438011
2671 438011 463553 487752 493221 373234 385555 363229 416002 428742 389055 404496 347096 428638
2659 428638 421267 380749 437009 437522 405135 474048 464279 401179 417690 413120 465704 446666 447644
2646 447644 499924 494092 476029 476803 427709 452933 481367 486535 471815 484813 476222 408921 474064
2633 474064 481398 480300 478899 496214 470959 427401 454100 491705 471877 455270 476530 470015
2621 470015 531048 528836 536875 481172 509597 517193 492355 516199 527578 472784 489633 554734
2609 554734 550729 590406 577946 547936 631130 550928 510485 528605 588640 655339 658553 723507
2597 723507 679143 599198 651138 676983 635804 616827 652752 637027 670399 744465 712606 725473
2585 725473 689347 689493 768665 727662 742781 726468 681816 688991 745285 770290 722026 760649
2573 760649 698727 746437 795630 777071 845074 854251 774068 807149 893111 923337 856165 859824
2561 859824 898294 906091 926689 990018 1033880 995682 1041747 1112270 1108010 1056111 1079881 1074003
2549 1074003 1110689 1125546 1128508 1070328 1116963 1147826 1197149 1145402 1096901 1104552 1111363 1051646
2537 1051646 1104530 1109396 1106164 1122759 1080432 1020800 1024020 1099701 1062423 1059095 1062025 992870
2525 992870 1087828 1051887 1070239 1139078 1061528 1012849 1011855 1054363 1127222 1140910 1085838 1058566
2513 1058566 1147294 1244966 1228804 1213253 1193330 1181614 1202292 1217880 1246248 1234405 1290422
2502 1290422 1274906 1261754 1322232 1337026 1289165 1264104 1370755 1344666 1340249 1428137 1372420
2491 1372420 1390416 1469081 1482408 1464505 1431280 1477643 1403474 1521898 1461659 1574099 1605823
2480 1605823 1635342 1631772 1627059 1661527 1685169 1725722 1787656 1803047 1878297 1942888 1937491 1929645
2468 1929645 2033046 2044896 2042548 2094572 2214852 2228983 2333538 2426535 2510612 2551498 2624370
2457 2624370 2628242 2754248 2844995 2900993 3017235 3081969 3176014 3229645 3301804 3311968 3335172
2446 3335172 3402518 3499056 3463902 3399241 3343178 3339852 3464786 3446748 3401553 3408758 3398991 3487451
2434 3487451 3519721 3616860 3596806 3593271 3640766 3602753 3683949 3733856 3782311 3875863 3914656 3958408
2422 3958408 4067442 4115418 4186017 4344469 4346705 4507564 4645906 4663963 4797784 4902465
2412 4902465 4984883 5179190 5261044 5366000 5497003 5609902 5708825 5801800 5895945 6031055
2402 6031055 6162384 6292032 6399287 6536967 6697376 6869023 6955485 7099314 7273504 7466548
2392 7466548 7654894 7857359 8088681 8346023 8586337 8871610 9167398 9524393 9841925 10216983
2382 10216983 10612739 10983851 11466671 11867914 12263320 12860085 13351644 13911848 14516793
2373 14516793 15200249 15884973 16582942 17341985 18149970 19015596 19948070 20845220 21846989
2364 21846989 22879318 23983413 25128619 26351625 27695310 29072301 30504270 32085384
2356 32085384 33822983 35750916 37701982 39962237 42323647 45023342 47908104 51000283
2348 51000283 54466064 58213222 62536541 67084822 71938911 77024608 82181594 87242972
2340 87242972 92049152 96400127 100024375 102919406 104982402 106401418 107054510 107171931
2332 107171931 106969065 106508406 106008033 105370111 104583036 103258831 101330468 98750113 95547595
2323 95547595 91635246 87054928 82238613 77434398 72759457 68429845 64513630 60987042
2315 60987042 57812223 54951328 52297292 49850308 47500331 45458682 43467875 41516650
2307 41516650 39731999 38073277 36530246 35072711 33666479 32414013 31311336 30231950
2299 30231950 29193914 28348376 27530908 26739555 26063575 25501957 24824790 24374826 23886972
2290 23886972 23559884 23255608 22974778 22714776 22551577 22368953 22404131 22355618 22363714 22462935
2280 22462935 22536273 22697320 22800220 23092481 23492094 23854879 24350616 24940521 25594717 26284795
2270 26284795 27049851 27991529 29039027 30117396 31324613 32637408 34116095 35697220
2262 35697220 37489685 39381302 41572907 43942651 46512487 49462179 52787111 56664524
2254 56664524 60954502 65967051 71813526 78259821 85397878 93219494 101107225 108970723
2246 108970723 116651768 123818846 130699412 137655425 144571429 151599479 158391327 164468879
2238 164468879 169294118 172326692 173329235 172359596 169713314 166022833 161948018 157889025
2230 157889025 153900494 149905070 145813916 141476429 136580879 130754781 123815673 116352926
2222 116352926 108828472 101777590 95396904 90052469 85667541 82378021 80235239 79210478
2214 79210478 79122639 79959022 81759797 84378892 87764545 91847182 96478220 101438905 106708488
2205 106708488 112428848 118490619 124756486 130815355 135747889 139382969 141934110 143793824
2197 143793824 145079472 145522901 144877970 142920409 140007798 136309727 132070619 127309690
2189 127309690 122576912 117793165 113165289 108733919 104305057 99926590 95253520 90315600
2181 90315600 85003843 79577464 73981488 68564739 63166551 57923892 53174912 48788130
2173 48788130 45077096 41799267 39032842 36786155 34993345 33559272 32415754 31355756
2165 31355756 30557358 29865756 29303303 28928282 28683629 28520244 28527486 28685862 28806446 28871107
2155 28871107 28878290 29023254 29190527 29309485 29432831 29668263 29732893 30006716 30295918 30367205
2145 30367205 30251628 30001319 29590007 29134518 28704813 28340948 28094613 27887435 27793670 27904875
2135 27904875 28160577 28490311 29015191 29663379 30670472 31780020 33261754 34969660 36972903
2126 36972903 39416708 41974566 44745378 47582438 50529303 53668934 56968871 60319662
2118 60319662 63689452 67035816 70435376 73604931 76497777 79195407 81810149 84058941
2110 84058941 85411442 85419391 84099497 81762591 78426756 74206064 69298552 63796283 58208549
2101 58208549 52490841 46994331 42070222 37549013 33565122 30091635 27177675 24791609
2093 24791609 22720797 20988137 19519376 18305861 17202470 16319608 15514816 14797471 14198552
2084 14198552 13631133 13174634 12698202 12361120 12086028 11800942 11550789 11322178 11219522
2075 11219522 11143795 11127513 11033515 11026980 11027937 11000687 11000319 11051778 11042718 10896081 10703246 10497578
2063 10497578 10226027 9839992 9487240 9098299 8670110 8300774 7964048 7657929 7326546
2054 7326546 7108485 6903736 6723400 6565648 6356624 6263693 6097690 5963868 5938030 5834942
2044 5834942 5719344 5700480 5650570 5599727 5521466 5492899 5552070 5454396 5500347 5466716 5517938
2033 5517938 5574793 5593811 5618723 5679457 5729839 5827472 5884774 5980436 6113872 6123918 6166745
2022 6166745 6158356 6197610 6106530 6076482 6014079 5944935 5896887 5875361 5808803 5805400 5812713 5825517
2010 5825517 5793329 5843523 5872343 5940348 5992736 6032402 6069743 6185733 6197945 6340336 6461022
1999 6461022 6599668 6793024 6933175 7091989 7308278 7586327 7766377 8046193 8325910 8632876
1989 8632876 8969544 9266455 9642425 10101551 10536733 10942083 11333668 11743334 12198302 12659809
1979 12659809 13227434 13789718 14537191 15322108 16016484 16946690 17944513 19080543 20429996
1970 20429996 21997370 23761304 25626224 27706075 29974317 32543106 35467566 38856602
1962 38856602 42491327 45611810 47865305 49816866 51878972 54293632 57044544 60221951
1954 60221951 63898511 68114958 72772741 78180192 84574313 92122014 100991009 111233092
1946 111233092 123185286 136925204 153263795 173125300 198605376 231951976 275584757
1939 275584757 331210226 395418740 446933369 454910096 416192637 355808684 296101174
1932 296101174 245826849 206386368 176132331 152008153 132054830 115393766 101581614
1925 101581614 90235778 80756405 72911928 66426421 60945679 56318271 52270835 48775198
1917 48775198 45819615 43245895 41053717 39243054 37760211 36637604 35647505 34499244
1909 34499244 33002996 31217030 29273285 27390429 25694690 24177772 22905047 21711272
1901 21711272 20603462 19597716 18753842 17929143 17097175 16377233 15737200 15123459 14496733
1892 14496733 13871580 13309224 12758350 12146453 11598410 11118767 10656732 10155488 9785929
1883 9785929 9368643 8983614 8654355 8387301 8128002 7875526 7618981 7337569 7096835 6900601
1873 6900601 6706023 6461179 6218077 6050940 5902087 5821064 5643707 5514819 5425285 5187798
1863 5187798 5053861 4952779 4905792 4780668 4656653 4503492 4457461 4313594 4213490 4041075
1853 4041075 3894142 3765148 3697800 3585855 3402657 3341057 3347789 3308873 3185370 3074335
1843 3074335 3047987 3040272 2984645 2961504 2838823 2740029 2726325 2740659 2642309 2651367 2627463 2625572
1831 2625572 2556878 2472203 2379858 2305164 2266630 2232956 2173623 2170881 2095629 2061680 2019012 1997283
1819 1997283 2002877 1991070 1970073 2043949 2084102 2073058 2072189 2041557 2059013 1928364 1975110 2000075
1807 2000075 1914665 1796737 1710553 1756489 1641267 1641155 1647994 1621418 1520929 1494029 1515219
1796 1515219 1516399 1508296 1465888 1446209 1425781 1327383 1310196 1347380 1282979 1339814 1275037 1164269
1784 1164269 1172454 1122082 1080847 1120624 1111964 1038649 1003130 996744 956820 925136 903963 914579
1772 914579 900663 945369 962656 985790 1007716 940000 898877 911107 947994 959988 895624 910650
1760 910650 895451 897839 948121 916521 904180 939314 908956 869565 895316 970587 973267 1015514
1748 1015514 1053334 1010319 963550 1001387 910035 913962 974241 1053074 1024388 981484 1015104 1066002
1736 1066002 1113855 1144240 1204866 1340479 1383214 1502339 1613159 1774700 1951144 2165788
1726 2165788 2501137 2791746 2871784 2802733 2542379 2141207 1885565 1659532 1434434 1335960
1716 1335960 1199578 1044044 1029118 985859 924409 869689 817062 763645 750911 750267 722802
1705 722802 665946 635099 672319 609404 563441 612101 603188 640937 579794 567551 527618 551857
1693 551857 504125 519317 529861 548127 560846 489876 490567 598630 558732 499151 499218 461313
1681 461313 495995 466009 428114 441936 414703 380303 380095 410098 400279 443104 407085 349351
1669 349351 371425 370500 316434 339527 295759 323078 316209 314329 324349 313186 273452 251175
1657 251175 307776 327556 261240 225137 219433 294285 360859 330208 380787 282881 285153 261219
1645 261219 296922 322105 320535 326129 267068 232434 246536 233422 221489 254176 353934 264053
1633 264053 288340 303756 282337 263321 190946 182022 207405 217007 188423 219486 256944 330129
1621 330129 292840 262330 254347 215953 213643 169451 172725 223766 188496 158635 190412 233881
1609 233881 189032 197642 174955 246947 235401 174653 152519 125700 216600 227220 243291 256393
1597 256393 250628 263304 256941 168803 144278 149729 136016 145440 169545 146424 204529 165492
1585 165492 179275 191726 176871 143495 205666 133995 143513 196657 146987 200486 283592 264204
1573 264204 276720 262642 256669 294179 251965 223880 194270 161320 151090 129455 125372 228173
1561 228173 191070 235710 221498 198847 157552 196336 147854 197897 237436 142976 156630 196047
1549 196047 199210 135998 115978 205389 115193 107679 85203 164651 235349 247093 141179 139500
1537 139500 162053 144307 167381 148277 80596 103221 95442 149577 107922 159277 195462 182542
1525 182542 97724 92595 119639 106636 129319 159820 80530 112818 153450 113655 119816 174886
1513 174886 213062 102729 127658 132873 163152 148996 169619 159013 72213 47154 71831 59386
1501 59386 68933 61398 60859 74317 104616 8923 112176 49020 146806 137735 95279 60221 34498
1488 34498 63297 138079 125212 141421 204950 168030 121604 181326 186214 212875 124773 165633
1476 165633 95452 126601 191389 140817 192029 190766 136134 135002 154442 161977 149276 183210
1464 183210 155687 93100 149329 115481 143330 158018 133689 134921 152233 191299 159652 145652
1452 145652 119986 114795 146224 146634 196153 175481 173351 175309 212592 110912 224708 230037
1440 230037 98510 52545 132503 181151 150710 137283 134776 209902 168927 177839 236144 209129
1428 209129 208284 265622 230965 284992 282308 336364 359608 246707 359255 317977 316200 368737
1416 368737 348725 441597 422059 444097 478114 502537 546207 522350 551138 572447 625235 722518
1404 722518 730787 771404 931147 1005702 1088115 1158114 1276406 1505941 1657260 1665018 1766260
1393 1766260 1850316 1916579 1909897 2030789 2248488 2391164 2620633 2810201 3040889 3342975
1383 3342975 3770581 4057591 4307251 4682748 5093855 5668481 6502220 7825692 9489618
1374 9489618 11715267 15086101 19214443 19771769 16848823 13503363 10700871 8605225
1366 8605225 7062004 5997189 5059867 4449645 3864036 3565011 3285139 2977842 2696233
1357 2696233 2401212 2132966 1882708 1762944 1676384 1540044 1485738 1355916 1298532 1232096
1347 1232096 1142296 988026 1003078 993376 894695 827584 767088 730495 728131 717645 674297 626496
1335 626496 534098 551479 581765 524371 479102 459282 467251 506190 432599 434498 398062 419609
1323 419609 380270 257083 245290 281780 324729 368349 281655 310811 259910 265098 311767 209468
1311 209468 282532 229155 160610 205874 257029 240993 269150 271639 214682 217839 229876 339921
1299 339921 279089 184644 225173 250476 189742 170117 153891 93128 100397 150805 105167 47756
1287 47756 128379 143284 126411 76693 35687 33838 67110 88922 127970 108775 82626 118277
1275 118277 51583 87052 147164 139554 140587 143293 141426 106711 154178 61856 29076 39917
1263 39917 48971 25551 68736 46447 114057 129423 49193 18110 -29314 40106 44018 127108
1251 127108 68087 46523 104443 41838 -10809 20338 63377 1732 -54951 53537 25823
1240 25823 89162 146786 67057 99378 77246 -31083 -7558 27127 39345 -16066 -40305 164
1228 164 8446 -22474 -7546 86017 -13797 -16248 -59647 10582 62946 -503 -85419 -26111 -1430
1215 -1430 7686 57970 77343 88667 49768 54904 -32327 29045 -38810 -51447 -17736 -30190
1203 -30190 -15045 -20334 8558 -54436 36168 89354 93400 120122 12896 -37814 49303 -7971
1191 -7971 -30350 52806 67447 17642 9376 72720 100126 148567 159583 87341 82882 15352
1179 15352 106271 126404 74077 48828 93375 151050 100673 71767 114517 93088 83866 139126
1167 139126 34226 3727 28713 54516 50754 21082 41189 88758 40695 14729 102100 106440
1155 106440 139811 80957 18996 53827 -13815 11837 -9256 32934 19164 -56457 -28486 33183
1143 33183 59356 18683 -15848 34911 50424 9296 53966 -8390 -11737 57526 -615 -19517
1131 -19517 -11046 -175 -13995 -59619 -40995 4449 -54637 -46038 36979 30567 21517 -15489 -18763
1118 -18763 -23392 -37407 -9757 31280 76942 18648 -879 -6624 -7555 -1043 -5182 -24293 -19633
1105 -19633 -21783 54443 27122 -23983 -25732 -3100 -21503 -32581 -29437 -10316 -33239 -37061 -68958
1092 -68958 -36438 32472 -13182 -20709 57414 128322 72195 43144 7900 25850 40673 30270
1080 30270 61307 70968 -42720 -8987 -2656 -33459 3225 -87298 -30397 60091 25979 22039
1068 22039 10452 11629 -66759 -40039 -27478 -76432 -6312 7950 -47761 -65665 -72828 44457
1056 44457 75888 19624 18377 -35122 -2369 357 21475 8730 36243 42450 -27396 9517
1044 9517 -58677 -87810 -121799 -67769 1688 62829 78705 14877 1793 -2870 -14921 -40453
1032 -40453 56560 -22670 27624 -23570 -28962 24333 -2880 -20037 -4841 -24579 -55338 -5418
1020 -5418 5296 -411 -34442 -91714 -47510 45027 21983 -19337 19106 -75844 -75876 -25425 8439
1007 8439 -29153 -11896 -2019 -67020 13386 6286 -29630 13458 62577 -10113 -92424 -126597
995 -126597 -20276 -21868 -71428 1953 29050 28653 17873 14474 -22541 -13109 -99818 -37750 11861
982 11861 -29834 -432 53566 -8505 -36665 74491 11295 23643 17222 23379 40493 51360
970 51360 19927 34866 1186 10471 -29749 -6120 -25046 -13244 -45982 -79618 -39536 4758
958 4758 63743 19044 -40191 -24365 -44696 13362 -95111 -116852 -46401 -63677 -24238 8110
946 8110 57576 80959 11140 -13748 -85683 -17501 -13985 -29494 -28799 -51989 -50585 8499 46661
933 46661 -5987 -36216 -35416 38991 25107 4094 -33836 -25103 3151 22464 -21394 -50673 39652
920 39652 -14372 -18873 -79959 -62022 -54939 2656 -7351 36113 22608 12720 7022 -24069 -7476
907 -7476 87579 43151 -79499 -50639 -46507 62934 -13813 -58467 -67929 -4532 -113229 -148641
895 -148641 -119237 -68564 -92192 -80637 -73851 -66569 -100208 -87287 -32090 -54095 -31309 -91975
883 -91975 -129668 -63632 -14874 -17427 -112869 -80804 -47918 50075 -9646 -20763 -17656 -25718 -51906
870 -51906 -21723 -79806 -85216 -90213 -52818 -54283 -37221 -24941 -46494 -42370 -31649 -30960 -36813
857 -36813 -76591 -48740 -34734 -95113 14961 -32793 -127776 -107453 8997 32818 -2448 -12917
845 -12917 -7920 -1427 19380 -25934 49289 94411 70634 51093 -38654 -27155 -52948 -76255
833 -76255 -60817 -30760 -5806 12260 -78585 -64688 10648 -27462 273 33086 23418 -4761
821 -4761 -55598 11792 63542 66467 -26126 -13035 52875 9438 -23530 -4676 -162 -43250 -17087
808 -17087 -48771 -23312 -54385 -41986 -10026 7667 -5150 1795 34422 16444 -12583 -36601
796 -36601 -79490 -66597 -41841 -71378 -45363 -3260 -11390 36654 24687 2204 -68412 -5628
784 -5628 1464 -3448 -17354 -66248 -40761 -69560 -35538 -79766 -36857 3139 -20980 -10542 -34963
771 -34963 -95919 -76863 -21211 -39488 -25249 -45863 -38179 2239 70336 7782 -54158 -86503
759 -86503 2789 31550 54903 56896 36025 27506 30306 -36780 -53808 -1727 59179 32587 -45916
746 -45916 -24186 -52695 -65500 -43942 -50741 -117828 -15260 -1953 -49424 -101457 -81414 -32546
734 -32546 -66666 -95520 21195 24833 -53946 18422 -36296 -32897 -54831 -78593 -11177 64930
722 64930 40766 9871 15376 14634 -58977 -29256 11624 19421 57808 16206 36808 -16248 -93002
709 -93002 -78784 18267 76401 57956 56486 178 -95487 -72509 -23803 -33993 -17330 49178
697 49178 -10982 -30925 -67285 -44618 -52013 -77780 -18707 56460 37785 -29452 -9956 5181
685 5181 -13439 -59569 -97265 22269 50886 52296 45905 22343 -12656 -36107 -9812 -32543
673 -32543 11708 -10802 -17498 -72613 -41976 27493 -2883 -49725 -40353 -24367 47459 33789
661 33789 50597 -4263 -18960 -8394 -20987 -59196 18987 -5759 -38043 7682 -6234 23013
649 23013 25126 -24492 10196 38139 38159 -11553 17708 -67428 -59735 -166 -9516 10577 -25421
636 -25421 -11067 -21246 83548 2792 -14901 -5306 -40526 -14546 -17217 -52963 -22318 -4794
624 -4794 -10645 43297 67214 -5740 -14495 -32472 -20079 -8088 -35307 -52621 36948 -2822 -24097
611 -24097 4274 5306 -1104 54699 22566 68708 -15098 -25202 -44817 -35163 22156 53393 31667
598 31667 -58474 -78868 -9767 19087 10119 -66392 -74316 -76451 749 65477 -21328 -31304 -86380
585 -86380 -61030 -63700 -27997 -59165 -63069 -86765 -128607 -64289 9122 -3989 -27641 6107
573 6107 26582 -23383 -57562 -22885 -23059 -39401 -60033 -4254 -14772 -74544 -33263 -48106 16530
560 16530 35954 86590 68240 40043 -2946 55262 65140 41914 61512 290 -42384 2458
548 2458 49159 -8875 38716 -1349 -5985 12394 -34432 -41447 -43612 -56826 -48206 -42429 -96532
535 -96532 -131493 -89943 -90878 -79075 -120448 6329 113904 94736 23921 15744 31818 -25492
523 -25492 -10512 32442 4976 -76668 -71642 -78307 -99587 29849 16901 -67058 3411 2462 48192
510 48192 -15090 -54382 -15710 -2792 11468 -26712 57003 70832 79927 90701 -4186 82258
498 82258 -28061 -45910 -34242 -12939 10962 -10188 -81375 -9932 29865 18806 -85030 -51704
486 -51704 39116 34688 -1930 18241 19077 27860 -49650 -67517 27080 820 15106 -426 19091
473 19091 -77528 -12499 -5109 21376 -3881 -65334 14331 21632 -67668 -48953 -18089 52559
461 52559 39309 -47749 -37529 -38064 1530 -55086 -63523 -13848 54421 10744 43383 40245 32721
448 32721 43364 -2151 -31606 13345 -7172 6172 -2294 -57668 11817 28074 -30468 3955
436 3955 43168 25780 20261 8049 11009 -80008 -66539 -70983 28913 7364 -67113 -48533 -40754
423 -40754 -31431 8887 3580 973 66205 85421 5869 -18251 39040 57065 10077 21496 53489
410 53489 58712 -22005 -44322 -10507 36555 61904 -14247 36168 -17791 2472 31875 -20086
398 -20086 -68919 -2459 49302 70025 -8290 15967 12643 -22235 789 14439 25946 1597
386 1597 -58888 -6460 5367 7056 98786 40900 48341 44142 88730 7409 -44131 -66226 -22376
373 -22376 -62202 14280 89148 109717 73064 32073 -43992 -54231 -10965 -12959 -53112 34824
361 34824 5506 -22894 -740 -11634 34107 6196 25247 -8408 -3582 17972 -55167 -48917
349 -48917 22939 6817 -8263 -61640 -24543 22611 -2151 -2965 29061 -15024 -24272 -42111 1062
336 1062 35541 28260 18372 -2107 -12772 -39375 -78406 -97490 15070 43095 62824 109277
324 109277 61001 56418 59791 -723 27012 21325 -31294 -30235 59678 -14401 -46949 -283 19276
311 19276 -1275 7983 77865 26557 -11939 45264 61657 -6438 -65528 5815 44124 30750
299 30750 14251 -13035 58786 71079 -5838 -20516 -3858 -70774 -43695 -10618 77591 90528
287 90528 -17627 48299 11836 -3080 -323 -14273 32077 -22186 25651 2086 -19388 -1783
275 -1783 -10148 -16469 -7402 13302 75542 74275 32544 11095 7506 -27458 -15393 -56171 -41214
262 -41214 -37772 -54602 3555 39035 49443 85692 72640 43835 92173 24969 -25308 2085
250 2085 -5903 -50543 44061 -8811 -85460 32608 65018 48753 -3770 -64950 -55443 5355
238 5355 26033 61802 11271 -11320 -8037 -14868 -4873 59242 20136 18880 23868 61184 47087
225 47087 34578 14516 45148 46574 38824 52032 -16168 3389 -25705 -49584 2157 -3147 -24952
212 -24952 3806 -1043 55557 63807 14067 -27307 -4782 -20406 -27635 -3318 -4836 4204 14010
199 14010 -40894 5541 41811 19710 43607 3841 -66378 20327 13598 -55780 -28864 6377
187 6377 -17588 -34520 -25140 15656 63612 -15592 42757 21784 42576 33097 83822 119278 12579
174 12579 12868 40549 68875 73708 -57693 8308 91978 31908 -6070 -41443 -13076 -1393
162 -1393 13392 -20235 -37176 -25072 -15637 -15832 23643 56215 -2244 34911 30117 20407 28938
149 28938 60960 66061 -7592 -1899 35861 49382 61559 12483 -9721 1728 23950 9177
137 9177 16082 -24693 -25049 6494 -8497 -15315 -90643 -45356 -39468 20921 4838 -6142 -335
124 -335 36006 16278 42669 18507 -9556 -26885 52763 -3989 26567 -10671 -12333 33725 50661
111 50661 47780 49872 46511 55044 20502 -10679 39495 69620 -10598 -28636 -38125 -212 11376
98 11376 -30943 -22145 10402 17304 -2630 78989 88259 59988 22969 30801 82162 67119 30875
85 30875 -17405 -4959 9584 23307 34980 34441 1570 -11847 14594 32125 3867 13185 45660
72 45660 -25431 49890 33911 -48064 -43083 -30681 -31105 12248 -10098 -3528 2059 72269 78039
59 78039 76693 -603 16423 16837 72587 17762 18851 18140 -17025 11792 27554 29577 17430 -34279
45 -34279 -20665 15951 -8053 -7261 -27555 -2981 27650 -10142 -14485 9858 60052 28098 -2874
32 -2874 2889 18005 8502 51306 58452 19761 72524 27221 -9031 64051 50932 15918 -6032
19 -6032 12247 28932 13754 35664 10820 38636 23344 13760 8477 6623 -18110 19107 30568
6 30568 6202 -615 -7271 -2373 57450 10154
0 10154
$$ Imaginary data points
##PAGE= N=2
##DATA TABLE= (X++(I..I)), XYDATA
16383 -2063438 -2055155 -1997340 -2050090 -2005602 -1995341 -1961259 -1898694 -1883524 -1909294 -1853899 -1788555
16372 -1788555 -1822299 -1811381 -1831207 -1731021 -1691783 -1704639 -1672264 -1681392 -1665127 -1674314 -1623889
16361 -1623889 -1580868 -1553797 -1556063 -1516349 -1513657 -1529506 -1473795 -1434362 -1455679 -1427871 -1461620 -1408133
16349 -1408133 -1335729 -1345554 -1330221 -1292208 -1315193 -1250211 -1250649 -1242247 -1216701 -1160801 -1142184 -1147986
16337 -1147986 -1131454 -1148947 -1120843 -1097835 -1091894 -1063807 -1058053 -1062654 -1029422 -998384 -1004052 -982696
16325 -982696 -1022180 -1009414 -885574 -895212 -865973 -846249 -804753 -798590 -833258 -796435 -794506 -786669
16313 -786669 -737830 -729142 -681914 -702322 -615377 -631398 -685053 -688728 -617923 -552082 -599448 -636928
16301 -636928 -582151 -517511 -563184 -527810 -459944 -468498 -414026 -447022 -432327 -367043 -328006 -379871
16289 -379871 -440303 -352100 -316334 -330286 -276360 -281735 -230905 -237752 -212317 -234273 -245164 -196757
16277 -196757 -234569 -163528 -156226 -202058 -155992 -194323 -151469 -105486 -123370 -110498 -61564 -27498
16265 -27498 -63589 -48746 -46399 -5493 -23448 -12153 -14586 35036 79832 51500 73740 -7616
16253 -7616 73666 149298 199841 194158 166938 167001 126638 162257 208290 272665 254105 208832 221223
16240 221223 224603 196803 234709 259157 307362 317143 349559 364771 321588 355532 403395 423960
16228 423960 376536 325810 399804 407682 373717 460443 484553 496836 458846 432907 456248 503873
16216 503873 496620 474831 535142 520296 510586 512057 564817 512113 521830 588342 625246 610727
16204 610727 637858 594322 524178 542395 554032 623464 680785 594206 604732 724599 738750
16193 738750 643309 672362 728335 760611 801171 678850 699836 698962 663949 681634 777487 749243
16181 749243 714357 714723 712930 783887 771799 801447 715251 709046 801250 819359 866384 836686
16169 836686 807733 801561 816663 852249 837553 879561 881743 829890 810027 836322 841859 865459
16157 865459 875132 987245 852001 857407 924221 934972 898699 857939 930659 979308 891687
16146 891687 846636 900303 951351 930022 951678 920026 941158 945290 895652 976689 1032640 996771
16134 996771 940756 973007 962920 926763 1012149 975578 931767 984611 1010148 1000631 982564 934767
16122 934767 960222 1017136 942214 949621 1015310 994787 915734 1047389 1102764 1039640 1002135
16111 1002135 1004748 969334 1008622 997785 955107 993866 984265 1017591 949577 993136 1115144
16100 1115144 995200 1052767 1065615 1079760 1101617 1056806 1008032 1003335 1020526 976410 972363
16089 972363 1056763 1040632 1100237 1044808 981293 1032103 1021921 1050582 1119301 1130685 1084576
16078 1084576 1067596 1096474 1071190 1034282 1022978 1121550 1038651 1019102 1085341 1045828 1045845 1100353
16066 1100353 1082535 1089566 1055093 1055081 1072632 1118806 1086642 1051002 1063971 1080402 1122821 1114497
16054 1114497 1110042 1142928 1124834 1126148 1155122 1077813 1086334 1090301 1026580 1001677 1059992 1121165
16042 1121165 1119020 1096999 1021357 1044158 1022662 1074557 1098040 1065235 1013243 1040412 1141162
16031 1141162 1109784 1124874 1167221 1128502 1109757 1120613 1143412 1086117 1035667 1069524 1043482
16020 1043482 1128513 1183423 1064960 1060082 1095249 1087214 1153988 1089518 1133025 1062150 1154348
16009 1154348 1133235 1085631 1104297 1105807 1060741 1032198 1067923 1122187 1062388 1105044 1176472
15998 1176472 1172742 1137688 1115932 1125305 1056351 1062271 1062697 1042746 1098442 1059224 1086490 1144421
15986 1144421 1121213 1111229 1092509 1098588 1056389 1010283 1085803 1079679 1084794 1106489 1092369 1137024
15974 1137024 1110575 1119342 1121860 1133873 1083588 1040132 1071902 1072807 1140321 1116027 1064662 1075734
15962 1075734 1131702 1095636 1143730 1112502 1153496 1154709 1149540 1186659 1086938 1187002 1138568
15951 1138568 1069555 1114571 1108789 1124076 1113683 1161993 1131308 1088075 1095221 1106208 1144491 1151617
15939 1151617 1140572 1172581 1150501 1130835 1070621 1068110 1148083 1150157 1111020 1094152 1083337 1172524
15927 1172524 1145703 1079230 1147476 1048698 1115504 1074155 1060722 1079382 1038676 1070814 1133090
15916 1133090 1113696 1050364 1097119 1083696 1058760 1093288 1114352 1151804 1120925 1131591 1150225
15905 1150225 1128750 1123647 1134056 1137959 1094797 1072751 1149521 1121427 1101512 1119556 1119596 1151437
15893 1151437 1158709 1182033 1205978 1094685 1135015 1084655 1110626 1152604 1097122 1080979 1108654
15882 1108654 1145209 1204128 1135972 1159411 1150097 1143955 1140179 1167504 1175625 1158252 1179491 1114130
15870 1114130 1098123 1061869 1091481 1109366 1188591 1177006 1060082 1096881 1087524 1084177 1124129
15859 1124129 1144766 1119950 1064864 1106992 1118786 1110694 1096604 1116752 1129312 1115830 1142252
15848 1142252 1149720 1124753 1168922 1116443 1129450 1189911 1178980 1169803 1151515 1097013 1103154 1094974
15836 1094974 1099875 1096372 1114296 1101533 1141881 1082290 1098205 1144655 1076306 1108168 1100893 1136774
15824 1136774 1117585 1147271 1177238 1120311 1175889 1178683 1156356 1107789 1165260 1177690 1204754
15813 1204754 1219670 1144452 1138268 1165597 1154986 1123256 1093227 1072156 1081103 1037735 1083191 1179682
15801 1179682 1202952 1164592 1134306 1157436 1171776 1184877 1166249 1186720 1122030 1184375 1142390
15790 1142390 1077075 1039486 1019352 1106862 1129135 1154235 1112449 1059289 1045994 1066181 1108967
15779 1108967 1176252 1072598 1058134 1050073 1074388 1161932 1171368 1148610 1146865 1168065 1128396 1151319
15767 1151319 1059328 1085351 1102224 1084958 1075595 1099798 1135024 1114701 1196323 1153265 1146976 1186074
15755 1186074 1198667 1140636 1139267 1147223 1094001 1080985 1114144 1152751 1184568 1104982 1137719 1170630
15743 1170630 1196952 1163299 1177161 1198231 1143271 1179172 1170862 1159732 1147030 1176005 1134829
15732 1134829 1080428 1084753 1193746 1216360 1109531 1051065 1136954 1148852 1133966 1097781 1141497
15721 1141497 1173435 1168403 1110250 1116180 1119843 1083370 1148670 1102887 1166561 1143358 1138765 1146222
15709 1146222 1138535 1129687 1127768 1129528 1189563 1070361 1159366 1221657 1106427 1139123 1162336 1211598
15697 1211598 1077727 1065633 1113123 1101388 1117436 1131176 1183191 1111737 1121346 1118446 1081115
15686 1081115 1081728 1078569 1140317 1147596 1081634 1069909 1049115 1106432 1138164 1137454 1133500 1128037 1177408
15673 1177408 1113414 1139929 1157375 1074844 1128024 1149187 1118872 1075875 1140784 1147985 1152888 1159558
15661 1159558 1129661 1154012 1149534 1155780 1180138 1187772 1192412 1194431 1146239 1175334 1172577 1170932 1143722
15648 1143722 1141192 1104651 1151716 1206025 1152986 1203677 1212725 1093489 1103827 1068910 1126819
15637 1126819 1134113 1162613 1192253 1153542 1129980 1137050 1123760 1164031 1146290 1146293 1128597 1158513
15625 1158513 1171521 1181004 1119793 1030114 1126335 1137559 1133754 1190624 1154308 1160349 1184202 1169303
15613 1169303 1143862 1077374 1207551 1198604 1180902 1188117 1174872 1182791 1118934 1151379 1200414 1197778
15601 1197778 1241600 1220259 1170100 1096977 1082913 1175941 1195276 1116054 1144765 1179609 1175754
15590 1175754 1151756 1172495 1244921 1199969 1163227 1222601 1254872 1215717 1160452 1161294 1209283 1169747
15578 1169747 1158247 1053223 1097664 1192017 1211653 1181017 1091284 1180331 1222915 1196321 1127177
15567 1127177 1121372 1094540 1113678 1176245 1200683 1130211 1160728 1123907 1114506 1136674 1257603
15556 1257603 1175574 1129557 1206548 1151064 1172120 1187170 1189317 1135273 1119716 1069502 1124047
15545 1124047 1109269 1149851 1202242 1142517 1102487 1111065 1142790 1143190 1177476 1198264 1196443 1259162
15533 1259162 1189810 1184455 1129221 1115123 1154535 1165993 1116207 1104605 1137840 1088934 1065789
15522 1065789 1079599 1175175 1173804 1137537 1185413 1180610 1092039 1097363 1091050 1127104 1142148 1107325
15510 1107325 1123598 1155364 1139380 1079193 1074378 1089782 1135130 1164890 1120331 1131314 1097141
15499 1097141 1150857 1120880 1156187 1177790 1158621 1135293 1175251 1199273 1112161 1136067 1106688
15488 1106688 1113265 1221099 1252072 1197468 1176673 1174151 1194705 1187483 1172967 1153775 1061931 1114488
15476 1114488 1178322 1156633 1163882 1098735 1141182 1151977 1189609 1148914 1144745 1163757 1258169 1210600
15464 1210600 1129902 1065139 1046472 1151095 1106853 1140068 1144571 1176563 1122962 1137743 1157168
15453 1157168 1074229 1086317 1095995 1106071 1131583 1149200 1178857 1168243 1155393 1174399 1110246
15442 1110246 1176624 1147606 1150999 1180044 1191723 1134934 1181244 1223004 1163425 1155400 1083436 1178176
15430 1178176 1187573 1181435 1167466 1151480 1151615 1179022 1162573 1175332 1168285 1167524 1193678 1152113 1143628
15417 1143628 1114392 1106349 1069397 1110360 1169877 1212262 1225059 1183235 1175326 1166120 1143615 1116645
15405 1116645 1184300 1193979 1214784 1177877 1149887 1243177 1147896 1149832 1226429 1210961 1155124 1151781
15393 1151781 1100886 1158364 1181484 1114638 1193538 1136933 1120671 1143853 1174135 1229149 1221856
15382 1221856 1237923 1225880 1200142 1231049 1190743 1184742 1218858 1193926 1166887 1180978 1114584
15371 1114584 1162505 1222182 1176450 1190116 1202908 1115258 1162419 1148343 1045633 1102780 1173452
15360 1173452 1166568 1139909 1162810 1136078 1196173 1222407 1240337 1245566 1199745 1118381 1146843 1218030
15348 1218030 1209238 1168328 1195081 1162986 1183524 1157682 1105521 1132618 1111243 1113239 1113793 1081392
15336 1081392 1206309 1223327 1138396 1153065 1117236 1273701 1218879 1148337 1117643 1201435 1234955
15325 1234955 1189115 1147367 1158454 1206963 1220539 1262212 1192291 1143829 1171229 1178064 1167855
15314 1167855 1218219 1163619 1186551 1241123 1182361 1183206 1174536 1163677 1106655 1193333 1157047 1121557
15302 1121557 1188039 1172420 1181121 1177511 1250493 1197412 1230953 1229339 1174331 1149323 1190952 1216946
15290 1216946 1244917 1203792 1223473 1211148 1202119 1172829 1221731 1226069 1217514 1209637 1175669 1202382
15278 1202382 1184566 1184838 1149563 1248068 1169340 1161348 1133632 1155608 1133925 1123877 1131952 1103283
15266 1103283 1135739 1102526 1069639 1075082 1107511 1131546 1154671 1152030 1184019 1219565 1221902 1153835
15254 1153835 1157082 1168177 1183482 1174851 1171371 1134166 1183758 1174895 1127449 1168872 1175799 1150708
15242 1150708 1088461 1165478 1186849 1237303 1264450 1228332 1169556 1145343 1195906 1173039 1230264
15231 1230264 1194884 1226057 1252595 1121551 1176972 1242810 1185260 1202839 1168660 1120262 1171596
15220 1171596 1224263 1168065 1208417 1208312 1155363 1173942 1209227 1187869 1206007 1201281 1217448 1216174
15208 1216174 1199161 1178276 1197975 1185047 1198169 1156491 1185441 1203675 1136442 1175696 1212385
15197 1212385 1275276 1242528 1244439 1144706 1209789 1198563 1153235 1237050 1277076 1240532 1217173
15186 1217173 1194445 1261668 1235640 1251186 1182146 1164828 1203296 1249868 1258689 1241481 1155314
15175 1155314 1204179 1225835 1172570 1154683 1177265 1207438 1216656 1182116 1152307 1164863 1198783
15164 1198783 1183592 1180122 1186923 1195307 1196755 1178774 1178993 1173212 1113420 1134549 1142440 1166725 1231437
15151 1231437 1199107 1271041 1186818 1178454 1153036 1208448 1160929 1162968 1203585 1236299 1122616
15140 1122616 1243211 1245345 1210995 1250294 1224399 1194582 1206217 1131307 1203421 1156821 1146367
15129 1146367 1129884 1167971 1178717 1104640 1112226 1087359 1162873 1116491 1100447 1133438 1123039
15118 1123039 1151333 1235063 1256106 1203200 1163337 1154204 1142610 1220262 1193019 1165956 1156545 1185774
15106 1185774 1202940 1216604 1185280 1181958 1147597 1102589 1133571 1150506 1156827 1210136 1160258 1178851
15094 1178851 1171199 1181630 1188305 1185083 1184613 1142092 1188675 1245166 1166415 1140793 1128536 1169375
15082 1169375 1156855 1156370 1188567 1227858 1259669 1279674 1252130 1263490 1227812 1250538 1250467 1173969
15070 1173969 1201514 1254322 1209691 1179558 1172752 1189473 1206473 1237182 1235320 1210879 1219012 1266393
15058 1266393 1224577 1165517 1163233 1166670 1227683 1216337 1159902 1156962 1192191 1165494 1170041 1177223
15046 1177223 1219226 1251445 1216614 1160977 1198678 1230909 1179329 1257054 1236551 1079688 1147491
15035 1147491 1183409 1202050 1206576 1285585 1231664 1229476 1230737 1175618 1213279 1264320 1257110 1297768
15023 1297768 1321807 1233309 1158313 1194796 1206137 1216365 1164758 1234645 1298266 1227766 1184153
15012 1184153 1183313 1169439 1144371 1128557 1201383 1202584 1158711 1220914 1244025 1217941 1172305 1142131
15000 1142131 1138950 1137170 1176082 1181930 1114253 1230337 1238101 1319275 1323729 1273987 1211833 1217927
14988 1217927 1219032 1213773 1265012 1237247 1167454 1241536 1195031 1162411 1196265 1211010 1251721 1177591
14976 1177591 1208664 1182288 1223239 1186736 1153407 1239839 1300846 1194031 1189736 1215662 1248015
14965 1248015 1278241 1230210 1225397 1244809 1202455 1268418 1263855 1304037 1259962 1267740 1196788 1150115
14953 1150115 1204328 1163668 1194008 1220012 1252207 1263782 1243609 1171465 1187017 1138256 1189160
14942 1189160 1138847 1175231 1216315 1248552 1263710 1168957 1207886 1308069 1220311 1253161 1230138
14931 1230138 1267225 1248597 1205386 1289748 1222849 1139075 1166251 1202813 1213543 1247182 1206664
14920 1206664 1132054 1234319 1225288 1168846 1156006 1183628 1185981 1125439 1189319 1271020 1267182 1199257
14908 1199257 1207007 1221004 1233733 1277543 1245329 1240956 1281967 1270519 1240633 1261686 1271294 1277466
14896 1277466 1233978 1196917 1207682 1250385 1290466 1189609 1188951 1223467 1236473 1219251 1193528
14885 1193528 1166703 1248396 1264496 1257250 1224712 1269249 1248626 1222268 1223274 1193513 1228740 1263421
14873 1263421 1216433 1192028 1152182 1224962 1283780 1338453 1296675 1238148 1229047 1199882 1319788
14862 1319788 1312218 1274288 1278649 1220094 1219587 1271426 1268216 1255400 1263539 1267636 1244273 1286755 1282245
14849 1282245 1292301 1289276 1251857 1264886 1259548 1233257 1194197 1191382 1213178 1203849 1217117 1216311
14837 1216311 1271136 1204948 1180112 1216986 1166615 1222561 1225103 1138652 1148935 1179816 1200941
14826 1200941 1204285 1227629 1267111 1276569 1221230 1175800 1158679 1225746 1292228 1237939 1241938 1194270
14814 1194270 1160821 1146474 1162188 1165339 1184969 1226908 1213302 1228500 1155311 1249407 1206127
14803 1206127 1187277 1218912 1222587 1203710 1219993 1191439 1157732 1187443 1150189 1139546 1150480
14792 1150480 1247967 1209930 1197627 1215851 1248203 1232157 1171737 1236625 1317846 1313788 1300606
14781 1300606 1213859 1208709 1176089 1249320 1242029 1166758 1202800 1182034 1200428 1253395 1242156 1284567
14769 1284567 1279492 1262092 1307215 1258218 1281301 1255223 1275243 1257150 1260812 1255864 1164785 1198438
14757 1198438 1210600 1243521 1239309 1203532 1204745 1251977 1287686 1243213 1204355 1178677 1218502 1220149
14745 1220149 1247499 1230260 1215993 1269191 1248052 1264521 1237710 1238672 1266048 1302890 1236197 1257033
14733 1257033 1297851 1221183 1241825 1207989 1237461 1245081 1266126 1241948 1210146 1251968 1317383
14722 1317383 1255393 1264169 1230946 1216302 1226591 1238083 1274074 1216207 1233464 1244605 1224485
14711 1224485 1228168 1262695 1226256 1244849 1215933 1229213 1238657 1217446 1261775 1243190 1242129 1210520
14699 1210520 1196737 1239886 1270998 1274321 1316911 1237017 1255597 1204540 1182737 1206733 1188128
14688 1188128 1314724 1262896 1219952 1191585 1249742 1239123 1221353 1181899 1229660 1164626 1221712
14677 1221712 1246172 1247333 1283281 1284114 1280126 1277925 1330996 1292138 1258913 1291230 1231846 1227362
14665 1227362 1226326 1233382 1216146 1200071 1229701 1260596 1277145 1232809 1268138 1279320 1226586 1143076
14653 1143076 1213683 1258025 1262657 1276559 1262265 1261693 1249840 1214539 1224366 1216006 1222234 1310174
14641 1310174 1284841 1245831 1180693 1237516 1164835 1144203 1245973 1278639 1270956 1243207 1271708
14630 1271708 1242972 1218977 1224955 1236378 1139539 1162902 1119467 1247230 1246724 1273744 1328866 1329293
14618 1329293 1296124 1349086 1295438 1238606 1254838 1240891 1264377 1250685 1313080 1283209 1279138
14607 1279138 1302116 1247548 1255940 1236850 1278142 1277829 1269896 1271586 1175366 1157837 1195865 1252605
14595 1252605 1251044 1265047 1232052 1251413 1321235 1246685 1297696 1291945 1222303 1153159 1122610 1147089
14583 1147089 1227461 1226396 1198831 1322030 1270137 1256899 1276295 1233810 1217115 1257109 1280966
14572 1280966 1276895 1294859 1292909 1232692 1266172 1243317 1306648 1295578 1291909 1338288 1228353 1230270
14560 1230270 1202572 1268275 1209039 1265836 1342664 1268575 1262001 1292361 1270184 1279401 1266166 1237437
14548 1237437 1243899 1264024 1266310 1305138 1221330 1210300 1309037 1256764 1212684 1199639 1267631 1255418
14536 1255418 1230672 1291908 1216295 1259093 1285069 1273208 1332439 1285842 1299114 1226338 1244186
14525 1244186 1232163 1236456 1231700 1255327 1224600 1249516 1238395 1271175 1274677 1256720 1306081 1276924
14513 1276924 1288552 1269548 1241062 1290467 1279855 1234784 1184704 1183968 1293766 1290299 1300283 1307421
14501 1307421 1194212 1272664 1244939 1272359 1306125 1253408 1244594 1247241 1286914 1259332 1231413
14490 1231413 1248903 1213320 1221981 1269200 1269623 1231875 1215703 1215899 1186584 1174363 1182694 1257922
14478 1257922 1236526 1306671 1335890 1291790 1303765 1310175 1252350 1207712 1270353 1232846 1250511
14467 1250511 1250127 1281021 1249945 1269200 1274485 1220787 1231828 1241085 1206511 1179988 1199445 1228086
14455 1228086 1266773 1296638 1163110 1183511 1248793 1234332 1282477 1291604 1286967 1296731 1313824 1293011
14443 1293011 1296008 1245555 1189425 1244192 1216364 1263356 1332568 1235714 1261038 1342036 1212858
14432 1212858 1153605 1283744 1231450 1272512 1313181 1290759 1324702 1303983 1275183 1217096 1206996
14421 1206996 1268698 1291990 1296058 1292601 1262274 1229985 1288119 1249928 1216151 1238772 1294501 1260771
14409 1260771 1305506 1305024 1297621 1314595 1247288 1297174 1307563 1263655 1328865 1244998 1303487 1294181
14397 1294181 1252008 1280764 1269857 1248031 1336183 1361399 1351638 1291229 1212197 1161587 1202660
14386 1202660 1242774 1285922 1313029 1312056 1293684 1290011 1272759 1232180 1328832 1359970 1315448 1249219
14374 1249219 1322561 1395766 1363407 1265047 1289793 1319823 1291778 1264058 1292725 1304578 1253462
14363 1253462 1321466 1380164 1288476 1233138 1303663 1266071 1251988 1329176 1355457 1314392 1317424
14352 1317424 1273584 1261717 1252043 1220393 1266287 1294349 1288791 1274848 1281059 1234727 1190752 1327712
14340 1327712 1265570 1301522 1337149 1257592 1202856 1220655 1302780 1309341 1307608 1226598 1217007 1167014
14328 1167014 1270622 1279894 1219220 1254493 1268247 1198078 1212186 1249138 1278188 1253665 1211664
14317 1211664 1221550 1239531 1242143 1315473 1346426 1288178 1237487 1308534 1278521 1255249 1283085 1316014
14305 1316014 1284224 1300508 1239791 1254654 1303347 1278979 1246335 1257365 1224855 1227807 1258337
14294 1258337 1283515 1330802 1327284 1356540 1338702 1340280 1287541 1277941 1268418 1292692 1311106 1304237
14282 1304237 1264028 1305836 1337319 1225471 1280471 1320906 1333950 1338921 1306677 1326121 1326309 1270210
14270 1270210 1263998 1242214 1252011 1324223 1287632 1317729 1405749 1304166 1268368 1279713 1259818
14259 1259818 1289038 1243412 1277530 1313659 1285238 1243538 1251994 1251924 1284599 1282853 1256624 1260365
14247 1260365 1298873 1302422 1308644 1307897 1251708 1258888 1231661 1290473 1220244 1246564 1281831 1329365
14235 1329365 1309910 1347316 1346888 1248694 1300546 1287923 1328246 1322193 1279930 1248383 1352921 1413716
14223 1413716 1315192 1245272 1282302 1298120 1304640 1311536 1263887 1283196 1369755 1363112 1332877 1358202
14211 1358202 1322511 1304699 1266365 1212710 1215086 1279023 1353955 1286094 1290239 1325670 1356976 1343606
14199 1343606 1340909 1260456 1321477 1285342 1250122 1238454 1235271 1261534 1265641 1240805 1305107 1310853
14187 1310853 1266132 1254474 1269423 1299063 1306565 1290109 1292113 1284923 1337125 1352509 1292668 1301821
14175 1301821 1351069 1363167 1239153 1287414 1272824 1265256 1272206 1277084 1319379 1236302 1249574 1279307
14163 1279307 1283789 1251442 1221124 1303885 1311535 1330885 1244777 1210721 1254696 1283397 1286952 1334126
14151 1334126 1381702 1359106 1297826 1353573 1354981 1269006 1308847 1307115 1263121 1313254 1317849 1271448
14139 1271448 1268024 1362474 1378183 1344382 1402721 1333083 1274559 1194949 1213395 1268623 1276117 1269706
14127 1269706 1287393 1304717 1310388 1282079 1236052 1280059 1281279 1302674 1235851 1296709 1363489 1326991
14115 1326991 1301028 1326688 1355469 1338672 1310112 1337881 1322060 1286690 1308037 1336677 1404948
14104 1404948 1306214 1228639 1260039 1382718 1272698 1222640 1301949 1357123 1303519 1269203 1273887
14093 1273887 1287361 1291176 1287484 1278682 1304662 1370843 1316221 1379094 1285358 1295695 1279072 1385903
14081 1385903 1349007 1307368 1267795 1283770 1309647 1263958 1287699 1292770 1220523 1261961 1343258
14070 1343258 1296487 1306234 1326136 1377419 1323414 1349337 1327901 1315765 1261458 1351985 1393355
14059 1393355 1352424 1324070 1296249 1323251 1348645 1313730 1392933 1365597 1367728 1367411 1361840 1384671
14047 1384671 1358886 1304445 1290356 1264175 1273813 1319159 1348988 1344667 1309396 1295061 1375718 1301715
14035 1301715 1251768 1311569 1274572 1289657 1316709 1327510 1356899 1299733 1335301 1327222 1275566
14024 1275566 1355378 1330008 1307346 1264204 1296545 1289466 1290410 1296257 1323867 1267263 1319207 1367864
14012 1367864 1312911 1306464 1356023 1343174 1325028 1278993 1292275 1357379 1313738 1315777 1289045 1262105
14000 1262105 1352570 1305836 1351508 1293273 1307614 1364692 1272481 1291581 1360326 1356397 1369065
13989 1369065 1368411 1345343 1403023 1408101 1306247 1247548 1314003 1348422 1349063 1421379 1301873 1289382
13977 1289382 1336937 1332185 1410507 1412405 1309810 1288466 1331827 1347590 1340898 1358057 1291456 1361153
13965 1361153 1405527 1346542 1354342 1367229 1380154 1306936 1325483 1313811 1330318 1404534 1339484
13954 1339484 1313384 1316755 1333127 1357023 1368942 1338910 1364512 1416952 1404669 1370972 1337412
13943 1337412 1365981 1357301 1304624 1391197 1375951 1269520 1301126 1353053 1318886 1323535 1332161 1308177
13931 1308177 1330576 1307499 1380113 1325896 1359967 1400536 1378995 1322578 1380665 1351809 1356415
13920 1356415 1314237 1351761 1304565 1345777 1292087 1319540 1325953 1331005 1363038 1325250 1352134 1341700
13908 1341700 1293936 1332096 1353205 1360916 1384500 1295892 1295743 1364769 1323898 1329882 1343720 1252458
13896 1252458 1285176 1261891 1266927 1366308 1371625 1351437 1352308 1360168 1285575 1279479 1378596 1317183
13884 1317183 1341593 1337898 1293057 1278560 1293630 1252323 1258355 1244685 1288939 1301681 1425891
13873 1425891 1502707 1396633 1326426 1316850 1346974 1372126 1262678 1262220 1313256 1304188 1367516 1373186
13861 1373186 1360244 1361889 1285757 1367663 1415438 1356385 1349012 1270203 1319069 1363031 1397240 1419574
13849 1419574 1506095 1401571 1417444 1416838 1366291 1403018 1351302 1294983 1362779 1362451 1357375 1376620
13837 1376620 1315465 1316361 1390935 1427984 1373217 1356412 1360816 1379495 1305488 1301059 1307119 1411829
13825 1411829 1352789 1321918 1338572 1348631 1331949 1382024 1306833 1329957 1359264 1350709 1318447
13814 1318447 1259035 1273704 1292558 1338641 1276577 1322564 1347350 1349913 1351591 1349970 1359617 1287547
13802 1287547 1304729 1292228 1267391 1268217 1270597 1334073 1398610 1412851 1370510 1408903 1384723 1352458
13790 1352458 1326427 1322138 1304430 1309298 1332471 1336939 1343285 1304001 1227213 1275842 1338160 1405751
13778 1405751 1423266 1446922 1380830 1377567 1403176 1411067 1399165 1402709 1443044 1404758 1425752 1385824
13766 1385824 1357882 1416262 1408030 1354443 1384288 1338377 1364915 1358385 1416284 1424926 1425363 1345313
13754 1345313 1269895 1326146 1397581 1432995 1354448 1367209 1371907 1360354 1288383 1370633 1383985
13743 1383985 1318286 1326833 1325973 1378097 1300683 1355048 1318257 1380778 1424288 1397069 1364441 1309958
13731 1309958 1367908 1431069 1455475 1375376 1344071 1344428 1406650 1441788 1403062 1308497 1402443 1406680
13719 1406680 1335219 1344710 1367096 1401896 1282905 1316178 1453466 1380796 1357335 1342772 1356201
13708 1356201 1374896 1409201 1360899 1333318 1381029 1314028 1250431 1286885 1257696 1228798 1304581
13697 1304581 1353219 1354745 1386147 1377344 1388998 1352061 1323146 1381818 1402196 1372501 1338976 1318461
13685 1318461 1260434 1295765 1392752 1411007 1377651 1362662 1333583 1329749 1332990 1340748 1378817 1382410
13673 1382410 1324492 1278131 1275380 1250567 1302638 1306205 1315822 1318531 1297105 1390893 1383633 1369481
13661 1369481 1317398 1325029 1405515 1425444 1385678 1352615 1372993 1307074 1311802 1293105 1309196 1299153
13649 1299153 1260374 1301563 1313274 1365804 1316363 1411103 1392506 1346040 1339456 1260050 1313651
13638 1313651 1347646 1330664 1307037 1404781 1400233 1330683 1381179 1344858 1352435 1305518 1337209 1366104
13626 1366104 1348241 1385971 1404979 1308277 1352338 1379020 1403026 1400881 1376776 1386176 1349078 1381672
13614 1381672 1377885 1356696 1421306 1419405 1372745 1418478 1403897 1411849 1419723 1427139 1389800 1330448
13602 1330448 1314206 1322997 1332822 1438136 1446076 1401838 1328464 1344012 1387582 1375707 1371055 1334824
13590 1334824 1367544 1373100 1396881 1370805 1385753 1403570 1401022 1377930 1305712 1278218 1358717 1386781
13578 1386781 1374965 1336302 1309223 1341225 1293709 1427903 1441899 1416380 1381732 1341719 1386998
13567 1386998 1438087 1335588 1331161 1366912 1361190 1372057 1434077 1314734 1345609 1401714 1378807
13556 1378807 1472636 1465026 1391996 1398231 1391121 1326113 1356885 1411372 1402021 1380887 1292146 1348124
13544 1348124 1405111 1384400 1386004 1408619 1377052 1377295 1409816 1273216 1319326 1352926 1392656 1378037
13532 1378037 1367363 1355482 1371859 1430243 1429051 1370806 1406156 1387609 1357788 1339094 1368891
13521 1368891 1405437 1392322 1415371 1445459 1414366 1394660 1428808 1375112 1362580 1309776 1348821
13510 1348821 1352256 1316170 1371084 1413124 1404475 1322847 1363442 1388744 1412939 1454801 1385449 1333666
13498 1333666 1347825 1399223 1418644 1376803 1336873 1435446 1411624 1376191 1399093 1388805 1375318
13487 1375318 1340873 1355520 1345194 1349201 1330973 1360693 1365081 1457920 1409416 1375298 1432014 1413682
13475 1413682 1360261 1344276 1353163 1456390 1396044 1350031 1371049 1324217 1317813 1363990 1348324
13464 1348324 1328815 1380246 1386420 1419897 1368640 1346193 1369015 1302327 1256153 1211979 1324237
13453 1324237 1434444 1382673 1346638 1379385 1338482 1367829 1407359 1397211 1420893 1384502 1373656
13442 1373656 1317728 1382308 1442386 1410205 1377567 1361389 1412464 1342219 1362753 1391057 1361288
13431 1361288 1386776 1373834 1349884 1414522 1366720 1373284 1418737 1374520 1429835 1398083 1437685
13420 1437685 1442562 1363592 1350824 1357652 1352428 1398168 1379996 1383280 1368113 1428219 1474103 1417128
13408 1417128 1366186 1388921 1457767 1363738 1394006 1395604 1413703 1395915 1333734 1400401 1458304
13397 1458304 1503206 1450756 1453119 1412140 1392426 1362052 1273711 1330764 1350459 1275957 1353565
13386 1353565 1432719 1400236 1438015 1424367 1381300 1357524 1288326 1398342 1374583 1405627 1364657
13375 1364657 1409729 1430656 1391023 1397361 1338139 1400050 1418823 1416949 1367622 1379266 1429132 1457950
13363 1457950 1477350 1398796 1343655 1388861 1374252 1379943 1377210 1293747 1397727 1423266 1460493
13352 1460493 1413436 1407774 1455255 1430707 1389519 1439204 1545856 1512677 1438481 1422770 1439716
13341 1439716 1401254 1401115 1381546 1410459 1422886 1447422 1440877 1404302 1410717 1436118 1387799 1412088
13329 1412088 1427103 1395808 1430430 1399438 1437470 1480834 1495705 1441895 1394190 1363747 1377799
13318 1377799 1467126 1456435 1430137 1486317 1433134 1450773 1447114 1437655 1417202 1435729 1425879 1417885
13306 1417885 1354030 1338285 1347297 1419647 1470530 1474949 1468903 1419307 1439263 1374325 1441435 1423276
13294 1423276 1371200 1351157 1402044 1413714 1441977 1495310 1531174 1465751 1386187 1369967 1351622
13283 1351622 1392260 1410597 1327617 1373927 1413559 1434218 1302072 1417436 1415614 1429216 1424769
13272 1424769 1387773 1379186 1370658 1365285 1377452 1425367 1487307 1471597 1418308 1435990 1389255 1417235
13260 1417235 1444316 1380167 1438331 1465289 1398828 1431298 1396767 1395798 1418419 1459746 1492646 1464527
13248 1464527 1553391 1514143 1387519 1492269 1501820 1441949 1422181 1420094 1354543 1357496 1365592 1378171
13236 1378171 1418542 1455670 1419652 1387602 1378602 1329996 1367791 1371049 1429875 1489482 1425833 1492215
13224 1492215 1424765 1384751 1437280 1459378 1463261 1426000 1392647 1388444 1429035 1428806 1424230 1378770
13212 1378770 1381330 1410950 1400219 1481742 1466695 1402558 1382352 1379228 1345752 1409259 1423071 1480295
13200 1480295 1472283 1422883 1459101 1435309 1491259 1530298 1437569 1376245 1376328 1437031 1492294 1442222
13188 1442222 1417936 1404038 1470993 1446108 1402370 1437548 1422980 1438339 1484371 1503961 1502266
13177 1502266 1482319 1421679 1426131 1454542 1391309 1391758 1444680 1394474 1404315 1403672 1386259 1428011
13165 1428011 1393014 1429955 1388103 1383131 1388296 1438234 1405729 1377267 1451303 1470796 1412359 1412458
13153 1412458 1434964 1463480 1475434 1474232 1442260 1451792 1393626 1384567 1438582 1419657 1406112 1436925
13141 1436925 1520386 1384649 1332294 1392802 1378075 1368342 1388361 1417696 1506226 1411831 1336267
13130 1336267 1380685 1366880 1389646 1371822 1363992 1403632 1460317 1479130 1431275 1410243 1377599
13119 1377599 1384424 1433414 1464464 1477888 1457673 1500358 1450185 1432630 1465294 1487885 1466874
13108 1466874 1406950 1446810 1414901 1549587 1496156 1430472 1429826 1500577 1451539 1479960 1496287
13097 1496287 1455491 1436304 1450491 1503449 1481255 1527978 1485970 1450454 1427457 1512910 1531788
13086 1531788 1480547 1507928 1458978 1419972 1406324 1470911 1446546 1437915 1435644 1386300 1391235 1499587
13074 1499587 1455594 1477852 1527280 1491679 1509585 1482127 1489084 1490402 1451124 1452472 1458316 1478091
13062 1478091 1514129 1463422 1424925 1420111 1438150 1449849 1452853 1459252 1453642 1409055 1398657 1431791
13050 1431791 1464737 1400092 1410698 1354780 1447689 1471941 1482582 1397843 1400285 1416679 1383585
13039 1383585 1433897 1431210 1397289 1424116 1410020 1420308 1428590 1445603 1489998 1471410 1510956 1464152
13027 1464152 1473213 1473316 1469879 1504592 1498400 1468909 1438610 1420753 1399386 1473969 1483879 1469962
13015 1469962 1444325 1481274 1454192 1527529 1480387 1440838 1454408 1385382 1485267 1487783 1469220
13004 1469220 1508982 1491332 1466788 1403899 1409985 1419838 1423626 1414795 1362709 1443579 1433455 1377147
12992 1377147 1384965 1375304 1392289 1439763 1441702 1468521 1486787 1477849 1396003 1420149 1455779 1405003
12980 1405003 1456281 1503699 1533007 1528568 1456989 1462629 1413527 1438644 1491670 1456721 1470228 1440606
12968 1440606 1456344 1463879 1416484 1441378 1436143 1457516 1535741 1540792 1506592 1471533 1481679 1524567
12956 1524567 1471295 1436275 1432699 1407657 1381357 1460095 1422272 1484354 1453772 1432792 1402328
12945 1402328 1481977 1475949 1372922 1350740 1443837 1505014 1457352 1451217 1389217 1438474 1499641
12934 1499641 1429161 1415366 1422627 1444140 1569711 1485989 1463403 1462482 1507010 1507275 1546191 1484664
12922 1484664 1505076 1432810 1429519 1460229 1445273 1396282 1420992 1445762 1451471 1446777 1367871 1455873
12910 1455873 1481149 1540894 1450438 1446061 1472850 1434495 1456800 1467925 1399211 1492270 1490554 1516322
12898 1516322 1543893 1475792 1466054 1479574 1505660 1529426 1539284 1498607 1446587 1501639 1541935 1447168
12886 1447168 1454065 1402087 1443035 1485519 1412883 1442343 1518295 1497496 1538682 1501674 1494200 1474591
12874 1474591 1435607 1474341 1433999 1489817 1518240 1514198 1466620 1459310 1507873 1522767 1558438 1555799
12862 1555799 1492416 1442255 1490941 1456639 1441820 1474893 1520484 1481309 1500055 1460890 1397418
12851 1397418 1417398 1489047 1553463 1526288 1450491 1423154 1421052 1419592 1486169 1458969 1478777 1482307
12839 1482307 1481765 1484192 1487853 1431342 1349395 1445287 1505964 1492025 1542280 1585706 1464218 1447439
12827 1447439 1522325 1496579 1496178 1565489 1546264 1531023 1502045 1432657 1463661 1487347 1480026 1478366
12815 1478366 1477352 1484552 1434981 1403717 1467359 1486086 1474156 1449652 1388362 1437887 1480666 1504520
12803 1504520 1606662 1511864 1515177 1488939 1465873 1450037 1533650 1537297 1478962 1477813 1516241 1537675
12791 1537675 1528242 1488879 1480068 1531430 1521587 1537416 1487738 1439934 1501406 1495550 1491963 1505290
12779 1505290 1536885 1584146 1580238 1494749 1489952 1493744 1495914 1477494 1473906 1439846 1465691 1475720
12767 1475720 1484749 1527238 1485092 1505664 1545335 1466453 1437302 1469999 1454522 1451230 1509126 1481920
12755 1481920 1494230 1572582 1540544 1491796 1470712 1493670 1522482 1518400 1528822 1498799 1519433
12744 1519433 1542522 1498050 1511396 1597671 1585181 1514442 1465524 1431653 1555445 1521362 1523879
12733 1523879 1483311 1491631 1477320 1511259 1506611 1511667 1460173 1492971 1501512 1567976 1568288 1574442 1519527
$$ [...]
##END NTUPLES=NMR SPECTRUM
##END=
