##TITLE=1H_EC-3330(2)
 CDCl3
 8 sc, 
 2.8.2024
##JCAMPDX= 6.0         $$ Bruker NMR JCAMP-DX V2.0
##DATA TYPE= NMR SPECTRUM
##DATA CLASS= NTUPLES
##ORIGIN= UXNMR, Bruker Analytische Messtechnik GmbH
##OWNER= root
$$ XWIN-NMR		Version 3.5
$$ Fri Aug  2 13:49:06 2024 Russian Standard Time (UT+4h)  she@DPX200
##.OBSERVE FREQUENCY= 200.1315
##.OBSERVE NUCLEUS= ^1H
##.ACQUISITION MODE= SIMULTANEOUS
##.ACQUISITION SCHEME= undefined
##.AVERAGES= 8
##.DIGITISER RES= 18
##SPECTROMETER/DATA SYSTEM= spect
##.PULSE SEQUENCE= zg30
##.SOLVENT NAME= Acetone
##.SHIFT REFERENCE= (INTERNAL, Acetone, 0, 22.5575)
##AUDIT TRAIL= $$ (NUMBER, WHEN, WHO, WHERE, WHAT)
$$ ##TITLE= Audit trail, XWIN-NMR		Version 3.5
$$ ##JCAMPDX= 5.01
$$ ##ORIGIN= Bruker BioSpin GmbH
$$ ##OWNER= she
$$ F:/spectra/data/she/nmr/H-F/1/pdata/1/auditp.txt
$$ ##AUDIT TRAIL=  $$ (NUMBER, WHEN, WHO, WHERE, WHAT)
(   1,<2024-08-02 13:47:34.51 +0400>,<she>,<DPX200>,
      <created by zg, POWCHK disabled, PULCHK disabled
       configuration hash MD5:
       00 E9 B6 7A A2 85 ED C7 34 08 36 98 17 FE 4E 26
       data hash MD5: 16K
       48 3A 90 8B 11 46 13 79 F6 EA DC 30 A4 3A 23 B1>)
(   2,<2024-08-02 13:47:37.59 +0400>,<she>,<DPX200>,
      <Start of raw data processing
       efp BC_mod = 2 LB = 0.24 FT_mod = 6 PKNL = 1 PHC0 = -25634.01 PHC1 = 5.787489 SI = 16K 
       data hash MD5: 16K
       3A 80 6D 24 4F D6 84 02 D4 64 DB BC 19 F9 35 61>)
(   3,<2024-08-02 13:47:54.67 +0400>,<she>,<DPX200>,
      <pk PHC0 = 0.7586481 PHC1 = 1.8 
       data hash MD5: 16K
       0C 89 84 D8 2D 8D 3B 75 6E 08 25 51 11 09 CC 31>)
(   4,<2024-08-02 13:47:58.28 +0400>,<she>,<DPX200>,
      <abs ABSG = 5 
       data hash MD5: 16K
       9C E3 39 EF DA D3 19 FB E5 2F 16 F2 78 5B AE 8F>)
$$ ##END=
$$ 
$$ hash MD5
$$ 7F DC 14 B3 C2 A3 8E 87 0B B0 06 0F ED AF C6 5C
##$RELAX= 
##$RELAX= 
##$RELAX= 
##$RELAX= 
##$RELAX= 
##$RELAX= 
$$ Bruker specific parameters
$$ --------------------------
##$DU= <F:/spectra>
##$EXPNO= 1
##$NAME= <H-F>
##$PROCNO= 1
##$TYPE= <nmr>
##$USER= <she>
##$AMP= (0..31)
100 100 100 100 100 100 100 100 100 100 100 100 100 100 100 100 100 100 
100 100 100 100 100 100 100 100 100 100 100 100 100 100 
##$AQSEQ= 0
##$AQ_mod= 1
##$AUNM= <au_zg>
##$AUTOPOS= <>
##$BF1= 200.13
##$BF2= 200.13
##$BF3= 200.13
##$BF4= 200.13
##$BF5= 200.13
##$BF6= 200.13
##$BF7= 200.13
##$BF8= 200.13
##$BYTORDA= 1
##$CFDGTYP= 0
##$CFRGTYP= 5
##$CHEMSTR= <none>
##$CNST= (0..31)
1 1 145 1 1 1 1 1 1 1 1 1 1 1 1 1 1 1 1 1 1 1 1 1 1 1 1 1 1 1 1 1 
##$CPDPRG= <>
##$CPDPRG1= <>
##$CPDPRG2= <>
##$CPDPRG3= <>
##$CPDPRG4= <mlev>
##$CPDPRG5= <mlev>
##$CPDPRG6= <mlev>
##$CPDPRG7= <mlev>
##$CPDPRG8= <mlev>
##$CPDPRGB= <>
##$CPDPRGT= <>
##$D= (0..31)
0 1.2 0 0 0 0 0 0 0 0.06 0 0.03 0 0 0 0 0.0002 0 0 0 0 0 0 0 0 0 0 0 0 
0 0 0 
##$DATE= 1722592054
##$DBL= (0..7)
120 120 120 120 120 120 120 120 
##$DBP= (0..7)
150 150 150 150 150 150 150 150 
##$DBP07= 0
##$DBPNAM0= <>
##$DBPNAM1= <>
##$DBPNAM2= <>
##$DBPNAM3= <>
##$DBPNAM4= <>
$$ [...]
##$SUBNAM3= <"">
##$SUBNAM4= <"">
##$SUBNAM5= <"">
##$SUBNAM6= <"">
##$SUBNAM7= <"">
##$SUBNAM8= <"">
##$SUBNAM9= <"">
##$SW= 24.0689530833862
##$SWIBOX= (0..15)
0 0 2 0 0 0 0 0 0 0 0 0 0 0 0 0 
##$SW_h= 4816.95568400771
##$TD= 16384
##$TD0= 1
##$TE= 0
##$TE2= 300
##$TE3= 300
##$TEG= 300
##$TL= (0..7)
0 120 120 120 120 120 120 120 
##$TP= (0..7)
150 150 150 150 150 150 150 150 
##$TP07= 0
##$TPNAME0= <>
##$TPNAME1= <>
##$TPNAME2= <>
##$TPNAME3= <>
##$TPNAME4= <>
##$TPNAME5= <>
##$TPNAME6= <>
##$TPNAME7= <>
##$TPOAL= (0..7)
0.5 0.5 0.5 0.5 0.5 0.5 0.5 0.5 
##$TPOFFS= (0..7)
0 0 0 0 0 0 0 0 
##$TUNHIN= 0
##$TUNHOUT= 0
##$TUNXOUT= 0
##$USERA1= <user>
##$USERA2= <user>
##$USERA3= <user>
##$USERA4= <user>
##$USERA5= <user>
##$V9= 5
##$VALIST= <valist>
##$VCLIST= <CCCCCCCCCCCCCCC>
##$VD= 0
##$VDLIST= <DDDDDDDDDDDDDDD>
##$VPLIST= <PPPPPPPPPPPPPPP>
##$VTLIST= <TTTTTTTTTTTTTTT>
##$WBST= 1024
##$WBSW= 4
##$XGAIN= (0..3)
0 0 0 0 
##$XL= 0
##$YL= 0
##$YMAX_a= 339871
##$YMIN_a= -255899
##$ZGOPTNS= <>
##$ZL1= 120
##$ZL2= 120
##$ZL3= 120
##$ZL4= 120
##$ABSF1= 21.99487
##$ABSF2= -2.074324
##$ABSG= 5
##$ABSL= 3
##$ALPHA= 0
##$AQORDER= 0
##$ASSFAC= 0
##$ASSFACI= 0
##$ASSFACX= 0
##$ASSWID= 0
##$AUNMP= <proc_1d>
##$AZFE= 0.1
##$AZFW= 0.1
##$BCFW= 0
##$BC_mod= 2
##$BYTORDP= 0
##$COROFFS= 0
##$CY= -3
##$DATMOD= 1
##$DC= 0
##$DFILT= <>
##$DTYPP= 0
##$F1P= 0
##$F2P= 0
##$FCOR= 1
##$FTSIZE= 16384
##$FT_mod= 6
##$GAMMA= 0
##$GB= 0
##$INTBC= 1
##$INTSCL= 3.70164e-10
##$ISEN= 128
##$LB= 0.24
##$LEV0= 0
##$LPBIN= 0
##$MAXI= 10000
##$MC2= 0
##$MEAN= 0
##$ME_mod= 0
##$MI= 1.114404
##$NCOEF= 0
##$NC_proc= -7
##$NLEV= 6
##$NOISF1= 3.799351
##$NOISF2= 2.8
##$NSP= 0
##$NTH_PI= 0
##$NZP= 0
##$OFFSET= 22.55754
##$PC= 1
##$PHC0= -25633.25
##$PHC1= 7.587489
##$PH_mod= 1
##$PKNL= yes
##$PPARMOD= 0
##$PSCAL= 0
##$PSIGN= 0
##$REVERSE= no
##$SF= 200.129394052286
##$SI= 16384
##$SIGF1= 3
##$SIGF2= 2
##$SINO= 5.538805
##$SIOLD= 16384
##$SREGLST= <1H.CDCl3>
##$SSB= 0
##$STSI= 16384
##$STSR= 0
##$SW_p= 4816.95568400771
##$SYMM= 0
##$S_DEV= 0
##$TDeff= 16384
##$TDoff= 0
##$TI= <>
##$TILT= no
##$TM1= 0
##$TM2= 0
##$TOPLEV= 0
##$USERP1= <user>
##$USERP2= <user>
##$USERP3= <user>
##$USERP4= <user>
##$USERP5= <user>
##$WDW= 1
##$XDIM= 16384
##$YMAX_p= 524488802
##$YMIN_p= -1255494
$$ End of Bruker specific parameters
$$ ---------------------------------
##NTUPLES= NMR SPECTRUM
##VAR_NAME=  FREQUENCY,     SPECTRUM/REAL,   SPECTRUM/IMAG
##SYMBOL=    X,             R,               I
##VAR_TYPE=  INDEPENDENT,   DEPENDENT,       DEPENDENT
##VAR_FORM=  AFFN,          ASDF,            ASDF
##VAR_DIM=   16384,         16384,           16384
##UNITS=     HZ,            ARBITRARY UNITS, ARBITRARY UNITS
##FACTOR=    0.29402158847633, 1,            1
##FIRST=     4514.42699033676, 0,            0
##LAST=      -302.528693670949, 0,           0
##MIN=       -302.528693670949, -1255494,    0
##MAX=       4514.42699033676, 524488802,    0
$$ Real data points
##PAGE= N=1
##DATA TABLE= (X++(R..R)), XYDATA
$$ [...]
6492 81180757 74046916 66514930 59496792 53408557 48921597 45653477 43166934 40883374
6484 40883374 39023504 37488381 35952365 34241773 32893450 31759194 30970513 29674906
6476 29674906 28548416 27589973 26192505 25236122 24158856 23675421 23163273 22632653 22515188
6467 22515188 22692547 22505106 22395184 22148200 21647565 21237527 21482899 21584784 21676167 21213240
6457 21213240 20548702 19797111 18985332 18671189 18106750 17589987 17381425 17121597 16701605
6448 16701605 16333729 16265255 16203925 15973621 16511808 16777867 16951465 17448869 17919490 18393679
6438 18393679 19182829 19661984 20336461 21389592 22818658 25218108 27360459 28721589 29064668
6429 29064668 28035477 27094360 27251811 27121337 26360317 24655713 21363652 18290414 16000868
6420 16000868 14358902 12871925 11769011 11333879 10661908 9744016 9256612 8824649 8669612
6411 8669612 8138458 7797071 7824327 7136270 6939415 7462839 7004567 6400442 5951663 5704188
6401 5704188 5620863 5437729 5180124 4939582 4880738 4777364 4749032 4650363 4765844 4680265
6391 4680265 4560417 4405516 3996550 3697187 3785204 3764349 3628400 3562122 3601709 3500572
6381 3500572 3396516 3126640 3280651 3546924 3441826 3386047 3434188 3037187 2869865 2974716
6371 2974716 3211257 2918896 2857455 2982155 3047297 2979565 2925186 2702582 2628481 2791316
6361 2791316 3081360 2583453 2671615 2857121 2935908 2876012 2833778 3001782 3284719 3391952
6351 3391952 3133481 2828086 3084945 3049174 2748858 3013085 3241476 3013161 2899781 2949384
6341 2949384 3325744 3198293 2945312 3134567 3058146 2865493 3019430 3259894 3440596 3574940
6331 3574940 3765631 3681839 3899705 3784011 3896847 4230926 4442703 5003584 5534001 5910936
6321 5910936 5315077 5188019 5467538 5395137 5879929 6388002 6375190 5963176 5460400 5225858
6311 5225858 5451169 5097557 4438517 4738480 4523591 4619943 4461215 4797439 4953624 5721953
6301 5721953 6072512 6417517 6601433 7257602 7770243 7737979 8011206 8148423 7837619 7814656
6291 7814656 8086242 8224319 8211126 8174050 7792188 7813661 7543579 7586201 7905057 7760658
6281 7760658 8197855 8557625 8539825 8915471 9502289 9720164 10310860 10834739 11320286 12459246
6271 12459246 13319629 14767956 16852451 19978513 22860659 24599943 25087748 24307504 23836640
6262 23836640 24406352 24953889 24120672 22531867 19983597 17851198 15879158 14156377 12851953
6253 12851953 11663734 11087852 10362981 10016827 9619017 9202837 8709176 8382167 7724297
6244 7724297 7350965 7372192 7550053 7476255 7548592 7523513 7294419 7118055 6960777 6965183 6959230
6233 6959230 7026500 6733928 6649455 6466282 5980849 5838573 5825584 5596728 5513715 5647376
6223 5647376 5502089 5812384 5815145 5584806 5899987 5759361 5452206 5755023 5956835 6129774
6213 6129774 6314907 6379325 6237223 6342409 6519868 6650548 6393269 6268968 6626555 6626034
6203 6626034 7024153 6950709 7089257 6947597 7464243 7592683 7544271 8014903 8738364 8874590
6193 8874590 9309925 9659856 9988466 10195627 11133858 11625246 12462213 13587093 14073798
6184 14073798 14712014 15617861 16615588 17488074 18338838 18940784 19458124 20553979 21444304
6175 21444304 22636412 23772210 24931522 26620347 28499596 29962166 31980479 34814150
6167 34814150 37914530 41912222 47841358 55512071 64856277 72609610 75894823 75306392
6159 75306392 73704227 74029146 77274022 82121146 83866619 81475477 76034060 70817552
6151 70817552 66770359 63993561 62465184 61422909 60933372 61479511 61970269 62124641 62066116
6142 62066116 62663296 64249449 65928132 68410626 70626148 73500667 78029202 85522944
6134 85522944 95546125 107695008 115026063 115888378 111988328 108549928 109022006 113867578
6126 113867578 119265476 118418333 111651475 101158939 92346056 86203911 82324070 79772581
6118 79772581 78824935 78546292 78160993 76522948 74731605 73351087 72839217 73632510 74570964
6109 74570964 74411798 73568791 72418347 71354811 70766159 70283112 69388754 68663521 67258451
6100 67258451 65055416 62716776 60498693 59576166 59790269 61337971 64524316 67834805
6092 67834805 70918302 72875395 73165349 72960020 72333099 70481186 68142246 65566881 62949857
6083 62949857 61189638 60095156 59257753 58558280 57756201 55892704 53052272 50009511 46861388
6074 46861388 44702427 42910939 41958983 41910920 41407356 40095750 38586989 37090706 36182176
6065 36182176 36030740 36492662 36640799 36613022 36166728 36152284 35774908 35421683 35586772 35591068
6055 35591068 35278578 35027830 34448083 34754741 34621454 34509616 34490439 34223553 33696742 32673191
6045 32673191 31062557 29617724 28233131 26746466 25412484 25213830 24526633 24287259 24363240
6036 24363240 24551516 25021809 25438711 26229673 27172133 28129404 29446972 30254815 31192555
6027 31192555 32440380 33815376 35050710 36203767 37025616 38024432 39404903 40863231
6019 40863231 42564406 44566220 46785668 49490408 52786709 56320028 61008094 67505535
6011 67505535 76316270 88185060 103582511 121288303 135110621 141947495 138865413 128335405
6003 128335405 115052676 102777756 93173985 85731536 80586116 77499981 76786077 76959657
5995 76959657 79083646 82145900 86985274 89171383 89513772 90863253 92628130 95350288
5987 95350288 98793655 101452002 104690581 107311761 110514318 114654553 121326113 130795084
5979 130795084 144305502 158263086 170405538 176441493 177983719 176796666 179728521 188882786
5971 188882786 209288383 244043568 310040932 344529641 321441708 268857702 216984876
5964 216984876 183039503 155654096 138102512 123506703 113202549 104387548 98864763
5957 98864763 94106649 91021021 87325977 83189950 77539892 72349110 67493338 63856851
5949 63856851 60467799 58325861 56444705 55122941 53270916 51329492 49937723 48811431
5941 48811431 47241845 46299936 44578486 43511084 42222801 40990064 40204161 39861054 39120648
5932 39120648 38667984 37615558 36883670 36355642 35748393 34190410 32491121 31150972 29966361
5923 29966361 28627885 27647744 26787567 26663611 26325769 26209576 26011829 26039434 25970826 25741875
5913 25741875 25145353 24932201 24147754 23062772 22204049 21424570 21476094 20969119 20259422
5904 20259422 19155698 18318938 17733444 17547237 17069601 16992819 17482927 17957069 18989561
5895 18989561 19991067 20986166 20937719 19832301 18626015 17096928 15651569 14829943 14256729
5886 14256729 13669084 13615752 13404153 13458183 14296748 14390281 14723480 14867415 14788062 14473152
5876 14473152 14173025 14407580 14754710 15633592 17145666 18377056 19390540 19365284 18754869
5867 18754869 18182257 17712878 17524734 17168561 16334993 15160380 13760969 12323732 11378815
5858 11378815 10573560 10057647 9512203 9245464 9047320 9099114 9143522 9338055 9547700 9308632
5848 9308632 9159366 9237042 9192267 9132813 9592407 10034822 11192995 12010143 12472845 11986225
5838 11986225 10812857 9532479 8032712 7749004 6962584 6560971 6113936 5883881 5620461
5829 5620461 5591856 5387283 5111221 5271099 4960274 5089577 4729803 4387792 4510199 4123114
5819 4123114 4052169 4046999 4027333 4011937 3738325 3755625 4130801 3874934 3658784 3820749 3879083
5808 3879083 3828088 3786796 3966700 4532745 4845360 5338057 5899706 5902173 5206311 4755207
5798 4755207 4155301 3662028 3376023 3290492 3089659 3008496 2744683 2796579 2690272 2583197
5788 2583197 2654587 2687627 2656620 2602388 2601173 2526824 2390068 2664207 2681568 2461278 2375678
5777 2375678 2630318 2969136 3154721 3288570 3874505 4031606 3903037 3501038 2978933 2646298
5767 2646298 2380853 1810224 1798404 2003865 2038081 1808275 1544865 1285043 1413506 1382689
5757 1382689 1337195 1375696 1191338 1262234 1287798 1005522 1333483 1355837 1400303 1225423 916369
5746 916369 1013854 1366195 1364284 1184861 1334924 1153412 1248329 1324046 1155631 1009709 1109672
5735 1109672 1358612 1377974 1235674 1338349 1074285 1202429 1313480 1357675 1296093 1314822
5725 1314822 975568 813830 730364 841309 784965 952580 661847 779963 801136 984080
5715 984080 877988 920891 722318 511699 777524 858651 1015924 899674 875810 1014498
5705 1014498 856438 860913 971432 1037481 972325 809591 715386 1003265 1143008 1022507
5695 1022507 829913 706529 521286 576814 608564 776121 636864 609413 664965 707552
5685 707552 780547 667395 776583 622658 600340 484878 460994 546230 676933 743600 809516
5674 809516 808779 447961 903862 660082 599126 562724 523697 441065 565460 615102 718060
5663 718060 577876 523629 460041 674528 684951 450365 500958 340705 567617 315588
5653 315588 293478 -140400 -11442 -116630 35687 52504 282041 585418 218663 -26318
5643 -26318 23254 110662 443057 490930 155885 179849 207979 159143 293698 260046 321994
5632 321994 473227 366772 533899 588300 464017 479347 389814 297398 55711 381730
5622 381730 547698 605422 659346 677094 682749 734517 768442 681616 900839 1103969 1403306
5611 1403306 1541455 1636134 1621646 1140642 994919 1067237 1074392 744098 522932 505483 341027
5600 341027 386612 327169 311255 455457 612375 443264 427517 291244 292038 207917 31551
5589 31551 344353 289618 293987 89567 539742 392074 374087 354900 367530 429113 386535
5578 386535 408435 130296 440099 405788 645147 644506 785474 974063 739710 395712 434956
5567 434956 654881 894796 1003150 1125704 1116667 1031743 967101 1018599 1083783 869244 702684
5556 702684 614592 373207 492822 442477 92082 86211 -26800 140935 317777 91157
5546 91157 -61231 136543 266700 389569 262952 401930 295092 416401 390337 411067
5536 411067 563542 426122 835962 1139764 804239 681466 868669 636023 676035 680790
5526 680790 745207 609861 421280 234601 299490 222882 207387 220153 396488 562480 189432
5515 189432 183065 200040 -168732 -20475 120815 265361 294899 -40393 13714 49987 -393145
5504 -393145 22896 174206 254070 363175 80126 223714 113323 121748 312870 431870
5494 431870 47358 -139385 -220277 -40005 -5575 -40491 198735 456361 -27315 364430
5484 364430 227890 -5133 -316105 14765 145038 129045 -32385 -262071 -87 209974
5474 209974 137577 60217 -52402 3041 159294 -49151 26488 6669 -54633 -73608 173432
5463 173432 -290241 -146917 148323 181574 -18757 -561 191854 5570 -63263 147608
5453 147608 -126394 -164602 -172045 15727 -53951 15192 7581 -115621 -69000 10738 -135587
5442 -135587 -293189 -224230 -257665 -193363 -173030 -167787 -86399 5834 -212991 -132259 -234962
5431 -234962 17241 99590 -169827 191319 245046 324267 -19324 -320713 60136 475879
5421 475879 156500 38417 -206497 -238735 7781 -56430 250902 263031 356587 341212 258932
5410 258932 217245 200919 -78113 85296 158194 85085 399194 383809 393310 363840 298110
5399 298110 690217 797209 781791 892835 769400 746521 507061 250769 223341 450677
5389 450677 300725 320199 320612 237112 -81783 96796 257751 259113 184467 159302 401744
5378 401744 236021 288948 434384 245726 283065 482103 517971 625382 653066 343121
5368 343121 473036 702396 752906 516244 358768 290372 277761 357032 173903 184097 97680
5357 97680 26610 -82814 299907 162156 -107967 -55237 -288447 -233789 68098 -23745 -31845
5346 -31845 -31289 -257531 -26401 2116 -49568 -243831 -183958 -73420 -196486 -2236 -75655
5335 -75655 -141715 -23838 115895 -71797 -72337 229236 304963 226201 167746 -125592 -113465
5324 -113465 43971 -126471 149069 259538 -228760 -146561 -19622 199361 83090 -165199
5314 -165199 -55737 -278730 -90104 -153603 -159987 -225108 -206250 -70221 -180758 -28364 59285
5303 59285 -145479 95723 103912 -262065 -229832 -126930 -143270 -128005 -251887 85036 85838
5292 85838 -48938 -97079 -14261 75991 -202449 -101426 -273005 -121205 -310069 57440
5282 57440 -176971 -324186 -392024 -507900 -233313 -175999 -217056 -23636 -52370 -242535 -399620
5271 -399620 -469462 -507379 -285470 -136035 -121981 -354615 -120827 -51375 -118143 -394686 -629738
5260 -629738 -225228 -206653 -174618 -50945 -215527 -242466 -99252 -27235 -107492 -364678 -257182
5249 -257182 -173106 -198772 -180553 -118139 -192018 -292557 -303888 -467484 -324057 -16868 -195585
5238 -195585 -246443 -512431 -362497 19068 136934 -182184 -134736 -127085 -285841 19550
5228 19550 -48105 -137014 -23032 -347526 -209267 -226023 -119186 -137590 -443590 -422784 -507492
5217 -507492 -259655 -35616 -693 315020 131391 -207947 -16980 95409 -100336 125928
5207 125928 44283 -196713 114883 95751 4071 -201111 -269358 75487 -240400 -65771
5197 -65771 48383 -334675 -247405 -259889 -499265 -512896 -549458 -313825 -274206 -48267 -262931
5186 -262931 -158736 -56717 -248212 -413762 -641945 -596912 -336049 -88939 -173058 -213085
5176 -213085 -418826 -46628 -309773 141955 -233382 -267952 -352603 -282071 -105707 -333169
5166 -333169 -406887 -314717 -184501 -83973 -49359 -66416 -19866 -155666 -222491 -29442 -66984
5155 -66984 -180362 -122720 -207467 -240704 -290073 -26285 -272046 -309328 -277956 -213524 -16091
5144 -16091 67876 -96910 -25849 -201498 -214991 -219957 -235103 -191397 -111422 -110081 157027 187822
5132 187822 323568 -43744 -309611 104768 -172499 -248058 -283312 -44911 166959 -70387
5122 -70387 -133642 -234868 117638 -322685 -359783 -258034 -223973 197367 150857 -119573 -238337
5111 -238337 -330801 -194969 -29029 -126473 -329044 -364600 -399541 -260371 -156060 -108796 173396
5100 173396 49950 1368 -156127 -332258 -40932 53768 -25717 -52840 -66837 81575 -126531
5089 -126531 -224007 -503442 -144987 -291138 -326081 -100224 -185517 -291345 -237768 -72065
5079 -72065 -241905 -230008 285590 285512 -126612 -256175 -355792 -436743 -354919 -297812 -33849
5068 -33849 -158870 -239572 -227114 -390295 -374593 10066 -168002 54703 348955 -122151
5058 -122151 24458 41129 -228087 -154312 127571 21917 -170348 -290072 85647 -17840
5048 -17840 98634 163994 204690 29732 -117162 -446295 -357960 -334656 -231766 -247460 -161661
5037 -161661 -293644 -458248 -104138 -138564 9265 -220413 -249539 18614 -156404 -335287
5027 -335287 70678 -159921 -326687 -361005 -168057 -107433 -67946 -200427 -426553 -579136
5017 -579136 -312542 -337488 -406166 -101470 -115567 15880 -243006 -280727 -29412 136961
5007 136961 -13616 -430538 -212754 -225771 -165778 56236 148477 -118940 -24703 -142334
4997 -142334 -103149 -221185 -280446 -11236 155932 -236123 -576044 -270342 -61501 276151
4987 276151 256202 -204269 -306570 -136946 -31063 -13588 -167343 -236590 -406843 -112588
4977 -112588 138701 59744 25468 113506 -138213 58192 -50317 -198471 146845 -80799
4967 -80799 -266637 -233779 -105360 -28576 -191227 -267716 -57943 -10589 -117099 -32831 -166507
4956 -166507 141774 257667 -282341 -257281 -181628 -230096 -336144 15173 -155322 -94480
4946 -94480 -306201 -69746 -88181 -247456 39593 301581 360572 -8537 8204 -85265 17167
4935 17167 -117554 186904 40702 153879 -60434 -259207 92332 125763 -194568 -359281
4925 -359281 -438468 -34158 -345576 -56555 119729 -138301 -216366 -323088 -271485 -283438
4915 -283438 -214883 -165337 -35737 178343 147640 -29364 -285779 -227613 -53601 -221757
4905 -221757 -247906 -168171 26316 -71443 -122138 -17214 -53121 -313912 -188203 37418 -32534
4894 -32534 -170221 -133505 -122684 10154 -15178 63042 -171010 -222098 77280 55622 -148552
4883 -148552 -239234 -109015 -37734 168813 34683 151250 68466 96775 -39353 -112779 -240412
4872 -240412 -353342 -10737 -67894 -197824 -146873 -457416 -228271 -337439 -331312 -140518
4862 -140518 -251814 -145949 47130 -31785 3441 -136469 -330223 118089 166691 -17978
4852 -17978 -282863 137963 21129 94286 89865 -129187 -78907 -137468 -131622 325279 303681
4841 303681 139020 360411 293456 -88391 122458 -5630 37046 66850 345231 239283
4831 239283 -26256 41022 39318 -29915 154540 128793 102995 -11419 -2346 -269322 -301986
4820 -301986 -33431 -57064 143517 -146364 -55825 199466 156909 -121761 -76194 -164403 94110
4809 94110 14449 -14680 -307002 -533335 -378548 -259855 -72113 150556 164239 63518
4799 63518 26441 -69541 1544 -5186 42061 -101306 199055 453039 205308 177348 67267
4788 67267 344756 167037 -9191 318159 326432 215627 226033 -122987 145889 187525 -152025
4777 -152025 -107552 20766 -114671 -146620 -318698 -113446 41238 90576 -171987 -62511
4767 -62511 -62715 126509 219673 -27469 -3475 -235435 -42967 7006 236980 340170 142370
4756 142370 51887 112079 -148126 -204742 -439552 -94295 -240773 -281144 137713 282257
4746 282257 83324 124928 -121296 11833 -121689 -403167 -116372 65395 238949 191621
4736 191621 68906 296570 144200 13736 187962 173140 -174053 -15410 357654 196697
4726 196697 295901 281068 333909 201210 71245 -17928 175951 217465 233412 154008 242321
4715 242321 77977 368254 461272 310106 314437 172625 364957 186314 227487 286258 -55702
4704 -55702 274572 206896 5442 171641 423079 364928 279900 374673 155555 235752 374976
4693 374976 428535 194313 493258 551759 586821 505881 408277 379226 466799 558935 523078
4682 523078 713994 660356 673165 946581 1015111 1038696 819562 544447 290046 500454
4672 500454 656307 506081 547575 423061 779789 917943 658688 580529 563499 713219
4662 713219 947694 935437 1068924 1349443 1271710 1167783 1278230 1332178 1452343 1189574
4652 1189574 1113263 1255224 1007408 1170608 764850 743730 917379 596634 744933 975674
4642 975674 1088498 830142 819595 523419 616816 799078 786083 711045 911722 982812 702039
4631 702039 1016419 761590 682633 710361 673267 517202 599870 825871 422257 488193 670643
4620 670643 479400 354417 143597 302063 326666 25618 96128 -81780 87742 85891
4610 85891 6422 249730 514828 701658 622312 593718 375166 480161 569437 565995 742870
4599 742870 694880 479640 351376 217798 272944 456686 580562 571332 296124 221216 245735
4588 245735 264843 95441 12306 -149319 15958 189999 303378 280743 424296 28057
4578 28057 145329 476911 502946 251928 -31390 89595 147007 62668 90311 399868 758055
4567 758055 563275 446277 356596 223690 567819 368578 119065 306863 202420 522675
4557 522675 566087 453821 458193 635645 944394 643198 295703 593780 643345 690811 624609
4546 624609 476336 462230 449702 718352 438291 500180 397226 805892 809092 532883 857788
4535 857788 902652 882125 1086138 1124497 1122959 675066 549828 586281 521608 370176 539593
4524 539593 294462 561806 750546 565464 506242 348124 503131 576207 600070 532335
4514 532335 565868 533185 541713 505176 769415 904171 772925 880428 1084148 1225361 891115
4503 891115 897455 965559 1081809 992047 1093215 967478 843824 770455 476665 438325 582556
4492 582556 797945 803203 800346 727856 602595 962850 892298 622819 661631 621657 960696
4481 960696 941372 1027824 1047510 870461 869264 780578 676267 558940 615013 573155 762028
4470 762028 466023 110254 329613 742170 461792 667719 845765 576618 874106 659223
4460 659223 479741 511965 793707 645547 944540 746971 793144 1082279 916702 916772 859698
4449 859698 658563 305325 722884 1065619 639393 587486 682756 709473 575228 563691
4439 563691 547190 742949 819726 790608 632452 859774 1053372 950481 764858 517600
4429 517600 665083 742394 600591 446639 975643 770464 511109 473532 312432 412342
4419 412342 268026 399851 512907 269885 446929 589175 338073 366583 308799 156002
4409 156002 171290 439414 394627 573789 703879 348925 503454 548270 546946 479247 241186
4398 241186 690374 487797 307785 177479 164311 336278 439873 391794 275677 451039
4388 451039 404868 296898 320656 453700 475625 330621 306571 285131 298856 562335 423995
4377 423995 523869 833403 816290 375374 459216 407282 543059 734123 627214 612499 682298
4366 682298 711210 545185 602808 721535 835258 750304 1024452 1259157 1180628 1061426
4356 1061426 797753 1035070 800173 494633 909418 1168590 1201386 1081492 1130207 1238661
4346 1238661 1183906 1319709 1007180 1213962 1156373 1023154 1220073 1302725 1359571 1432397
4336 1432397 1510025 1684185 1739136 1477132 1659374 1717201 1782964 1544541 1818084 1803565
4326 1803565 1710839 2074926 2094774 2359900 2695884 2750815 2916418 3258357 3495748 3733342
4316 3733342 3732979 3800599 3888741 3598103 3556642 3403668 3280285 3057187 3062253 3510675 3547409
4305 3547409 3465897 3890445 4299272 4421607 4617346 5053317 5435529 5889381 6045967 6080590
4295 6080590 5907306 5514694 5150724 4708921 4338798 4236899 3697232 3380378 3450015 3335650
4285 3335650 3298330 3159999 3443951 3347421 3574016 3732066 3811811 4104219 4203659 4047243
4275 4047243 3880089 3918574 3322784 3085426 3006969 2851102 2658086 2541282 2426489 2607567
4265 2607567 2365437 1908823 1892040 1961561 2047520 1977299 1806348 1826398 1725952 1635915 1725292
4254 1725292 1672110 1937046 1786282 1736999 1769509 1725967 1916906 1963322 1896756 2043408 1573925
4243 1573925 1633927 1786551 1569997 1944325 1728200 1552473 1643786 1802151 1710646 1607060
4233 1607060 1695051 1611722 1542465 1627467 1798245 1590153 1520216 1826895 2125777 2045457 2058212
4222 2058212 1926599 1766608 1729105 1657728 1407497 1587744 2027770 1872336 1816935 1969075
4212 1969075 2086326 2186498 2171671 2253123 2036899 1946493 2038673 2235893 2381092 2295398
4202 2295398 2209134 2514312 2554524 2487659 2565817 2843251 3084802 3306689 3492465 3537273
4192 3537273 3668972 3485176 3446845 3292547 3405858 2899308 2787845 2962134 2504482 2716952
4182 2716952 2413649 2579788 2460683 2621658 2979925 3228684 3306092 2953516 2742171 2736089
4172 2736089 2757331 2505118 2777981 2647499 2466685 2439113 2545507 2445892 2641055 2830219
4162 2830219 3031127 3165312 3107074 3301452 3145071 3057006 3019850 2746038 2634476 2775825
4152 2775825 2849921 2742479 2940987 2881289 3083602 3001676 2777753 2986929 3085070 3165277
4142 3165277 3184137 3121788 3110360 3187163 3382334 3027306 3099939 3569156 3309775 3412347
4132 3412347 3951594 3780389 3759328 3966423 3638799 3886619 4227139 4284838 4229814 4371237
4122 4371237 4435595 4373636 4214412 4441729 4205821 4546749 4939648 4755044 4819672 5086127
4112 5086127 5241065 5287288 5988530 6040983 6438918 6833987 7444226 7873692 8378860 9259682
4102 9259682 10110560 10961888 11393364 11300706 11077158 10515784 10297506 9709713 9601325 9254329
4092 9254329 9124404 9441554 9496981 9920709 10296552 11134733 11744284 12600231 13492956 14841510
4082 14841510 15833322 17387891 18705832 18687718 18146550 17174187 15825201 14894995 14295370
4073 14295370 13588022 13026381 13089364 13464072 13499328 13703467 14411824 15096788 16065679 16476084
4063 16476084 17114723 17801912 18123968 18613545 19066834 19036062 18935898 18600727 18328220 18130631
4053 18130631 17694958 17867347 18383985 18712908 19335520 20124600 20955737 22303363 23281808
4044 23281808 24292926 25018667 25634353 26136131 27045473 28194173 29588700 31181924 33396566
4035 33396566 35572676 38475277 41826223 45612582 49790288 54237930 58268279 60411351
4027 60411351 61382652 60679165 59108267 57345492 55732019 54881603 54235653 54518039 55560382
4018 55560382 56989263 59674734 63294173 67738425 73344511 79463019 86776450 95041877
4010 95041877 102238307 107640414 109368195 106386395 99934154 92457973 85672473 80047568
4002 80047568 76089811 73306516 71134632 69366922 67938918 66772800 66490090 66843233
3994 66843233 68175736 70323440 73096034 75701197 77848691 78302679 76629626 73233229
3986 73233229 69617026 66253154 63476607 61424855 59713907 57774779 55016537 51195529
3978 51195529 47609939 43987066 40432770 37684285 35778321 34142705 32578623 31656089
3970 31656089 30311563 29396627 28464518 28143683 28240048 28330861 28556423 28516732 27732999 27382132
3960 27382132 26189365 24366912 22662864 21433267 19947443 18553396 17782533 16952265
3952 16952265 16175222 15463397 14837747 14451048 13785885 13294880 12789003 12560087 12043310
3943 12043310 11921138 11658697 11754206 11461852 11236836 11051885 10387371 10053611 9805597 9579208
3933 9579208 9395533 8876279 8546779 8463206 8414933 8330004 8289732 8151485 7958635 7913657
3923 7913657 7891527 7937872 8223368 8129909 7964515 7709028 7866546 7625423 7226533 6844097
3913 6844097 6507265 6501372 6381795 6526810 6406618 6179363 6152789 5928730 6010601 6041034
3903 6041034 5961027 6215891 6154564 6254244 6069899 6020104 5759028 5705999 5659157 5589071 5821346
3892 5821346 6009325 5674685 6126783 6076984 5876520 6172059 6411108 6056429 6010954 5976159
3882 5976159 5977753 6099053 6029270 6404553 6842475 7016905 7494428 7824145 8278136 8543521
3872 8543521 9160512 9694680 10444827 10691222 10531434 10456420 10086394 9690720 9693106 9404329
3862 9404329 9399719 9157199 9446938 9914040 10286217 10840116 11253269 12039462 12831577 13512072
3852 13512072 14442561 14934951 15039248 14712554 13911189 13423805 12483430 11540930 11003379
3843 11003379 10975216 10574311 10455046 10307041 10711146 11176035 11370749 11930952 12770356 13358950
3833 13358950 13747507 14160117 13792404 13436330 12857081 12182423 11227747 10301882 9667721
3824 9667721 9315050 9267845 9114941 9038229 8949177 9261197 9474026 9802587 10599243 11453163
3814 11453163 11707293 12167416 11833018 11595425 10650480 9753566 9159881 8463954 8077668
3805 8077668 7669323 7455815 7229403 6810361 6419668 6656650 6726017 6683988 6794333 7179259
3795 7179259 7552040 7710788 7363070 7120610 6878169 6486880 6155114 5586534 5500703 5222952
3785 5222952 4744113 4718869 4306969 4113817 4110655 4253395 4021951 4151221 4303940 4049750
3775 4049750 3775491 3583485 3891071 4037558 4068502 3999050 4264321 4124009 3949117 3640103
3765 3640103 3684589 3787712 3620823 3751067 3679340 3569928 3596372 3806365 3661393 3742126
3755 3742126 3858063 3733115 3770356 3641602 3656892 3661679 3876654 3586680 3800300 3706438
3745 3706438 3178879 3482250 3540213 3486857 3143966 3320555 3439370 3499534 3396727 3479059
3735 3479059 3471393 3858463 3851970 3597284 3609175 3795813 3662227 3730716 3619444 3763924 4134095
3724 4134095 4331714 4056587 4183528 4423612 4318692 4665720 4498601 4759741 4922441 5226917
3714 5226917 5117387 5013450 4994696 5372946 5473124 5788024 5530302 5753540 5942556 6206382
3704 6206382 6228237 6249681 6579692 6883442 7250335 7804429 8114749 8429436 9124856 9469450
3694 9469450 9843303 10088479 10189025 10257899 10269323 10435281 10533291 10846553 11037159 11050470
3684 11050470 11280063 11726022 12442595 12855980 13421284 14252953 15151181 16298741 17748073
3675 17748073 18989804 20239197 21458017 21990076 21748229 21571480 21343708 21055077 20554582
3666 20554582 20233574 20109461 20399376 20723775 21552205 22464774 23445980 24902693 26327886
3657 26327886 27725412 29445793 31325132 33223366 35234218 37505205 38903531 39556606
3649 39556606 39788477 39287278 39271617 39666650 40468623 42122541 44450247 47259997 50837734
3640 50837734 54841268 59553310 65259104 71189538 76996765 80817236 81538579 79971377
3632 79971377 76626421 73224217 70304878 67765713 65960342 64762927 64913572 66085836
3624 66085836 68017413 70893842 74936828 79914204 86074519 94330411 104524131 114275662
3616 114275662 119875931 119775536 113563287 104751520 95652436 87289529 80180924 74568018
3608 74568018 70178601 66665001 64404957 62851143 62182746 62187537 63036205 64110083 66364242
3599 66364242 69056745 72759951 75138017 75845086 74591967 71311743 67501409 63461310
3591 63461310 59188272 54942240 51086636 47218373 44164313 41897833 39897398 38155219
3583 38155219 37350294 36400900 35886270 35545990 35407643 35147492 34530418 33550711 32181221
3574 32181221 31406689 30545436 29268095 28477276 27513397 26224535 25715411 25010795 24485412
3565 24485412 24128209 23904775 23622055 23250686 22966236 22897799 22643670 21718679 21260049 20814883
3555 20814883 20629786 20184118 20152603 20407147 20586022 20556457 20828041 20918969 20731091 20387498
3545 20387498 20018125 19910450 19470738 18919004 18447814 18049611 18176481 18201216 18383905 18502744
3535 18502744 18790100 19281990 19892458 20839204 22080962 23087566 23192907 22483562 21683279
3526 21683279 20795307 19970750 19059605 18161884 17860968 17703688 17740076 17511850 17546479 17307511
3516 17307511 17227362 17141727 17306501 17397232 18031551 18687638 18942645 19314684 19428857 19022488
3506 19022488 18849291 18499354 18214739 18208575 18170299 18089333 17922088 18168961 18430272 18779679
3496 18779679 19283513 19143181 19647648 19630787 19457421 19476743 19779883 19751231 19740074 19959432
3486 19959432 19932278 20286893 20069178 20176936 20871118 21302970 21890929 22346787 22329259 22099567
3476 22099567 22145673 21763969 21297074 20661509 20719271 20715830 20869719 21103594 21752105 21875104
3466 21875104 21760672 22322227 22141627 22584757 23056780 23486713 24106920 24787129 24891413
3457 24891413 24795357 24608801 25237805 25306777 25541068 26376320 27290534 27985326 28724016 29208887
3447 29208887 29978055 30976000 31579045 32569566 33658977 34969359 36659688 38031832 39808843
3438 39808843 40994925 41479897 41525896 42171087 43213049 44539607 45831222 47190363 49182572
3429 49182572 51059980 53109437 56245793 59058336 61264897 63073923 65254140 67475152
3421 67475152 69874797 72126972 74975846 77056561 78694999 80026725 81611763 83947613
3413 83947613 86881329 90956069 95721845 101183170 106792776 111597525 116016507 119686851
3405 119686851 123234700 126434111 130250306 134453086 139315060 144147977 149564788 156149919
3397 156149919 164554256 174571991 187781383 199669995 204438567 203652835 200517864 199379929
3389 199379929 200285134 202769754 204032713 204957028 205392164 205942650 207954399 212602411 219385096
3380 219385096 227645353 236565359 246012958 256289403 266967957 275751012 281562701 285183714
3372 285183714 287589906 288159522 288052641 290530086 295065805 291912472 278953976 259434869
3364 259434869 239964774 222699740 207848336 196489629 187849326 181366501 177190585
3357 177190585 173505816 170494593 167482590 163579675 158639306 152893997 147423695 142516010
3349 142516010 138285992 134697532 131453757 128305216 125107874 122195422 119466086 117177461
3341 117177461 116164654 116179447 117831083 120460982 122428972 123242922 120843436 116039109
3333 116039109 108978187 101239985 93620516 86992968 81938665 77506891 74064001 71054124
3325 71054124 68343621 66110842 64989398 63934014 63575365 64060684 65257172 66486646
3317 66486646 66214686 63461086 59140443 54259870 49599416 45336612 41730949 38557587
3309 38557587 36107090 34369416 32971016 31616866 30432324 29619632 28862398 28434412 28050347
3300 28050347 27353081 27205902 27087044 27139133 27076628 26856294 26471874 26393288 26706689 27037034
3290 27037034 27257904 27260351 26983680 26559665 26589081 26646435 26820605 26964559 26431606 27052955
3280 27052955 27702739 28040526 28992415 30196319 32092796 33060309 33639749 34239079 33966132
3271 33966132 34115217 34908122 35740957 37090090 39385904 41193529 43082496 44047868 44913857
3262 44913857 45362110 45743139 45620008 45665234 45765417 45499542 44612910 43934727 42694535
3253 42694535 41224850 39562919 37847680 36726316 35675096 34714241 34309840 34541914 34750944
3244 34750944 35775900 37109476 38741461 39992787 40316902 39539768 38023553 35817089
3236 35817089 33540626 32080407 30695959 29699493 29352517 28936764 28847920 29942305 31178829
3227 31178829 31571873 30922984 29009249 26769815 24322618 22566242 21217797 20736767 20083412
3218 20083412 19491694 18995893 18072804 16925235 16047833 15110325 14143537 13489107 12695677
3209 12695677 12042718 11982970 11562439 11277632 10761653 10347487 9966711 9461144 9109988 8558866
3199 8558866 8158330 8083610 7410173 7095936 6995196 6812441 6961882 6853585 7014343 6872721
3189 6872721 6875874 7077884 7151610 7197990 7779398 7743866 7794658 8002441 7983004 7671436 7670657
3178 7670657 7380757 7140342 7232530 6679872 6414432 6128518 6102416 6072964 5654545 5483434
3168 5483434 5278325 5344463 4974803 4968406 5130821 5072390 5000556 5214324 5373359 5488245
3158 5488245 5636612 6110787 6278575 6045765 6139168 5839961 5494270 5418413 4955452 4869613
3148 4869613 4869754 4563752 4831659 4487417 4309635 4369677 3761274 3768313 3821693 3579257 3785000
3137 3785000 3861388 4100543 3816313 3999558 3585126 3869517 3965986 4041711 3899776 3765957
3127 3765957 3639232 3477822 3734728 3805822 3469043 3089271 3014785 2998312 3079347 3372431
3117 3372431 3259790 3072795 2969639 2904386 2893451 2830569 2718066 3067135 3079050 2772132
3107 2772132 2629955 2603555 2376116 2617164 2511406 2504267 2755237 2568479 3064547 3364947
3097 3364947 3163015 2898088 2730930 2474468 2686488 2671595 2213314 2086307 2331251 2233790
3087 2233790 2149797 2195491 2106246 2064472 2380995 2659132 2334741 2154717 2483107 2463473
3077 2463473 2557917 2542073 2664980 2660248 2709049 2462372 2378146 2144997 2460515 2390541 2218324
3066 2218324 2114429 2117527 1913093 2240844 2173438 1997605 2056744 1934014 1999021 2019050 2000640
3055 2000640 2325845 2183411 2171594 2223946 1867352 2075214 2385997 2416492 2146507 1959275
3045 1959275 1863890 1935648 2096744 2116321 1952033 2018555 1946166 2102254 2015501 1896954 1776271
3034 1776271 2011187 2095599 1887082 1878539 1992390 1956677 1994870 1718925 1643425 1658352 1662438
3023 1662438 1654171 1646642 1780245 1994742 2000670 1907813 1740816 1989408 2008547 1733377 2029911
3012 2029911 1860715 1783533 1670149 1915754 2062119 2188295 2082217 1829223 1765401 1653754
3002 1653754 1760488 2013720 1793442 1930302 2040732 1943636 2221161 2288675 2192721 2137911
2992 2137911 2162998 2259932 2238181 2236101 2466175 2475568 2400321 2476411 2566937 2570626 2662027 2809480
2980 2809480 2890251 3045674 3237841 3141719 3338840 3645777 3863375 4049293 4184509 4619652
2970 4619652 5191094 5266168 5670337 6247147 6588594 6640065 6972548 7165988 7819616 7756334
2960 7756334 7746614 7980852 8583397 9238521 9663620 10638836 11440265 12290427 12775194 13323403
2950 13323403 14707625 16827847 19205987 23566409 28885444 32233928 32515747 29406906
2942 29406906 25036107 20518017 16781968 13675338 11449765 10032669 9004649 7795736
2934 7795736 7048766 6601534 6123128 5983502 5442302 5535217 5151987 5131532 4542380 4576274
2924 4576274 4634433 4116573 4072686 3986292 4128211 4056686 3992305 4140060 4225520 4382682 4150536
2913 4150536 4061958 4146872 3783637 3805026 4077540 3758372 3748071 3668829 3751579 3886545 4032962
2902 4032962 3685068 3684370 3829394 4043234 3989610 4218529 4443007 4252838 4422788 4207945
2892 4207945 4379695 4551634 4948036 4920676 5411564 5110019 5066863 5232895 5275184 5577247
2882 5577247 5774457 5744797 6051869 5890767 6034853 6482636 6585711 6903101 7295604 7367853
2872 7367853 7703884 7955435 8221864 8749908 9020920 9421728 9665071 10255348 11171219 11788177
2862 11788177 12650857 13624533 14548906 15810258 17050622 17885001 18530992 18912122 19169124
2853 19169124 19720850 19965604 20877922 21121557 21456464 21695234 22431512 23120286 24118930
2844 24118930 25542188 26956173 29046647 30934864 32668642 34372901 35757133 36703894
2836 36703894 37518973 38643417 40002117 41706737 44306574 47671822 51229721 55582497
2828 55582497 59765072 62338834 62674952 61021215 58612782 56379115 55003621 53964086
2820 53964086 52948969 52541847 52106663 52185818 52549050 53569955 55644677 58583930 63136950
2811 63136950 68028445 72562810 75534892 75167475 72137889 66783024 60947599 55621327
2803 55621327 50956676 47605222 44481046 42251674 40539986 38830758 37290751 36667723
2795 36667723 36834233 37485090 38933380 40665773 41303574 41245845 39152057 35713733 31745885
2786 31745885 28025965 24729943 22217482 19929291 17821552 16516077 15333218 14060926
2778 14060926 13144213 12610157 11616594 10967939 10808276 10269441 9522579 9609832 9113782 8957689
2768 8957689 8795875 8236885 7958786 7846052 7717294 7549384 7576982 7119131 7112376 7085279
2758 7085279 7076354 6895723 6610569 6498865 6320061 6229457 6156561 6160517 6229868 6099399 6098312
2747 6098312 6524165 6423897 6534376 6384666 6348805 6738600 6624655 6567428 6693920 6642797
2737 6642797 6481759 6654357 6492292 6847640 7003012 7271351 7742060 7827508 7958780 8201150
2727 8201150 8329009 8146288 8201975 7879940 7813344 7686213 7828510 7573684 7361300 7403351
2717 7403351 7426695 7642413 7743488 8284506 8545243 8707265 8725151 8492116 8379784 8288283
2707 8288283 7987913 7541514 7116752 6766621 6433953 6499575 6272769 5930937 6415805 6421392
2697 6421392 6167644 6114401 6260502 6209368 6156220 5874887 5721132 5481804 4856799 4644466
2687 4644466 4576115 4242576 3734361 3888302 3590760 3444965 3602665 3452570 3486054 3293463
2677 3293463 3005204 2967855 3158996 3045068 3092990 2989091 3156736 2816300 2674987 2491412
2667 2491412 2748552 2811691 2820814 3110983 2591968 2598609 2307154 2316827 2464335 2441241 2085594
2656 2085594 2160200 2289442 2218928 2275772 2465199 2525295 2945950 2665082 2378956 2431205
2646 2431205 2769433 2659396 2595443 2694845 2567292 2180809 2199374 2469055 2568700 2853740
2636 2853740 2733258 2832455 2779675 2595703 2714397 2877901 2893317 2750171 2722705 2643627
2626 2643627 3062807 3127726 2904287 2819637 2756512 2927012 2539201 2859556 3052924 3279549
2616 3279549 2882216 2965459 2818273 2799114 3144215 3220391 3222495 3319835 3290266 3420807 3286698
2605 3286698 3311677 2989095 3250992 3447231 3262785 2960572 3188559 3316852 3288458 3235000
2595 3235000 3411618 3418953 3173829 3376248 3228619 3143657 2923145 3138915 3361302 3339238
2585 3339238 3439734 3329637 3419722 3457303 3142545 3590289 3735648 3408190 3347656 3491902
2575 3491902 3526943 3504010 3172285 3431293 3136146 3261776 3405207 3278594 3313996 3719514
2565 3719514 3534200 3599153 3699700 3539747 3599582 3428931 3571276 3765162 3789037 3721043
2555 3721043 3705197 3753971 3495334 3722027 3662342 3503492 3660242 3820688 3836617 3765023
2545 3765023 3928735 3909344 3799476 3876673 3976442 4064625 4077549 4371277 3933110 4092238
2535 4092238 4257391 4252837 4642613 4574322 4706366 4806293 5205601 5021640 4951695 5221898
2525 5221898 5284490 5649744 5642064 5697585 6025791 6115413 6393519 6425116 6527903 6846242 7155926
2514 7155926 7449795 7633176 8130886 8487525 8762609 9168707 9671525 10325370 11067385 12279707
2504 12279707 13575390 15454253 16920867 16628899 16335041 15905369 15123421 15028473 15222646
2495 15222646 16082532 16285624 16881178 17726466 18541321 19506941 20447386 21093454 21950666
2486 21950666 23035227 23965244 25149151 25831787 27195610 28758413 30006239 31462108
2478 31462108 33110045 33951990 34517460 35260460 35755046 36108453 36645332 37574345 38389329
2469 38389329 39621545 40814245 41527804 41776913 41357314 40303237 39519259 38401288 37292238
2460 37292238 36617860 36234989 35794548 35481884 34749725 33896619 32461295 31124494 29343119
2451 29343119 27774242 26575482 25594155 24638579 23911247 23230775 22147544 20849134 19617165
2442 19617165 18327036 17208070 16841355 15681357 14807141 13922499 13670546 13084988 12555237
2433 12555237 12182595 11483089 11172406 10955723 10620366 10249191 9542759 9525017 9633995 9673700
2423 9673700 9752377 9741512 9671576 9532738 9661822 9457365 9151078 8926028 9116590 9034313
2413 9034313 8949308 8612479 8492697 8668464 8530395 8818433 8995954 8502844 8132795 7895520
2403 7895520 7820531 7808500 8157742 8218670 7834948 7555376 7520722 7698497 7607619 7299903
2393 7299903 7062023 7337253 7350775 6745942 6771750 6616497 6574467 6518581 6392221 6381751
2383 6381751 6182325 6299705 5939754 6169040 5839579 5711585 5662067 5803286 5961061 5632234
2373 5632234 5665942 5878340 5428244 5703609 5637539 5605446 5418529 5432064 5452974 5541713 5699398
2362 5699398 5388208 5329860 5355906 5240659 5478052 5584782 5526657 5385018 5457898 5551962
2352 5551962 5558353 5715627 5441812 5380847 5601790 5452643 5170941 5457436 5321015 5557859
2342 5557859 5409623 5674703 5707540 5592931 5595669 5783458 5942711 5920092 6169718 5995955
2332 5995955 5894661 5909456 6134571 6274592 6314518 6510464 6401896 6731981 6631362 6591281
2322 6591281 6599339 6727939 6396755 6131497 6623807 6425116 6481355 6639964 6806742 6549628
2312 6549628 6478351 6905364 6825512 6823115 6544330 6718780 6751907 6893981 6973222 6769173 6940640
2301 6940640 6889666 6980203 7116474 7092487 7055509 7238907 7425226 7546357 7671651 7640923
2291 7640923 7634310 7766074 7497051 7686420 7669813 7925308 7839315 8002232 8289919 8328051
2281 8328051 8251367 8282932 8519973 8278519 8256427 8102281 8062429 7981294 8225749 8154297 8284920
2270 8284920 8199515 8200282 8235553 8154923 8131038 8203896 8184536 8378130 8356402 8346419 8183805 8250120
2258 8250120 8326699 8321322 8322526 8348403 8441104 8541116 8602894 8535976 8778408 8553533 8379930
2247 8379930 8953652 8957758 8603883 9011243 8869157 8868439 8828598 8712041 8986194 8881755 9101763
2236 9101763 9246543 9337732 9251465 9219165 9609106 9704093 9773989 9294728 9391794 9838737 9885673
2225 9885673 9821012 9949893 9876983 9937210 10345620 10271218 10281111 10257182 10392145 10273964 10469913
2214 10469913 10892067 10814172 10902425 11189884 11084763 10685285 10883486 11074489 10709011 10757232
2204 10757232 11067779 10957592 11020408 10830587 10977388 11146556 11338587 11424161 11229624 11258989
2194 11258989 10862362 11043871 11069810 11236048 11367303 11233446 11158349 11448749 11332135 11326138
2184 11326138 11597191 11573419 11583565 11511733 11580013 11871602 12230804 11883842 11950865 12070885
2174 12070885 12365637 12273261 12214514 12058960 12162267 12141311 12510552 12517414 12740156 12994685
2164 12994685 13016578 12967660 13456220 13459661 13500989 13396572 13486433 13800836 13509602 13332249
2154 13332249 13480760 13893819 14104024 14265038 14583750 14449211 14646813 14830295 14822055 15065488
2144 15065488 15139361 15482247 15421330 15199164 14914602 14731556 14741584 14473578 14211608 14107136
2134 14107136 14125688 14133869 13860230 14108345 14036185 14183751 14098025 14236737 14121868 14346706
2124 14346706 14251564 14128344 14243053 14095182 14470756 14415768 14463265 14635463 14822636 14888844
2114 14888844 14975021 15021859 14928780 14966010 15046038 15253804 15129424 15319484 15323981 15575686 15771526
2103 15771526 15730025 16023374 16105384 16166409 15902347 15906227 15840738 15690262 15558499 15509601 15495337
2092 15495337 15291315 15437976 15422664 15198435 14820449 14887693 15098305 14821471 14876576 14820354
2082 14820354 14784950 14714679 14612420 14867802 14622715 14940041 15206267 15179158 15004023 15286585
2072 15286585 15333087 15215408 15193190 15111669 14798517 15127062 14792976 15025842 15277785 15517613
2062 15517613 15361520 15310436 15229376 15204136 15304376 15452495 15516637 15589018 15831719 15883582
2052 15883582 15713940 15923509 16059266 15497337 15594528 15789210 16201887 16171360 16257975 16293224
2042 16293224 16176544 16456999 16774534 16827437 17206708 17556098 17609002 17932280 18514422 18700057
2032 18700057 19129383 19506843 20353381 20581115 21418595 22362334 22596564 23282727 24742846
2023 24742846 25590006 26832368 27739164 28368184 29478002 31168177 32526280 33747039 35142609
2014 35142609 36628928 38309309 39947404 41949964 44358365 46474838 48974532 51946603
2006 51946603 55326497 58501526 61968680 66129573 70367986 74940447 79460290 84783338
1998 84783338 90528204 95702359 100706006 104513777 106651698 107851131 107771796 106447136
1990 106447136 104548922 102834138 101297864 100478141 99938339 99137237 97515857 94752839
1982 94752839 90894979 86007145 80621710 74573136 68601611 63355526 57799392 53284599
1974 53284599 49308941 45759217 43308036 40837854 38656055 37162721 36106054 34788080
1966 34788080 33653457 33149620 32272288 31672102 31429484 31238626 30990029 31026051 30951414 30957089
1956 30957089 30706220 30706446 30948498 31001694 30970389 31252733 31565261 31704480 32153041 32380962
1946 32380962 32712431 33012532 33378703 34011858 34656513 35170361 35564153 36356319 37079825
1937 37079825 37356063 37959968 38768908 40026839 40794042 41766122 42852940 43828915 45458638
1928 45458638 46884148 48406783 49979927 51578109 53430117 55582170 57512331 59542835
1920 59542835 61979884 64379315 67157246 70203333 73463766 76836171 80806685 85324155
1912 85324155 90122988 95406296 101153288 107873223 115418718 124379270 134342125 145682858
1904 145682858 159072003 173438882 188223714 201954204 214051540 223635402 229705687
1897 229705687 232549864 233256704 232388968 231709490 231575055 232201408 233332112 234699620 234931040
1888 234931040 233516306 230262689 223960746 215481550 205976595 195788685 186029354 178084889
1880 178084889 170607899 164116167 158382594 153810003 150177193 147590300 146409341 146689194
1872 146689194 148032115 149373802 150837174 152792169 155325645 158548608 162320527 167278942
1864 167278942 173187239 180089007 187690752 195355150 203216964 210435622 217148563 222598175
1856 222598175 227195550 230267701 230714708 230136846 228354701 225566624 223421912 221887586
1848 221887586 220479881 217806645 212993894 206404709 197817424 187529041 176179994 164591077
1840 164591077 153294725 141977938 131661375 121892251 112712084 104882129 98629270 92849120
1832 92849120 87799054 83401219 80238917 77510751 75406917 73993413 73231033 73452626
1824 73452626 74376793 74943479 75270529 75556713 75276315 75434371 75317783 75157332 76273673
1815 76273673 78271578 80932573 84526928 89946835 97181211 107787174 115594523 113657068
1807 113657068 105792712 96388967 89567014 84375399 80640455 77917689 75736489 73940898
1799 73940898 72705470 71546551 71193634 71022233 71531609 72457340 75108268 79015730 85085034
1790 85085034 93227458 104266406 110549663 107768851 100024606 92972920 88123982 85475842
1782 85475842 84790532 85488931 87396187 90095184 93397864 96700999 100384274 103973647
1774 103973647 107269601 110037988 112257657 112978246 112692056 111639444 110473636 108906596
1766 108906596 107656768 105710213 103398523 100379256 96789165 92039948 86921374 80913610
1758 80913610 75174732 69473931 64104042 59093992 54702225 51317402 47949332 44904678
1750 44904678 42436976 40007810 38059450 36178348 34708222 33588310 32900080 31745533
1742 31745533 30765980 30404828 30143983 29598764 29223952 29388833 29133969 28657184 28751237 28453017
1732 28453017 28243400 27516786 26957854 26994187 26904620 26820906 26174910 26185990 26338017 25942003
1722 25942003 25902803 26239480 25676358 25071881 24630666 24166336 23312614 22220373 21525905
1713 21525905 20469918 19603241 19075180 18275492 17907149 17631448 17043866 16922814 16820884
1704 16820884 16544002 16472377 16312359 16339669 16190879 16093656 16368032 16603072 16589019 16982496
1694 16982496 17107956 17218907 17572415 18157893 18433058 18763959 18926721 18730184 18503857
1685 18503857 18742312 18456589 18794887 19012903 19051118 19482998 19255952 19533274 19695760 19762643
1675 19762643 20049163 20216715 20258799 20728394 21121593 21142028 21120413 21397816 21915633 22825653
1665 22825653 23533086 23872563 23964672 23742039 23267592 23363600 23455576 24017347 24519872 24837493
1655 24837493 24781805 24553888 24771253 25222847 24970811 25777992 26494340 26882481 27344755 27634437
1645 27634437 28509872 29458630 30115129 31229445 32365511 33325184 34672060 35901072 37234157
1636 37234157 38662878 40154938 41385177 42501101 43561627 45039322 46571128 48059918
1628 48059918 49450724 51069820 52761426 54631142 56285476 58377688 60703407 63864338
1620 63864338 67224420 71674919 75964194 80276214 84475243 87264113 89732008 92053193
1612 92053193 95054912 98642945 102245090 106434889 111748730 117252763 123688574 131305632
1604 131305632 140093655 150007087 161259386 174295195 188791657 205081567 223631407
1597 223631407 246041013 275249206 313217482 362435750 423180873 484871485 523461475
1590 523461475 524488802 492263270 442029440 387226704 334670517 289188929 250369584
1583 250369584 218193377 191438234 169606971 151015198 135934664 123423701 113424544
1576 113424544 105090986 98111591 92622276 88152714 84600143 81858415 80231645 79053995
1568 79053995 78736195 79645279 81590380 83724903 83892304 81193267 76050426 69681605 63774776
1559 63774776 58230076 53640574 49899358 46304554 43330912 40969641 38398099 36273374
1551 36273374 34556186 33193214 32115184 31366350 30368372 29230328 27624024 25916229
1543 25916229 24098339 22371913 21041167 19696566 18794932 17818944 17101721 16205803 15489434
1534 15489434 14888773 14155003 13781750 13036255 12525959 11886594 11565659 10927937 10479507
1525 10479507 10415733 10200458 9708473 9144058 9098967 8861172 8847712 8631862 8299728 8011076
1515 8011076 8166313 7832729 7292182 7013837 6952075 6740020 6526233 6130810 5999563 5572368
1505 5572368 5627610 5726194 5264526 5010469 4875390 4832017 4787480 4530743 4618292 4676670 4491377
1494 4491377 4467802 4217204 4254761 3884742 3837319 3571177 3673650 3431140 3386829 3355894
1484 3355894 3626700 3475148 3305789 3400005 3100096 3277319 3090425 2823684 3036187 3014877
1474 3014877 3164025 2911658 2630274 2738998 2512300 2687676 2608551 2452167 2367441 2410022
1464 2410022 2692225 2205793 2167403 2054833 2437994 2226033 2122739 2014030 2097818 1917072
1454 1917072 1548049 1771144 1672024 1799864 1819180 1949412 1776344 1807483 1509140 1344851
1444 1344851 1310656 1419964 1394148 1354700 1549294 1320178 1173759 1416943 1469792 1429489
1434 1429489 1329315 1309883 1194893 1364686 1449449 1364815 1010141 885972 928037 1016266
1424 1016266 1135846 1136526 1119224 1286156 1114048 728446 1110409 1270607 1129509 1068892
1414 1068892 1279839 1106769 1163218 1202286 1118091 695494 915007 1185491 958843 1144740
1404 1144740 1283470 1257746 963360 1186206 1394991 1107215 1249081 1457448 1566138 1652929
1394 1652929 1508255 1539542 1614838 1569340 1352960 1272735 1477561 1613634 1344529 1814002
1384 1814002 1688127 1989317 2222376 2446208 2871876 3128775 3111543 2878725 2521409 2062602
1374 2062602 2109733 2092878 1826381 1515883 1590319 1423662 1107213 833103 832340 977022 895175
1363 895175 772292 670986 563387 552271 407206 473994 598403 836313 941465 709155
1353 709155 531075 658473 639709 552067 173826 219513 181290 -25437 306600 306529 326063
1342 326063 381909 135291 109451 414781 467460 491628 649451 323426 238457 5966 214127
1331 214127 218185 218750 -3516 -153221 136144 373147 247299 4897 72416 142431 227287
1320 227287 33249 83668 -101217 -4545 -136320 40442 66387 79637 -188038 128393
1310 128393 -118353 -237604 -235735 -313078 -160864 -51893 -21052 -115882 -118282 -41383 -108871
1299 -108871 -51687 113082 236745 -2589 -471331 -244242 -197374 -28626 -65864 -193771
1289 -193771 206536 331209 172970 28273 7315 25362 -53258 91310 269852 -51533
1279 -51533 44935 -293636 -239419 98719 -225127 -171977 -101309 -41263 38628 177515 10939
1268 10939 -136512 -185181 -67489 160399 -221360 -112538 -67867 -181462 -233930 -301918 -238323
1257 -238323 69145 223212 -19415 80979 99422 -82762 -49725 -23253 -300942 3126
1247 3126 -39955 -180162 -151087 -11965 151717 96654 100755 -128280 -258425 -107443 -151310
1236 -151310 -322484 -305046 70909 -137678 -120345 -305355 1889 190367 398657 426223
1226 426223 87408 -383316 -335413 -224634 -160479 -232910 15348 262150 -67492 -248377
1216 -248377 -74009 22549 -89334 -173854 -25160 194934 85690 36925 -160728 -288381
1206 -288381 31019 137722 55685 -15416 22050 -30808 192854 123264 -2363 -74510 -221674
1195 -221674 -447245 -338673 78584 -292320 -326712 -317604 -59141 -11842 -36734 -79626 -221640
1184 -221640 70561 83647 135994 -79439 -220046 -233292 -293385 -174014 -49869 -147188 -222953
1173 -222953 -203213 -288867 -116377 295344 173721 -20309 87714 136669 145062 85325 256867
1162 256867 87197 -89879 123474 303615 218424 8354 -101982 -8148 -22892 -13875 -111345
1151 -111345 -38946 950 42772 69037 127695 193057 9102 40823 -257717 -435623 -373405
1140 -373405 -209701 -21123 -265413 -62145 85030 18071 -70502 316462 56867 33924
1130 33924 -165135 96494 -44690 -93292 -65085 324062 241748 239164 372719 1499 274625
1119 274625 95244 -168615 -168283 -695 154732 190225 105497 270438 47566 -56654 236940
1108 236940 155545 56928 206035 149669 234098 296267 288495 42692 39912 309835 124374
1097 124374 21164 372303 381128 328967 527355 540457 587756 433721 709908 671225 388728
1086 388728 532811 769170 729689 764617 891229 886083 805751 935915 940082 876211 1243505
1075 1243505 1152538 1313242 1573739 1642488 1550933 1347530 1558922 1950928 2339483 2432308
1065 2432308 2374074 2606687 2990307 2907919 3127603 3466782 3912782 4583856 4810174 5351598
1055 5351598 6070134 7065084 7489110 7522503 7530093 7562626 8015988 8254095 8674343 9372507
1045 9372507 9864006 10598941 11858397 13182048 14342721 15661842 16800391 18004943 18952548
1036 18952548 20980935 23462095 27304520 32463224 39746223 51112794 68858690 76284051
1028 76284051 69103986 54906093 42264964 33878941 27204866 22496953 18795922 16266317
1020 16266317 14007078 12778362 11593087 10622354 9235499 8126467 7255768 6867159 5863335
1011 5863335 5381076 4868878 4620166 4229072 4193277 3863371 3575135 3345849 3060991 3082541
1001 3082541 2857003 2104198 2282242 2256665 1992471 2020824 1857422 1628116 1635639 1382663
991 1382663 1710732 1347615 1326835 965902 1182170 1246542 1107521 1186707 793489 823968
981 823968 731101 614212 682991 546504 541728 746960 429367 454959 516815 266390 222354
970 222354 64266 88545 21722 315219 318944 232195 207467 194053 235427 195541 129372 136382
958 136382 400248 265529 350026 521777 -2492 64648 225478 182082 326539 680272
948 680272 510402 192994 380476 -134241 -111583 254211 366156 108334 333657 394746
938 394746 198505 137647 258699 200084 119971 363539 217946 -94708 -209203 -207200 -202286
927 -202286 -121226 119551 -39849 167812 59954 91447 121518 36685 -40676 -119988 -190345
916 -190345 -20129 -191515 -98550 -188222 -218692 -106547 137257 176538 98782 39988 54860
905 54860 -47713 87470 32318 456583 295243 174497 -167597 -156323 45078 -26336 -61370
894 -61370 -23669 -67290 48875 158973 35383 -316336 -230047 -382547 -348349 -7438 203731
883 203731 121505 127 67188 -94093 147850 -136163 -215462 -419205 -302814 -40066
873 -40066 -105450 -104770 -144471 -236858 -217940 -263738 -267908 -12669 53521 201493 56441 -255555
861 -255555 -227895 -18532 -112657 -320049 -229682 -479747 -142280 -310948 -336354 -281493 64273
850 64273 122258 -169562 -133024 -51888 -261998 -426591 -375772 -513973 -335659 -53917 -86605
839 -86605 -136214 -335591 -133688 -24031 -206972 -121263 208039 13927 50620 -47331 24898
828 24898 -3995 57945 167205 49646 -373783 -119002 -19018 -121843 149906 313823 -31534
817 -31534 -98155 -306456 -345562 -191185 -176529 42551 158499 31184 -44640 -224550 204464
806 204464 -8386 5340 33314 -176645 -9542 -132990 -144673 -240208 -208606 70306 -147925
795 -147925 -219664 -164929 103302 -93786 -131234 173139 111098 74336 -85925 -34318 136710
784 136710 -173910 -282279 44895 -176133 -232921 -264606 -308810 -382633 -142862 -81928 -49200
773 -49200 -156165 -501292 -101635 114919 -248138 -209413 -232367 -297029 -269065 -272197 -150707
762 -150707 -115446 -258022 -125207 -29185 48235 109872 -108891 -236364 -188520 -377877 -134715
751 -134715 -207330 -3524 194755 187121 137291 35367 -35259 -111234 -339643 -195482 -233289
740 -233289 -117450 -55609 256468 31108 -71682 -168160 26218 -16236 183802 133807 -156249
729 -156249 -304654 -142873 -285222 28821 186360 240868 -20288 -102078 77021 -123040
719 -123040 -126998 -11681 2038 -383127 -70832 -98278 -145587 -125080 -76885 -108814 -88095
708 -88095 -237216 -179691 72300 -32390 -358368 -158375 -1681 -209208 -121015 -81592 -54090
697 -54090 73608 126886 28738 -353059 -321832 -24022 -212377 -102790 -7132 -101081 -40796
686 -40796 45120 -53599 98344 128842 106634 77039 57293 61160 -19372 -6092 29080 -40388
674 -40388 107343 49869 -232930 -111356 -58216 189902 -233 -156001 -190053 -28224 193248
663 193248 36685 -35835 -24683 -178890 -216462 -171692 115402 -52516 -331821 -11133 202367
652 202367 -132985 119032 69956 199815 149940 -34965 136608 237158 38726 60337
642 60337 -107179 -368658 60512 27928 -70011 -111347 -145182 -96086 -73825 -149591 -226446
631 -226446 -45857 -96429 318596 58837 -184499 -207463 20558 67577 -206857 -27640
621 -27640 -141467 -370272 -30893 -203977 63952 176273 51636 -200544 99519 169716
611 169716 99362 15868 14755 -74355 22500 99261 162536 95357 -67949 147344 -146215
600 -146215 37043 -72247 -325283 -338499 -18410 16913 -34773 52520 147963 -295159 -138040
589 -138040 -198631 -118965 62609 -11566 218357 392483 327441 239294 230153 387722 114291
578 114291 51294 -46813 -35101 224649 95755 2738 190423 97562 395729 466676 317665
567 317665 161588 219611 -128599 -332273 -12010 61739 -110287 3643 100233 37507 28295
556 28295 -137618 -72892 128182 23607 -18845 -108378 439218 501911 -93059 -299839 -220389
545 -220389 -62811 -91745 -162990 -107495 84019 80836 -40236 351065 258540 -18088 -70723
534 -70723 -190554 -235972 -41543 37957 46019 185120 -39908 180205 -42063 -186840 -59487
523 -59487 120625 54916 397500 267034 268063 587 -54287 87844 -12071 41117 57534
512 57534 77600 59930 5065 24703 29 116841 183789 56303 -333742 -77791 -141249
501 -141249 -348786 -323462 -72565 33755 132908 157073 -30952 36213 267991 270216 246008
490 246008 246471 -63422 -37909 -77357 81715 -95302 137020 319818 388555 367806 363485
479 363485 184868 -94115 114891 209340 177516 341774 164662 65044 320528 44125
469 44125 162379 118832 -162755 172996 -68452 -336605 -439934 -13177 127652 286719
459 286719 67373 155209 -81521 242574 234932 -58238 -226249 -260760 94552 -15505 194966
448 194966 -21958 -123273 134749 215207 208344 116386 41431 355833 227989 10245 19624
437 19624 181742 -122878 -29281 48759 -116316 -229340 -230304 -180907 153058 -65807 -357007
426 -357007 -81605 51177 -106684 -76994 -127534 57943 56094 56198 -73912 224485 395087
415 395087 425705 183579 258019 262062 123830 237008 221178 251694 218186 315414 501944
404 501944 394740 -24279 178900 108677 308166 417084 301557 164448 260099 150709
394 150709 230756 118939 285992 374517 411468 386683 173283 44386 545136 476845 391261
383 391261 456016 468432 345193 257801 240497 452500 245467 310705 445955 252212 260630
372 260630 174934 277754 27009 281166 338827 507652 294714 334303 190478 399292
362 399292 439927 600166 339645 210178 449687 264270 393001 345845 482004 124133
352 124133 556842 409886 -86705 224052 346727 34557 279441 320120 346600 328782
342 328782 302193 231228 150372 328171 194216 362127 300871 93011 202077 86445 347879
331 347879 323113 143472 517409 221522 32441 309783 483184 435669 634135 351023
321 351023 459936 398820 410543 488713 287497 80046 356092 364977 28776 256739 395765
310 395765 299294 382354 747958 249573 -79206 -70119 -67052 -87089 -8035 192130 -4087
299 -4087 433338 296071 20856 303592 376072 319943 304246 318693 265790 445621 640548
288 640548 670590 360671 525117 424819 323953 451086 280294 67200 292116 56795
278 56795 161537 472024 300669 626958 347559 427890 547079 858849 491848 431443
268 431443 232005 396574 389567 179117 412824 410508 424824 576371 449841 75389 424065
257 424065 385148 427252 504195 468210 489132 425474 146928 222505 399945 439466 418877
246 418877 310894 323538 245607 325429 193467 254562 125765 366156 407779 352524 384183
235 384183 225271 240368 269356 265158 197203 216975 143833 431801 387310 184650 35506
224 35506 478805 436318 540612 569754 550860 370576 505680 563865 385447 410955 562177
213 562177 536615 481576 415480 177621 197670 231431 322648 451331 280088 293531 549299
202 549299 325656 465124 375493 335679 514280 485503 380225 378275 160314 225040 394722
191 394722 319149 280288 -67483 36803 335433 542402 250897 280474 476648 333560
181 333560 186591 151049 378957 453232 366612 471983 406523 335319 232316 289320 325081
170 325081 323160 279145 438268 461291 449375 443398 344876 418796 244615 250051 320671 325470
158 325470 69045 303893 557364 539817 336250 406963 454760 436892 316021 336347 636232
147 636232 495760 485472 422487 340761 442851 605954 413541 321410 208126 246290 325880
136 325880 562590 490487 180881 385827 377962 429925 443161 429126 453602 541570 430626
125 430626 365043 353242 402243 593635 390075 436587 352902 378576 321879 456392 702841
114 702841 512396 426684 377056 417219 137929 106935 356510 320991 420974 412106 330906
103 330906 462470 373829 789556 647046 328344 325696 409342 481670 381979 260245 330902
92 330902 475467 461967 384240 429722 366314 324199 181501 439970 505649 340498 272407
81 272407 75389 468968 320000 351408 404380 164860 554446 529468 536306 454075 524270
70 524270 460142 429100 427187 275476 353522 413174 345207 414342 434036 175680 189676 293235
58 293235 231137 293146 374784 246134 420627 355554 429940 427441 515945 465921 465416 580728
46 580728 380916 273526 503880 490230 481302 342412 306052 561937 573216 374910 655983
35 655983 721328 607566 498005 490011 594495 429019 346752 287073 269767 480391 548183
24 548183 412191 443865 410286 522952 455547 537691 691283 607680 447543 598174 503189
13 503189 439985 292355 294013 232549 226646 298034 514126 394343 161272 253138 511425
2 511425 502541 481138
0 481138
$$ Imaginary data points
##PAGE= N=2
##DATA TABLE= (X++(I..I)), XYDATA
16383 -5801640 -5472540 -5573948 -5520162 -5400938 -5418117 -5281214 -5184309 -5216486 -5107374 -5048957
16373 -5048957 -5194925 -4964850 -5029041 -4874058 -4703070 -4747442 -4775701 -4859119 -4621265 -4606469
16363 -4606469 -4475442 -4426542 -4369357 -4415218 -4236239 -4236231 -4061320 -4039380 -4022621 -3833260 -4017085
16352 -4017085 -4207779 -3960272 -3658857 -3555912 -3468481 -3564603 -3579823 -3612144 -3465478 -3330306
16342 -3330306 -3075851 -3172590 -3270599 -3049194 -3249098 -3242735 -3092790 -3033322 -3101635 -3307179
16332 -3307179 -3169878 -2909952 -2866711 -2853122 -2889973 -2936418 -2720825 -2676886 -2438869 -2543204
16322 -2543204 -2350641 -2303008 -2328206 -2385393 -1982446 -1805486 -1926599 -1936245 -2015792 -1864849
16312 -1864849 -2043609 -1785017 -1580631 -1566253 -1668399 -1428434 -1335767 -1502506 -1595223 -1653438
16302 -1653438 -1600522 -1501442 -1455842 -1586445 -1461874 -1199952 -1217099 -993636 -984370 -927920 -906298
16291 -906298 -789805 -886234 -873852 -850579 -714729 -656713 -483699 -488661 -537339 -589670 -581319
16280 -581319 -718476 -703893 -542684 -512542 -282879 -468597 -520328 -318792 -126806 -242330
16270 -242330 -324832 -44651 46200 -159117 -71133 -19071 -6472 -27923 45094 128942 174389
16259 174389 116213 270469 531122 592598 559601 783674 581238 605112 691958 592371 539084
16248 539084 581972 561204 735964 790030 906286 734403 861834 1090962 1048983 915650
16238 915650 941157 1066181 981068 1165176 1130463 1378086 1509505 1381306 1250449 1135379
16228 1135379 1106895 1066219 1327560 1429677 1550024 1429466 1561653 1579679 1802805 1765423
16218 1765423 1543085 1681480 1558043 1724723 1852942 1599232 1606832 1714789 1757007 1936599
16208 1936599 1846437 1960500 1875096 1934388 1979836 1857483 1986747 1739299 1842716 2031780
16198 2031780 1904843 1746050 1895147 2072303 1974811 1862750 1907757 2272172 2143730 2265990
16188 2265990 2351672 2329795 2182975 2059823 2310766 2189290 2252753 2345853 2206613 2342820
16178 2342820 2399414 2210180 2296786 2415421 2647748 2420837 2297539 2403976 2519301 2448450
16168 2448450 2570129 2698359 2482164 2484559 2968032 2575641 2527007 2650239 2460755 2582784
16158 2582784 2655938 2872407 2644481 2690901 2683661 2863683 2789344 2730275 2744734 2967063 3006012
16147 3006012 2676875 2436973 2576876 2745473 2805526 2723043 2921126 2407379 2475936 2429934
16137 2429934 2524667 2726951 2728189 2931729 2800877 2738366 2934074 2987244 3022680 3227566
16127 3227566 2968902 3083948 3036668 2726923 2881501 2862311 2825792 3054634 2983070 3056690
16117 3056690 2975885 2797515 2863692 2586564 2370647 2534937 2885637 3001295 3290717 3322692
16107 3322692 3097160 3094509 3235335 3247040 3211297 2987571 3081785 2996287 3041754 2885692 3045650
16096 3045650 2817791 2976552 3394579 3084099 3226393 3085645 3282566 3254792 3336733 3226194
16086 3226194 3429069 3368188 3098510 3120209 3031627 3025692 2935291 3028404 3258236 3333731 3237891
16075 3237891 3140975 3266932 3414270 3443766 3459051 3243426 3524218 3336871 3346692 3473480
16065 3473480 3383028 3246138 3205059 3119266 3404752 3406453 3049258 3300463 3298172 3203420 3367337
16054 3367337 3541207 3542357 3602801 3473566 3281039 3423557 3353158 3178444 3223884 3342633
16044 3342633 3019362 2564908 2933231 3009856 3202401 3359812 3368244 3358105 3294148 3066192
16034 3066192 3147332 3023691 2980754 2832156 2982993 3149763 3123445 2852490 3114212 3136973
16024 3136973 3410844 3251160 3477577 3292391 3274862 3405939 3382528 3311732 3251030 3288550
16014 3288550 2933214 3078710 3218024 3297045 3602066 3444529 2974834 3321272 3650558 3425888
16004 3425888 3290161 3270005 3228437 3316215 3379363 3362086 3147289 3342527 3359810 3286999 3247741
15993 3247741 2964156 3094231 3119534 3128792 3506291 3451177 3309772 3272905 2852842 2999304
15983 2999304 3058426 3161291 3008057 3404183 3636935 3282337 3370371 3274737 3418530 3395985
15973 3395985 3168390 2950776 3042328 3134223 3298184 3346225 3432726 3446034 3449688 3376858 3548952
15962 3548952 3603198 3561058 3537481 3601134 3273957 3190302 3308581 3419630 3446219 3392451 3080823
15951 3080823 3283744 3564769 3833258 3652953 3223614 2933692 2886074 3092638 3235985 3038980
15941 3038980 3338520 3204062 2969945 2974583 3185489 3592627 3212216 3132325 3206677 3311587
15931 3311587 3201477 3187204 3095781 3253129 3435007 3523677 3724058 3448177 3284634 2925832
15921 2925832 2949333 3285496 3215227 3059338 3320040 3156871 3153501 3091594 3458044 3397025
15911 3397025 3337617 3583751 3667406 3545589 3286337 3455115 3236787 3367951 3294031 3064241
15901 3064241 3208447 3309546 3409065 3581525 3368027 3431681 3377047 3289984 3544761 3476829
15891 3476829 3253761 3533202 3313296 3433630 3579729 3339835 3425146 3307909 3230965 3164541
15881 3164541 3103965 3151472 2954643 3114328 3230673 3261962 3232079 3195715 3296044 3227666
15871 3227666 3344863 3361104 3364487 3419334 3443958 3462626 3538215 3147709 3406518 3586993 3417164
15860 3417164 3106808 3156240 3548532 3351850 3370961 3277325 3150673 3046243 3032847 3265013
15850 3265013 3304255 3122632 2997036 3400378 3386131 3451602 3464300 3489458 3387481 3239581
15840 3239581 3377744 3456929 3494393 3340815 3426693 3491631 3399932 3481543 3736052 3730200 3650204
15829 3650204 3008670 2966922 3078076 3144213 3290603 3501822 3556916 3445405 3285702 3321589
15819 3321589 3278862 3416222 3408260 3065116 3058089 3322850 3371500 3238599 3548282 3281201
15809 3281201 3191687 3370224 3307014 3440196 3522294 3597460 3463739 3232094 3120023 3363270
15799 3363270 3472792 3382714 3493829 3601054 3453603 3150435 3402899 3469679 3144634 3307741
15789 3307741 3397957 3469540 3494980 3546498 3133527 3304675 3188914 3112042 3164443 3368422
15779 3368422 3495687 3534837 3477671 3324515 3210115 3440014 3482454 3541905 3362894 3485709
15769 3485709 3469900 3469661 3254551 3361331 3117530 3158775 3488892 3365594 3524335 3324559
15759 3324559 3329682 3746375 3687292 3369107 3742222 3397056 3149047 2989269 3173711 3249217
15749 3249217 3442095 3379434 3332598 3596950 3732295 3696308 3683700 3307645 3321106 3225467
15739 3225467 3118712 3234885 3269012 3207201 3440692 3576424 3483687 3468648 3294680 3309601
15729 3309601 3161052 3118540 3382951 3366667 3262265 3470460 3395050 3339809 3642415 3677828
15719 3677828 3625685 3700355 3705834 3374266 3487888 3237825 3367100 3291353 3271357 3238723 3442243
15708 3442243 2990816 3296948 3569118 3476409 3455293 3328384 3077061 3390735 3401703 2867284
15698 2867284 2914263 3121358 3557260 3583614 3603749 3558861 3567395 3691319 3524776 3249833
15688 3249833 3453446 3593880 3634301 3426090 3351794 3253878 3535841 3764946 3329843 3196877
15678 3196877 3267430 3511182 3621283 3465404 3507338 3264184 3342902 3219137 3458191 3270843
15668 3270843 3264386 3414901 3291551 3377406 3333196 3419771 3661738 3466463 3177116 3336054
15658 3336054 3393513 3378758 3319216 3574004 3148355 3098792 3397686 3415677 3423282 3418593 3382032
15647 3382032 3410885 3466754 3445999 3522239 3402844 3397307 3660022 3756572 3598534 3465841 3391041
15636 3391041 3523737 3460934 3775624 3631915 3255645 3312371 3219122 3690297 3457533 3625341
15626 3625341 3637034 3497212 3666992 3400265 3316392 3193447 3359234 3678477 3707132 3416772
15616 3416772 3485806 3429791 3290294 3507306 3602099 3436180 3267046 3303836 3577633 3432925
15606 3432925 3493559 3375343 3350114 3454784 3291996 3093249 3171263 3350635 3597652 3308765
15596 3308765 3368663 3597384 3554083 3636723 3515827 3300724 3295673 3356368 3327993 3396901 3419619
15585 3419619 3404673 3205505 3287690 3254156 3308747 3624738 3540610 3263790 3116764 3414515
15575 3414515 3377581 3290752 3417611 3466349 3716299 3683082 3183034 3499310 3655879 3701430
15565 3701430 3651892 3766805 3575869 3579582 3451218 3455708 3573981 3461112 3729369 3683920
15555 3683920 3411718 3473886 3365552 3539262 3800111 3633969 3294264 3492305 3428807 3198719
15545 3198719 3165493 3110564 3041433 3285133 3429066 3476518 3309434 3057090 3285203 3466054
15535 3466054 3675467 3810784 3786418 3546636 3791724 3505875 3454103 3287549 3193607 3326310
15525 3326310 3150797 2980054 3182262 3511051 3615613 3488731 3392797 3469286 3550095 3398865
15515 3398865 3588740 3754963 3512644 3531149 3663716 3520117 3760727 3567784 3431610 3421693
15505 3421693 3526760 3321988 3369860 3654087 3502992 3741959 3822883 3552393 3569556 3655228
15495 3655228 3635833 3215288 3442457 3565033 3581247 3503132 3568228 3655858 3824228 3548703
15485 3548703 3281253 3454831 3262920 3290020 3340820 3237102 3238455 3425131 3587399 3535464
15475 3535464 3609409 3588074 3515004 3208378 3309349 3437424 3325738 3366017 3390929 3278539
15465 3278539 3426917 3475410 3474531 3409816 3208813 3400179 3566305 3595329 3763198 3608534
15455 3608534 3401474 3786195 3666419 3486509 3400383 3505462 3624266 3303427 3247900 3441830
15445 3441830 3256936 3350246 3546577 3535452 3441497 3416303 3265705 3647607 3762537 3621873
15435 3621873 3630499 3667208 3654586 3419857 3364724 3554754 3525786 3420825 3502183 3487590 3456217
15424 3456217 3342917 3389453 3536520 3484423 3456285 3656773 3536211 3756573 3574865 3336599
15414 3336599 3434414 3683906 3640423 3528711 3678317 3572328 3476876 3813148 3736828 3634220
15404 3634220 3672777 3576097 3820811 3642772 3812350 3394761 3189421 3337230 3344031 3436637
15394 3436637 3377561 3099579 3286205 3284900 3580722 3258076 3118963 3556885 3461587 3335908
15384 3335908 3440852 3514988 3813349 3604176 3550002 3859046 3656331 3462530 3634375 3402267
15374 3402267 3126115 3544354 3630556 3459069 3337337 3452290 3108940 3130679 3567400 3565842
15364 3565842 3606170 3618355 3699190 3349419 3229260 3243399 3174001 3221767 3616974 3545090 3401192
15353 3401192 3574740 3520701 3608983 3542472 3675396 3790587 3573954 3464291 3471644 3402906
15343 3402906 3436118 3551325 3659866 3620004 3579826 3498218 3567945 3382049 3389257 3470974 3519023
15332 3519023 3384386 3308328 3241810 3127902 3334837 3469595 3529533 3668298 3464636 3354360
15322 3354360 3380444 3668351 3579124 3490128 3475506 3284644 3468839 3517840 3837715 3613036
15312 3613036 3355348 3491117 3443987 3590715 3610405 3378967 3564312 3563440 3473027 3778000
15302 3778000 3597903 3574494 3341786 3276535 3334741 3281224 3405014 3329435 3410369 3516219
15292 3516219 3651935 3153538 3407506 3595311 3362267 3223988 3161919 3503553 3669688 3660222
15282 3660222 4139314 3772675 3496181 3264700 3310715 3463258 3278173 3589620 3384077 3296778
15272 3296778 3374469 3628910 3474296 3505896 3510561 3790344 3705668 3667088 3536059 3404473
15262 3404473 3502498 3413063 3825913 3829929 3347471 3676809 3627391 3639826 3998928 3463079
15252 3463079 3392643 3576312 3920869 4106942 3661596 3540876 3145283 3353165 3381919 3584716
15242 3584716 3709564 3744565 3618074 3637805 3598087 3599986 3599721 3524062 3464703 3243485 3418234
15231 3418234 3311438 3580393 3602053 3530352 3516550 3398980 3540873 3659112 3390701 3493796
15221 3493796 3632557 3676040 3493817 3533183 3451657 3494017 3609100 3728288 3577937 3769797
15211 3769797 3608990 3643520 3687411 3681260 3783678 3668970 3589926 3299653 3480959 3385506
15201 3385506 3639697 3348960 3571547 3766629 3695803 3959501 3955081 3610253 3586451 3591315
15191 3591315 3565933 3409023 3456313 3991860 3971011 4105854 3856789 3468040 3867910 3502504
15181 3502504 3504460 3659625 3436431 3095942 3356748 3891204 3726149 3496032 3607243 3664022
15171 3664022 3330288 3280942 3379186 3351628 3580037 3317567 3463504 3619214 3384497 3599681
15161 3599681 3566303 3304120 3056972 3478374 3537867 3344464 3315707 3462964 3391945 3388582
15151 3388582 3463216 3497835 3367118 3430843 3435899 3463249 3687237 3888311 3878035 3667728 3487425
15140 3487425 3452363 3632770 3696530 3349190 3489619 3544532 3384192 3645975 3789397 3801165
15130 3801165 3637474 3484202 3813805 3630314 3747761 4024730 3819633 3716332 3540337
15121 3540337 3583684 3553292 3510291 3648305 3388558 3626982 3701800 3491277 3491101 3535751 3512864
15110 3512864 3658552 3575701 3407274 3573689 3372712 3373002 3644153 3529547 3421341 3659394
15100 3659394 3877228 3821059 3745948 3242822 3283104 3625313 3728542 3631866 3394922 3332363
15090 3332363 3503228 3442430 3240122 3835336 3726014 3531784 3808236 4055171 3634365 3739236
15080 3739236 3655917 3415995 3443249 3681100 3764879 2997143 3364096 3560489 3558270 3599303
15070 3599303 3653610 3486451 3298703 3405294 3441963 3423518 3418498 3617126 3845791 3799865
15060 3799865 3617213 3753861 3695464 3699897 3638620 4003488 3970438 3967436 3641166 3427270 3467156
15049 3467156 3528413 3790898 3700707 3931499 3646167 3521080 3561344 3381897 3384998 3359050
15039 3359050 3514390 3841710 3661389 3679842 3562101 3384949 3794155 3843220 3711090 3734467
15029 3734467 3695166 3664057 3618837 3829688 3492645 3412532 3443687 3451717 3565706 3459230 3651827
15018 3651827 3690626 3634830 3743677 3617134 3442916 3858629 3482159 3627080 3757519 3604121
15008 3604121 3564044 3781590 3632361 3685861 3427342 3352229 3661913 3542304 3625981 3560726
14998 3560726 3683178 3490935 3568007 3772772 3561770 3621296 3845662 3877496 3721641 3655638
14988 3655638 3513311 3807755 3675213 3687246 3605452 3388030 3597092 3612135 3675809 3980498
14978 3980498 3682288 3533633 3710855 3643139 3734679 3696783 3530226 3334294 3732579 3605697
14968 3605697 3463807 3655765 3608751 3490435 3487886 3361882 3224035 3223454 3321229 3412052 3602071
14957 3602071 3571031 3619886 3489095 3397725 3453714 3504968 3556373 3501051 3390689 3420922 3412078
14946 3412078 3415445 3331703 3618240 3651074 3304454 3543721 3386071 3525789 3708748 3533122
14936 3533122 3898438 3674246 3571448 3805214 3772792 3863385 3371329 3295372 3576759 3463520
14926 3463520 3469908 3475256 3551325 3503724 3557691 3709553 3758561 3564337 3376735 3594169 3564421
14915 3564421 3692922 3590475 3607303 3273554 3208217 3388043 3484814 3569127 3592580 3586915 3318871
14904 3318871 3628661 3678483 3619531 3752854 4141867 3801238 3738903 3574622 3615820 3587159
14894 3587159 3764309 3969431 3476634 3902563 3944216 4009432 3607688 3593846 3673718 3391713
14884 3391713 3395972 3452472 3291494 3450583 3512220 3431972 3487639 3629642 3357379 3394416 3512423
14873 3512423 3625507 3630161 3487635 3658257 3780442 3698618 3726283 3588309 3447879 3796882
14863 3796882 3579098 3511489 3588700 3665063 3268082 3702695 3687644 3924448 3843997 3528362
14853 3528362 3831735 3724754 3924200 3867369 3683223 3556446 3575946 3621177 3562756 3381335
14843 3381335 3850949 3787097 3621282 3856398 3659067 3971716 3500185 3586065 3897896 3797691
14833 3797691 3889139 4099550 3960518 3654133 3662026 3765584 3599650 3805326 3774758 3586160
14823 3586160 3969307 4069223 3745178 3395487 3741218 3770210 3274968 3495164 3814632 3662593
14813 3662593 3666286 3680495 3652214 3785000 3845521 3903520 3844326 3598685 3434561 3800490 4044776
14802 4044776 3807058 3690010 3751514 3587314 3572298 3517284 3612806 3650215 3744862 3696858 3594107
14791 3594107 3662978 3901150 3664056 3714200 3796459 3661920 3713540 3877510 3973786 3805775
14781 3805775 3846159 3972817 3770620 3495052 3659151 3496115 3871702 3787409 3790316 3881304
14771 3881304 3809689 3697453 3777255 3827064 3840983 3740865 3959177 3828768 3914689 3832652
14761 3832652 3745158 3723979 3630436 3666046 3883238 3624393 3736864 3808662 3694670 3828418
14751 3828418 4031404 4168563 4042787 3967846 3755836 3429388 3443514 3740754 3798521 3808449
14741 3808449 3639745 3674394 4011057 4063512 3953339 3885131 3535770 3413820 3610513 3700609
14731 3700609 3837085 3663442 3554642 3873857 3809284 3858259 3708475 3825784 3779521 3772214
14721 3772214 3722445 3881468 4117116 3826024 3644545 4025236 3903967 3746905 3910097 3798018
14711 3798018 3762537 3865636 3598079 3620177 3777991 3739237 3785028 3641480 3715693 3572321
14701 3572321 3713432 3896709 3792277 3472639 3647636 3606121 3575542 3494410 3559698 3529994
14691 3529994 3783654 4062108 3675991 3546547 3654627 3290513 3543104 3859231 4017509
14682 4017509 3987864 3680933 3936248 4035438 3695572 3647597 3622271 3334245 3686375 3847369
14672 3847369 3881739 3683806 3561110 3344616 3368024 3379411 3603985 3563369 3617503 3737478
14662 3737478 3783050 3859904 3794657 3819605 3823543 3923753 4052044 4174524 3956215 3956030 3737271
14651 3737271 3459387 3471940 3724904 3968355 3700583 4114056 4173071 3728167 3691011 3859769
14641 3859769 3982461 3856930 3452334 3627453 3913396 3998642 3851748 3860178 3922168 3551225
14631 3551225 3644048 3594390 3495254 3694085 3711139 3680380 3879753 3594978 3776094 3533780
14621 3533780 3703463 3919826 3980088 3875020 3984335 4272174 4007885 3827058 3804392 3870273
14611 3870273 3990310 3762192 4011105 3761861 3633124 3836986 3903820 4213122 3888558 3840425
14601 3840425 3701734 3722605 3288010 3502829 3548105 3395870 3288608 3395225 3564196 3771337
14591 3771337 3822533 4091931 3796021 3909027 4058436 4036178 4022258 4123208 4085038 3840199
14581 3840199 3711520 3593171 3767924 3934608 3659432 3674605 3868888 3959151 3848525 3674758
14571 3674758 3662661 3655775 3844959 3848987 3902545 3950840 3866917 3850487 3770778 3666793 3777646
14560 3777646 3877644 3929789 3886431 3910894 3879350 3700186 4027420 4104245 3852646 3972294
14550 3972294 3864032 3864368 3597727 3774515 4003343 3949034 3919970 3825221 3800705 3831013 3818715
14539 3818715 3880125 3886779 3813044 3715434 3683854 3559095 3882003 3695822 3847059 4033452
14529 4033452 4029433 3899943 3905724 3863660 3692338 3790365 3666663 3634338 3704897 4005298 3901453
14518 3901453 3798498 3699761 3597104 3796842 3785451 3864375 3989216 3786144 3712871 3639365
14508 3639365 3676999 3676058 4064453 3818137 3672705 3712594 3771699 3855183 3853119 4074919 4055037
14497 4055037 4086567 4052259 4080822 4271553 4028780 3831170 4211282 3573479 3763741 4015046
14487 4015046 3762898 3835569 3916386 4114559 4009967 4142380 3758455 3819198 3959941 3910761
14477 3910761 3706614 3600524 3669207 3529218 3731964 3641984 3752820 3752193 4102418 3973346
14467 3973346 3879427 3740396 3739722 3864694 3889183 3816468 3819045 3586570 3621229 3585297 3967063
14456 3967063 3873604 4071076 3929644 3695840 3837152 4170319 4119492 3978649 4091563 4011403
14446 4011403 3789367 3673610 3844680 3887338 3768473 3638161 3726491 3856460 4084528 3876506
14436 3876506 3752889 3516080 3772155 3765453 3847478 4077045 3992396 3919351 3970340 3891861 3888273
14425 3888273 3939255 4100350 4134296 4078725 3971497 3941665 3681890 3597256 3594329 3825893 3651260
14414 3651260 3673838 3581486 3520204 3861744 4077867 4079320 4198724 3957118 3998431 3773654
14404 3773654 3842372 3752302 3527131 3655795 3780995 4111100 4025926 3596171 3755090 3824839
14394 3824839 3602780 3901107 3886786 4000326 3986508 4005659 3750448 3760469 4002566 3938568
14384 3938568 3750668 3651632 3847675 3841575 3926647 3728272 3882889 4138480 3716953 3763750
14374 3763750 4221789 4109793 3783005 3777275 3489153 3738113 3681067 3584412 3773767 3504994
14364 3504994 3696926 3793748 4205758 4220784 3712454 3812139 3915394 3819786 4080385 3961627
14354 3961627 3939404 3823288 3703074 3918151 3910902 3811223 3783061 3898027 3827170 3695423
14344 3695423 3713401 3956553 4126101 4066491 3861608 3890380 3757170 3685035 3782892 3668587
14334 3668587 3574603 3750234 4009873 4025796 3974680 3620336 3669463 3915717 3956003 3838008
14324 3838008 3658966 3706640 3969679 3969294 3897461 3815370 3903939 3793158 3721674 3852809 3884008
14313 3884008 4084308 4001083 3642075 3808162 3892626 3634498 3676821 3814192 3767984 3586901
14303 3586901 3433631 3642912 3632143 3495048 3873938 3829602 3871063 3597450 3778969 3918245
14293 3918245 4027900 4087696 3992797 3548900 3941541 4161475 3842073 3575529 4001379 4327351
14283 4327351 4106993 4169919 3896042 3949985 3746005 3896832 3973413 3946737 3823119 4055748
14273 4055748 4170113 4175578 3856902 3892334 3996549 3984894 4171279 3882855 3736422 3969668
14263 3969668 4118429 3948042 4027268 3889363 3794699 3801869 3568479 3711050 3988970 4302401
14253 4302401 4133186 3937223 3839209 3442032 3624239 3878961 3996119 3795358 3762154 3968630
14243 3968630 4168355 4027598 4128552 4095850 3881897 4139077 4151642 3992015 3849329 3933913
14233 3933913 4018005 4029055 3785886 3729343 4014111 4156512 4106302 3843118 4138455 3830597
14223 3830597 3879965 4020120 4141122 3899796 4118328 4152687 4033145 3987974 4057618 3791525
14213 3791525 3849103 3996439 4369547 4158084 4017609 3917975 3709825 3774677 3815963 3992718
14203 3992718 3898103 4148523 4131679 3818923 3671792 3897480 4020058 4056138 3534357 3628258
14193 3628258 3687451 3726273 3625234 3790554 3899485 3975292 3934521 4107115 3759192 3757409
14183 3757409 3936274 4026647 3938021 3913664 3838365 3704644 3636345 3501326 3697188 3924169
14173 3924169 3923200 3959924 3874186 3697578 4013449 3723404 3630995 3696019 3891151 4079189 3950515
14162 3950515 3944212 4072798 4110615 3857843 4122691 4249383 3938997 3749692 3830540 4113710
14152 4113710 3950519 3870150 3767633 3370360 3925283 3852372 3632347 3416983 3830527 3876498
14142 3876498 3978950 4139584 4102193 3910273 3834046 4266275 3938995 3903157 3800615 4208097
14132 4208097 4125811 3610517 3746097 4079730 3941100 4049436 3956753 3989212 4009142 3881457
14122 3881457 4077352 4051328 3853531 3769723 3846303 3897349 3755717 3777079 3913427 3678331
14112 3678331 3877897 4069005 4142431 4094142 3962579 3809854 3878391 3931605 4030549 3851452
14102 3851452 4105834 3893690 3706776 3829407 3787048 3997043 4055678 4020069 4113325 4057098
14092 4057098 3969125 3903685 3829404 3975311 4009611 4075838 3768813 3768799 3982864 4182033 4213229
14081 4213229 4133135 3784610 3784936 3929983 3973935 3925502 3911935 3923065 3921395 3445954 3935919
14070 3935919 4235169 3741001 3971961 3900882 3531466 3671784 3784758 3611742 4122467 4108551
14060 4108551 3828792 3938139 4105711 3991113 3910594 3947411 3881557 3887018 3790542 3838745 3892407
14049 3892407 3941370 3917443 4029763 4449901 4304874 4010662 3860696 3889715 4132034 3937110
14039 3937110 3923918 3773149 3730648 3692438 3828142 4036276 3933915 4012491 4172993 3974396
14029 3974396 4038678 4011014 4004409 4103858 4062160 3904502 3858803 3735820 3874446 3927729 3882937
14018 3882937 4067808 3976918 4248346 4099644 3958408 4161125 4103490 3892118 4097866 4120303
14008 4120303 3947882 3825601 4257300 4228024 3830375 3612637 4030353 4185772 4317375 4314702
13998 4314702 4156682 4238670 4039421 4019107 3935590 3962292 3932973 4330918 4234705 4009578
13988 4009578 4110510 4142116 4156544 4008685 4017015 4041347 3776858 3665077 3921153 3856424
13978 3856424 3722631 3724853 3711199 3836307 3865352 3930104 3940717 3977141 4361100 4407221 4157518
13967 4157518 4225517 3960283 3849403 4165450 4018606 4154878 4081858 3876777 4057577 4110915
13957 4110915 4252757 4210274 4346039 4152238 4154409 4224974 4114208 4078517 4010894 3920936 4052927
13946 4052927 3865124 3791883 3923957 4094755 4071972 4088720 4183824 4287719 4279505 4123682
13936 4123682 3935655 3965538 4187887 3842591 4012185 3986912 4201989 4067878 4094343 4123962
13926 4123962 4231915 4327766 4063039 4111361 4209820 4259495 3785124 4044758 4057233 3989002
13916 3989002 3977485 4039057 4129800 4253352 3826750 4013902 4133670 3720267 3759392 3993645
13906 3993645 4067646 3917460 4092688 3989321 3771826 3820923 3917067 3717415 3567612 3922198
13896 3922198 3950749 4178320 4068333 3779712 3953247 4351358 4341737 4213533 3974771 3680474
13886 3680474 3750057 4148864 3807019 3945596 4255481 3837655 4032365 3956339 4003085 3923156
13876 3923156 4100229 3926900 4082424 4012459 3802931 3671861 3854656 3947278 4088465 3838597
13866 3838597 3815170 4298401 4221123 4064819 4297588 3884515 4056619 4270991 4223636 4240897
13856 4240897 4116446 4106636 3962020 4155267 4230050 4159872 4170273 4003791 4331283 4162420
13846 4162420 3910976 4337178 4177544 4193527 4234897 4078426 4235850 4099421 3937038 4091601
13836 4091601 4209073 4150526 4049681 3928818 3902107 3962014 3937997 3867455 4082763 4183908
13826 4183908 4568544 4430978 4143220 4257397 4054973 3981747 4106238 4289783 4117860 3973475
13816 3973475 3979773 4017956 4011788 4178400 4020682 3911661 4187575 3975558 4120814 4085220
13806 4085220 4175401 4145030 4087476 3896335 3874483 3944524 4055084 4093791 4031200 4243732 4353732
13795 4353732 4281522 4005544 3861980 4036607 4043720 3905819 4202720 4016770 4167210 4328261
13785 4328261 3973529 4055561 4265933 4382391 4193473 4257094 4357446 4149235 3987773 3966551
13775 3966551 4116156 4109715 4262749 4181527 4045724 4052779 4213941 4236137 3988656 4025319 4046062
13764 4046062 4032606 3739843 3984148 4143820 3955640 4118296 4263809 3986488 3747652 4081830
13754 4081830 4012467 4043009 4095469 4304613 4035248 4036277 4250188 4456857 4157025 4299020
13744 4299020 4261695 4292235 3938225 3991325 3900213 4349701 4329124 4154653 3975473 3949041
13734 3949041 4264650 4250536 4147727 3976703 3898049 4245657 4225946 4345133 4256950 4146993
13724 4146993 4289474 4205121 4077142 4422104 4192662 4080876 4149658 3985155 3973538 3976108
13714 3976108 4016192 4421171 4373428 3977896 4105554 4141623 4309944 4244218 4140401 3842225
13704 3842225 3808105 3885592 4004373 4175902 4019448 4043212 3873922 3857947 4092678 4171714
13694 4171714 4324498 3947970 4018559 3924785 4227180 4403294 4216197 4006291 4156694 4074440
13684 4074440 4149497 4133013 4035787 4283896 4405190 4220274 4021980 4042652 4202872 3898794
13674 3898794 4257102 4108882 4015591 3867869 3961213 3939349 4122558 4117878 4083647 4175074 4225932
13663 4225932 4395200 4164784 3911297 4073019 3867442 3978903 4116308 3844946 3710778
13654 3710778 3915653 4043904 3965237 4080006 4308019 4414804 4047983 4110784 4481370 4277704
13644 4277704 4250967 3787308 3898235 4265259 3900775 4143990 4244902 4322747 4196338 4290231
13634 4290231 4499105 4302068 4238524 3951620 4216620 4240231 4275639 4531544 4177971 4072314
13624 4072314 4362555 4126568 4149316 4221085 4259970 4333443 4404226 4463896 4222210 4322098 4177609
13613 4177609 4308134 4271239 4199941 4262846 4221841 4004849 4099797 4144378 3967343 4026104 4059548
13602 4059548 4070537 4335214 4251779 3919112 4000711 4133968 4178355 4121913 4082776 4157291 4238788
13591 4238788 4191055 3943904 3844497 3802462 3883685 3941020 4006902 4025324 4205616 4082256 4298178
13580 4298178 4200432 4016057 4239669 4450102 4209586 3910235 3808269 3893723 4173070 4383643
13570 4383643 4303311 4094366 4062274 4105952 4131979 4004311 3985279 4435765 4363303 4102136
13560 4102136 4189556 4070153 4179504 4346717 4336788 3999163 3888198 4179651 4320562 4220428
13550 4220428 4374557 4622900 4495983 4165451 4190134 4067684 4138258 4249090 4298164 4252941
13540 4252941 4236020 4379309 4332885 4345476 4303836 4114461 4318696 4258591 4127039 4189520
13530 4189520 4256653 4124968 4106807 4275166 4262368 4327073 4294177 4374657 4292152 4230221 3923362
13519 3923362 4018235 3953423 4136487 3946325 4268333 4378420 4521557 4700193 4463251 4258958
13509 4258958 4175879 4107914 3959932 4214707 4236678 4346375 4185612 4343014 4467715 4209346
13499 4209346 3993969 4186342 4175926 4065286 4229339 4335042 4782731 4418958 4124001 4198432
13489 4198432 4336682 4434181 4268519 3982428 4119314 4307825 4178871 4208566 4024144 3937781
13479 3937781 4136053 3778786 4145909 4078078 4076604 4216296 3936245 4348433 4354750 4076669
13469 4076669 3946943 4043049 4071541 4035795 4167920 3926985 4148657 4040571 4476318 4430488
13459 4430488 4136753 4148992 4244154 4586990 4470770 4634455 4190057 4237768 4464420 4357084
13449 4357084 4108865 4384425 4139542 4210407 4506206 4546067 4302191 4144085 4062053 4109457
13439 4109457 4266749 4161441 4030488 3976055 4168601 4187396 3925998 4082889 4250500 4203073
13429 4203073 4153555 4250548 4254830 4054969 4006341 4302272 4333816 4485140 4127904 4504494
13419 4504494 4301674 4229543 4295882 4283373 4093497 4112625 4218990 4142091 4314442 4338395
13409 4338395 4274173 4312595 4439319 4355241 4181881 4065790 4226867 4376630 4263715 4268892
13399 4268892 4270480 4101560 4217789 4471431 4161061 3928801 3962723 4178880 3788471 3892544
13389 3892544 4364107 4189101 4310234 4312290 4544325 4246221 4160239 4053239 4372789 4512546
13379 4512546 4316125 4373187 4456218 4422932 4364369 4334185 4433412 4222722 4298057 4324784 4037869
13368 4037869 4063882 4059944 4350300 4266653 4230133 4488861 4251223 4123134 4169130 4157398 4216320
13357 4216320 4131697 3993782 4021526 3954346 4105867 4336343 4075362 3953608 3981895 4522962
13347 4522962 4299893 4275373 4373633 4268517 4206505 4069959 4324194 4020764 4010889 3981500
13337 3981500 4158395 4280675 4128000 4082727 4285651 4376974 4440681 4325138 4292165 4471641
13327 4471641 4097771 4255746 4472769 4012483 3984576 4216686 4221284 4195624 4339818 4075364
13317 4075364 4129282 4237074 4175997 4103938 4124913 4337519 4224535 4264347 4172838 4250019 4398877
13306 4398877 4186848 4366314 3895944 4061742 4255602 4675514 4341052 4170120 4291446
13297 4291446 4115148 3897180 4113513 4093182 3875260 3877525 3927296 3748259 3976319 4159735
13287 4159735 4232086 4205050 4208839 4305561 4065033 4253740 4165030 3902243 3915021 4290403 4602350
13276 4602350 4718915 4446778 4334091 4045788 4058973 4292003 4293887 4324628 4456378 4343880
13266 4343880 4504802 4390218 4409116 4531755 4367981 4228395 4214243 4083417 4223478 4438049
13256 4438049 4252347 4221427 3936033 3927107 4320608 4319586 4231179 4694665 4403430 4076427
13246 4076427 4229510 4460807 4585836 3996898 4182383 4463300 4127404 3945520 4264927
13237 4264927 4124789 3946972 4211257 4413729 4384009 4213552 4366007 4300685 4251594 4297578
13227 4297578 3995743 4259814 4261434 4236526 4035173 4238718 4319701 4232037 4144100 4185286 4160233
13216 4160233 4205558 4303858 4237471 4091804 3898048 4229520 4478183 4313936 4467266 4439556
13206 4439556 4340968 4173021 4320722 4491226 4630161 4470364 4540337 4342928 4382327 4100910
13196 4100910 4439683 4254159 4196420 4128360 4229633 4362000 4078861 4313025 4390607 4363661
13186 4363661 4372248 4488727 4454786 4631594 4679814 4654766 4179166 4100758 4077750 4543228 4117139
13175 4117139 4143491 4138854 4545506 4573400 4592869 4437473 4124313 3965839 4077791 4254810
13165 4254810 4437243 4425339 4468318 4307031 4311135 4216851 4389893 4409514 4320290 4380006 4460904
13154 4460904 4505672 4687966 4457424 4171873 4125734 4239656 4561142 4518680 4685721 4571306
13144 4571306 4392699 4463346 4159930 4454270 4691940 4394055 4460930 4429714 4337604 4293484
13134 4293484 4271579 4131970 4287769 4276855 4241589 4395290 4318795 4325420 4607951 4532771 4439883
13123 4439883 4241633 4271959 4320701 4107715 4216925 4500463 4497507 4329432 4234949 4695819
13113 4695819 4232738 4341788 4708217 4558528 4513012 4487664 4440827 4650561 4595030 4655835
13103 4655835 4554553 4318153 4156966 4421036 4313492 4361882 4732878 4468717 4428125 4488252
13093 4488252 4248419 4576207 4367545 4568595 4807226 4436664 4401300 4418899 4493343 4703431
13083 4703431 4679262 4523336 4193362 4363716 4625247 4418355 4468205 4432486 4641339 4591097
13073 4591097 4316358 4314628 4277017 4236241 4164918 4013646 4237131 4086998 4357235 4383341
13063 4383341 4326594 4623122 4406430 4330340 4206481 4330111 4560971 4573652 4417830 4238669
13053 4238669 4451387 4710115 4320263 4390860 4685022 4551085 4693603 4672987 4624756 4545635
13043 4545635 4310085 4323743 4567020 4680032 4773661 4449740 4576505 4567808 4440458 4329256
13033 4329256 4542646 4148713 4293337 4283480 4525625 4756443 5054878 4400612 4240961 4251146
13023 4251146 4237747 4198835 4086987 4366005 4469517 4446129 4094701 4291139 4028511 4304972
13013 4304972 4506661 4531349 4435254 4288481 4445782 4396590 4551017 4403572 4423370 4245816
13003 4245816 4010690 4056790 4285157 4528062 4489831 4660720 4515349 4145480 3898212 4238396
12993 4238396 4370248 4327138 4450261 4514381 4489602 4537865 4577676 4511974 4294509 4184808
12983 4184808 4479262 4318464 4147978 4263022 4576735 4435792 4467827 4777285 4602438 4647981
12973 4647981 4410835 4573251 4425931 4467648 4572916 4515314 4383391 4264950 4343659 4283513
12963 4283513 4309750 4674678 4677438 4402842 4313410 4187285 4570600 4532746 4398277 4500423
12953 4500423 4326379 4570435 4824562 4411803 4032715 4197987 4282261 4382727 4240687 4261009
12943 4261009 4336598 4513393 4536639 4480833 4476887 4509103 4718701 4719860 4626332 4706760 4486976
12932 4486976 4608150 4433965 4595315 4289932 4272701 4344205 4194858 4419493 4375584 4472234
12922 4472234 4650894 4802438 4699064 4470392 4508399 4435768 4146519 4292670 4602270 4593699
12912 4593699 4473071 4463629 4389317 4614475 4488089 4464001 4561505 4414024 4450373 4269224
12902 4269224 4563192 4328644 4517546 4439806 4135627 4178677 4273358 4242249 4192657 4252996
12892 4252996 4459855 4675732 4598954 4349371 4543206 4524698 4189773 4466807 4203798 4350176
12882 4350176 4501330 4585925 4214287 4250929 4537616 4845211 4542919 4578542 4504590 4700527
12872 4700527 4591846 4635587 4549138 4564758 4611594 4328541 4406540 4417920 4642135 4479262
12862 4479262 4517923 4470636 4330022 4604164 4608456 4784765 4604397 4307781 4517528 4783596
12852 4783596 4496650 4538487 4449121 4374771 4813993 4699082 4471758 4472372 4573878 4620950 4572440
12841 4572440 4624971 4689213 4361950 4811360 4738409 4898028 4902727 4422598 4535260 4923184
12831 4923184 4661923 4482786 4503522 4435355 4547104 4395642 4253013 4337457 4494529 4689307
12821 4689307 4689247 4673380 4744196 4579762 4362597 4579549 4620057 4706120 4626115 4560403 4867803
$$ [...]
##END NTUPLES=NMR SPECTRUM
##END=
