##TITLE=1H_EC-3329oc
 CDCl3
 8 sc, 
 24.7.2024
##JCAMPDX= 6.0         $$ Bruker NMR JCAMP-DX V2.0
##DATA TYPE= NMR SPECTRUM
##DATA CLASS= NTUPLES
##ORIGIN= UXNMR, Bruker Analytische Messtechnik GmbH
##OWNER= root
$$ XWIN-NMR		Version 3.5
$$ Wed Jul 24 13:55:07 2024 Russian Standard Time (UT+4h)  she@DPX200
##.OBSERVE FREQUENCY= 200.1308
##.OBSERVE NUCLEUS= ^1H
##.ACQUISITION MODE= SIMULTANEOUS
##.ACQUISITION SCHEME= undefined
##.AVERAGES= 8
##.DIGITISER RES= 18
##SPECTROMETER/DATA SYSTEM= spect
##.PULSE SEQUENCE= zg30
##.SOLVENT NAME= D2O
##.SHIFT REFERENCE= (INTERNAL, D2O, 0, 16.9692)
##AUDIT TRAIL= $$ (NUMBER, WHEN, WHO, WHERE, WHAT)
$$ ##TITLE= Audit trail, XWIN-NMR		Version 3.5
$$ ##JCAMPDX= 5.01
$$ ##ORIGIN= Bruker BioSpin GmbH
$$ ##OWNER= she
$$ F:/spectra/data/she/nmr/H-F/1/pdata/1/auditp.txt
$$ ##AUDIT TRAIL=  $$ (NUMBER, WHEN, WHO, WHERE, WHAT)
(   1,<2024-07-24 13:53:15.32 +0400>,<she>,<DPX200>,
      <created by zg, POWCHK disabled, PULCHK disabled
       configuration hash MD5:
       00 E9 B6 7A A2 85 ED C7 34 08 36 98 17 FE 4E 26
       data hash MD5: 16K
       76 6C DE 47 BD EB 71 35 65 71 FF 22 FD 2B 93 42>)
(   2,<2024-07-24 13:54:01.15 +0400>,<she>,<DPX200>,
      <Start of raw data processing
       efp BC_mod = 2 LB = 0.24 FT_mod = 6 PKNL = 1 PHC0 = -25637 PHC1 = 14.38749 SI = 16K 
       data hash MD5: 16K
       2E F1 FD 9E 42 4C 6D F0 7E BE 8C 2B 42 B9 08 FD>)
(   3,<2024-07-24 13:54:20.45 +0400>,<she>,<DPX200>,
      <pk PHC0 = 1.903494 PHC1 = -3.6 
       data hash MD5: 16K
       57 56 F0 93 28 46 BA 88 FE 24 A1 B4 CE 8A 00 F3>)
(   4,<2024-07-24 13:54:23.45 +0400>,<she>,<DPX200>,
      <abs ABSG = 5 
       data hash MD5: 16K
       C5 D5 A3 C3 0B BD 43 07 C5 B5 C3 99 CD 0A C1 D8>)
$$ ##END=
$$ 
$$ hash MD5
$$ A4 DC 11 65 BF 6E F9 42 83 C9 66 81 4F B6 A9 0B
##$RELAX= 
##$RELAX= 
##$RELAX= 
##$RELAX= 
##$RELAX= 
##$RELAX= 
$$ Bruker specific parameters
$$ --------------------------
##$DU= <F:/spectra>
##$EXPNO= 1
##$NAME= <H-F>
##$PROCNO= 1
##$TYPE= <nmr>
##$USER= <she>
##$AMP= (0..31)
100 100 100 100 100 100 100 100 100 100 100 100 100 100 100 100 100 100 
100 100 100 100 100 100 100 100 100 100 100 100 100 100 
##$AQSEQ= 0
##$AQ_mod= 1
##$AUNM= <au_zg>
##$AUTOPOS= <>
##$BF1= 200.13
##$BF2= 200.13
##$BF3= 200.13
##$BF4= 200.13
##$BF5= 200.13
##$BF6= 200.13
##$BF7= 200.13
##$BF8= 200.13
##$BYTORDA= 1
##$CFDGTYP= 0
##$CFRGTYP= 5
##$CHEMSTR= <none>
##$CNST= (0..31)
1 1 145 1 1 1 1 1 1 1 1 1 1 1 1 1 1 1 1 1 1 1 1 1 1 1 1 1 1 1 1 1 
##$CPDPRG= <>
##$CPDPRG1= <>
##$CPDPRG2= <>
##$CPDPRG3= <>
##$CPDPRG4= <mlev>
##$CPDPRG5= <mlev>
##$CPDPRG6= <mlev>
##$CPDPRG7= <mlev>
##$CPDPRG8= <mlev>
##$CPDPRGB= <>
##$CPDPRGT= <>
##$D= (0..31)
0 1.2 0 0 0 0 0 0 0 0.06 0 0.03 0 0 0 0 0.0002 0 0 0 0 0 0 0 0 0 0 0 0 
0 0 0 
##$DATE= 1721814794
##$DBL= (0..7)
120 120 120 120 120 120 120 120 
##$DBP= (0..7)
150 150 150 150 150 150 150 150 
##$DBP07= 0
##$DBPNAM0= <>
##$DBPNAM1= <>
##$DBPNAM2= <>
##$DBPNAM3= <>
##$DBPNAM4= <>
##$DBPNAM5= <>
$$ [...]
##$SUBNAM3= <"">
##$SUBNAM4= <"">
##$SUBNAM5= <"">
##$SUBNAM6= <"">
##$SUBNAM7= <"">
##$SUBNAM8= <"">
##$SUBNAM9= <"">
##$SW= 24.0690372696642
##$SWIBOX= (0..15)
0 0 2 0 0 0 0 0 0 0 0 0 0 0 0 0 
##$SW_h= 4816.95568400771
##$TD= 16384
##$TD0= 1
##$TE= 0
##$TE2= 300
##$TE3= 300
##$TEG= 300
##$TL= (0..7)
0 120 120 120 120 120 120 120 
##$TP= (0..7)
150 150 150 150 150 150 150 150 
##$TP07= 0
##$TPNAME0= <>
##$TPNAME1= <>
##$TPNAME2= <>
##$TPNAME3= <>
##$TPNAME4= <>
##$TPNAME5= <>
##$TPNAME6= <>
##$TPNAME7= <>
##$TPOAL= (0..7)
0.5 0.5 0.5 0.5 0.5 0.5 0.5 0.5 
##$TPOFFS= (0..7)
0 0 0 0 0 0 0 0 
##$TUNHIN= 0
##$TUNHOUT= 0
##$TUNXOUT= 0
##$USERA1= <user>
##$USERA2= <user>
##$USERA3= <user>
##$USERA4= <user>
##$USERA5= <user>
##$V9= 5
##$VALIST= <valist>
##$VCLIST= <CCCCCCCCCCCCCCC>
##$VD= 0
##$VDLIST= <DDDDDDDDDDDDDDD>
##$VPLIST= <PPPPPPPPPPPPPPP>
##$VTLIST= <TTTTTTTTTTTTTTT>
##$WBST= 1024
##$WBSW= 4
##$XGAIN= (0..3)
0 0 0 0 
##$XL= 0
##$YL= 0
##$YMAX_a= 196242
##$YMIN_a= -126522
##$ZGOPTNS= <>
##$ZL1= 120
##$ZL2= 120
##$ZL3= 120
##$ZL4= 120
##$ABSF1= 16.97651
##$ABSF2= -7.092648
##$ABSG= 5
##$ABSL= 3
##$ALPHA= 0
##$AQORDER= 0
##$ASSFAC= 0
##$ASSFACI= 0
##$ASSFACX= 0
##$ASSWID= 0
##$AUNMP= <proc_1d>
##$AZFE= 0.1
##$AZFW= 0.1
##$BCFW= 0
##$BC_mod= 2
##$BYTORDP= 0
##$COROFFS= 0
##$CY= -3
##$DATMOD= 1
##$DC= 0
##$DFILT= <>
##$DTYPP= 0
##$F1P= 0
##$F2P= 0
##$FCOR= 1
##$FTSIZE= 16384
##$FT_mod= 6
##$GAMMA= 0
##$GB= 0
##$INTBC= 1
##$INTSCL= 3.70164e-10
##$ISEN= 128
##$LB= 0.24
##$LEV0= 0
##$LPBIN= 0
##$MAXI= 10000
##$MC2= 0
##$MEAN= 0
##$ME_mod= 0
##$MI= 1.114404
##$NCOEF= 0
##$NC_proc= -7
##$NLEV= 6
##$NOISF1= 3.799351
##$NOISF2= 2.8
##$NSP= 0
##$NTH_PI= 0
##$NZP= 0
##$OFFSET= 16.96917
##$PC= 1
##$PHC0= -25635.1
##$PHC1= 10.78749
##$PH_mod= 1
##$PKNL= yes
##$PPARMOD= 0
##$PSCAL= 0
##$PSIGN= 0
##$REVERSE= no
##$SF= 200.12981244068
##$SI= 16384
##$SIGF1= 3
##$SIGF2= 2
##$SINO= 5.538805
##$SIOLD= 16384
##$SREGLST= <1H.CDCl3>
##$SSB= 0
##$STSI= 16384
##$STSR= 0
##$SW_p= 4816.95568400771
##$SYMM= 0
##$S_DEV= 0
##$TDeff= 16384
##$TDoff= 0
##$TI= <>
##$TILT= no
##$TM1= 0
##$TM2= 0
##$TOPLEV= 0
##$USERP1= <user>
##$USERP2= <user>
##$USERP3= <user>
##$USERP4= <user>
##$USERP5= <user>
##$WDW= 1
##$XDIM= 16384
##$YMAX_p= 418983454
##$YMIN_p= -6859103
$$ End of Bruker specific parameters
$$ ---------------------------------
##NTUPLES= NMR SPECTRUM
##VAR_NAME=  FREQUENCY,     SPECTRUM/REAL,   SPECTRUM/IMAG
##SYMBOL=    X,             R,               I
##VAR_TYPE=  INDEPENDENT,   DEPENDENT,       DEPENDENT
##VAR_FORM=  AFFN,          ASDF,            ASDF
##VAR_DIM=   16384,         16384,           16384
##UNITS=     HZ,            ARBITRARY UNITS, ARBITRARY UNITS
##FACTOR=    0.29402158847633, 1,            1
##FIRST=     3396.0367326641, 0,             0
##LAST=      -1420.91895134361, 0,           0
##MIN=       -1420.91895134361, -6859103,    0
##MAX=       3396.0367326641, 418983454,     0
$$ Real data points
##PAGE= N=1
##DATA TABLE= (X++(R..R)), XYDATA
$$ [...]
12814c62617J06467L45656n27897K55843K30516K84949j93458r7226J56654k31529
12804c2642O8457p8881J3259m69205J99573k79280J31759J19854m3777L72771
12794A888J24602k63127j01855j11436L99071J90715l53474l71983J91601n8743
12784c52741K02258k15423l65790M47681j09891J27038K25762j60012O37350n293
12774D30939j01014k628m27071J06151M99180j47490o5644L19637q15261j42861
12764c46062j42246m5643J3180N60750j37334j3959j03718k59402J45546j255
12754c30143o1478J01454O23956j41919L48097n2832m03453L98940L94759l66965
12744E10416m1722k66003J09047N7572l63549K21653j37378k90607J6913J00289
$$ plain form
12814 -362617 -256150 89506 -438391 -182548 47968 332917 139459 42233 198887 -32642
12804 -32642 35815 -43066 -29807 -499012 -299439 -578719 -446960 -327106 -370883 1888
12794 1888 126490 -136637 -238492 -349928 49143 239858 -113616 -485599 -293998 -352741
12784 -352741 -150483 -365906 -731696 -284015 -393906 -266868 -41106 -201118 436232 430939
12774 430939 329925 327297 -99774 6377 505557 358067 292423 612060 -203201 -346062
12764 -346062 -488308 -533951 -520771 39979 -97355 -111314 -215032 -474434 -328888 -330143
12754 -330143 -391621 -290167 333789 191870 539967 487135 83682 482622 877381 510416
12744 510416 468694 202691 311738 369310 5761 227414 90036 -200571 -183658 -83369
12734h3369Q385j38625K23663k59106k7922M61833k23079K97582m1136j68081
12724E0145k39810n533L61743m78845N22589m94835J95883O1413j59938J07128
12714h0060Q020k86609K35124J26343k0318L95710j9764k51155L555k59743k39167
12703c88064M92454J021K4902O2618K05004j71209o00032J4266L73569n8847J03660
12692E9342n2504o205j11412J93264K42360k65738Q612K77277l26551N98715k83917
12681C33243k62998j64888L59493k59834p4496K83835o35003K73261J15193p9858
12671a12052N4420m35446L62704J19707P5979k68692j65292L74591J75964o3971
12661A17912J25487k9586K21300J0110L1713l18076Q9836m50749M76255k24045
$$ plain form
12734 -83369 -74984 -213609 10054 -249052 -276974 184859 -38220 259362 218226 50145
12724 50145 -189665 -195198 166545 -312300 210289 -284546 -88663 -27250 -187188 -80060
12714 -80060 -72040 -358649 -123525 2818 -17500 378210 358446 107291 110846 -148897 -388064
12703 -388064 104390 105411 130313 192931 397935 226726 -373306 -359040 14529 -44318 59342
12692 59342 6838 633 -110779 82485 324845 59107 67719 344996 18445 617160 333243
12681 333243 70245 -94643 264850 5016 -69480 214355 -420648 -147387 -32194 -112052
12671 -112052 -57632 -493078 -130374 -10667 65312 -203380 -368672 5919 181883 117912
12661 117912 243399 213813 435113 445223 476936 158860 248696 -202053 274202 50157
12651E0157J47017J17587J19042J32862l25415l76674j14995O1205o9377J1051
12641b47540o921o306J31314l10147M20199J60411m81193K62022p1511N04309
12631C54637k33930K31993m21288J1278M88579m54514k55115L24523j25283J16035
12621C6915l23734K50436k43387O0959J94527m03352L12026n24172K49079L63573
12611b7130M0598J19885R0729j25922m63003J47272K55734q3573L01359J5760
12601B71709m85990N50749l96290Q8224k01806K2845J02914j61471M60874l05903
12591e4145k25245O00250J32649n61281j62317L51910j6236J46829j73959m6355
12581g900R4625K67248k57904j15055j66872J82282k11001K15606K04899J89676
$$ plain form
12651 50157 197174 314761 433803 566665 241250 -135424 -250419 -189214 -258591 -247540
12641 -247540 -254461 -260767 -129453 -439600 -19401 141010 -340183 -78161 -149672 354637
12631 354637 120707 352700 -68588 -57310 431269 -23245 -278360 46163 -79120 36915
12621 36915 -286819 -36383 -279770 -218811 -24284 -427636 -115610 -639782 -390703 -27130
12611 -27130 13468 133353 224082 98160 -364843 -217571 38163 -45410 255949 271709
12601 271709 -214281 336468 -59822 28402 -173404 -150559 -47645 -209116 251758 -54145
12591 -54145 -279390 320860 453509 -107772 -270089 81821 65585 212414 38455 -7900
12581 -7900 86725 353973 96069 -18986 -185858 -3576 -214577 1029 205928 395604
12571C95604J44774l68378j80298K71743k36147L42139k89683k95163K19493R1744
12561I5828r3149J47249K28354k49987l62432m7010l6501j09565m2666N86216
12551A16337n8781j22910p4704K50237M12597l67315k64727M10497k3056Q8468
12541C66643j6561j26212n689p9999k48139n774r9006k34033K36096K84587J0745
12530H2658l07671J7411k80778K80223J17701K97867k73752K33992l60954k924
12520a96227K1619M22706p0387j85128M3599J46489Q7222l21464P3102J38082
12510A59613K8281j12618m71748L78694k14663M73463N1145m2207Q5254K04755
12500E39969k46975m01446L36912j75919N1187O1699q766K18320j54733j47486
$$ plain form
12571 395604 540378 172000 -8298 263445 27298 369437 79754 -215409 4084 95828
12561 95828 2679 149928 378282 128295 -234137 -281147 -317648 -427213 -469879 116337
12551 116337 57556 -65354 -140058 110179 522776 155461 -109266 301231 278175 366643
12541 366643 350082 223870 218181 138182 -109957 -115731 -214737 -448770 -212674 71913 82658
12530 82658 -225013 -207602 -488380 -208157 -90456 207411 -66341 167651 -193303 -196227
12520 -196227 -174608 248098 177711 -7417 36182 182671 269893 -51571 21531 159613
12510 159613 187894 75276 -396472 -17778 -232441 241022 292167 249960 335214 539969
12500 539969 292994 -108452 228460 52541 103728 165427 156661 374981 220248 72762
12490G2762K27264J10886k12211O1185k55100j99628K56935K75476q3363L26406
12480E80612m00247j48970M2890k9417J31807L11328m66399K4947o462k27270
12470a87181J84167k41736l49894M20372K26431l417l12731J51163L7418k19412
12460b94820J42432K45646l51371j96989Q2316J4357J22235l9121L84712k42172
12450a32775K62049R473K02222K12234j40538l01220k69293j89973M83796m58130
12440c22155J95286l75336M4608J66225O7627L46964j28986L4089j75727l20959
12430d68364k79663Q22632K42080l58876J48350m8335p7825Q2320K02922l25866
12420f0625j51033L23125J2046j62030K18671j91659N5840k89096r4214M14681
$$ plain form
12490 72762 300026 410912 198701 259886 4786 -194842 62093 337569 254206 580612
12480 580612 180365 31395 74285 44868 176675 488003 21604 46551 40089 -187181
12470 -187181 -3014 -244750 -594644 -174272 52159 48742 -263989 -112826 -75408 -294820
12460 -294820 -152388 93258 -258113 -455102 -372786 -358429 -236194 -275315 109397 -132775
12450 -132775 129274 138747 340969 553203 412665 111445 -157848 -347821 135975 -322155
12440 -322155 -126869 -502205 -457597 -291372 -223745 123219 -5767 28322 -147405 -468364
12430 -468364 -748027 74605 316685 -42191 106159 57824 -20001 62319 265241 -60625
12420 -60625 -211658 111467 123513 -38517 180154 -11505 44335 -244761 -338975 75706
12410G5706Q886p010n7014k71086K89573l00286J05838p1902j2310O86718l25534
12399A21579k99456M28205K21768M8465l07776k35203k83148j50222J59683R848
12389b86257K05764j25582M7348K64333o8575m8863q8568O5328l1821J88396j06879
12378A4624J58543k14798l96158k9827J34157J08436J05668L4277J09932n38351
12368e13497m4668N88000J27537l9857l01086r2009N92640m0705n91323l40360
12358f55328M59655K38734n52419L44676M8876k57479L50860J50825j88415m3299
12348a03314l1409K47305k26730J9605J93136P7447Q8607L3380k12000P9834p2096
12337I3765K82623Q1308j58049r8200n4226k6583k38834k3821L56544o9600r0677
$$ plain form
12410 75706 84592 77582 20568 -250518 39055 -261231 -155393 -227295 -239605 447113 121579
12399 121579 -177877 250328 472096 520561 212785 -22418 -305566 -455788 -296105 -286257
12389 -286257 -80493 -206075 -158727 105606 37031 -11832 -100400 -35072 -66893 121503 14624
12378 14624 173167 -41631 -437789 -467616 -333459 -225023 -119355 -85078 24854 -513497
12368 -513497 -558165 29835 157372 117515 -183571 -275580 317060 276355 -314968 -655328
12358 -655328 -195673 43061 -509358 -164682 -115806 -373285 -22425 128400 -60015 -103314
12348 -103314 -134723 112582 -114148 -94543 98593 176040 264647 298027 86027 165861 93765
12337 93765 376388 457696 299647 201447 147221 120638 -118196 -142017 214527 144927 54250
12326E4250k99309O1488P3528j3075Q7110L76763M523K51517j21663m00919k13292
12315a39079m7085L63345O010n66096L10879K22935N5737n68742J20010K51916
12305I830j73123L50261L03243J06414p96823l39008K43492L97048J50240j55924
12295I5650J08649N9661m30204k43603L03431j77417p3305J4942J09496q5239
12285c17939J73901J37985n19334M16427O1058K72972M8333Q092J28167j17382
12275B92280l45830j02011r1545m1295K79612L70213k57960R6108j2927j25322
12265F1323l50704j17185K67017j00812K78849K21072l53911k76354R1725j93290
12255d72270K02474k37586K45310M86529j13922J32066n9607j35306n00609k4131
$$ plain form
12326 54250 -245059 -183571 -110043 -123118 -36008 340755 345278 596795 475132 74213 -139079
12315 -139079 -186164 177181 183191 -382905 -72026 150909 206646 -362096 -242086 9830
12305 9830 -163293 186968 490211 596625 -200198 -539206 -295714 101334 251574 95650
12295 95650 204299 263960 -166244 -409847 -106416 -283833 -357138 -342196 -232700 -317939
12285 -317939 -144038 -6053 -525387 -108960 -47902 225070 273403 281495 409662 292280
12275 292280 -53550 -155561 -247106 -288401 -8789 361424 103464 199572 186645 61323
12265 61323 -289381 -406566 -139549 -240361 38488 259560 -94351 -370705 -278980 -472270
12255 -472270 -269796 -507382 -262072 224457 110535 242601 182994 47688 -452921 -477052
12245d77052L82009Q0512O3522j32990J91408k80010P399j28166j38367m0101
12235d71836M94586J24962l65213j03486N28073p6489l12339m9003l14140N43019
12225a866L68862j78870Q0700Q1049n2888L89695k55537n8223l40505L0750k29050
12214a65883O97179k05110k01646l5933J33349m38168n0073N56210l85898r1137
12204a87110L04057j59062k2193K83382k10687J52060N4915j61783k20612j51320
12194c18353Q7139J721K34460J96426k77118J29836Q4061l58239n8374j15154
12184c93595J88173j19576p0511K0801J64335j45003L55440k80877l06410n7571
12174f44794K72880Q58771k76835k27951k3383l4727l51966L16429m9991M24003
$$ plain form
12245 -477052 -95043 -14531 48991 -83999 107409 -172601 -165202 -293368 -431735 -471836
12235 -471836 22750 147712 -217501 -320987 207086 130597 -181742 -230745 -544885 -1866
12225 -1866 366996 188126 268826 349875 296987 686682 431145 372922 32417 63167 -165883
12214 -165883 531296 326186 124540 88607 221956 -216212 -266285 289925 -95973 -187110
12204 -187110 116947 -42115 -64308 219074 8387 160447 215362 53579 -167033 -318353
12194 -318353 -231214 -229493 4967 201393 -75725 54111 138172 -220067 -278441 -393595
12184 -393595 -205422 -324998 -395509 -374708 -210373 -355376 64 -280813 -587223 -644794
12174 -644794 -371914 486857 210022 -17929 -41312 -76039 -428005 -111576 -161567 262436
12164B62436j81611J38388j67569j82208J90257j16172j57731K1360M91170J55657
12154D53977n79704O0914l65878K2823L98988J21419J83751l65765M201q2323
12144a47597k1815j74036j91440L58991L50248j24078J10678k27720q0779J45175
12134b373J36434L34565k7801J63379l10513k77050o5421N7515J78176o0652m6680
12123G9579N69840n31650n5252l66327R2749M351r0180M21860k67415m51800K49079
12112c45166j70076O40883P2699l99170n8722Q3848L06469K39651J05176m44594
12102C0998K59697q3370l8540n4959l11155L87826L4685l92866m10674K18464
12092c59894N72380m47357k86464J5842l2465O61715q0719J02384r6308k09547
$$ plain form
12164 262436 80825 219213 51644 -130564 59693 -56479 -214210 -192850 298320 453977
12154 453977 -125727 -64813 -430691 -407868 -8880 112539 296290 -69475 -65274 -147597
12144 -147597 -169412 -343448 -534888 -175897 174351 50273 160951 -66769 -147548 -2373
12134 -2373 134061 468626 440825 604204 293691 16641 -48780 8735 186911 126259 79579
12123 79579 649419 117769 62517 -303810 -211061 -206710 -296890 124970 -142445 -594245 -345166
12112 -345166 -515242 125641 198340 -200830 -259552 -175704 130765 370416 475592 30998
12102 30998 290695 207325 168785 113826 -197329 190497 225182 -167684 -578358 -359894
12092 -359894 212486 -234871 -521335 -505493 -537958 123757 43038 145422 49114 -160433
12082a60433K67549N1682q7805j75702N93152m31462k18825j34063K12095L13117
12072B29305K6661j62114m2163P5062K04633l19436l8502J16577p5167k95542
12062b80686K56467K46855l82393J04265N66194m57691k78193K63590J88045K47742
12052D74195l79569l2181L3913o06951O61327j62993L17110j31397p05302L28944
12042b02904L0029N4430j09989j53695L57346Q8035k82141j41195J1334l01181
12032f49931L22789r105L21084O3674l39911k03918K02118L6286j46112J79402
12022b23624L53038K74513j44653k73723M21111J73622k74830k0262j02539l29170
12012a46517K77237K33494r8324k30414o2239K89637j69898q3483J3939j62490
$$ plain form
12082 -160433 107116 158798 70993 -104709 488443 56981 -161844 -295907 -83812 229305
12072 229305 255966 93852 51689 126751 331384 11948 -26554 90023 14856 -280686
12062 -280686 -24219 222636 -159757 -55492 510702 53011 -225182 38408 226453 474195
12052 474195 94626 62445 96358 -510593 150734 -12259 304851 173454 -531848 -202904
12042 -202904 -172875 -118445 -228434 -382129 -24783 63252 -218889 -360084 -348750 -649931
12032 -649931 -327142 -336247 -15163 48511 -291400 -495318 -293200 -256914 -403026 -223624
12022 -223624 129414 403927 259274 -14449 406662 580284 305454 285192 182653 -146517
12012 -146517 130720 364214 265890 35476 -26763 262874 92976 9493 23432 -139058
12002a39058J00429r2773o6266j83822K31798K45260Q1549n5831j82303J89635
11992A28618K85858j49804r9490k05951j41378P6849N6182j63431k40619K64405
11982a88761K43853q0651l66605L42449j20759m29127O87362J6386k92524L78628
11972A90251m34463J86087o23748Q08398Q3673k44762J55383j74595K31696k89079
11962a11159L4491K57528n6794j77287J12055J34356l45148L33354k46196p3666
11952a38466M80477K90552k99030J63271J42066p00544r7800J81833p1842M42375
11942C92892m22777k53692j3644M17683L24756k81586j72110L73247m42214J23361
11932D5916k84973j05692k34447M75193j12412R8144j95514l43561M12472K14310
$$ plain form
12002 -139058 -38629 -131402 -197668 -381490 -149692 95568 177117 121286 -61017 128618
11992 128618 414476 264672 165182 -40769 -182147 -105298 -49116 -212547 -453166 -188761
11982 -188761 55092 -25559 -392164 -49715 -170474 -599601 87761 104147 -188377 190251
11972 190251 -244212 -58125 -681873 126525 210198 -34564 120819 -53776 177920 -111159
11962 -111159 -76668 180860 124066 -53221 58834 193190 -151958 181396 -64800 -138466
11952 -138466 342011 632563 333533 496804 638870 -61674 -159474 22359 -49483 392892
11942 392892 -29885 -283577 -297221 120462 445218 163632 -8478 364769 -77445 45916
11932 45916 -239057 -344749 -579196 -104003 -216415 -118271 -313785 -657346 -244874 -30564
11922c0564N7166J44653q30971J13627N03257L7248K47190j99554k53767l06625
11912e18340l3168L15347K08004J81676m76652K28418k18314o6079M27062m2269
11902E685N06629n68489k32669k88139L88389J6256J20254K91624k88534j10693
11892a59687J96227k2818L72370L93668l27492l54229O6183m15877P2383K50944
11882G1672K64402m22374L6980J80669j68132j44066L4288M8549J71977k34202
11872a60237l14146M05879R8951l60493L34717M3130J50817k21921K39485j17501
11862I8681K9408k23745M2020j67761M64929R5377j14510n48106K59890J54017
11852I0200n2839j90400L41645k46437m1742K64994m47013n7015K17485q203J90684
$$ plain form
11922 -30564 26602 171255 -659716 -546089 -42832 -5584 241606 42052 -211715 -518340
11912 -518340 -551508 -236161 -28157 153519 -323133 -94715 -313029 -379108 47954 5685
11902 5685 512314 -56175 -288844 -576983 -188594 -172338 -52084 239540 -48994 -159687
11892 -159687 36540 13722 386092 779760 452268 98039 164222 -251655 -179272 71672
11882 71672 336074 -86300 -49320 131349 -36783 -180849 -146561 -98012 73965 -160237
11872 -160237 -474383 -68504 30447 -330046 4671 47801 198618 -23303 216182 98681
11862 98681 128089 -95656 -53636 -221397 243532 338909 224399 -323707 -63817 90200
11852 90200 37361 -153039 188606 -57831 -99573 165421 -281592 -338607 -121122 -129325 61359
11841F1359J76565j16780k12576j22226k20327P04683j42807K19153j23881p35285
11831e12122K81415L15422p29j61247J59342r4219K39235M9905k16409J28222
11821A88815n20326K98875p586M59947j22923q35578K65357R3485J68419J81611
11811A70096k8601L0985m52837J99135L52217o41917j22980K54388M98644o47039
11801c87909K96720l29686j9096L56828N083J84383j90019l69944L76828L3195
11791d3617j57094J59552M2892j73855K21179j55560J99096k49216K17220l01947
11781b41350K57112J71306Q5189k64200o8868l3484j05364j32955L72417k56499
11771b16696K00146M26829k74097K7098r8362k40294J84853l4655q7713Q3903
$$ plain form
11841 61359 237924 121144 -91432 -213658 -433985 270698 127891 347044 223163 -512122
11831 -512122 -230707 84715 83986 -77261 82081 -12138 227097 277002 60593 188815
11821 188815 -331511 -32636 -40222 419725 296802 -538776 -273419 -179934 -11515 170096
11811 170096 141495 172480 -280357 -81222 270995 -370922 -493902 -239514 259130 -387909
11801 -387909 -91189 -420875 -439971 -83143 -78060 106323 -83696 -453640 -76812 -43617
11791 -43617 -200711 -41159 1733 -172122 49057 -106503 92593 -156623 60597 -241350
11781 -241350 15762 187068 272257 8057 -60811 -94295 -199659 -332614 39803 -216696
11771 -216696 -16550 410279 136182 163280 64918 -175376 9477 -25178 -112891 -28988
11761b8988j42217N9040j57872L1770K60148j37223j80190j01590n4231j11477
11751e62830J13734J79626J62019P9129J58777K57010k89749p81327O09595J53551
11741G9535l63207l42273R6313K01789K42683J22429l01191k67874L17071j31342
11731c46067m25445M84057L72785J70979j74053M19550M659p81564j42288R4601
11721c22786r5599Q21808m85018k11101K21185L59234m3382l60953j23969j39731
11711c80312J21973J07865J26235j97144O3418j38395J08537r1422L34235K75701
11701C30691N3964K13950n66119l01547k69209K89412J77160L6386N8609R863
11691C3160m76291n00155N46533K51856j719k9653L0817K303L00249m06631j05997
$$ plain form
11761 -28988 -171205 -112165 -270037 -238267 21881 -115342 -295532 -397122 -451353 -562830
11751 -562830 -449096 -269470 -107451 -28322 130455 387465 97716 -683611 -74016 79535
11741 79535 -283672 -625945 -529632 -327843 -85160 37269 -263922 -531796 -214725 -346067
11731 -346067 -771512 -287455 85330 256309 82256 501806 506465 -275099 -417387 -322786
11721 -322786 -418385 403423 -81595 -292696 -71511 287723 244341 -116612 -240581 -380312
11711 -380312 -258339 -150474 -24239 -221383 -157965 -296360 -187823 -279245 54990 330691
11701 330691 384655 598605 32486 -269061 -538270 -248858 -71698 -35312 23297 33160
11691 33160 -443131 -943286 -396753 -144897 -146616 -176269 -145452 -143149 157100 -249531 -355528
11680c55528l7615K7737M29159K02803J77341l92186M9262m15146M0591M81119
11670B07537K20219n23592q4094L09642L74406m86561o3816J46384m41815J27326
11660b14364K01107j07229k96199P0402m6035M80980Q2168n30336K24068J12573
11650b2865J93047j58444l30021L24027L0642j73772j2087m761M83482o40751
11640c11503K21810j12747J98606j82661L030O5139k2904M1434L28344n6550j69124
11629B874K86699o6262L42633l10735l17006o741J5312q136j82132J24698R5047
11618b3749r2445L60683p9265j92552J52n4027K35136l89735L45063N8268m24060
11607b56531J15202N22352m51024n5867L31961J58161k27837j27884J10600k59941
$$ plain form
11680 -355528 -393143 -365406 63753 266556 443897 51711 100973 -314173 -273582 207537
11670 207537 427756 -95836 -179930 129712 504118 17557 -46259 100125 -341690 -214364
11660 -214364 -13257 -120486 -416685 -346283 -392318 88662 170830 -359506 -135438 -22865
11650 -22865 170182 11738 -318283 5744 36386 -137386 -149473 -154234 329248 -311503
11640 -311503 -89693 -202440 -3834 -186495 -183465 -118326 -141230 -99796 228548 171998 2874
11629 2874 289573 223311 565944 255209 -61797 -68538 -53226 -61362 -243494 -118796 -23749
11618 -23749 -116194 244489 165224 -27328 -27176 -81203 153933 -235802 109261 167529 -256531
11607 -256531 -141329 381023 -70001 -125868 206093 364254 136417 8533 119133 -140808
11597a40808P1099k36384J57835J09120N4654r053m110k50036M29932k04091k459
11586b4301R4024Q1614o14460M92314K38458k14180K61703j26064r0262J08315
11576B07161q5612j97199J01219j53915j2260L54415k2512l08653J65564J3319
11566F1527J61883N25376m35038k91555j91235J36649j36738L59060K36281k03318
11556B22892J4N0348j39513K26807l86006l4381L07573m07408k39626j06194L17203
11545a88291j85646N32981J56291j26066p6007j32965J70488j30960m5876j99380
11535b25431k60390M0298N31857j5102k03810J39031j05949k5431j60973J49393
11525a36507K67519k65144m3663J15992J03526L185K60957K63501m04340J79779
$$ plain form
11597 -140808 -69709 -306093 -148258 -39138 15516 6463 2353 -247683 182249 -21842 -24301
11586 -24301 69723 151337 -463123 29191 267649 53469 315172 189108 98846 207161
11576 207161 121549 -75650 25569 -128346 -140606 213809 191297 -117356 48208 61527
11566 61527 223410 748786 313748 22193 -169042 -32393 -169131 189929 426210 222892
11556 222892 222906 273254 133741 360548 -25458 -59839 247734 -159674 -399300 -505494 -188291
11545 -188291 -373937 159044 315335 189269 113262 -19703 150785 19825 -26051 -225431
11535 -225431 -485821 -445523 86334 71232 -132578 6453 -99496 -124927 -285900 -136507
11525 -136507 131012 -134132 -177795 -61803 41723 44908 305865 569366 165026 344805
11515C44805j20042k77011L07448K32455l13449n2842p2258n8044M11292l98396
11505C958J67633J18898o50730P2603K45675l91150N02875M66303m75538J11910
11495A72437p9314O2139j60642o53992N54671J91586M08424l1069n66564P9219
11485b3105L23418R7952J60330k85434m58894K36840l07536J88568r3058m50958
11475f11877N60219L21036K71329l77310l87502K69655L91149M0243j04288n36274
11465a63620J97409k35300j33175O68947m01917n08289J31143P91266l26266r8434
11455g8236K44856k83676J85344L6783k29610l31403n4177M44383M91292j90271
11445B35285l19853J31556p5026L09411k23963m91923L56054k31828J0732J30258
$$ plain form
11515 344805 224763 -52248 255200 487655 174206 121364 49106 -8938 402354 3958
11505 3958 171591 290489 -360241 -287638 -41963 -433113 69762 536065 60527 172437
11495 172437 93123 155262 -5380 -659372 -104701 86885 495309 464240 -102324 -23105
11485 -23105 300313 398265 558595 273161 -185733 51107 -256429 -67861 -160919 -611877
11475 -611877 -51658 269378 540707 163397 -224105 45550 436699 476942 372654 -163620
11465 -163620 33789 -201511 -334686 334261 -67656 -575945 -444802 346464 20198 -78236
11455 -78236 166620 -117056 68288 105071 -124539 -455942 -510119 -65736 425556 235285
11445 235285 -84568 46988 -28038 281373 57410 -434513 -78459 -310287 -299555 -169297
11435a69297L69645L28097l58558J72111k13635j1025l43748R4738K81780n05190
11425c55082P601J47882j64561m3781K04547K09103l91299K07022N56789m52124
11415g3903L5298L06383k74468J96667l34201K78752m36701L05799K05941K87182
11405D96749J53895k13484o05815M9827m27178L28337m3253q9181m9278k20858
11395f20239Q13200P1474l33978j33634L35182j66554k96107J9446K03028l48339
11385d56521J11781k3951K55558N9357o1439K15750Q6852k1135l24466k54043
11375d12257N44239k14880j45821K78564j33244L66406k83779R4660J67034k9349
11365B31573p18627j61794N12116l3134j45584N82308j957o0639p4206J18708
$$ plain form
11435 -169297 200348 528445 169887 341998 128363 117338 -226410 -131672 150108 -355082
11425 -355082 -347481 -199599 -364160 -407941 -203394 5709 -385590 -178568 378221 -73903
11415 -73903 -38605 267778 -6690 189977 -144224 134528 -302173 3626 209567 496749
11405 496749 650644 437160 -168655 -118828 -546006 -217669 -260922 -350103 -399381 -620239
11395 -620239 192961 264435 -69543 -203177 132005 -34549 -330656 -311210 -108182 -456521
11385 -456521 -344740 -368691 -113133 -53776 -115215 100535 187387 166252 -158214 -412257
11375 -412257 131982 -82898 -228719 49845 -83399 283007 -772 93888 260922 231573
11365 231573 -487054 -648848 -136732 -169866 -315450 266858 264901 204262 130056 248764
11355B48764O2634n5684r7411J19270m31841m369J70618l60476L64531j65593
11345a49557L71807j01639j5276k27096j67654l03385N53964M902p8801m744J07657
11334i822l36359L55691j26857K65280J08228l41746k6130J44484J11219K75828
11324D19816q29231K47090K7045L67841o4993j56475j11129o9918J1438j10643
11314b69159J15690j14585J26940M4963L03416n47435L11477k47234K04262N94326
11304E22661R0466k63877Q5177j35218j30002p8816m35761j89244k1236K47312
11294c08538J1558L25212p3224J62520M4806k06057J38709j09195j1362q6824
11284a12395M04939Q052j50748j82623l3288k35046L13661J42923l40984J53515
$$ plain form
11355 248764 311398 255714 158303 277573 -154268 -158637 11981 -348495 16036 -149557
11345 -149557 222250 120611 105335 -121761 -289415 -592800 -38836 -33934 -112735 -117479 -9822
11334 -9822 -346181 9510 -117347 147933 256161 -85585 -111715 32769 143988 419816
11324 419816 -409415 -162325 -135280 232561 167568 11093 -100036 -169954 -158516 -269159
11314 -269159 -153469 -268054 -141114 -96151 207265 -340170 -28693 -275927 -71665 522661
11304 522661 613127 349250 434427 299209 169207 90391 -345370 -534614 -555850 -308538
11294 -308538 -296980 28232 -44992 117528 162334 -43723 94986 -14209 -25571 -112395
11284 -112395 292544 300596 149848 -32775 -66063 -301109 12552 155475 -185509 -31994
11274c1994J1761K71178N6597L01763m95816j62903p4570r1178K81378l14435
11264b48219L21435k67022J56851q1717K88532K8648j13254m8612R6380q5236
11254D7786l45688j32247l4377P11855j41334k34049k61445K73248K52068P8865
11244B14682J1645l36231M16469P1232q5594q99637L62253K32315K4889n02726
11234d90703j66214L72393j40523L63215P7533N76459l53772k26459j99307J8741
11224a68637O08078k44122j88543Q5519j43675j40178L86525N26k26083m8641
11214g9231K0833n31900K92667J54236j72439N45265p8237j40234k98820K59909
11204b7951J71153p2401L17091l68086n6797M87401l13401j24617R9380K0518
$$ plain form
11274 -31994 -20233 250945 307542 609305 113489 -49414 -123984 -215162 66216 -248219
11264 -248219 73216 -193806 -36955 -118672 169860 198508 85254 36642 133022 47786
11254 47786 -297902 -430149 -464526 247329 105995 -128054 -389499 -116251 135817 214682
11244 214682 226327 -109904 306565 377797 292203 -607434 -245181 -12866 12023 -490703
11234 -490703 -656917 -284524 -425047 -61832 15701 592160 238388 11929 -187378 -168637
11224 -168637 439441 195319 6776 92295 -51380 -191558 194967 195493 -30590 -79231
11214 -79231 -58398 -590298 -297631 -143395 -315834 229431 151194 10960 -287860 -27951
11204 -27951 143202 70801 387892 19806 -36991 450410 137009 12392 111772 132290
11194A32290j800o8225n69028M06726r7279l71249N51247j94507k13300K20187
11184b04938N08625j69962n30512j56536J10088N10832J4737n63833L63334j7491
11174a35656J31350K2433m56621M05150n2432J25126L894l80996K09029k82637
11164d11360L07326P5476k30839k3554j77497L65323K91610p5596j22642j88843
11154a90596j2689N70978m90056m0546O11762l85936j62625N65954n3489o00006
11144a87249L78877o3609l35824K45214N32576n96345j38952L86762Q7502K96029
11134F04981q12525J96681J36701m03708j38751J33709L24530j6304J00268J5318
11124A40900J482j83648J88706q6985o56318N7997K59856K44595K09193j41035
$$ plain form
11194 132290 130490 62265 -506763 -100037 -197316 -568565 -17318 -211825 -425125 -204938
11184 -204938 303687 133725 -396787 -553323 -443235 67597 82334 -481499 -118165 -135656
11174 -135656 -4306 18127 -438494 -33344 -85776 39350 43244 -337752 -128723 -411360
11164 -411360 -104034 -28558 -259397 -282951 -460448 -95125 196485 120889 -1753 -190596
11154 -190596 -203285 367693 -122363 -162909 448853 62917 -99708 466246 412757 -187249
11144 -187249 191628 128019 -207805 37409 569985 -26360 -165312 221450 308952 604981
11134 604981 -207544 -10863 125838 -277870 -416621 -282912 41618 25314 125582 140900
11124 140900 142382 -41266 147440 60455 -595863 -537866 -278010 -33415 175778 34743
11114C4743k39608j34346R0686Q546j27885M48520L97483j58086k55539r9101
11104c4587j14476j35616k16640M07031j3231n39391M69602J800L1043M21383
11094B76918l63110n76458P9698K95816K72280J94045q9504k05484k68690O3542
11084c20947L13767J62515j44868J16433o553j80679j83206M31453n2988j97624
11074f2697k44629K91020J56159r7129R3937n8404l14924K09551J93403n55423
11064c89136Q71830k54884j44045J19328l21062J25169m3762p5168L93908l2791
11054B49387m87736j94969J29954M361J35796K32610J1074L33771n0903n776N1040
11043D08609J69883m6962J54813m09770L2538k92558j6532O1711M31397m22616
$$ plain form
11114 34743 -204865 -339211 -248525 -239979 -367864 80656 478139 320053 64514 -34587
11104 -34587 -149063 -284679 -501319 -94288 -107519 -646910 -177308 -175508 -144465 276918
11094 276918 -86192 -662650 -582952 -287136 -14856 179189 89685 -115799 -384489 -320947
11084 -320947 -7180 155335 10467 126900 120347 -60332 -243538 187915 134927 -62697
11074 -62697 -307326 -16306 139853 42724 136661 78257 -236667 -27116 166287 -389136
11064 -389136 482694 227810 83765 203093 -117969 7200 -36562 -111730 282178 249387
11054 249387 -238349 -433318 -303364 -299003 -163207 69403 80477 414248 363345 357569 408609
11043 408609 578492 531530 686343 276573 309111 16553 21 61732 493129 70513
11033G0513j57352j0800K31502j49098p2323R4049k50279j46245j31125J06843
11023d14315Q7072L63629o62236M15399R2259K01976n8601j11140R9972Q6274
11013A00289K04021J74575m19637k99019l1952j49739K77624L62253M5694o11901
11003c47792o2877N71343M110r9224j47037K36173k04733Q8711l1738J72922j30254
10992D9604p0011k58030L10523Q9791j59078L06494j36256K2257j46980q0831
10982g2517N09110l11860m15487M73099m59053l38606P95627o55012k40549L08456
10972d06792J6287L3539K42071L86694p7847m01086k06242J83722N85864L8314
10962C94524m48386j28556j77015K36841o1526J66714q3199M37719m91776n19747
$$ plain form
11033 70513 -86839 -97639 133863 -15235 -87558 6491 -243788 -390033 -521158 -414315
11023 -414315 -327243 36386 -625850 -210451 -118192 83784 25183 -85957 14015 100289
11013 100289 304310 478885 59248 -239771 -271723 -421462 -143838 218415 264109 -347792
11003 -347792 -410669 160674 164784 65560 -81477 154696 -50037 38674 6936 179858 49604
10992 49604 -20407 -278437 32086 121877 -37201 269293 133037 155294 8314 -72517
10982 -72517 436593 124733 -290754 182345 -276708 -615314 180313 -474699 -715248 -406792
10972 -406792 -390505 -356966 -114895 271799 193952 -207134 -413376 -229654 356210 394524
10962 394524 -53862 -182418 -359433 -122592 -184118 -17404 -100603 337116 -154660 -674407
10952f74407L75053J29507J02881M04024l7102l32756O9081k97919n9431J02324
10942b18745O1470J27026n4354l0419K78324K36371j78262l03935Q7100K03497
10932B08073L7740k36221p9803J18981n77161M54837M46115k6721K92284l4590
10922F03534k02335o88383j16290J72651J52659J99344k37582k0897k38067J4834
10912c60532O538J3230J88411L2856m433L90366N071n89213N7894L29028Q384
10901G7600L3222k9999J54133l13982j70682Q34513j89629k89454l1974J3091
10891H6839J96861M5007J58804k52084J59256k86392o189k84115Q4390m0003N5224
10880h2402m5946J00547N14504k58614m20182k9619o712J58274L29153k99134
$$ plain form
10952 -674407 -299354 -169847 -66966 337058 299956 -32800 36281 -261638 -321069 -218745
10942 -218745 -157275 -30249 -84603 -115022 163302 399673 221411 -82524 4576 208073
10932 208073 245813 9592 -70211 48770 -528391 -73554 372561 345840 638124 603534
10922 603534 401199 -287184 -403474 -230823 -78164 121180 -116402 -137299 -375366 -360532
10912 -360532 -353994 -340764 -152353 -119497 -123930 266436 271507 -317706 -259812 69216 77600
10901 77600 110822 80823 234956 -79026 -249708 584805 395176 105722 73748 86839
10891 86839 283700 328707 487511 235427 394683 108291 102102 -182013 -97623 -137626 -82402
10880 -82402 -128348 -27801 486703 228089 -192093 -221712 -228424 -70150 259003 -40131
10870d0131l47165L76886L96071K80446j47951m32609l06601O30849k38407n02873
10860c31485L1951J32370R2069J31156J03687j00386k95665j03842m0916P1966
10850c09095k06691k05213J85458l6762M57433j54515m4515O7053k25366j10152
10840e82365M26328K74888m05339n03261Q87566o0454K65709n28901j09789l0254
10830c65872k669M9137M24538P12058o53407j41623k53886j67676L01045J13778
10820A5423J27659k27525j18162m0832N57840R0376m4857P0970k27564N5853j40658
10809A18523K32235j75714j97464K76408r1887O1206k86852P5024N96044j97873
10799D09650m15178K85298J75890m15213J82388j31877m23813Q8406M27429q6708
$$ plain form
10870 -40131 -387296 -10410 385661 666107 518156 85547 -221054 409795 171388 -331485
10860 -331485 -299534 -167164 -75095 56061 159748 59362 -236303 -340145 -381061 -309095
10850 -309095 -515786 -720999 -535541 -572303 -114870 -269385 -313900 -246847 -472213 -582365
10840 -582365 -156037 118851 -286488 -789749 97817 37363 303072 -225829 -335618 -365872
10830 -365872 -368541 -319404 105134 817192 163785 22162 -231724 -399400 -98355 15423
10820 15423 143082 -84443 -202605 -243437 314403 404779 359922 430892 203328 259181 118523
10809 118523 350758 175044 -22420 253988 162101 223307 -63545 11479 607523 409650
10799 409650 -5528 279770 455660 40447 222835 90958 -332855 -244449 182980 96272
10789I6272k41709L03824q3486L86063j25474k24001j99341o990j23987j02449
10779c21278N08731m275j20947N8048j53947N27715m30447l50426J97936n4440
10769a43330L2156m3339Q4445K55096R6163m692m3639N8863l28272l86198J49459
10758b73288q5165M54444j11887k81104L17501L86757k52266J06270r3654n6279
10748A11329k67001J64795J18144N60428M2443m7909J0675l18053o47563O08864
10738C36152j58196K5327O416k60337k45069j36442M24590m22263j07817K05393
10728c32246J02135J81075K49789J16836O1743l70923K10871N4671P3572l1435
10718C16088m15969K60505L8805m66838l79982J38943K11315j03204r225m3593
$$ plain form
10789 96272 -145437 158387 74901 460964 335490 111489 -87852 -94842 -218829 -321278
10779 -321278 187453 183178 62231 120279 -33668 494047 63600 -286826 -88890 -143330
10769 -143330 -111174 -154513 -70068 185028 281191 276499 232860 291723 -36549 -422747 -273288
10758 -273288 -358453 95991 -15896 -297000 20501 407258 154992 261262 167608 111329
10748 111329 -155672 9123 127267 687695 730138 682229 692904 374851 -272712 336152
10738 336152 177956 203283 209699 -50638 -295707 -432149 -7559 -429822 -537639 -332246
10728 -332246 -230111 -49036 200753 317589 379332 8409 219280 273951 347523 316088
10718 316088 -99881 160624 199429 -267409 -647391 -508448 -297133 -400337 -409562 -453155
10708d53155K86347j56289M14797m9136j37014j07407M6404L00539J82135q3554
10698B43667r1643J23415n31630K74181N53089o8939j03535j88679m91861j54888
10688d36823Q9839p9612N7098L22415J63685J83639l01187j06889J58592m33716
10678c82959L9331L04798j59188K29085L19243k97373n52464M94140J67049l09403
10668a47741o10178N29400O87467l69472l1095l25585K70020K89608K19442j4143
10658D97723m44611M776K2943k339k4332k15622O8834J59423J50766j43935j43696
10647g0070K60587K4573N0179j0537j69451j55172r1408l3107M1242K94468L87695
10636E28999p93630J02294L30272l71484N12032j53583r3460M02276q8479m16684
$$ plain form
10708 -453155 -166808 -323097 91700 42564 -94450 -201857 -155453 145086 327221 243667
10698 243667 152024 275439 -256191 17990 571079 502140 398605 209926 -281935 -436823
10688 -436823 -346984 -426596 -369498 -47083 116602 300241 -946 -107835 50757 -382959
10678 -382959 -343628 -38830 -198018 31067 350310 52937 -499527 -5387 161662 -147741
10668 -147741 -757919 -228519 458948 89476 58381 -267204 2816 292424 511866 497723
10658 497723 53112 57888 80831 78492 54160 -161462 -92628 66795 217561 73626 -70070
10647 -70070 190517 215090 265269 254732 85281 -69891 -161299 -194406 -153164 141304 528999
10636 528999 -264631 -162337 167935 -203549 308483 154900 61440 463716 375237 -41447
10626d1447L74782q0590M38344n65015J93870K44917l35550K72881j69786M5128
10616C77534K64853M0328k51284R7650L01778M68918m3113o91446m9313M16706
10606I32611O1099P39161n64915o62183L34872J50971o9115J73762k52897n61851
10596B81515J81070J6163L33447L5361J7304j75973k03858K59138k17252n90707
10586f3792L78756M92848K56409k17849L19166J39527N43055k8541m43067k94000
10576A082512n9137P2307M0369n69697o87319Q41402L0070q2378M7567J23850
10566H39546J64357l71591r0963R8231K42535l39950L98424J51l10629R7463L5744
10555G63318l99895K39580P5905m63681L91815k13651M09979K13047q96670J2893
$$ plain form
10626 -41447 333335 252745 691089 126074 319944 564861 229311 502192 332406 377534
10616 377534 642387 682715 431431 529081 830859 1299777 1256664 565218 515905 932611
10606 932611 993710 1732871 1167956 505773 840645 991616 922501 1096263 843366 281515
10596 281515 462585 478748 812195 847556 864860 688887 485029 744167 526915 -63792
10586 -63792 314964 807812 1064221 846372 1165538 1305065 1848120 1819579 1376512 1082512
10576 1082512 1023375 1095682 1136051 566354 -120965 720437 750507 668129 715696 839546
10566 839546 1003903 632312 541349 639580 882115 542165 940589 940740 630111 727574 763318
10555 763318 363423 603003 678908 215227 607042 393391 803370 1016417 119747 132640
10545A32640P10331k22086q9191k59872k88720K46150N44137K3839q89075O68031
10535E76184M16556r65775P79477j17089n7599K94147j98220j71436J17247j6112
10525F57380j25661j06625L90333J80018J70789l98822j91279k0485J91426j10015
10515F37059K02103q7306J9151m02418K53860J01237L43871N42466n79917J7503
10505A047609n71584J63121J77728K29140M94572l37848P0134K17172l19383J05114
10495A275775n41420M84579k13512K4215j36005k26777J57649J38171M3241n1833
10485I54083J47356L2470J30278K40311k36868k02942j15569j62439L5083p0099
10475G51664K58481j6884q4185k57751K29089l39314K98113N47383n6313j18017
$$ plain form
10545 132640 842971 620885 531694 271822 -16898 229252 773389 797228 -91847 576184
10535 576184 992740 26965 806442 689353 631754 925901 727681 556245 673492 657380
10525 657380 531719 425094 815427 995445 1166234 767412 576133 555648 747074 637059
10515 637059 839162 751856 771007 368589 622449 723686 1067557 1610023 1030106 1047609
10505 1047609 476025 639146 816874 1046014 1540586 1202738 1272872 1490044 1170661 1275775
10495 1275775 734355 1218934 1005422 1029637 893632 666855 824504 962675 1005916 954083
10485 954083 1101439 1133909 1264187 1504498 1267630 1064688 949119 786680 821763 751664
10475 751664 1010145 993261 909076 651325 880414 541100 839213 1386596 1330283 1212266
10465A212266j17786m11508p8911J39445j8444J48417J75008J7900J74040k62685
10455I77742j2920N9539n9612l51957k02899K31255o7121L34723M07280k70308
10445A045722K16353k25148O47181j37580o3572r3466j47972P6071J93005K6797
10435A537391l72195K14909J73731J16927j44935p4340k42140j43912P09731K76901
10425B052068o55914K5884j76576L52965p5004O2341J2476r4102Q6213J67275
10415A757626K51284L14938J89883r4376J7896O38299k54611n923l52511P57852
10405C220357r5348p7363l8422K48612r9819J33953L32204j6560j74941K01472
10395C634145M12366k01553K76615K52351l32308K37791N79292p4287K62392J36658
$$ plain form
10465 1212266 1094480 682972 604061 743506 725062 873479 1048487 1066387 1240427 977742
10455 977742 964822 1024361 964749 612792 409893 641148 574027 908750 1316030 1045722
10445 1045722 1262075 1036927 1684108 1546528 1482956 1389490 1241518 1317589 1510594 1537391
10435 1537391 1165196 1380105 1553836 1670763 1525828 1451488 1209348 1065436 1775167 2052068
10425 2052068 1396154 1422038 1245462 1598427 1523423 1585764 1598240 1504138 1590351 1757626
10415 1757626 2008910 2323848 2513731 2419355 2437251 3075550 2820939 2815016 2462505 3220357
10405 3220357 3125009 3047646 3009224 3257836 3158017 3291970 3624174 3607614 3432673 3634145
10395 3634145 4046511 3844958 4121573 4373924 4041616 4279407 4858699 4784412 5046804 5183462
10385E183462L83124K79945J41634P77449J92658M20624L02250O44462N63288
10376H888896R72692R29871L44415O81665Q76742N61825Q34940J001812M04441
10367A5497299R28478L57300N70971J015188Q40703J204506P26952J328965J312545
10358B3782907J052300J913276J953500K240110K679639K505206K534085L586941
10350D2247964L101161M320413M142691M845813N262743O726560Q444563J1099881
10342I0191789J3932801J7675133J7470471J4292279J2993118R510926K515869
10335A78582386n499636p287913j1001591j7168519j6902142j3999683j0326405
10328I6396497q228294n619540l906582k390274j255568o19398J044396J714131
$$ plain form
10385 5183462 5566586 5846531 5988165 6765614 6958272 7378896 7681146 8325608 8888896
10376 8888896 9861588 10791459 11135874 11817539 12694281 13256106 14091046 15092858 15497299
10367 15497299 16425777 16783077 17354048 18369236 19209939 20414445 21141397 22470362 23782907
10358 23782907 24835207 26748483 28701983 30942093 33621732 36126938 38661023 42247964
10350 42247964 45349125 49669538 53812229 58658042 63920785 70647345 79091908 90191789
10342 90191789 104124590 121799723 139270194 153562473 166555591 176066517 178582386
10335 178582386 173082750 165794837 154793246 137624727 120722585 106722902 96396497
10328 96396497 88168203 82548663 78642081 76251807 74996239 74376841 75421237 77135368
10320G7135368K501358M115282O150366Q006934J2222041J6935018J8559763J4510546
10312A60136676J3176514J1928106M214026o272526j0559191j2709864j8650535
10305A41263206k0590441j8867040j4886138j2388486j0179452p828164o805227
10298D9718258m562453m322357l839672l330817k832073k345264k218270j922929
10290B4344423j613554j476029j344084p68944j384312q26459n56248p05891r98806
10281A4670096j136803p04340m61583r02592p27567p7350k31086o21200k94266
10272I513309m40859j89901O648k70021l72694l43522l03438m00339q3763Q617
10262G124037o77629L5727l16427m48468m28201k27531j96474K77231j79233l11437
$$ plain form
10320 77135368 79636726 83752008 89902374 97909308 110131349 127066367 145626130 160136676
10312 160136676 173313190 185241296 189455322 183182796 172623605 159913741 141263206
10305 141263206 120672765 101805725 86919587 74531101 64351649 56523485 49718258
10298 49718258 45155805 40833448 36993776 33662959 30830886 28485622 26267352 24344423
10290 24344423 22730869 21254840 19910756 19141812 17757500 16931041 16374793 15668902 14670096
10281 14670096 13533293 12828953 12367370 11464778 10737211 10659861 10428775 9807575 9513309
10272 9513309 9072450 8882549 8889197 8619176 8246482 7902960 7599522 7199183 7115420 7124037
10262 7124037 6446408 6482135 6165708 5717240 5289039 5061508 4865034 5142265 4963032 4651595
10252D651595j90805m23658L10893m5386k51165J03918j64744k85273j4747j39462
10242C551166r318n3147n1347L82317j15588n83295k61506l4277J71769l11587
10232B685187P4783M72119j59786m31881M99827j05529K39890o6569l58286j72234
10222B677521K5093N58515l12518m14029L335j48911K05942k38350J9194K74368
10212B650160J56082j05758R7227l94108m16703M11289J2194m32296M88463o59989
10202A806561r0395M52118k78667K33189o0809K33565J19767j38345R0295j12111
10192B255168j1980j86996l59345k09335L7129L00177O41002K6697J05738n65274
10182B032981n3287K83528l78085M80338j20698m33947j89106j7005M03239l9487
$$ plain form
10252 4651595 4460790 4037132 4348025 4302639 4051474 4155392 3990648 3705375 3690628 3551166
10242 3551166 3541848 3488701 3437354 3819671 3704083 3120788 2859282 2825005 2996774 2685187
10232 2685187 2759970 3232089 3072303 2640422 3140249 3034720 3274610 3208041 2849755 2677521
10222 2677521 2702614 3261129 2948611 2534582 2537917 2389006 2594948 2356598 2375792 2650160
10212 2650160 2806242 2700484 2797711 2403603 1986900 2398189 2410383 1978087 2466550 1806561
10202 1806561 1716166 2168284 1889617 2122806 2061997 2295562 2415329 2276984 2367279 2255168
10192 2255168 2243188 2056192 1696847 1487512 1524641 1824818 2465820 2492517 2598255 2032981
10182 2032981 1979694 2263222 1885137 2365475 2244777 1810830 1621724 1604719 2007958 1968471
10172A968471j81211N78343k11807P9338k0151k71481m33567j33617M61452L84593
10162B220363l05890m49978M5808M14435k66219J03443p5207l53475M24571L96215
10152B154066J90139l02356j63932R63887n28575m08500J5252j02356O9428N83483
10142B470536n01757o27465L35976k12046J96620j78745J76668L14317j28024
10133A846080J85375j80084m77858P19423J91541K16918j82646k05265Q0646K67859
10123B461989l68150k10306J56581j47958J5793K4843k4025l20102o9393L38880
10113A858152K48824J06482N9894j00839k7058k32067k242M09426j06443J24765
10103B338894J8144k3545J35304K01909j88820m86433j65828J00046M3535k8597
$$ plain form
10172 1968471 1787260 2365603 2153796 2233134 2212983 1941502 1507935 1374318 1835770 2220363
10162 2220363 1914473 1464495 1510303 1924738 1658519 1761962 1686755 1333280 1757851 2154066
10152 2154066 2344205 2041849 1877917 2841804 2313229 1904729 1919981 1817625 1887053 2470536
10142 2470536 1968779 1341314 1677290 1465244 1661864 1483119 1659787 1974104 1846080
10133 1846080 2031455 1851371 1373513 2092936 2284477 2501395 2318749 2113484 2194130 2461989
10123 2461989 2093839 1883533 2040114 1892156 1907949 1932792 1908767 1588665 1519272 1858152
10113 1858152 2106976 2213458 2273352 2172513 2145455 1913388 1911146 2320572 2214129 2338894
10103 2338894 2357038 2333493 2468797 2670706 2481886 1995453 1829625 1929671 1973206 1944609
10093A944609j56732j77101J9014j38174M7350q7628J36207M63266m77739M1516
10083A614588L77367m21181J96961M79905p1104j01963j74271J02151k03733K08117
10073B006837m0318m53566Q41616n3621K80727J11742r6537j57428J30309J89701
10063B759462l94265k25692L7400J63883m35985J57843j23843j17362l28589P40090
10053B232942M76891n36943L1249j49731M63106P1430k33662l36254K64932L80467
10043B664427J06940M08111O4693J29636J22475l89691L19276l64886k20579M54584
10033C294986j7561L64089n72355l83019l53234L21308J41363l27027N2941K51796
10023B773287L81550n5197J47508l38947J79767J16317K0024J23058p7710j9751
$$ plain form
10093 1944609 1787877 1610776 1629790 1491616 1538966 1451338 1587545 2050811 1573072 1614588
10083 1614588 1991955 1570774 1767735 2247640 2176536 2074573 1900302 2002453 1798720 2006837
10073 2006837 1966519 1512953 2354569 2300948 2581675 2693417 2596880 2439452 2569761 2759462
10063 2759462 2365197 2139505 2176905 2340788 1904803 2062646 1938803 1821441 1492852 2232942
10053 2232942 2709833 2172890 2204139 2054408 2517514 2588944 2355282 2019028 2283960 2664427
10043 2664427 2771367 3179478 3244171 3373807 3496282 3106591 3425867 3060981 2840402 3294986
10033 3294986 3277425 3641514 3069159 2686140 2332906 2654214 2795577 2468550 2521491 2773287
10023 2773287 3154837 3099640 3247148 2908201 3087968 3204285 3224309 3347367 3269657 3249906
10013C249906J29964m24091N00636l05388K49269j77017J68726K34289j47013
10004C479281l34118l47160K92700k06709J63098q0156j60118M9534K07874J98049
9994C262275j06149p4387l00351m4376M45689J75616K18771l27375k31580J72706
9984C190839J95378m65076N54169r5881J22280J96567k7768q0069k22934j44965
9974C222540L70204j89013m26977J85371j1214J19342J90021l48685O63627K37553
9964D012769l21873K62872R8879R01413k1861L89563K15246J27531O43950j21559
9954F186930n3873O04918K97631n481L77548N05700o405K04398J80788M17173
9944H709327L34031J42125M73834M69140M40749n475N88814p8997N37817J023906
$$ plain form
10013 3249906 3379870 2955779 3456415 3151027 3400296 3223279 3392005 3626294 3479281
10004 3479281 3145163 2798003 3090703 2883994 3047092 2966936 2806818 2856352 3064226 3262275
9994 3262275 3156126 3081739 2781388 2737012 3182701 3358317 3577088 3249713 3018133 3190839
9984 3190839 3386217 2921141 3475310 3379429 3501709 3698276 3670508 3590439 3367505 3222540
9974 3222540 3592744 3403731 2976754 3162125 3150911 3270253 3460274 3111589 3775216 4012769
9964 4012769 3690896 3953768 4052647 4954060 4932199 5321762 5537008 5664539 6308489 6186930
9954 6186930 6133057 6737975 7035606 7030125 7407673 7913373 7906968 8111366 8292154 8709327
9944 8709327 9043358 9185483 9659317 10128457 10569206 10563731 11152545 11073548 11611365 12635271
9934A2635271q1010O27814Q05332Q39892Q21262J72871Q42579J653093J259410
9925A9576514J455086J234444J376976J552708J553402K076186K019559K243263
9917C3088138K690595K773857L431673M055826N487391N928366L529174J857856
9909F2842876K374876K538181P03094j922573j862153j726641j201745o45823
9901F1100092m96501M41206P07814J881329K816425K950640M209214M883639N910184
9892H4404042O657183Q015279Q571224P459307O862468Q450740J1836756J3735997
9884A55992996J2808940M214096o73060J683910L317245m590076j1760287j2674060
9876A48319704j0530683p222007n170175k213335L77476J369794L232724N411173
$$ plain form
9934 12635271 12554261 13182075 13987407 14827299 15648561 15821432 16664011 18317104 19576514
9925 19576514 21031600 22266044 23643020 25195728 26749130 28825316 30844875 33088138
9917 33088138 35778733 38552590 41984263 46040089 51527480 57455846 60985020 62842876
9909 62842876 65217752 67755933 68459027 66536454 64674301 62947660 61745915 61100092
9901 61100092 60603591 61044797 61752611 63633940 66450365 69401005 73610219 78493858 84404042
9892 84404042 91061225 99076504 107647728 115107035 121969503 130420243 142256999 155992996
9884 155992996 168801936 173016032 172342972 174026882 177344127 172754051 160993764 148319704
9876 148319704 137789021 130567014 125396839 123183504 123560980 124930774 128163498 133574671
9868A33574671O677728R549464J3184581J7476248K2928111K9882487L1899005
9861B65172295K0349723J6292687K2985531K5370600J0540588m094433o819764
9854C49797227r306435r185916m301008p239724j2892886j6020406k5297035l2810429
9846B32743388l2014241k7294010k2667118j7563195j4278551j1139508r209968
9839I8576797o777649n702948l924541l759236k007220n18946M76675K055044
9831G8417976M436542N352144M251371J931259O06052k447334n050894m836748
9823H2660368n010750n297084m967520m910421n688757n411685m727463l760909
9815D2885779k569051k918500j927765j926581j003718j249031j447727r29558
$$ plain form
9868 133574671 140252399 149801863 162986444 180462692 203390803 233273290 265172295
9861 265172295 285522018 301814705 324800236 350170836 360711424 356616991 349797227
9854 349797227 340490792 331304876 327003868 319764144 306871258 290850852 265553817 232743388
9846 232743388 200729147 173435137 150768019 133204824 118926273 107786765 98576797
9839 98576797 91799148 86096200 82171659 78412423 76405203 75886257 76362932 78417976
9831 78417976 82854518 88206662 92458033 94389292 94995344 92548010 87497116 82660368
9823 82660368 77649618 72352534 67385014 62474593 56785836 51374151 46646688 42885779
9815 42885779 40316728 37398228 35470463 33543882 32540164 31291133 29843406 28913848
9807B8913848q13301l99284k26714m95278l02625K9432K9927N97722M58035K76788
9797B8068550Q78501J00339K94501j00135n7769K24901O1866M65514N04603Q00926
9787C1241797L54262P64340J589303J264247J430811J589142J037590K172596
9779D1444088J889516K250928K949077K923742L210884L564180M131614N395170
9771F7759199O058820P653375Q686656J1142904J3819373J6998293J3113728M695978
9763A49928326M514039Q480060J8278909J3966091p172217j9223401k0560455
9756A48211352j7053509j4013720r775387p179325m765377l249564j200624K11919
9748I1185765K341666M332106P025435J0037867J2857470R686597M841214N829620
$$ plain form
9807 28913848 28100547 27701263 27474549 26979271 26676646 26706078 26736005 27333727 27791762 28068550
9797 28068550 28947051 29047390 29341891 29241756 29183987 29408888 29470754 29936268 30440871 31241797
9787 31241797 31596059 32360399 33949702 35213949 36644760 38233902 39271492 41444088
9779 41444088 43333604 45584532 48533609 51457351 54668235 58232415 62364029 67759199
9771 67759199 73818019 81471394 90158050 101300954 115120327 132118620 145232348 149928326
9763 149928326 154442365 162922425 181201334 195167425 187995208 168771807 148211352
9756 148211352 131157843 117144123 107368736 100189411 95424034 92174470 90973846 91185765
9748 91185765 93527431 97859537 104884972 114922839 127780309 137466906 142308120 148137740
9740A48137740R891320J0599229L238270n498833r823393q924371n237355n548237
9732A36834370j0916155j2814479j2392127j0477877q957075o459800m651647
9725G0165210l613513k388636j048387m13814J704095K951677N127534Q026449
9717H0510615N333325j771376l887836l146389o66124J757529q48505o134754
9709G1146485q441533q302835p526824n941689m392811l895363k811925k813127
9701B7020378k142735j544270j784849j565705j349423j088725q17863p12736
9693A6014072r86360j019247n62394m82275k14991j75660r12454o67284l61790
9684A0631617o81049j98881m9118k94718n3324p62389J04942n47571l80293m98461
$$ plain form
9740 148137740 158029060 168628289 171866559 166367726 156544333 147619962 142382607 136834370
9732 136834370 125918215 113103736 100711609 90233732 81276657 74816857 70165210
9725 70165210 66551697 64163061 63114674 62700860 64404955 67356632 72484166 80510615
9717 80510615 85843940 84072564 80184728 77038339 76372215 78129744 77281239 71146485
9709 71146485 62704952 54402117 46875293 40933604 36540793 32645430 29833505 27020378
9701 27020378 24877643 23333373 21548524 19982819 18633396 17544671 16726808 16014072
9693 16014072 15027712 14008465 13446071 12963796 12748805 12573145 11660691 10993407 10631617
9684 10631617 9950568 9751687 9702569 9407851 9354527 8592138 8697080 8149509 7769216 7270755
9674G270755r3301o08318l89170J59873j95770m03428j06612L811n78554j47248
9664D912038L10752J1962J96720j97109j29925k2709J69119m34456k232L00489
9654E114649q38437o2275K80450k34187l7834N3266l856j47738k50633l59685
9644C513720K48799j84277k72449N0293k18978J43432k08447L63177M04376l67783
9634C471863K78129K3737K29653k23015q3826J64750J98719j19889J92428j49106
9624C983443m38817q19722K48119j00746k50065N7459M3055L3078K6244N93055
9614C375103o56259M56229K5276p09141L15358K94175l34291l93691P77996L7708
9604C188463m92064O67657l57335j78341j09472J19092k0786J1104k20017m56293
$$ plain form
9674 7270755 7177454 6569136 6179966 6339839 6144069 5740641 5634029 5637840 5059286 4912038
9664 4912038 5222790 5234752 5431472 5234363 5104438 5081729 5250848 4816392 4814160 5114649
9654 5114649 4276212 4213937 4494387 4260200 4222366 4275632 4271776 4124038 3873405 3513720
9644 3513720 3762519 3578242 3305793 3356086 3137108 3280540 3072093 3435270 3839646 3471863
9634 3471863 3749992 3773729 4003382 3780367 3696541 3861291 4060010 3940121 4132549 3983443
9624 3983443 3544626 2724904 2973023 2872277 2622212 2679671 2722726 2755804 2782048 3375103
9614 3375103 2718844 3175073 3200349 2491208 2806566 3100741 2766450 2372759 3150755 3188463
9604 3188463 2696399 3364056 3006721 2828380 2718908 2838000 2817214 2828318 2608301 2152008
9594B152008k99402N22682j69552q3020l5748K77394m52728M92993L40174L8376
9584B783177m55891j28854M86747j97200l38011l35958r4884j96625j62245J26569
9574A486825L03089J6832o2834m30000J3025K29451j43045q2497J73832l30535
9564A174143j63272j43529J77634M30104J51487o7233M23165K61781k02434n7457
9554A984389q22091m75013L57649N70710o65270k96998K34578n2894j84635M2642
9544F93067k1678r1013J31787R4326j20059J07261K23734j59113j72105q0089
9534F06118k67680K84332L8042J30245M4240o3559j71956k26311M79715L64217
9524A217403k33704L1373k60225J08707m7662k36224l0773L3031N8492j13102
$$ plain form
9594 2152008 1852606 2375288 2205736 2122716 2086968 2364362 1911634 2404627 2744801 2783177
9584 2783177 2327286 2198432 2685179 2487979 2149968 1814010 1719126 1522501 1360256 1486825
9574 1486825 1789914 1806746 1743912 1313912 1326937 1556388 1413343 1330846 1504678 1174143
9564 1174143 1010871 867342 1044976 1475080 1626567 1559334 1982499 2244280 2041846 1984389
9554 1984389 1162298 687285 1044934 1615644 950374 653376 887954 835060 650425 693067
9544 693067 671389 580376 712163 806489 686430 793691 1017425 858312 686207 606118
9534 606118 338438 622770 660812 791057 835297 771738 599782 373471 853186 1217403
9524 1217403 983699 1015072 754847 863554 815892 579668 548895 581926 640418 527316
9514E27316J8834p6507j02119J85367M50429l97304J41709k47921L28527l75684
9504D52647J86875L30958j37894j37817l40654n71652M51155L00816K70929L02358
9494A107721O16k10185M08883j11428j63137k59193k06773K8126j0345j58867
9484D25418p2446L34196K02103l97986j00851P5220J07883J93927Q0303n799k89452
9473E52516N14233L24105l02756k40180k76917L57535K7934J78919J55198J13559
9463A404146o2893M8614k5904m57773m06038k24676N49875q8869k68871j8265
9453D49346N73520n91057L88654n18969L01319Q8262l15020M51810j04471p1046
9443F52348R8108l03129o397K87757J29513Q0582j80510K89957l74565j4738L06018
$$ plain form
9514 527316 546150 469643 367524 552891 1003320 606016 747725 499804 828331 452647
9504 452647 639522 970480 832586 694769 354115 -217537 233618 534434 805363 1107721
9494 1107721 1108337 898152 1307035 1195607 1032470 773277 566504 594630 584285 425418
9484 425418 352972 687168 889271 491285 390434 465654 573537 767464 847767 841968 552516
9473 552516 1066749 1390854 1088098 847918 571001 928536 956470 1135389 1290587 1404146
9463 1404146 1341253 1389867 1363963 906190 500152 275476 825351 736482 467611 449346
9453 449346 1022866 431809 820463 301494 602813 691075 376055 827865 723394 652348
9443 652348 750456 447327 440930 728687 858200 938782 758272 1048229 673664 658926 964944
9432I64944l20198n38228K90169j43414j81493K06945J50815m48410j24673r418
9422a52961q8766M74285K41077m32009R852P4632m69768P6203L26483L01708k03699
9411A57037q1757K50376n8580K45139r9990m78783p8128K62496K80034K07840
9401F05684L6081K1721L8763n09438K44148q9447K8288k64183K95951j08393j59526
9390A39649J15742o8018M01452j98375m3185k76125m04048k47054N07727J0673
9380f1562n7085P5839K19178k26656K3342O2562j8198J50231J27500J56558r9941
9369C51768l29015L7219K79231n69063L48832K36441m07272P7020N0184L9351
9359A14696L38593k45799j97999j85653K39596k84932K10214j71633Q0862K41758
$$ plain form
9432 964944 644746 106518 396687 253273 71780 278725 429540 -18870 -143543 -152961
9422 -152961 -241727 232558 473635 41626 51478 126110 -343658 -267455 59028 360736 157037
9411 157037 75280 325656 267076 512215 412225 -66558 -144686 117810 397844 605684
9401 605684 641765 663486 702249 192811 436959 347512 375800 111617 407568 299175 139649
9390 139649 255391 187373 588825 390450 347265 71140 -332908 -579962 -72235 -61562
9380 -61562 -118647 -42808 176370 -50286 -26944 35618 17420 167651 295151 451709 351768
9369 351768 22753 59972 339203 -229860 118972 355413 -51859 25161 75345 114696
9359 114696 453289 207490 9491 -176162 63434 -221498 -11284 -182917 -102055 139703
9349A39703K81977K94744l22209j01164r5043o43768N32676O628j49714N47466
9339D91296o05544j63667P3776O63268m61672r9939k2446J89112R9824n07P052
9328A70553l23526j0773M06884k48511k22257P29001l13137j000450L04010O81921
9318A73715l05952n3675q9809N202Q7922K3116L62105m55855j5885J94839j25184
9307a99461l52972L77159k14357N31531k10285p6865O9779k51911j12486k40759
9297f80627L73105N4144L57060o21181R9803K79896o021Q48887m95655j68343
9287D1068J25140k49868J33415j40109M59524k19951o5303K58543p5769j8915
9277B47775j43426k64752K25045n04786P7077j62183j56343K03276K51547k54426
$$ plain form
9349 139703 421680 716424 394215 293051 198008 -445760 86916 93544 -56170 491296
9339 491296 -114248 -277915 -204139 459129 -2543 -102482 -124928 64184 164008 163501 170553
9328 170553 -152973 -163746 243138 -5373 -227630 501371 188234 -812216 -508206 173715
9318 173715 -132237 -185912 -275721 -270519 -182597 -159481 202624 -253231 -269116 -74277 -199461
9307 -199461 -552433 -175274 -389631 141900 -68385 -145250 -75471 -327382 -439868 -680627
9297 -680627 -307522 -253378 103682 -517499 -417696 -137800 -143821 705066 209411 41068
9287 41068 166208 -83660 49755 -90354 369170 149219 83916 342459 266690 247775
9277 247775 104349 -160403 64642 -440144 -363067 -525250 -681593 -478317 -226770 -481196
9267d81196J29327K73000J82929n1267Q6041J2217n03664M58241k11394m89138
9257e94904N27693M5211O8259j36378M46888l3396k68064j77407M85680j41474
9247B22108j46477j66155j56047l4657K90772K46977j33004K75910K1577j50921
9237B70083m89795K65976J7163K27385m4104j98396l92523R05626J61460o48995
9227G3880l19350R6076j71646K29073K44172j14766k37278n4362k45060M95058
9217d203Q7209n20741M37141m9673J04453k43771k97638O85658l82459J58985
9207b5039j87930o75913O23086M25385L6133k58446l3029m87141k69907N08758
9197c44043L53342N67279k04903k53922p84669M15899J81084k52692P585J27926
$$ plain form
9267 -481196 -351869 -78869 104060 52793 138834 151051 -352613 105628 -105766 -594904
9257 -594904 -67211 -22000 46259 -90119 356769 323373 55309 -122098 363582 222108
9247 222108 75631 -90524 -246571 -281228 9544 256521 123517 399427 421004 270083
9237 270083 -219712 46264 63427 290812 246708 48312 -344211 561415 722875 73880
9227 73880 -245470 -149394 -321040 -91967 152205 37439 -199839 -254201 -499261 -4203
9217 -4203 83006 -437735 -594 -50267 54186 -189585 -487223 198435 -184024 -25039
9207 -25039 -212969 -888882 -265796 159589 195722 -62724 -95753 -582894 -852801 -344043
9197 -344043 9299 576578 371675 117753 -666916 -251017 -69933 -322625 -315040 -187114
9187a87114J17340L23497j32579J54512J2597m53355M07503j43555r4099K05130
9177B09877R4272l60318M36655k1605j17927k719n5279l47532m7988L3351L97111
9166B17898l03805J00184J02827j95756J6220N291J52142m34938R0887N19146
9156B70096M19882o19618N7268J58682n82373K33018K43987j3846l89615R4445
9146a28074j54392J7305L50127M14752l50284k18225J27844j66373n2786j5981
9136a76087J15942r3341q339K55163J50544K51801j57509j13343q6021n7926r5907
9125a5023k15592l62845K52015M50750r2516j15242k16645L53461J33667L3809
9115B05839k43138m42261j6963L99339k77997l47470L27965j12702P6072Q34912
$$ plain form
9187 -187114 -69774 253723 121144 275656 288253 -165102 242401 98846 4747 209877
9177 209877 304149 -56169 380486 358881 240954 238235 182956 -164576 -212564 -179213 217898
9166 217898 -85907 14277 117104 -78652 -62432 -57141 95001 -339937 -249050 270096
9156 270096 689978 70360 127628 286310 -296063 -63045 180942 167096 -222519 -128074
9146 -128074 -282466 -265161 84966 499718 149434 -68791 59053 -107320 -160106 -176087
9136 -176087 -60145 -153486 -161825 93338 243882 495683 338174 224831 138810 80884 -15023
9125 -15023 -230615 -593460 -341445 109305 16789 -98453 -315098 38363 172030 205839
9115 205839 -37299 -479560 -496523 -97184 -375181 -722651 -394686 -507388 -431316 403596
9105D03596m30017l78846K8646m42020K1346N20752J04745J06382O7556K42494
9095B44634K03804k05841L5310p04381L35555J7602j69292j24355J35693o7931
9085b99202l31978J86690L91881J47993l86070j51169L68424J4834k50035J37949
9075a70683k22366N88211k01306m2446n9699l35901M22687j0816K22076l02878
9065a13121K86805L2790l49064K55898m49947L0741K6609K13349j20860j59256
9055c46056k9272R6158o6532j7194J44807k5850j23089k70596R4544N5048K06547
9044b81485J69666j53431R0279K9026J00854J08421J71202o40481j6336J60416
9034b61869k1052j24256m08842L79220J98097m67801L94257K63843l30733L4736
$$ plain form
9105 403596 -26421 -405267 -376621 -818641 -797295 -276543 -171798 -65416 2140 244634
9095 244634 448438 242597 277907 -426474 -90919 -73317 -242609 -366964 -231271 -299202
9085 -299202 -631180 -444490 -52609 95384 -290686 -441855 -73431 -58597 -308632 -170683
9075 -170683 -393049 195162 -6144 -48590 -108289 -444190 -21503 -32319 189757 -113121
9065 -113121 173684 206474 -142590 113308 -336639 -305898 -279289 -65940 -186800 -346056
9055 -346056 -375328 -279170 -345702 -362896 -218089 -243939 -367028 -637624 -543080 -488032 -281485
9044 -281485 -111819 -265250 -174971 -145945 -45091 63330 234532 -405949 -422285 -261869
9034 -261869 -282921 -407177 -816019 -436799 -238702 -706503 -312246 -48403 -379136 -344400
9024c44400k35024K70220J24166J9726j47710L37528j01104L49199k46720j4913
9014A0968p44139M04733L86236m4620L25419n80766Q6850j42230L8886J40534
9004a18129n5722K62306j4737j13590j12580J3644K64683j26128N7378K50145
8994C07270n5968o7478k99053j63023N06191m76997N9738R2699j24018k06062
8984d26701O970K49472L18365k47660K14111k26940M45717k67083k8756J95850
8974B33345k99697J41701n57806R6882Q0884P4453M48871l41545L74300k93509
8964d2121j36236m0607J55755K19996L50225k83570o31751L55027J40675l99187
8954c11794k91520K71368m93012j07245K90758L97100L38619m22368o4065J21112
$$ plain form
9024 -344400 -579424 -309204 -185038 -165312 -313022 24506 -76598 272601 25881 10968
9014 10968 -733171 -328438 57798 13178 338597 -242169 -155319 -297549 -258663 -118129
9004 -118129 -173851 88455 73718 -39872 -152452 -138808 125875 -253 57125 307270
8994 307270 251302 183824 -115229 -278252 227939 -249058 -189320 -96621 -220639 -426701
8984 -426701 -419731 -170259 148106 -99554 114557 -112383 333334 66251 37495 233345
8974 233345 -66352 75349 -482457 -385575 -304691 -230238 218633 -122912 251388 -42121
8964 -42121 -178357 -218964 -63209 156787 507012 223442 -408309 -53282 87393 -311794
8954 -311794 -603314 -331946 -824958 -932203 -641445 -244345 94274 -328094 -392159 -271047
8944b71047J8400k03028k45789O56612q3314j08431j1357P6070J36213N8772k6699
8933c598K60009n78697L96807m93634K48643K90801p0754K86264J15647m84515
8923c3027l57778J47897j47488j6465N51265j56121l4333J13166o4139m82475
8913d79498L28071p5456l96183o2398K01613L08666J74967J5478m1890J3142p1461
8902h4949L04629J44953j0703j85473m78788M53968N02464p5185K56925p95509
8892C2332J08475J93425N3895l98384K0967n4867J11923j54074j05368l89163
8882e80839M39651j41472l10764L40006j37371J46625k04743P3965M27241J62977
8872B15276m26301m55024O18870J59041J76228o7629k58037o9973j76641L04029
$$ plain form
8944 -271047 -252647 -455675 -701464 -44852 -128166 -236597 -247954 -171884 -35671 23101 -3598
8933 -3598 256411 -322286 74521 -419113 -170470 120331 49577 335841 451488 -33027
8923 -33027 -390805 -242908 -390396 -406861 144404 -11717 -46050 67116 2977 -479498
8913 -479498 -151427 -226883 -623066 -685464 -483851 -175185 -218 15260 -26630 -13488 -84949
8902 -84949 219680 364633 353930 168457 -310331 143637 646101 570916 827841 32332
8892 32332 140807 334232 388127 -10257 10710 -44157 67766 -86308 -191676 -580839
8882 -580839 -141188 -282660 -593424 -253418 -390789 -244164 -448907 -374942 52299 215276
8872 215276 -211025 -666049 -47179 111862 288090 220461 -37576 -107549 -284190 19839
8862A9839k36264k24762K76837M7201J7782q0531N83605j07330o8936j74906l67015
8851c14480K39264N37558m09489l99788K0693K44856J68275m6317k0484j28845
8841a08757j34712J40829J83715j45900j74869q2876J82266o2925k8520P0780
8831a60969L05913j3788l34113J69345J64985l57259k52763J57307N7025k50822
8821e15139J2125K55362J33668K46890K97595n64214J84759K28034j31458n38543
8811c90921J11767J69645k65242n0674j2111o9268L71273K41552o53464L09103
8801b38340O69630r5156l07103l76857M86774o8289j12895l18933J30661K403
8791b28105j1222M57073j08922l41233J702K50341J43446j26383r8507j54400
$$ plain form
8862 19839 -216425 -441187 -164350 -117149 -99367 -179898 403707 296377 227441 52535 -314480
8851 -314480 -75216 462342 52853 -346935 -326242 -81386 86889 40572 20088 -108757
8841 -108757 -243469 -102640 81075 -64825 -239694 -322570 -140304 -203229 -231749 -160969
8831 -160969 144944 131156 -202957 -33612 131373 -225886 -478649 -321342 -264317 -515139
8821 -515139 -503014 -247652 -113984 132906 430501 -133713 51046 279080 147622 -390921
8811 -390921 -279154 -109509 -374751 -425425 -437536 -506804 -135531 106021 -547443 -238340
8801 -238340 431290 336134 29031 -347826 138948 70659 -42236 -361169 -230508 -228105
8791 -228105 -239327 217746 108824 -232409 -230707 19634 163080 36697 -61810 -216210
8781b16210K22468j14889k34525K07518k72002L71456K25705k76751m82177Q8931
8771d80476M22679L11749J18265l53225k9422K5605J03658O1670k89004O9908
8761c8593k70223j98670N07493j64076K12433J40705L75170l65k22261k5444k78819
8750C7350m386J42491J04498k46516k25429Q0730m99669m01203M28534L69987
8740b13613j7819J01514J12849K08044j50075r4398K97039J94464L52342o57811
8730A32536k38143n41918J52928M24308J81429l93587J12438j15388l7007K99659
8720b2745j2530l95302j827P6171j50664J77584j98168k60167M72686P9697m02755
8709f38020K53954L59920q6471p6973m8311j13326j85859N15386K34761m54920
$$ plain form
8781 -216210 6258 -108631 -343156 -135638 -407640 -36184 189521 -87230 -569407 -480476
8771 -480476 -57797 253952 372217 18992 -10430 15175 118833 180503 -108501 -38593
8761 -38593 -308816 -507486 7 -164069 48364 189069 564239 563874 341613 316169 37350
8750 37350 32964 175455 279953 33437 -191992 -111262 -610931 -1012134 -583600 -213613
8740 -213613 -231432 -129918 -17069 190975 40900 -53498 243541 438005 790347 132536
8730 132536 -105607 -647525 -494597 -70289 111140 -282447 -170009 -285397 -322404 -22745
8720 -22745 -35275 -430577 -432404 -356233 -506897 -329313 -527481 -787648 -314962 -235265 -638020
8709 -638020 -384066 -24146 -110617 -187590 -235901 -349227 -535086 -19700 215061 -239859
8699b39859J52503k42353J90141L06091m8091K6720k17468k84131q4912R3801
8689c47558R8218J48138k40964j0200L63908p1245l40937n1199J83291P634k18810
8678d79724m4519L84194m33572k09084L73405L21543J0718L54119k68253p6722
8668f7895l00511L18864M08221m31648M04649n5636n91723j48038M06031J95008
8658A37322K87076o691l39063J05822n17446j51952K10421k41329J15837O29073
8648B29070j56567j27626K54672J91771m40793K43122m67227J09188Q6719l18517
8638c96188O68264R6480j78964m03891K56849m19746j7788K11708j08013O5670
8628b25619k31396J34700K08180N427p1203N0536L27709m6745K99038o14998o9043
$$ plain form
8699 -239859 -87356 -329709 -139568 166523 118432 145152 -72316 -356447 -441359 -347558
8689 -347558 -249340 -101202 -342166 -352366 11542 -59703 -400640 -451839 -268548 -260914 -479724
8678 -479724 -524243 -140049 -573621 -782705 -409300 -87757 -77039 277080 8827 -67895
8668 -67895 -368406 -49542 358679 -72969 331680 276044 -315679 -463717 -57686 137322
8658 137322 424398 417707 78644 184466 -332980 -484932 -274511 -515840 -400003 229070
8648 229070 72503 -55123 199549 391320 -49473 193649 -273578 -164390 -77671 -396188
8638 -396188 272076 368556 189592 -214299 42550 -377196 -394984 -183276 -291289 -225619
8628 -225619 -457015 -322315 -114135 -108708 -179911 -129375 198334 151589 450627 -164371 -233414
8617b33414m38392M2515N10175J18899k08788L39308j20837q9263j91514N2825
8607b18486M0851k0443M49447m9484K04314l26589n08019L38963K67457j48328
8597B9683l16479l5007L33348k63817J64855K02705K436q368j48555l67413r1639
8586d98251L13157J66011k73330j36845N91595o4905l69713J01014j40815o7996
8576c80078m05167L80085L25456j03786J58973l6726K22895m61685p901K55458
8566e2476l36185k49473K18654K52879l43693J59004K27232J70711M1625J42175
8556B30453l0450K55133l34941k77676k2430L79072K85587m351m61103j34909
8546a15615l27717J34244O3919L89471J74506k33279j85607M13107o72280Q3481
$$ plain form
8617 -233414 -671806 -629291 -119116 -217 -209005 130303 9466 -79797 -271311 -218486
8607 -218486 -177635 -198078 251369 201885 406199 79610 -428409 -89446 178011 29683
8597 29683 -286796 -321803 11545 -252272 -87417 115288 117724 109356 -39199 -406612 -498251
8586 -498251 -185094 -19083 -292413 -429258 162337 97432 -272281 -171267 -312082 -380078
8576 -380078 -785245 -405160 -79704 -183490 -24517 -61243 161652 -300033 -307934 -52476
8566 -52476 -388661 -638134 -419480 -166601 -510294 -351290 -124058 46653 88278 230453
8556 230453 200003 455136 120195 -157481 -179911 199161 484748 480397 19294 -115615
8546 -115615 -443332 -309088 -245169 144302 318808 85529 -100078 313029 -359251 -275770
8536b75770K64491q7580K49064n3579L00324n12050j99961J05198L90305q9037
8526I1405J10999J79686J46980k52954n1103p6326k06852j91724k63033L14162
8516a98760L12088o90525J6244M74726j95689n51192O34323J13827j88326K35078
8506c8206o7411J95123n05599L99979j23791N6049Q0581R8091O016l59244J88651
8495f9761k02116N1802J76919j32317k94072J25665O63819j19960l92792m68966
8485f61779P7708M24049J42134l4401l68037O41442N9270j56229l16321K49445
8475E7281J73608K14760k53412j87226j36643J66898l6721k03772k50031J89743
8465b65515J74066L63382l23863m77838l4949K49084K85573l87354L65519J33774
$$ plain form
8536 -275770 -11279 -98859 150205 96626 396950 -115100 -315061 -209863 180442 91405
8526 91405 202404 382090 529070 276116 225013 148687 -58165 -249889 -512922 -198760
8516 -198760 113328 -577197 -560953 -86227 -281916 -833108 -198785 -84958 -273284 -38206
8506 -38206 -105617 89506 -416093 -16114 -139905 -83856 -3275 94816 100832 -258412 -69761
8495 -69761 -271877 -220075 -43156 -175473 -469545 -343880 319939 199979 -192813 -661779
8485 -661779 -584071 -160022 -17888 -52289 -420326 221116 280386 124157 -192164 57281
8475 57281 230889 445649 192237 5011 -131632 35266 -1455 -205227 -455258 -265515
8465 -265515 -91449 271933 -51930 -529768 -564717 -315633 -30060 -417414 -51895 81879
8455H1879M24j0545k69772K00134l52492Q9892M84442L24645j08565n21895J6874
8444f4979R0372l2966j19399J1824J80300k43658j25427j28315N2568j46950L26288
8433b00342L4962J52272n96029L55598L21997L1573K53259P5743n20213l39688
8423d30868O26041L0585O6134n82370n8691n0367K90883m29744L56337l88807
8413e70867K80041J36790K09832j65881K18217K63382j68789n4403K27727l97319
8403b1270m05192J68960R859k80658o1667N34558K38055J63427J71610j843m00803
8392A15036m56822M02920k30638j1442J11139J47388J3003k07729L55018k03814
8382C4059N5063k84401J09123M26243N3653n73360L07222L2077j35368L14875
$$ plain form
8455 81879 82303 71758 -198014 2120 -350372 -260480 223962 548607 440042 -81853 -64979
8444 -64979 25393 -7573 -126972 -115148 65152 -178506 -303933 -432248 -379680 -526630 -200342
8433 -200342 -165380 -13108 -609137 -253539 68458 100031 353290 429033 -91180 -430868
8423 -430868 195173 225758 291892 -290478 -349169 -399536 -108653 -538397 -182060 -570867
8413 -570867 -290826 -154036 55796 -110085 108132 371514 202725 148322 376049 -21270
8403 -21270 -426462 -257502 -247643 -528301 -589968 -55410 182645 346072 517682 515839 115036
8392 115036 -341786 61134 -169504 -180946 -69807 77581 90584 -117145 237873 34059
8382 34059 89122 -195279 -86156 340087 393740 -179620 127602 159679 24311 339186
8372C39186k57720K9637P3893q22694J64402M78082j55434J47859n7805M37910
8362C77316m25667K94636K66417m17983J15739l30814K24548k34969M27385N3223
8352C49831J64090q0530m69476m4205K15380J13503n66096L96345L02875R8627
8342D80344j313J52850j63162o0964K59943n07860J94169Q3245M43784n6241m35917
8331C88878K67672K94485k07542n77139K16181O8774J14402l38507K0021n26811
8321b79586l2825J38937k25960L70535j24751L31799j85762j63444r7127J83786
8311h4398J21856Q9412k64379K1423L42709j46012L32648m54677K32168j2318
8301A78432j15953K30474J47534k05887L9472m04664k64183J009632m93435N0896
$$ plain form
8372 339186 81466 111103 184996 -637698 -473296 4786 -150648 -2789 -60594 377316
8362 377316 -48351 246285 512702 94719 210458 -120356 104192 -130777 296608 349831
8352 349831 513921 433391 -36085 -80290 135090 248593 -317503 78842 381717 480344
8342 480344 479031 631881 468719 407755 667698 159838 354007 437252 881036 824795 388878
8331 388878 656550 951035 743493 166354 382535 451309 565711 227204 247225 -279586
8321 -279586 -312411 -173474 -399434 -28899 -153650 178149 -7613 -171057 -268184 -84398
8311 -84398 37458 126870 -137509 -116086 226623 80611 413259 -41418 190750 178432
8301 178432 62479 292953 440487 234600 274072 -130592 -394775 614857 121422 172318
8291A72318J58521j82601J15808j82939L46193j93200p6442k77200j20373K34279
8281e636k63183K9870L09472J96839J16790K878j0375l09758k3949j51292M00910
8270B92566k6004k27476K74591j06649o01008J70889N27143m68692j27177J37058
8260a54759k09157J16537j29726M8506J79615K72249J46040r2216k56402j55296
8250b34609j06574K9965O77578n78237Q8163M4921k44427N45863J69911j7810
8240C74744m41834k09237O03259J14160k78447j94742O19568j02535K2106l74494
8230A32548l33645k72173N24947j06955j23829J05999m5607N0961J61450O0879
8220A54575J92287J0949j1972j06608K48493j22974j95863l06879J40882o9231
$$ plain form
8291 172318 330839 148238 264046 81107 427300 234100 157658 -119542 -239915 -5636
8281 -5636 -268819 -238949 70523 267362 384152 387030 376655 66897 42948 -108344 292566
8270 292566 266562 39086 313677 207028 -393980 -223091 304052 -164640 -291817 -154759
8260 -154759 -363916 -247379 -377105 -328599 -148984 123265 269305 177089 -79313 -234609
8250 -234609 -341183 -311218 366360 -211877 -123714 -78793 -323220 222643 392554 374744
8240 374744 -67090 -276327 326932 441092 162645 -32097 587471 484936 507042 132548
8230 132548 -201097 -473270 51677 -55278 -179107 -73108 -118715 -67754 93696 154575
8220 154575 346862 357811 345839 239231 487724 364750 168887 -137992 2890 -66341
8210f6341P6254k50896J19482k23855K0713L43128J86221o05598L84237M29737
8200D13082O3592j89401M93750o98874n33531o29296L72498j438043m712880N689259
8190a169844J194631m3264J33548K31621k89058k09215N2082j16100M15681K3266
8180B23348j15467l31178K57401m61211L40995N7097J58475N36970n22340p3951
8170G0139J06735r5464P6361j42928M69552M58044l45331m58641j77676L7117
8160b092P760n9453L78081n25005k64194J49372M86953K48848k86266j99052L11718
8149B46670l40196N1642j06526K8164q1455L76116m55370K08949j1544k44087
8139c27637M60477K12017k97856j62024j15023J21044O0363L6916L41649j74812
$$ plain form
8210 -66341 9913 -240983 -121501 -345356 -324643 18485 204706 -400892 -16655 413082
8200 413082 476674 287273 781023 82149 -451382 -1080678 -708180 -2146223 -6859103 -1169844
8190 -1169844 24787 -18477 115071 346692 57634 -151581 -99499 -215599 200082 223348
8180 223348 107881 -223297 34104 -427107 -86112 -29015 129460 666430 144090 70139
8170 70139 176874 81410 157771 14843 484395 942439 597108 138467 -39209 -2092
8160 -2092 5668 -53785 324296 -200709 -464903 -315531 171422 420270 134004 -65048 246670
8149 246670 -93526 -41884 -148410 -120246 -201701 174415 -280955 -72006 -83550 -327637
8139 -327637 132840 344857 47001 -115023 -230046 -109002 -48639 -11723 329926 155114
8129A55114k04360R702L7434J68868l93202J84004M69065m10086k70873M28567
8119A74233J07048k68175K60379j54444k8248j93955L30808R2171M3868P3165
8109D36850J349J75016k57852n20613p8063J55353L873K18680l884k99643q9499
8098b58433L22426J61290o3689L8434j04606k75103M31110k45469n15354L71621
8088a37773j06117P0926M29289m34765L39780J16855n37145K44109L3136M23229
8078D41524m90812j50655k26889L90454J75303j25509P2135j72402K41435J08091
8068B62675k60926L97863j94781j61824J16620k6556M84537j75122m24903O46200
8058F63783K21895k93944P8505n31345j28836M54961j61555J6902j36024J70147
$$ plain form
8129 155114 -49246 -39544 -2110 166758 -226444 -42440 426625 16539 -254334 174233
8119 174233 281281 13106 273485 119041 90793 -103162 227646 319817 363685 436850
8109 436850 438199 613215 355363 -165250 -243313 -87960 -84087 134593 130709 -168934 -258433
8098 -258433 63993 225283 161594 200028 95422 -179681 251429 5960 -509394 -137773
8088 -137773 -243890 -172964 256325 -178440 161340 278195 -258950 -14841 18295 441524
8078 441524 -49288 -199943 -426832 -36378 138925 13416 85551 -86851 154584 262675
8068 262675 1749 399612 204831 43007 159627 133071 617608 442486 17583 663783
8058 663783 885678 591734 670239 138894 10058 465019 303464 320366 184342 354489
8048C54489k36286o3610j1191K65399l47852k63344k09468M18909N04690M32335
8038H44071m9090m01663K37055J72512L53420l23925P7967K5364J08012J88137
8028A231860K58828p70052k09384K45596L86966J66763j79093r9352l45604P2606
8018G59134L68314K53665k19402m1551j8309m14933L19407K17634K79495l31523
8008A171931K10132P2452R1166j08635K59320j72650J12798j41410l07974N3236
7998A240366j15080l97999N18847K79953M1740l41426k73022k04544M60695J81932
7988A391462j68876k88249k91969K51516n1610M42486j12271m05731L1807M65728
7978A264293J1319n0896J8772k65445M2206m1722Q6242L55065j16252l91457j26881
$$ plain form
8048 354489 118203 54593 43402 308801 -39051 -302395 -511863 -92954 411736 844071
8038 844071 794981 393318 630373 802885 1156305 832380 910347 935711 1043723 1231860
8028 1231860 1490688 720636 511252 756848 1143814 1310577 1131484 1032132 686528 759134
8018 759134 1127448 1381113 1161711 1120160 1101851 686918 1006325 1223959 1503454 1171931
8008 1171931 1382063 1454515 1545681 1437046 1696366 1523716 1636514 1495104 1187130 1240366
7998 1240366 1125286 727287 1246134 1526087 1567827 1226401 953379 748835 1209530 1391462
7988 1391462 1222586 934337 642368 893884 842274 1284760 1172489 766758 798565 1264293
7978 1264293 1275612 1224716 1243488 978043 1020249 978527 1064769 1419834 1303582 912125 785244
7967G85244K32257J15986J49830J08050l87825O1380K11641l90540K76851J1190
7957A174064k07954J13525K88311k06153j70692j45860J94920k253l0781R6657
7947A103784L11084k3953n1444J45984k04358K31475K45009m02894j15360O5395
7937A304722N4736O7376N1023j21552J06990K82551j84126o841K19881k04261
7927A570499o9054P85718k43941k64648L73475o77282N93576L13309J6024L68861
7917B766537o2036q5580K32064K23394O1699J3666k24919q2572l06452R6983O14332
7906C247116l1044q660O91448R7448M55319J5776M73331P51643k1921j47698k99058
7895E223700l70843m15428L01586K16155j92436K25084p1020l00884J98606J9735
$$ plain form
7967 785244 1017501 1133487 1283317 1391367 1003542 1064922 1276563 886023 1162874 1174064
7957 1174064 966110 1079635 1367946 1161793 991101 845241 1040161 1037908 1007127 1103784
7947 1103784 1414868 1390915 1339471 1485455 1281097 1512572 1757581 1354687 1239327 1304722
7937 1304722 1359458 1426834 1477857 1356305 1463295 1745846 1561720 1554879 1774760 1570499
7927 1570499 1501445 2287163 2043222 1778574 2152049 1474767 2068343 2381652 2397676 2766537
7917 2766537 2704501 2618921 2850985 3074379 3136078 3149744 2924825 2842253 2535801 2632784 3247116
7906 3247116 3216072 3207412 3898860 3996308 4451627 4467403 4940734 5692377 5670456 5522758 5223700
7895 5223700 4852857 4437429 4739015 4955170 4762734 4987818 4916798 4615914 4814520 4834255
7885D834255O31337L88396M28745M11553K45044N9072J29785l28717p5041k86909
7875F437520J12708l00804L9236R1141l4009k81706l39140J09792l74399N3471
7865E513810L87814j62922J78001J99635J26776M35865J72611K58465o12719l31623
7855F165713j07260p690N9803K18266K46527p7968o6929j68143j86097j42208
7845E934014l0954K61506M99032K20699k19280K32506M5740M14661M27324M22844
7835H208092J08345Q12245Q01400Q80819L76626J70686N20569J83244P63408N12011
7825A3337445P6242N11736O82273P67547Q87294J003506P37530J533047J062906
7816B0599526J321528J882798J174003K277480K004370J887775K592728K622075
$$ plain form
7885 4834255 5465592 5853988 6282733 6694286 6939330 6998402 7128187 6799470 6724429 6437520
7875 6437520 6550228 6249424 6288660 6379801 6345792 6064086 5724946 5834738 5460339 5513810
7865 5513810 5901624 5738702 5916703 6116338 6243114 6678979 6851590 7110055 6497336 6165713
7855 6165713 6058453 6050763 6110566 6328832 6575359 6497391 6430462 6262319 6076222 5934014
7845 5934014 5903060 6164566 6663598 6884297 6665017 6897523 6943263 7357924 7785248 8208092
7835 8208092 8316437 9128682 9930082 10810901 11187527 11358213 11878782 12062026 12825434 13337445
7825 13337445 13413687 13925423 14607696 15375243 16262537 17266043 18003573 19536620 20599526
7816 20599526 21921054 23803852 24977855 27255335 29259705 31147480 33740208 36362283
7808C6362283J904441K793314L171986L667595M495681N527946P335025Q634640
7800G3892911J0734102J1971341J0850501O294736j333176n312055o844074o624134
7792I3630152n210563l560021k082835n80783J038958J548222L098565M726856
7784I2608551O873074R160584J1792749J5697443J9755181K3558192K2769996
7777B02215770J1576148o313947j8607163k2668712k0755886j7025963j4483360
7770A13936887j1167515q525717o726871n000373k885393j396077N52730J801525
7762H0589196M257479O644085Q947103R798581Q760229K643616n181023j0945818
7754A05513448j2738369j1975438j0834031q399433p636191o689768n718420m618054
$$ plain form
7808 36362283 38266724 41060038 44232024 47899619 52395300 57923246 65258271 73892911
7800 73892911 84627013 96598354 107448855 113743591 112410415 107098360 100254286 93630152
7792 93630152 88419589 84859568 82776733 82195950 83234908 84783130 87881695 92608551
7784 92608551 99481625 108642209 120434958 136132401 155887582 179445774 202215770
7777 202215770 213791918 207477971 188870808 166202096 145446210 128420247 113936887
7770 113936887 102769372 94243655 87516784 82516411 79631018 78234941 78787671 80589196
7762 80589196 84846675 91490760 100437863 110236444 118996673 121640289 116459266 105513448
7754 105513448 92775079 80799641 69965610 61566177 53929986 47240218 41521798 36903744
7746C6903744l428327l139511k805203j860476j594733j766124j706408j091641
7738A9511321j275752j600866n99020q08504r83566q48761m83355j11873l31933
7729A2467691q00224p11785o52548l20290k19274k89551o38282n10889p31550
7720G593298L02678k75638n03624L06275k88325m10439m69864J14559n20373p9571
7710E768976Q6393n56799J40870l93326K61502n25199m81196J70433l36619r5018
7700D040017L11806j57554n34592L02260k26131J54100l26302j17907m0554P6438
7690C481581r4002K11248j69412n80115k36430P13410q7295n2276k32055k56839
7680B697815R7658J92101n9192n656n0361K46926m3162k78910r5051K87342L7076
$$ plain form
7746 36903744 33475417 30335906 27530703 25670227 24075494 22309370 20602962 19511321
7738 19511321 18235569 16634703 16035683 15227179 14243613 13394852 12911497 12799624 12467691
7729 12467691 11667467 10955682 10303134 9982844 9763570 9474019 8835737 8324848 7593298
7720 7593298 7895976 7620338 7116714 7422989 7134664 6724225 6254361 6368920 5848547 5768976
7710 5768976 5855369 5298570 5439440 5046114 5307616 4782417 4301221 4471654 4135035 4040017
7700 4040017 4351823 4194269 3659677 3961937 3735806 3889906 3563604 3445697 3405143 3481581
7690 3481581 3387579 3598827 3429415 2849300 2612870 3326280 3238985 3186709 2954654 2697815
7680 2697815 2795473 2987574 2928382 2922726 2872365 3119291 3076129 2797219 2702168 2989510 3026586
7669C026586j70888k09520K69996p4081k74724J52914n83131j09086J62704J39932
7659B330702m0413j94317K71062O9981j05275j7492k61630j24868K04606N34281
7649B666637l78889K02401l8228m45889J51103l14241j63950M09010k61925j33508
7639A692521L38546k31097j10593k95823N8176M3446m9155L32083k07593J04270
7629A674781k45924q1939J81649l38434M60839j54096o07262j09409N1823L16709
7619A148737L092J31392j70752L67570Q1035o93840J3397J95511j88766L77725
7609A265101M00278k87592l29128L4863K61266o10969J35776K39134j56932J73000
7599A124797K24620j092k89739J90737K29917R5411J29214R2408J8014J99639
$$ plain form
7669 3026586 2855698 2646178 2916174 2842093 2567369 2720283 2137152 2028066 2190770 2330702
7659 2330702 2290289 2095972 2367034 2437015 2331740 2314248 2052618 1927750 2132356 2666637
7649 2666637 2287748 2490149 2451921 2006032 2157135 1842894 1678944 2087954 1826029 1692521
7639 1692521 2031067 1799970 1689377 1393554 1451730 1495176 1446021 1778104 1570511 1674781
7629 1674781 1428857 1346918 1528567 1190133 1650972 1496876 889614 780205 832028 1148737
7619 1148737 1151829 1283221 1112469 1480039 1561074 867234 880631 1076142 887376 1265101
7609 1265101 1665379 1377787 1048659 1083522 1344788 733819 869595 1108729 951797 1124797
7599 1124797 1349417 1348325 1058586 1249323 1479240 1574651 1703865 1796273 1814287 2013926
7589B013926m45304L81122J6049m88639J289J96931J17329j22859k54885j81443
7579A233516N32789j23586N8258J79381M42629n66151J60923J33461k67790P6037
7569A859467M5088N66931K03673j53164J46444m92040j14321K58299m67403K96366
7559B149340j040718R4266O81930K89702l17560Q6615O61665o00155K82139R6857
7549B384081m60322K3057j20090L67279N14947j03767k85107M09097l89479l24630
7539B015066Q3649m34163j60865K67677L84710l42343l30732k13504M71159M03674
7529B144328l38410K3697j01841K69804M78606J54165m96877l63160K914m9948
7519A723278k72825K49482L1325J22410m98293L19131K4482R1398M91576m59283
$$ plain form
7589 2013926 1568622 1949744 1965793 1477154 1478443 1675374 1792703 1669844 1414959 1233516
7579 1233516 1766305 1642719 1700977 1880358 2322987 1756836 1917759 2051220 1783430 1859467
7569 1859467 1904555 2471486 2675159 2521995 2668439 2176399 2062078 2320377 1852974 2149340
7559 2149340 1108622 1202888 1884818 2174520 1856960 1943575 2605240 2005085 2287224 2384081
7549 2384081 1923759 1946816 1826726 2194005 2708952 2605185 2320078 2729175 2339696 2015066
7539 2015066 2098715 1664552 1503687 1771364 2156074 1813731 1482999 1269495 1740654 2144328
7529 2144328 1805918 1829615 1727774 1997578 2476184 2630349 2133472 1770312 1773226 1723278
7519 1723278 1450453 1699935 1731260 1853670 1355377 1674508 1698990 1790388 2281964 1822681
7509A822681K77237r0190J6268m64382M10300R1333k09065M51820l3266l71504
7499A901232K69753L08670L72195n3391k06838R4565j56004n9211l15791N85411
7489B740591P6877l93430J41360Q7783O4327N84890P5676j51061J85683m5422
7479C367274K22169j20200j9762J52734j10151l40063K32522L49085j76794M8400
7469C605214P4835j09222K25145L32726j14016O52593L04210K37726L08074M22438
7459E939723j31399j55287m65861j19144J14665l39901l98245m95513J19839J62706
7449D231583N42761M5935N64823K09274j54687m2815J43545N41221n3067Q77735
7439F906308N84904n55664k58456o04869N7994j48401n16623k76062j23114k0270
$$ plain form
7509 1822681 2099918 2009728 2025996 1561614 1971914 2063247 1854182 2306002 2272736 1901232
7499 1901232 2170985 2479655 2851850 2798459 2591621 2686186 2530182 2470971 2155180 2740591
7489 2740591 2817468 2424038 2565398 2653181 2717508 3302398 3378074 3227013 3412696 3367274
7479 3367274 3589443 3469243 3449481 3602215 3492064 3152001 3384523 3733608 3556814 3605214
7469 3605214 3680049 3570827 3795972 4128698 4014682 4667275 4971485 5209211 5517285 5939723
7459 5939723 5808324 5653037 5187176 5068032 5182697 4842796 4444551 3949038 4068877 4231583
7449 4231583 4774344 4820279 5385102 5594376 5439689 5396874 5540419 6081640 6028573 6906308
7439 6906308 7491212 6935548 6677092 6072223 6130217 5981816 5465193 5189131 5066017 5045747
7429E045747R8756J33304J02928k8571N08689M08145m5152l8678J20179M16155
7419F721502k68245k27003p9129O1184j07832n72672K31747l42943o5720K95033
7409E645922M09843n18203j48344K44344K07560O5972L60409K73777k28365M71526
7399F784441j16281j57998L74479J27048k14323K22847K69975J94053M29826M73157
7389H387224K81884O19032L82896K09386L94266O42567P56508O00842J48759P95742
7379A3219106O53708O90346O19433k91139R70675O02230Q54158J495528J318657
7370B0132702P24489J183039J499481J263086J561919K049982K332679K283234
7362C3030611J988126K382389L029905K688693L123390K901818M321101N105433
$$ plain form
7429 5045747 5144503 5277807 5380735 5352164 5860853 6268998 6223846 6185168 6305347 6721502
7419 6721502 6453257 6226254 6147125 6208309 6100477 5527805 5759552 5416609 5350889 5645922
7409 5645922 6055765 5537562 5389218 5633562 5841122 5907094 6267503 6541280 6312915 6784441
7399 6784441 6668160 6510162 6884641 7011689 6797366 7020213 7290188 7484241 7914067 8387224
7389 8387224 8669108 9288140 9671036 9880422 10274688 10917255 11673763 12274605 12423364 13219106
7379 13219106 13872814 14563160 15182593 14891454 15862129 16464359 17318517 18814045 20132702
7370 20132702 20857191 22040230 23539711 24802797 26364716 28414698 30747377 33030611
7362 33030611 35018737 37401126 40431031 43119724 46243114 49144932 53466033 58571466
7354E8571466N999133P703905R873881J2778907J4199015J4468029R048100k84161
7346A32358275p301173q720134r157962p554813n563454l846130k199168n19203
7338H7496238Q96668J580762L677132N605830Q783664J1471726J5118400J9950470
7330A54580890K5784921K6648984J3131157p325289j9850138k3551153k2194254
7323A47225118j8755661j5303183j1936950r312106o944617m899486l531447k593668
7315G3948000p09306J209678K642651M399983O510769Q261668Q106371M375452
7307A08745266l997917r765651j1471059j0424252r415929p550044o683566n461526
7299D3975322m650475m162177k921007k536659k807855k122870j560595j423845
$$ plain form
7354 58571466 64570599 72274504 82148385 94927292 109126307 123594336 132642436 132358275
7346 132358275 125057102 116336968 107179006 99624193 94060739 90214609 88015441 87496238
7338 87496238 88392906 89973668 93650800 99256630 108040294 119512020 134630420 154580890
7330 154580890 180365811 207014795 220145952 212820663 192970525 169419372 147225118
7323 147225118 128469457 113166274 101229324 91917218 84972601 80073115 76541668 73948000
7315 73948000 73238694 74448372 77091023 81491006 88001775 96263443 104369814 108745266
7307 108745266 104747349 94981698 83510639 73086387 63670458 56120414 49436848 43975322
7299 43975322 39324847 35162670 32241663 29705004 26897149 24774279 23213684 21789839
7291B1789839j616916j106528j115717j390322l57532o35317o49735n34962q99874
7282A3482936l72024j07874m92078l55864j15875p16131j95928K31324p30678
7273A0627808l65581l7540o83156j54469L001j65281k0456l08036j44720k15302
7263H536268l1093K72746J31955m16139m26259k02562L46078M13640n00056J7124
7253H141702J6637j27448j21318L0052r2996k9060j70409Q4055J64439J44967
7243H040621m6905J81404K5036o473P4340k23930K55327L11223j43235L11052
7233H778460J83411n21058N16898J73256L83041O41083n8311P60275P29893N59389
7223A2146337O43078J33016L21066p72147R1539k8693k10568j69722k6402n63870
$$ plain form
7291 21789839 20172923 19066395 17950678 16560356 16202824 15567507 14917772 14382810 13482936
7282 13482936 13110912 13003038 12510960 12155096 12039221 11323090 11127162 11358486 10627808
7273 10627808 10262227 10224687 9541531 9387062 9390063 9224782 9204326 8896290 8751570 8536268
7263 8536268 8505175 8777921 8909876 8493737 8067478 7864916 8210994 8624634 8124578 8141702
7253 8141702 8158339 8030891 7909573 7939625 7846629 7817569 7647160 7731215 7895654 8040621
7243 8040621 7993716 8175120 8200156 8193683 8268023 8044093 8299420 8610643 8467408 8778460
7233 8778460 8961871 8440813 8957711 9130967 9514008 10155091 10096780 10857055 11586948 12146337
7223 12146337 12789415 12922431 13243497 12471350 12562889 12534196 12323628 12153906 12127504 11563634
7213A1563634k39395J81504N32317N34072L84255P0831R42530Q44972P63543J679176
7203A7257439J326737J015501R55559j57836r73702j047867j101451m22942K81394
7194A7132832K92323K03625O27590O82456J503705P32262n56285q66591j432641
7185A8319276j526281j404507j320111o52419j61410o28478l01227j4924P7381
7176A2387300m28901n6947l7929n7997r5089j63149p10158n02968l1314M37581
7166A0740429p11569k96733K23337j67635P7363M56333M73128k45334J02813M6851
7156A0698983M16745L21392P2736O20978L01259J50593J67693O22022J172189
7147A4544590O04140R48047J138266Q47982J603340J529624J656602J857317J487438
$$ plain form
7213 11563634 11324239 11505743 12038060 12572132 12956387 13027218 13969748 14814720 15578263 17257439
7203 17257439 18584176 19599677 20555236 20397400 19423698 18375831 17274380 16851438 17132832
7194 17132832 17425155 17628780 18256370 18938826 20442531 21174793 20618508 19751917 18319276
7185 18319276 16792995 15388488 14068377 13415958 13254548 12626070 12324843 12309919 12387300
7176 12387300 11958399 11901452 11863523 11805526 11710437 11547288 10837130 10334162 10302848 10740429
7166 10740429 10028860 9732127 9955464 9787829 9865192 10321525 10794653 10549319 10652132 10698983
7156 10698983 11115728 11437120 11509856 12130834 12432093 12582686 12750379 13372401 14544590
7147 14544590 15148730 16096777 17235043 18083025 19686365 21215989 22872591 24729908 26217346
7138B6217346K098710J217143J168721R81678O02792J141621P72684J709036K242705
7129C8152436J817615K245096J978645K148394K048497K743129K514184L565084
7121E7213080L574855L954771M507225N909567O240736O911703Q156576R260759
7113A05729272J0073027J2419947J5976831K0536843K7144197L5146627M5825404
7106B72852148N9386207O2785358K3959741k7594361n1779597n4088529m7894489
7099B37626478l9652306l1476613k5375988k0159597j6431103j2399404j0889880
7092H1241587q612526p120094n683805n123860m471573l402548l453514l206614
7084D0167053k533352k333603k091805k307021j964073j768016j463098j314472
$$ plain form
7138 26217346 28316056 29533199 30701920 31683598 32286390 33428011 34200695 35909731 38152436
7129 38152436 39970051 42215147 44193792 46342186 48390683 51133812 53647996 57213080
7121 57213080 60787935 64742706 69249931 75159498 81400234 88311937 96468513 105729272
7113 105729272 115802299 128222246 144199077 164735920 191880117 227026744 272852148
7106 272852148 332238355 395023713 418983454 391389093 339609496 285520967 237626478
7099 237626478 197974172 166497559 141121571 120961974 104530871 92131467 81241587
7092 81241587 72629061 65508967 59825162 54701302 50229729 46827181 43373667 40167053
7084 40167053 37633701 35300098 33208293 30901272 28937199 27169183 25706085 24391613
7076B4391613j328561r79248j172391q28954q01624q78952p87005r49892o80709
7067A5984277m48210p49980r75493j027678n19164l45262m50860m35739r26912
7058A0104979j58283j24222l63654k42530p94560l23684O7011o16358n27397K3501
7048G044803k80095l35831l63908M3766n38968k48197M56520l36333k89222N6090
7038E208625o0044l4930o14Q9774k93161l70797m54656R5630k11501L70054J28125
7027D466505l71523r3713k39905m2052M06662o2259m51895L08740K69912J6024
7017D206496m54500o19591L67507N0254M2346k61022k87839k15189m89049k39728
7007B099685N66760l89466n6034q4220m22489N65645L68085m02464K47994J02474
$$ plain form
7076 24391613 23063052 22083804 20911413 20082459 19280835 18401883 17614878 16664986 15984277
7067 15984277 15536067 14786087 13810594 12782916 12263752 11918490 11467630 11031891 10104979
7058 10104979 9946696 9822474 9458820 9216290 8421730 8098046 8165057 7548699 7021302 7044803
7048 7044803 6764708 6428877 6064969 6108735 5569767 5321570 5778090 5441757 5152535 5208625
7038 5208625 5148581 5113651 5113037 5202811 4909650 4538853 4084197 4179827 3968326 4338380 4466505
7027 4466505 4094982 4001269 3761364 3719312 4125974 4063715 3611820 3920560 4190472 4206496
7017 4206496 3751996 3132405 3499912 3550166 3592512 3331490 3043651 2828462 2339413 2099685
7007 2099685 2666445 2276979 2220945 2136725 1714236 2279881 2647966 2245502 2493496 2595970
6997B595970Q9977M05505l13496k34973n2253l6138P6253M74872j93467m37475
6987B374775J94397J81390l05295j79913m0823n6380Q3315J11581j64704Q818
6977B207161J39640n58308o7171m5804m5801K43688l84423k20001J74000r7138
6967A345843j18698p6949J31779j2746K40523m90741K39269L38985k29839k65128
6957A102298j85882K69317q2131j77518R4165n2393L62412j57503l07423K13310
$$ plain form
6997 2595970 2685947 3091452 2777956 2542983 2490730 2454592 2530845 3005717 2812250 2374775
6987 2374775 2569172 2750562 2445267 2265354 2224531 2168151 2251466 2363047 2198343 2207161
6977 2207161 2346801 1788493 1721322 1675518 1629717 1873405 1488982 1268981 1442981 1345843
6967 1345843 1227145 1150196 1281975 1269229 1509752 1019011 1258280 1597265 1367426 1102298
6957 1102298 916416 1185733 1103602 926084 1020249 967856 1330268 1172765 865342 1078652
$$ [...]
##END NTUPLES=NMR SPECTRUM
##END=
