##TITLE=1H_EC-3329-X2
 CDCl3
 8 sc, 
 2.9.2024
##JCAMPDX= 6.0         $$ Bruker NMR JCAMP-DX V2.0
##DATA TYPE= NMR SPECTRUM
##DATA CLASS= NTUPLES
##ORIGIN= UXNMR, Bruker Analytische Messtechnik GmbH
##OWNER= root
$$ XWIN-NMR		Version 3.5
$$ Mon Sep  2 14:22:57 2024 Russian Standard Time (UT+4h)  she@DPX200
##.OBSERVE FREQUENCY= 200.1318
##.OBSERVE NUCLEUS= ^1H
##.ACQUISITION MODE= SIMULTANEOUS
##.ACQUISITION SCHEME= undefined
##.AVERAGES= 8
##.DIGITISER RES= 18
##SPECTROMETER/DATA SYSTEM= spect
##.PULSE SEQUENCE= zg30
##.SOLVENT NAME= D2O
##.SHIFT REFERENCE= (INTERNAL, D2O, 0, 20.9914)
##AUDIT TRAIL= $$ (NUMBER, WHEN, WHO, WHERE, WHAT)
$$ ##TITLE= Audit trail, XWIN-NMR		Version 3.5
$$ ##JCAMPDX= 5.01
$$ ##ORIGIN= Bruker BioSpin GmbH
$$ ##OWNER= she
$$ F:/spectra/data/she/nmr/H-F/1/pdata/1/auditp.txt
$$ ##AUDIT TRAIL=  $$ (NUMBER, WHEN, WHO, WHERE, WHAT)
(   1,<2024-09-02 14:21:41.46 +0400>,<she>,<DPX200>,
      <created by zg, POWCHK disabled, PULCHK disabled
       configuration hash MD5:
       00 E9 B6 7A A2 85 ED C7 34 08 36 98 17 FE 4E 26
       data hash MD5: 16K
       AB 7E 90 CA BF C3 95 7F 93 1A 94 8A CB CF 31 50>)
(   2,<2024-09-02 14:21:44.06 +0400>,<she>,<DPX200>,
      <Start of raw data processing
       efp BC_mod = 2 LB = 0.24 FT_mod = 6 PKNL = 1 PHC0 = -25993.71 PHC1 = 12.38748 SI = 16K 
       data hash MD5: 16K
       94 02 1C 8B AC 09 F3 D7 C7 EB 52 BF D9 49 D3 35>)
(   3,<2024-09-02 14:22:02.71 +0400>,<she>,<DPX200>,
      <pk PHC0 = -1.079187 PHC1 = 1 
       data hash MD5: 16K
       01 3F 6E 20 6C 62 ED 13 77 DE BA F8 79 EF D4 93>)
(   4,<2024-09-02 14:22:05.90 +0400>,<she>,<DPX200>,
      <abs ABSG = 5 
       data hash MD5: 16K
       6A 2D 77 C0 DF 73 9A BE 8E 60 B8 4D 7E 00 42 67>)
$$ ##END=
$$ 
$$ hash MD5
$$ 4D 00 D7 73 56 BD CE 1C 54 F5 6E AC 0B AB EE 9A
##$RELAX= 
##$RELAX= 
##$RELAX= 
##$RELAX= 
##$RELAX= 
##$RELAX= 
$$ Bruker specific parameters
$$ --------------------------
##$DU= <F:/spectra>
##$EXPNO= 1
##$NAME= <H-F>
##$PROCNO= 1
##$TYPE= <nmr>
##$USER= <she>
##$AMP= (0..31)
100 100 100 100 100 100 100 100 100 100 100 100 100 100 100 100 100 100 
100 100 100 100 100 100 100 100 100 100 100 100 100 100 
##$AQSEQ= 0
##$AQ_mod= 1
##$AUNM= <au_zg>
##$AUTOPOS= <>
##$BF1= 200.13
##$BF2= 200.13
##$BF3= 200.13
##$BF4= 200.13
##$BF5= 200.13
##$BF6= 200.13
##$BF7= 200.13
##$BF8= 200.13
##$BYTORDA= 1
##$CFDGTYP= 0
##$CFRGTYP= 5
##$CHEMSTR= <none>
##$CNST= (0..31)
1 1 145 1 1 1 1 1 1 1 1 1 1 1 1 1 1 1 1 1 1 1 1 1 1 1 1 1 1 1 1 1 
##$CPDPRG= <>
##$CPDPRG1= <>
##$CPDPRG2= <>
##$CPDPRG3= <>
##$CPDPRG4= <mlev>
##$CPDPRG5= <mlev>
##$CPDPRG6= <mlev>
##$CPDPRG7= <mlev>
##$CPDPRG8= <mlev>
##$CPDPRGB= <>
##$CPDPRGT= <>
##$D= (0..31)
0 1.2 0 0 0 0 0 0 0 0.06 0 0.03 0 0 0 0 0.0002 0 0 0 0 0 0 0 0 0 0 0 0 
0 0 0 
##$DATE= 1725272500
##$DBL= (0..7)
120 120 120 120 120 120 120 120 
##$DBP= (0..7)
150 150 150 150 150 150 150 150 
##$DBP07= 0
##$DBPNAM0= <>
##$DBPNAM1= <>
##$DBPNAM2= <>
##$DBPNAM3= <>
##$DBPNAM4= <>
##$DBPNAM5= <>
$$ [...]
##$SUBNAM3= <"">
##$SUBNAM4= <"">
##$SUBNAM5= <"">
##$SUBNAM6= <"">
##$SUBNAM7= <"">
##$SUBNAM8= <"">
##$SUBNAM9= <"">
##$SW= 24.0689170037331
##$SWIBOX= (0..15)
0 0 2 0 0 0 0 0 0 0 0 0 0 0 0 0 
##$SW_h= 4816.95568400771
##$TD= 16384
##$TD0= 1
##$TE= 0
##$TE2= 300
##$TE3= 300
##$TEG= 300
##$TL= (0..7)
0 120 120 120 120 120 120 120 
##$TP= (0..7)
150 150 150 150 150 150 150 150 
##$TP07= 0
##$TPNAME0= <>
##$TPNAME1= <>
##$TPNAME2= <>
##$TPNAME3= <>
##$TPNAME4= <>
##$TPNAME5= <>
##$TPNAME6= <>
##$TPNAME7= <>
##$TPOAL= (0..7)
0.5 0.5 0.5 0.5 0.5 0.5 0.5 0.5 
##$TPOFFS= (0..7)
0 0 0 0 0 0 0 0 
##$TUNHIN= 0
##$TUNHOUT= 0
##$TUNXOUT= 0
##$USERA1= <user>
##$USERA2= <user>
##$USERA3= <user>
##$USERA4= <user>
##$USERA5= <user>
##$V9= 5
##$VALIST= <valist>
##$VCLIST= <CCCCCCCCCCCCCCC>
##$VD= 0
##$VDLIST= <DDDDDDDDDDDDDDD>
##$VPLIST= <PPPPPPPPPPPPPPP>
##$VTLIST= <TTTTTTTTTTTTTTT>
##$WBST= 1024
##$WBSW= 4
##$XGAIN= (0..3)
0 0 0 0 
##$XL= 0
##$YL= 0
##$YMAX_a= 132562
##$YMIN_a= -105541
##$ZGOPTNS= <>
##$ZL1= 120
##$ZL2= 120
##$ZL3= 120
##$ZL4= 120
##$ABSF1= 20.96059
##$ABSF2= -3.108541
##$ABSG= 5
##$ABSL= 3
##$ALPHA= 0
##$AQORDER= 0
##$ASSFAC= 0
##$ASSFACI= 0
##$ASSFACX= 0
##$ASSWID= 0
##$AUNMP= <proc_1d>
##$AZFE= 0.1
##$AZFW= 0.1
##$BCFW= 0
##$BC_mod= 2
##$BYTORDP= 0
##$COROFFS= 0
##$CY= -3
##$DATMOD= 1
##$DC= 0
##$DFILT= <>
##$DTYPP= 0
##$F1P= 0
##$F2P= 0
##$FCOR= 1
##$FTSIZE= 16384
##$FT_mod= 6
##$GAMMA= 0
##$GB= 0
##$INTBC= 1
##$INTSCL= 3.70164e-10
##$ISEN= 128
##$LB= 0.24
##$LEV0= 0
##$LPBIN= 0
##$MAXI= 10000
##$MC2= 0
##$MEAN= 0
##$ME_mod= 0
##$MI= 1.114404
##$NCOEF= 0
##$NC_proc= -7
##$NLEV= 6
##$NOISF1= 3.799351
##$NOISF2= 2.8
##$NSP= 0
##$NTH_PI= 0
##$NZP= 0
##$OFFSET= 20.99145
##$PC= 1
##$PHC0= -25994.79
##$PHC1= 13.38748
##$PH_mod= 1
##$PKNL= yes
##$PPARMOD= 0
##$PSCAL= 0
##$PSIGN= 0
##$REVERSE= no
##$SF= 200.130007459762
##$SI= 16384
##$SIGF1= 3
##$SIGF2= 2
##$SINO= 5.538805
##$SIOLD= 16384
##$SREGLST= <1H.CDCl3>
##$SSB= 0
##$STSI= 16384
##$STSR= 0
##$SW_p= 4816.95568400771
##$SYMM= 0
##$S_DEV= 0
##$TDeff= 16384
##$TDoff= 0
##$TI= <>
##$TILT= no
##$TM1= 0
##$TM2= 0
##$TOPLEV= 0
##$USERP1= <user>
##$USERP2= <user>
##$USERP3= <user>
##$USERP4= <user>
##$USERP5= <user>
##$WDW= 1
##$XDIM= 16384
##$YMAX_p= 371687273
##$YMIN_p= -510474
$$ End of Bruker specific parameters
$$ ---------------------------------
##NTUPLES= NMR SPECTRUM
##VAR_NAME=  FREQUENCY,     SPECTRUM/REAL,   SPECTRUM/IMAG
##SYMBOL=    X,             R,               I
##VAR_TYPE=  INDEPENDENT,   DEPENDENT,       DEPENDENT
##VAR_FORM=  AFFN,          ASDF,            ASDF
##VAR_DIM=   16384,         16384,           16384
##UNITS=     HZ,            ARBITRARY UNITS, ARBITRARY UNITS
##FACTOR=    0.29402158847633, 1,            1
##FIRST=     4201.01891622333, 0,            0
##LAST=      -615.936767784384, 0,           0
##MIN=       -615.936767784384, -510474,     0
##MAX=       4201.01891622333, 371687273,    0
$$ Real data points
##PAGE= N=1
##DATA TABLE= (X++(R..R)), XYDATA
$$ [...]
6589A65346p8555N0745k440m92094J57253K84878N7240j26612j66210Q5830j59396
$$ 165346 86791 137536 135096 -356998 -199745 85133 142373 15761 -150449 -64619 -224015
6578b24015K32607R1085l02837P8299J7518J70593J74100j88913N9010j12615
$$ -224015 8592 99677 -203160 -124861 -107343 63250 237350 48437 107447 -5168
6568e168P8386L9127j44343j64247J77741J45816J80852j47476j43260K5684k14977
$$ -5168 73218 112345 -31998 -196245 -18504 127312 308164 160688 17428 43112 -171865
6557a71865J00199J31376q4100L3268J00199k60582j07757J83957R7261O5745
$$ -171865 -71666 59710 -24390 8878 109077 -151505 -259262 -75305 21956 87701
6547H7701m3379J39494k5446j76534j92366K26551J36364O289M4993o6177o789
$$ 87701 44322 183816 158370 -18164 -210530 16021 152385 158674 203667 137490 130701
6536A30701j48110J63511j69372J29827J7505J2092q7243j60473Q3307J49013
$$ 130701 -17409 146102 -23270 106557 124062 136154 48911 -111562 -28255 120758
6526A20758Q897n9440J4942J25857N1663l03464Q9739J30135k91447L10343j03979
$$ 120758 129655 70215 85157 211014 262677 -40787 48952 179087 -112360 197983 94004
6515I4004K749J92293k25910o2388n6922j29207P8155K09679n2640j914L5721
$$ 94004 96753 289046 63136 748 -56174 -185381 -107226 102453 49813 47899 83620
6504H3620N332J67463k24153N7741P4262j9435O8344N3312k00064j7907N8063
$$ 83620 88952 256415 32262 90003 164265 144830 213174 266486 66422 48515 106578
6493A06578j5700R6522N0855j31171J46273o0179J3695J86141l19275k14640L65401
$$ 106578 90878 187400 238255 107084 253357 193178 206873 393014 73739 -140901 224500
6482B24500N2707k58032J054J67928J55002k9785k27081j32574K77838j6400Q6004
$$ 224500 277207 19175 20229 188157 343159 313374 86293 -46281 231557 215157 301161
6471C01161j51493J29196j31104m2342j58661r8038K14373K58742k67345j08132
$$ 301161 149668 278864 147760 105418 -53243 -151281 63092 321834 54489 -53643
6461e3643k4273j17468R871K53794l6870K3477k01213L4543Q091m6832J38788
$$ -53643 -77916 -195384 -185513 68281 31411 54888 -146325 -111782 -103691 -150523 -11735
6450a1735o6069J97420J8943j20584m34J45006k55121J3836j05838n836k3983
$$ -11735 -77804 119616 138559 17975 17541 162547 -92574 -78738 -184576 -190412 -214395
6439b14395j3399K79692k0211k10007P5846J83320k5008P6160j62018P235K84767
$$ -214395 -227794 51898 31687 -178320 -102474 80846 55838 131998 -30020 -22785 261982
6428B61982j01647j01741O5540j5706k09783j09582m3324M3448J30532J78771
$$ 261982 160335 58594 124134 108428 -101355 -210937 -254261 -210813 -80281 98490
6418I8490p0355m8279O1207J2536l9639r7031k0920Q6540j74347J42748K17660
$$ 98490 28135 -20144 41063 53599 13960 -83071 -103991 -17451 -191798 -49050 168610
6407A68610j87505J61076J22651k38844L6750n4405j80295r924j01979J63950
$$ 168610 -18895 142181 264832 25988 62738 8333 -171962 -181886 -283865 -119915
6397a19915j83467K36401j62078R0887L7323q8546K69126N7690m3202l4065k12584
$$ -119915 -303382 -66981 -229059 -138172 -100849 -189395 79731 137421 94219 60154 -152430
6386a52430J36443r3540l1725j03130l5294J46779l2350p8194j32262K69849l4817
$$ -152430 -15987 -109527 -141252 -244382 -279676 -132897 -165247 -243441 -375703 -105854 -140671
6375a40671R0710l0911R6785K642J4089m170j05119q2436j23937m2256K81743
$$ -140671 -49961 -80872 15913 18555 32644 28474 -76645 -159081 -283018 -325274 -43531
6364d3531K18573l12874m2581J60607q6700j28879K64193m8666J38857q2198k27745
$$ -43531 175042 -137832 -180413 -19806 -106506 -235385 28808 -19858 118999 36801 -190944
6353a90944J27589l15196K71656J53701j07676r9923L17245o0126k14159q7045
$$ -190944 -63355 -378551 -106895 46806 -60870 -160793 156452 96326 -117833 -204878
6343b04878K11913O3591Q2583K8019n4743k62420L09635k76778j34754K57582
$$ -204878 7035 70626 153209 181228 126485 -135935 173700 -103078 -237832 19750
6333A9750k59253L54817o8247P797P9460j97704m0470J45534J15027j96367O9675
$$ 19750 -239503 115314 47067 54864 134324 -63380 -103850 41684 156711 -39656 30019
6322C0019J7755j69782m5847L6246r2515J68323k03701K01633K8204p459N4654
$$ 30019 47774 -122008 -167855 -131609 -224124 -55801 -259502 -57869 -29665 -37124 17530
6311A7530j3966l2716l814K02502j73097M2664j4087K62646j44867r8981j29045
$$ 17530 3564 -29152 -32966 169536 -3561 39103 25016 287662 142795 43814 -85231
6300h5231R0423J11281J23253j70727J0318Q894r3385j26235R8326N9207P8087
$$ -85231 5192 116473 239726 68999 79317 88211 -5174 -131409 -33083 26124 104211
6289A04211p2295O0158j18924j79163J6452K68500R1485J05668j54592j86681
$$ 104211 31916 92074 -26850 -206013 -189561 78939 170424 276092 121500 -65181
6279f5181J10835j41290j8434j22670K15117J63760r9117k8008l5297N3995k6442
$$ -65181 45654 -95636 -114070 -236740 -21623 142137 43020 15012 -20285 33710 7268
6268G268N0452n8068j79942j98980K26344K86333j55123j28380J5256J90969J45204
$$ 7268 57720 -348 -180290 -379270 -152926 133407 -21716 -150096 -134840 56129 201333
6257B01333k34820j33984l1103K43237N7277k09959J76149j51488J16023J28814
$$ 201333 -33487 -167471 -198574 44663 101940 -108019 68130 -83358 32665 161479
6247A61479j4024q6704J74753j53513r0027j70288J87661r1978J12532J27960
$$ 161479 147455 60751 235504 81991 -8036 -178324 9337 -82641 29891 157851
6237A57851j35913J58520P2100j30015l0663r4418N0079k361J45683j39846j26367
$$ 157851 21938 180458 252558 122543 91880 -2538 47541 45180 190863 51017 -75350
6226g5350M03922j21927N16n2116k66499L26920j5889k38091J9853J2662J2361
$$ -75350 328572 206645 207161 155045 -111454 215466 199577 -38514 -18661 -5999 6362
6215F362R7741m7854j10415q4166r1795J02890J19855L36876k64212N2345K1112
$$ 6362 104103 56249 -54166 -138332 -230127 -127237 -7382 329494 65282 117627 138739
6204A38739k48154J08280k02814N5051Q8043j716R0080J1173j98035p400J09963
$$ 138739 -109415 -1135 -203949 -148898 -60855 -62571 27509 38682 -159353 -166753 -56790
6193e6790r1599o8420J7961J51006K0912J5165j01997q9437j28386L21706k0876
$$ -56790 -148389 -216809 -198848 -47842 -26930 -11765 -113762 -203199 -331585 -9879 -30755
6182c0755l6754N5980J36309k48113k0744K0725L36855j5774M8514P3148k55258
$$ -30755 -67509 -11529 124780 -123333 -144077 -123352 213503 197729 246243 319391 64133
6171F4133m0813J2732l4663j13039p9237o6902J86198k3122l0858q1133K72544
$$ 64133 23320 36052 1389 -111650 -190887 -257789 -71591 -94713 -125571 -206704 65840
6160F5840O9385k291l0546l78918L57779N6659j57267j65596j84197k0074R9044
$$ 65840 135225 132934 102388 -276530 81249 137908 -19359 -184955 -369152 -389226 -290182
6149b90182J99738j9084K2368L8042J13062J38360j33915R4443J6368j69444j10755
$$ -290182 -90444 -109528 -87160 -49118 63944 202304 68389 162832 179200 9756 -100999
6138a00999J30670q0152L0658J69644j50962J22827o7357M2908Q1219Q5099J6982
$$ -100999 29671 -50481 -19823 149821 -1141 121686 54329 97237 178456 263555 280537
6127B80537l08522j64300K76418O5515r6919j6462J37336k89449J484R8060M3398
$$ 280537 -27985 -192285 84133 149648 52729 36267 173603 -115846 -114362 -16302 27096
6116B7096j65741N4635K3173J68888n6772j57702m6408j60482K21470M40176o7020
$$ 27096 -138645 -84010 -60837 108051 51279 -106423 -152831 -313313 -91843 348333 281313
6105B81313k67621n1305m2048L2907K34375m7796q9861j14437L4570J5991o8024
$$ 281313 13692 -37613 -79661 -46754 187621 139825 49964 -64473 -29903 -13912 -81936
6094h1936R050P7419J2757j44953K19244j44323j8421r8584J47415k03246J45299
$$ -81936 -72886 4533 17290 -127663 91581 -52742 -71163 -169747 -22332 -225578 -80279
6083h0279J06139j03495J6454N2124Q5592K0848l1172k43901L36103j46330m5312
$$ -80279 25860 -77635 -61181 -9057 76535 97383 66211 -177690 158413 12083 -33229
6072c3229k8610k64701J40093L03175L170j69802j19502m765K11432j19449J41725
$$ -33229 -61839 -326540 -186447 116728 119898 -49904 -169406 -174171 37261 -82188 59537
6061E9537j03056j15836J26531j53585K21813j65085l9605K88318M283j70083
$$ 59537 -43519 -159355 -32824 -186409 35404 -129681 -169286 119032 123315 -46768
6051d6768K66420m22718N353K71047k03795j01327R4727N1154M4122J53075k76274
$$ -46768 219652 -203066 -197713 73334 -130461 -231788 -137061 -85907 -41785 111290 -164984
6040a64984j432J28180n7103o9453R3403J81500L6037n3296m9893j04643J17693
$$ -164984 -166416 -38236 -95339 -164792 -71389 110111 146148 92852 42959 -61684 56009
6029E6009K9088K27204k17843r3601J17533r3285K5420M0042N5174k05203J08833
$$ 56009 85097 312301 94458 857 118390 25105 50525 90567 145741 -59462 49371
6018D9371J5858j30079k2921q8272J16308l5850K37418k64329q8601P8333m9788
$$ 49371 65229 -64850 -87771 -176043 -59735 -95585 141833 -122496 -211097 -132764 -182552
6007a82552J51801K22773k82240J05892J3561m1421m9894K50060M3088L3857q2449
$$ -182552 -30751 192022 -90218 15674 29235 -12186 -62080 187980 231068 264925 182476
5996A82476j2646p7587q6577j65430n3351J26875L77529L3553l36513m4103L1543
$$ 182476 169830 92243 5666 -159764 -213115 -86240 291289 324842 -11671 -55774 -24231
5985b4231p3601K6964J78819l31534q6593M5325L8261J4583J49724n659p3589
$$ -24231 -97832 -70868 107951 -223583 -310176 -264851 -226590 -212007 -62283 -67942 -141531
5974a41531j0075Q5042P3552K14038j41825j21764l319R4252N0951L1514k12589
$$ -141531 -151606 -66564 6988 221026 79201 -42563 -45882 48370 99321 130835 -81754
5963h1754K89034k06869m116j57009J09432m4709L14424j60366J17637J2264j60965
$$ -81754 207280 411 -3705 -160714 -51282 -95991 218433 58067 175704 187968 27003
5952B7003j81332Q599K62397M713p3548k04072n0249J48387N4767j72566P5175
$$ 27003 -154329 -145730 116667 121380 47832 -156240 -206489 -58102 -3335 -175901 -100726
5941a00726J75912j59913j23044k4901K49510p4358j22425o1701o680L3905j28124
$$ -100726 75186 -84727 -207771 -232672 16838 -57520 -179945 -241646 -248326 -214421 -342545
5930c42545L18256j52800J20272J61361j91546J84027J67928k86621m5893j49747
$$ -342545 -24289 -177089 -56817 104544 -87002 97025 264953 -21668 -67561 -217308
5920b17308R2537j39809K77951p8522n5353N0248m1197k3458K80750j76539J45090
$$ -217308 -124771 -264580 13371 -65151 -120504 -70256 -111453 -134911 145839 -30700 114390
5909A14390k63921j04092L30266m5695n2142j99295J11367J38286j95857O2632
$$ 114390 -149531 -253623 76643 30948 -21194 -220489 -109122 29164 -166693 -104061
5899a04061K07978k18816k15898J291K58459J36823j18390J04399n5460k15883
$$ -104061 103917 -114899 -330797 -329506 -71047 65776 -52614 51785 -3675 -219558
5889b19558K26203j26643j35210J06242J29639N7350r6623K56806L974q0305j16074
$$ -219558 6645 -119998 -255208 -148966 -19327 38023 -58600 198206 202180 121875 5801
5878E801N7835j08784p8223J62358k6505j57055K90224k7227p9664r7252j32992
$$ 5801 63636 -45148 -123371 38987 12482 -144573 145651 118424 38760 -58492 -191484
5867a91484j12612J72008P5150j83887J42936J04106L09571l07640p1870P1766
$$ -191484 -304096 -132088 -56938 -240825 -97889 6217 315788 8148 -63722 8044
5857H044p4514j91269J83718K15079O6886r1137j9760m986J15119j2237l0389
$$ 8044 -66470 -257739 -74021 141058 207944 116807 97047 92061 207180 194943 164554
5846A64554m4809m1678P8499j09795o3275R2396L1702j40079Q8121N4623r8797
$$ 164554 119745 78067 156566 46771 -16504 75892 107594 -32485 55636 110259 11462
5835A1462J11927K3179j72383M9198N6237M4486m3121k17842K03757K64208k02383
$$ 11462 123389 146568 -25815 23383 79620 124106 80985 -136857 66900 331108 128725
5824A28725n36N8839j25942M8666J7684J07628J2853M5810j15919k0221k7609
$$ 128725 128189 187028 61086 109752 127436 235064 247917 293727 177808 157587 129978
5813A29978m934L4445m8195k04897p9430l5165n017Q2086m3587L11529j72703
$$ 129978 125044 159489 111294 -93603 -173033 -208198 -213215 -131129 -174716 136813 -35890
5802c5890K1743q5632J90532p6392J71018P2792l03499k989j78852M17564J5980
$$ -35890 -14147 -99779 90753 14361 185379 258171 -45328 -48317 -227169 190395 206375
5791B06375l60862K59453l5918K0283p109J08875j92632o3153K7822j99391J57463
$$ 206375 -154487 104966 69048 89331 82222 191097 -1535 -64688 -36866 -236257 -78794
5780g8794K56521k10236J66068k9043n9296O8385j68429k4806P0203J87022r5818
$$ -78794 177727 -32509 133559 104516 45220 113605 -54824 -79630 -9427 177595 81777
5769H1777J42150k60705M014J23727J8652j26783j10663k3539L06246J38827j86075
$$ 81777 223927 -36778 -32764 90963 109615 -17168 -127831 -151370 154876 293703 107628
5758A07628n1344J05180l00519N3902K4282K9796R593J55372M9158n5274O6599
$$ 107628 56284 161464 -139055 -85153 -60871 -31075 -21482 133890 183048 127774 194373
5747A94373l33026p986K06723J3479k730J02888J28045o6340k34997j30299K66814
$$ 194373 -138653 -146639 60084 73563 70833 173721 301766 235426 429 -129870 136944
5736A36944l2388j01188J88156q0437M6901P9310l79640L53961L880q6661j65376
$$ 136944 104556 3368 191524 111087 157988 237298 -142342 211619 215499 128838 -36538
5725c6538j06435r665K49001j85620L5309Q0705l14137Q6599J83452J82476M6960
$$ -36538 -142973 -152638 96363 -89257 -53948 26757 -287380 -200781 -17329 165147 212107
5714B12107q0455p7597P4403p2674j64137m2826J91597M3208n7830q439r826J14192
$$ 212107 131652 54055 128458 55784 -108353 -151179 40418 83626 25796 17357 7531 121723
5702A21723L340l5520m7204P5737j39527j61983L18753J43534j47470J19450k44840
$$ 121723 125063 89543 42339 118076 -21451 -183434 135319 278853 131383 250833 5993
5691E993p1126K79509N182R2019j88176p4161P623J63215j31071k39990Q6573
$$ 5993 -65133 214376 219558 311577 123401 49240 56863 220078 89007 -150983 -64410
5680f4410K4505n037J93483o0700M8300J0959J13927j79453K90368j36498m8471
$$ -64410 -39905 -44942 148541 87841 136141 147100 261027 81574 371942 235444 186973
5669A86973j05319q3926L4927O6019j18511J31530J33253p8741J46937k08370
$$ 186973 81654 -2272 32655 98674 -19837 111693 244946 166205 313142 104772
5659A04772j7085M4412k2720R6123R0480Q4098j09557R3683j4417r812j57341
$$ 104772 87687 132099 109379 205502 295982 380080 270523 364206 349789 339977 182636
5648A82636P0360j69663N2935M095Q0416j0410J23896j02113P4712R2557j12009
$$ 182636 252996 83333 136268 140363 220779 210369 334265 232152 306864 399421 287412
5637B87412O4904k52253q9050Q535J77321n3350J10171Q1645p8011J52150j66563
$$ 287412 352316 100063 11013 19548 196869 143519 253690 335335 257324 409474 242911
5626B42911m6372m532q1861J21648J7993j66217p6344Q8347j20164J58925P6988
$$ 242911 196539 192007 110146 231794 249787 83570 7226 95573 -24591 134334 211322
5615B11322L1811o9168N907M3833O2558j70741N3223L60433m394M8883K02742
$$ 211322 243133 173965 179872 223705 286263 115522 168745 529178 524784 573667 776409
5604G76409r5560j41157J6482K1523j13571J23609k38368j64500J18209j80993
$$ 776409 680849 539692 556174 577697 464126 587735 349367 184867 303076 122083
5594A22083J10136J64897m266n4390j88766q0424N2169L4791K21694k5370k26032
$$ 122083 232219 397116 392850 338460 149694 69270 121439 156230 377924 352554 126522
5583A26522N7644R0322q8580k10318K99889j36912m6990R6414J62874k14218j50985
$$ 126522 184166 274488 185908 -24410 275479 138567 91577 187991 350865 136647 -14338
5572a4338K47778J60814q4385j25364j66098O6916J18660k7109j8883j3490M8852
$$ -14338 233440 394254 309869 184505 18407 85323 203983 176874 157991 144501 193353
5561A93353q5215J51421O9653j89812N9182J39261O6547o5416k06445O5850P025
$$ 193353 108138 259559 329212 139400 198582 337843 404390 338974 132529 198379 205404
5550B05404q6467J88881o6154K1731r96r3387j4689j06984R5620K1008K2603K02244
$$ 205404 118937 307818 241664 263395 262399 169012 154323 47339 142959 163967 186570 388814
5538C88814o5282M8090N580l9491m7960J02969k71378Q0851l3307j45868J32659
$$ 388814 323532 371622 377202 337711 289751 392720 121342 202193 168886 23018 155677
5527A55677J0339J34257L4106j5925j84260J65243r0935Q1151K53292j33584q0059
$$ 155677 166016 300273 334379 318454 134194 299437 208502 289653 542945 409361 329302
5516C29302j8090o3391R8684j44508l4679k0963j91927K74269j74807J7990K62976
$$ 329302 311212 247821 346505 201997 167318 146355 -45572 228697 53890 71880 334856
5505C34856k16125o3834k21J18041j8466J31902k9165O3654j31486j6562Q4307
$$ 334856 118731 54897 54676 172717 154251 286153 256988 320642 189156 172594 256901
5494B56901N7785J9899j72772r2523J64653j5586J04408J45948m06617K97807
$$ 256901 314686 334585 161813 69290 233943 218357 322765 468713 62096 359903
5484C59903j2787o4417J22345o1849k77036K32246K39088k06959j40464k0923
$$ 359903 347116 282699 405044 343195 66159 298405 537493 330534 190070 169147
5474A69147K2669K9692J366J82726k7106j0551n7515k31891N1870P0194J18004
$$ 169147 191816 221508 222874 405600 378494 367943 310428 78537 130407 200601 318605
5463C18605j94730N9956J01046o9499J79678J37551r2019n601j17437j31462M4399
$$ 318605 123875 183831 284877 215378 395056 532607 440588 434987 317550 186088 230487
5452B30487J00312r2308O6858J6528n4994O9225r1828J19783k1026J44809r2870
$$ 230487 330799 238491 305349 321877 266883 336108 244280 364063 343037 487846 394976
5441C94976p4096J31264l04859m9880j69842j5387L04595J0108J6389L64577l36636
$$ 394976 320880 452144 147285 97405 -72437 -87824 216771 226879 243268 607845 271209
5430B71209M8895K7690K6259j78481N3391j75583J81410M3473K08058j8151k47213
$$ 271209 320104 347794 374053 195572 248963 73380 254790 298263 506321 488170 240957
5419B40957K10434j92826p7886k3837L49929l04305M5867K18333O130O8823L1926
$$ 240957 451391 258565 180679 156842 506771 202466 248333 466666 472796 541619 573545
5408E73545L0491j39445R5535O1539p9189P2349j20759j10490k32323L1360K45991
$$ 573545 604036 464591 560126 621665 542476 614825 494066 383576 151253 182613 428604
5397D28604n8196J31693j02533J72382J57447l13531L348M1444J2126K78977l19433
$$ 428604 370408 502101 399568 571950 729397 415866 419214 460658 472784 751761 432328
5386D32328M6557k45355M2987J44645p6504J30612J55504k6891j04730J00611
$$ 432328 478885 233530 276517 421162 344658 475270 630774 603883 499153 599764
5376E99764L2579p9556o569p1496J86078j07760j87595K33530l8852N9153J33618
$$ 599764 632343 552787 546218 474722 660800 553040 365445 598975 560123 619276 752894
5365G52894j7500k52018J91745j06079O9615j32162K9866m9271m6457J54925J69155
$$ 752894 735394 483376 675121 569042 638657 506495 536361 487090 440633 595558 764713
5354G64713l9908j3411P08L249j99505J11923N8453p5135K59972J6551n63944
$$ 764713 724805 711394 712102 715351 515846 627769 686222 611087 871059 887610 323666
5343C23666K53960M2492k31013L0778L09093J92812J6505j05649l35794J00425
$$ 323666 577626 620118 389105 419883 728976 921788 938293 832644 496850 597275
5333E97275K68011Q7215p7668j77852n0824J24030o9237K60313r6561k63084K6786
$$ 597275 865286 952501 874833 696981 646157 770187 700950 961263 864702 601618 628404
5322F28404O5405J57556m6494j2224J9331K02460O1167o7813k8754k11514K12999
$$ 628404 693809 851365 804871 792647 811978 1014438 1075605 1007792 979038 767524 980523
5311I80523J60553j00888J34915R897M2569k04935o2763N5586q2287K42243Q0000
$$ 980523 1141076 1040188 1175103 1185000 1227569 1022634 959871 1015457 933170 1175413 1255413
5300A255413l6936n8456l2164R8659m2883j7068K12973n5678p421O3112J49993
$$ 1255413 1218477 1160021 1127857 1226516 1183633 1166565 1379538 1323860 1316439 1379551 1529544
5289A529544L847M244n7445j53851M0385j9365K09222J33286p1669J06378q9174
$$ 1529544 1533391 1537635 1480190 1326339 1366724 1347359 1556581 1689867 1618198 1724576 1635402
5278A635402j34218J45351j44284l9589J80113M1042K2360j96876K87742J47106
$$ 1635402 1501184 1646535 1502251 1462662 1642775 1683817 1706177 1509301 1797043 1944149
5268A944149k03338q7600L40646n5916J4550N6369j40966K17527J0410J80010
$$ 1944149 1740811 1653211 1993857 1937941 1952491 2008860 1867894 2085421 2095831 2275841
5258B275841l66761P5815K65608j98604K30531o6608N3514K9210J54560o8706
$$ 2275841 1909080 1984895 2250503 2051899 2282430 2215822 2269336 2298546 2453106 2384400
5248B384400K5714R6987j21887J96698K8164K9245m7553O0653K19975J06407l1305
$$ 2384400 2410114 2507101 2385214 2581912 2610076 2639321 2591768 2652421 2872396 2978803 2947498
5237B947498k1366J92259j56388J9906J49838R4463J04751M04459J35018R4714
$$ 2947498 2926132 3118391 2962003 2981909 3131747 3226210 3330961 3735420 3870438 3965152
5227C965152n6338k20210J70882j45180L80186L90505J26097q8556j15091L4003
$$ 3965152 3908814 3688604 3859486 3714306 4094492 4484997 4611094 4522538 4407447 4441450
5217D441450M27366K18298p8960K02324J10581J03507O1737K10071M09614K54904
$$ 4441450 4868816 5087114 5008154 5210478 5321059 5424566 5486303 5696374 6105988 6360892
5207F360892K1684K52962J1419L97841L16560J77073K95431o4564M23207K41272
$$ 6360892 6382576 6635538 6646957 7044798 7361358 7538431 7833862 7769298 8192505 8433777
5197H433777K53338J38367K60245L86225J98735K63941N27573M99486N45073L39277
$$ 8433777 8687115 8825482 9085727 9471952 9670687 9934628 10462201 10961687 11506760 11846037
5187A1846037J89431N29087K79921J34361K47851M97209P40979M79417L87778
$$ 11846037 12035468 12564555 12844476 12978837 13226688 13723897 14464876 14944293 15332071
5178A5332071M95327P51566M33504K62544M92427O99519N08656L80755Q38815
$$ 15332071 15827398 16578964 17012468 17275012 17767439 18466958 18975614 19356369 20195184
5169B0195184L36760J71345N79729K12289K53389N70717M69211K33934K7763M686
$$ 20195184 20531944 20703289 21283018 21495307 21748696 22319413 22788624 23022558 23050321 23055007
5159B3055007L90260J03288P2101m8350P0418l7902j53935J05806j80718k68419
$$ 23055007 23445267 23548555 23620656 23572306 23642724 23604822 23450887 23556693 23375975 23107556
5149B3107556l04608J629n04051m72226m35277k43341l03367p23339o54183m29779
$$ 23107556 22802948 22804577 22300526 21828300 21393023 21149682 20846315 20122976 19468793 19039014
5139A9039014n36243l88240l15211m37877m71329m41346p40452k76798j12599
$$ 19039014 18502771 18114531 17799320 17361443 16890114 16448768 15708316 15431518 15318919
5130A5318919l28666l71946n44280m56879l12757m96451l00171l47672n14567
$$ 15318919 14990253 14618307 14074027 13617148 13304391 12807940 12507769 12160097 11645530
5121A1645530l47389j84241l87484k16492l88271k88396k20506j36173q8740l93219
$$ 11645530 11298141 11113900 10726416 10509924 10121653 9833257 9612751 9476578 9387838 8994619
5111H994619l9775k24785l04876j89172k76801k09181j44382j39870l7007n3232
$$ 8994619 8954844 8730059 8425183 8236011 7959210 7750029 7605647 7465777 7428770 7375538
5101G375538q6462j66429o3913P3163j43859k58248k82652q6865J33384o8587
$$ 7375538 7289076 7122647 7058734 7131897 6988038 6729790 6447138 6360273 6493657 6425070
5091F425070r2824p2756Q4762l8202j66557j18736P4695P3908p2467q8692J71568
$$ 6425070 6332246 6259490 6344252 6306050 6139493 6020757 6095452 6169360 6096893 6008201 6179769
5080F179769j12634M6343J46763Q31P2531m5596J3406K96771o8073n9139L39345
$$ 6179769 6067135 6113478 6260241 6261072 6333603 6288007 6301413 6598184 6530111 6470972 6810317
5069F810317K50595L41452K11378K1803P5872P1257k22343N7858M1461j52842
$$ 6810317 7060912 7402364 7613742 7635545 7711417 7782674 7560331 7618189 7659650 7506808
5059G506808l1740J34041M0685O0588J62166q9726K08412N4893K42513N48386
$$ 7506808 7475068 7609109 7649794 7710382 7872548 7782822 7991234 8046127 8288640 8837026
5049H837026M18025L06022K30096J35236j6687l25182l57509m58089k40165j15828
$$ 8837026 9255051 9561073 9791169 9926405 9909718 9584536 9227027 8768938 8528773 8412945
5039H412945m19185k76506o5734j50439j45352j44920M51805j17519q0727r4731
$$ 8412945 7993760 7717254 7651520 7501081 7355729 7210809 7662614 7545095 7464368 7369637
5029G369637P7588K13079j24085j61597j83793k49094p7089l24153l89062l2625
$$ 7369637 7447225 7660304 7536219 7374622 7190829 6941735 6864646 6540493 6151431 6118806
5019F118806m1972k15241k19565j80578k86780j55361k75048j12762N7857m133
$$ 6118806 6076834 5861593 5642028 5461450 5174670 5019309 4744261 4631499 4689356 4685223
5009D685223p1878k43764j79580j4576Q0812k6219k13804J4003l3213j03377l40799
$$ 4685223 4613345 4369581 4190001 4175425 4256237 4230018 4016214 4030217 3997004 3893627 3552828
4998C552828j47053K23040M3688k3404j72536R4591J42067k34786J74739j7453
$$ 3552828 3405775 3628815 3672503 3649099 3476563 3571154 3713221 3478435 3653174 3635721
4988C635721J23128r1501k60025M055o9197p8603M0790q3662P269l13180l2682
$$ 3635721 3758849 3667348 3407323 3411378 3342181 3263578 3304368 3220706 3227975 2914795 2882113
4977B882113J73810j37416l547p6121m9951J22186k08558n9579O1735N0609M0790
$$ 2882113 3055923 2918507 2914960 2838839 2788888 2911074 2702516 2642937 2704672 2755281 2796071
4966B796071M567P071j16865j12571N0105l9194J73091k6846j42072q6073J09261
$$ 2796071 2800638 2807709 2690844 2578273 2628378 2589184 2762275 2735429 2593357 2507284 2616545
4955B616545j56229M6480J75010M1180R2815j51257k69511r8047J95871J07910
$$ 2616545 2460316 2506796 2681806 2722986 2815801 2664544 2395033 2296986 2492857 2600767
4945B600767j7199K4573O8993M3329q6118L361o8850L6432j88480J66L5528j46682
$$ 2600767 2583568 2608141 2677134 2720463 2634345 2637706 2568856 2605288 2416808 2416974 2452502 2305820
4933B305820J98232O3108P3441j08079r3773L24962n4752k5280J14261j50159
$$ 2305820 2504052 2567160 2640601 2532522 2438749 2763711 2708959 2683679 2797940 2647781
4923B647781K572r1643j9115K0414J25539o3514K0886Q0643j6020q3708K30912
$$ 2647781 2650353 2558710 2539595 2560009 2685548 2622034 2642920 2723563 2707543 2623835 2854747
4912B854747j84931j91522J20780K25398j08180M7669k20909J47759l6715k6207
$$ 2854747 2669816 2478294 2599074 2824472 2716292 2763961 2543052 2690811 2654096 2627889
4902B627889K89237n026j96355k9781o4853k2210J51429J7032j39220p670Q2041
$$ 2627889 2917126 2912100 2715745 2685964 2621111 2598901 2750330 2767362 2628142 2620472 2702513
4891B702513Q896R7584q1926J59490R5275P530j88942K00463j04237R7163j07964
$$ 2702513 2711409 2808993 2727067 2886557 2981832 2989362 2800420 3000883 2896646 2993809 2885845
4880B885845P8945L30895j40218Q1789o6156j02257j46430o122K55474L9311m0260
$$ 2885845 2964790 3295685 3155467 3237256 3171100 3068843 2922413 2916291 3171765 3211076 3170816
4869C170816R7684p5466J21594O9368l0267J12154j07763N1167J36561n5871j43541
$$ 3170816 3268500 3193034 3314628 3383996 3353729 3465883 3358120 3409287 3545848 3489977 3346436
4858C346436o2050J80855J609j92540M44855n6010k3614J90492k5673l2693J04980
$$ 3346436 3284386 3465241 3466850 3274310 3719165 3663155 3639541 3830033 3804360 3771667 3876647
4847C876647O43N8449q7830N1903L64870j26104m67K76483L6967j38279K517k4322
$$ 3876647 3877290 3935739 3847909 3899812 4264682 4138578 4138111 4414594 4451561 4313282 4315799 4291477
4835D291477J86960L5478o9321K89639L21181j21076J815l2063P8481J00239j61305
$$ 4291477 4478437 4513915 4444594 4734233 5055414 4934338 4936153 4904090 4982571 5082810 4921505
4824D921505R1895K58078J12128o0252M491K50472N4487P0258Q4937K81512J16395
$$ 4921505 5013400 5271478 5383606 5323354 5327845 5578317 5632804 5703062 5787999 6069511 6185906
4813F185906J78956j02868j22856J91377K15992J74870j2629L24048L95358J66704
$$ 6185906 6364862 6261994 6139138 6330515 6546507 6721377 6708748 7032796 7428154 7594858
4803G594858j74758J83751L40994l1823K12498K49049m0144R8011J78266L08092
$$ 7594858 7420100 7603851 7944845 7913022 8125520 8374569 8334425 8432436 8610702 8918794
4793H918794L07226L20836M7364J78084L35400J53212J65277L62032P3043K54030
$$ 8918794 9226020 9546856 9594220 9772304 10107704 10260916 10426193 10788225 10861268 11115298
4783A1115298K97930L43143J16469J28764L65268J19482M16207M85869J13492
$$ 11115298 11413228 11756371 11872840 12001604 12366872 12486354 12902561 13388430 13501922
4774A3501922L19843K62680K59847L63684J27884L82996L99218J47610L51147
$$ 13501922 13821765 14084445 14344292 14707976 14835860 15218856 15618074 15765684 16116831
4765A6116831M79578L89245L52288L02940M9543L00558M82911R8473N00105K01395
$$ 16116831 16596409 16985654 17337942 17640882 17690425 17990983 18473894 18572367 19072472 19273867
4755A9273867K95953J78744M24292J53521R789L04555L58943k39070J55221L08783
$$ 19273867 19569820 19748564 20172856 20326377 20336166 20640721 20999664 20760594 20915815 21224598
4745B1224598L58312J29589o818M8247k210J03383n6010J30091k4667j18343j48198
$$ 21224598 21582910 21712499 21705681 21753928 21751718 21855101 21799091 21929182 21904515 21786172 21637974
4734B1637974p630k3761j52454j19822j37569l59209j96322J49199j91988k36190
$$ 21637974 21630344 21606583 21454129 21334307 21196738 20837529 20641207 20790406 20598418 20362228
4724B0362228m86487j37778k81340p0986l89814l28426L8661k77490k20710k68611
$$ 20362228 19875741 19737963 19456623 19385637 18995823 18667397 18706058 18428568 18207858 17939247
4714A7939247j94247l44020J31888q1579P5677l2125j43704n14220m6152k09673
$$ 17939247 17745000 17400980 17532868 17451289 17526966 17494841 17351137 16836917 16790765 16581092
4704A6581092j79922j60009k2378l50307l07142j37216j85819l13779j28312k02837
$$ 16581092 16401170 16241161 16218783 15868476 15561334 15424118 15238299 14924520 14796208 14593371
4694A4593371J31795k20395j74443Q5628j97853J62843R1721j69320p8703k64181
$$ 14593371 14725166 14504771 14330328 14415956 14218103 14380946 14472667 14303347 14224644 13960463
4684A3960463j89490k00272K16077p5j16924p1777k94420p8234J74194Q1661l28447
$$ 13960463 13770973 13570701 13786778 13786703 13669779 13598002 13303582 13225348 13399542 13481203 13152756
4673A3152756J86449J25252j95209k50795K80870N3524J74614j42387J0541m7667
$$ 13152756 13339205 13464457 13269248 13018453 13299323 13352847 13527461 13385074 13395615 13347948
4663A3347948N2003R9120K4957j02996J17870r8001K80L26686P5409P4806M2767
$$ 13347948 13399951 13499071 13524028 13421032 13538902 13440901 13441181 13767867 13843276 13918082 13960849
4652A3960849J14877O6169Q9151J45285K25588J77327o9174Q5185Q2590J36076
$$ 13960849 14075726 14141895 14231046 14376331 14601919 14779246 14710072 14795257 14877847 15013923
4642A5013923J95765L8288K74683J02538k2636L44782N714J42830K52302J36318
$$ 15013923 15209688 15247976 15522659 15625197 15602561 15947343 15953057 16095887 16348189 16484507
4632A6484507L45202j06534J95610K62960J97539J40085K01395J96948K69403
$$ 16484507 16829709 16723175 16918785 17181745 17379284 17519369 17720764 17917712 18187115
4623A8187115M38063K10144M21311K79233K30538M14380L21573K63520j37811
$$ 18187115 18625178 18835322 19256633 19535866 19766404 20180784 20502357 20765877 20628066
4614B0628066J37494r8068P670J4914j44230k24293K24091N95562N1394k4633
$$ 20628066 20765560 20667492 20675162 20690076 20545846 20321553 20545644 21141206 21192600 21167967
4604B1167967L85068L24619J19898L96498M87121K96287J92983J28046m32804
$$ 21167967 21553035 21877654 21997552 22394050 22881171 23177458 23370441 23498487 23065683
4595B3065683j18265j15621j62413m81339m78932j8243l09268J61415j77283j22713
$$ 23065683 22947418 22831797 22669384 22188045 21709113 21690870 21381602 21543017 21365734 21243021
4585B1243021J64676q2574l4008j16632Q5976P5138J21677k02391J1518M9132
$$ 21243021 21407697 21325123 21291115 21174483 21260459 21335597 21457274 21254883 21266401 21315533
4575B1315533j56324j91766j71567l11730l03589k4369m9306j38679k56014j68671
$$ 21315533 21159209 20967443 20795876 20484146 20180557 20156188 20106882 19968203 19712189 19543518
4565A9543518L01108P7566j76304K50981j4447R7736l1631m7615K2185J522n8797
$$ 19543518 19844626 19922192 19745888 19996869 19982422 20080158 20048527 20000912 20023097 20024619 19965822
4554A9965822r2925J52729K64644L17729k8051J66433J30541K1528J14570K94362
$$ 19965822 19872897 20025626 20290270 20607999 20579948 20746381 20876922 20898450 21013020 21307382
4544B1307382M9072J54017P7118r2158J91608K56574P1592K16333K19887K03891
$$ 21307382 21356454 21510471 21587589 21495431 21687039 21943613 22015205 22231538 22451425 22655316
4534B2655316J20856J53467O6525J76506O6879O4996N98414N5938J72854L49806
$$ 22655316 22776172 22929639 22996164 23172670 23239549 23304545 23902959 23958897 24131751 24481557
4524B4481557Q5258K84880K29636P9034M33270L4807J69836J56097J82687M07148
$$ 24481557 24566815 24851695 25081331 25160365 25593635 25628442 25798278 25954375 26137062 26544210
4514B6544210M89607P5935O8125R8647L2736q941M10352K92096M8239J07816K52685
$$ 26544210 27033817 27109752 27177877 27276524 27309260 27300319 27710671 28002767 28051006 28158822 28411507
4503B8411507m5229J74888J06562R7018K12997j4105O8971k48653J5570k3737
$$ 28411507 28366278 28541166 28647728 28744746 28957743 28943638 29012609 28763956 28779526 28755789
4493B8755789P0245O6390J47429j50168J15361n2575L5495O2126k1915M0447J91733
$$ 28755789 28826034 28892424 29039853 28889685 29005046 28952471 28987966 29050092 29028177 29068624 29260357
4482B9260357j48462r0402P0378K6362j61919J32000k05550j5117K57590J85382
$$ 29260357 29111895 29021493 29091871 29118233 28956314 29088314 28882764 28867647 29125237 29310619
4472B9310619J77488K60961L18907K76714o3905l78249l29513n41959l73623m04976
$$ 29310619 29488107 29749068 30067975 30344689 30280784 29902535 29573022 29031063 28657440 28252464
4462B8252464n23429m76856l06476l52080r3911L32188J20705K10090J35822O0947
$$ 28252464 27729035 27252179 26945703 26593623 26499712 26831900 26952605 27162695 27298517 27359464
4452B7359464n16353n85145r27839j207753q82804q99533p29977k33710m30401
$$ 27359464 26843111 26257966 25330127 24122374 23239570 22340037 21610060 21376350 20945949
4443B0945949p88156m35123l40391n74578n80402k04746n62389k49610l25827
$$ 20945949 20157793 19722670 19382279 18807701 18227299 18022553 17460164 17210554 16884727
4434A6884727m90484m38811m47711m84529j66065l08727k80222j51216j80100
$$ 16884727 16394243 15955432 15507721 15023192 14857127 14548400 14268178 14116962 13936862
4425A3936862m02424q6284j64334k70390l9850p9068m09685l7416j01892j32739
$$ 13936862 13534438 13448154 13283820 13013430 12973580 12894512 12484827 12447411 12345519 12212780
4415A2212780j66049j78322j78141l03693L3021j34056j93793J12782j53450o446
$$ 12212780 12046731 11868409 11690268 11386575 11419596 11285540 11091747 11204529 11051079 11044633
4405A1044633K0138J00844J28098O784m29669n9753J30656k07500J98659J30226
$$ 11044633 11064771 11165615 11293713 11300497 10870828 10811075 10941731 10734231 10932890 11063116
4395A1063116L13435J06938m151K8789R6352M007J58445K11473Q3732P7081L57684
$$ 11063116 11376551 11483489 11479338 11508127 11604479 11608486 11766931 11978404 12062136 12139217 12496901
4384A2496901K98704M90312N13274K91999Q06776P22338J017056J176656J194856
$$ 12496901 12795605 13285917 13799191 14091190 14897966 15620304 16637360 17814016 19008872
4375A9008872O54541J5890j69805r68208j098308j027025j211526j099523q94159
$$ 19008872 19663413 19679303 19509498 18541290 17442982 16415957 15204431 14104908 13210749
4366A3210749o44533m87702o10346m16873m21876n41995j19917l55251l06208
$$ 13210749 12566216 12078514 11468168 11051295 10629419 10087424 9967507 9612256 9306048
4357I306048j48424j37779k45936p5567m87641l07002m3264k15904j37639j8185
$$ 9306048 9157624 9019845 8773909 8698342 8210701 7903699 7860435 7644531 7506892 7488707
4347G488707k37862k40916J9728r7745k0723J0882k98122j16960J22369J97097
$$ 7488707 7250845 7009929 7029657 6931912 6911189 6922071 6623949 6506989 6629358 6826455
4337F826455j00572l15465j86391j69397J922j7417m3056m65831J4429j41191
$$ 6826455 6725883 6410418 6224027 6054630 6056552 6039135 5996079 5530248 5544677 5403486
4327E403486p2881J22249k9536l41460K02532J92087k51390N1178O1301j25051
$$ 5403486 5330605 5452854 5423318 5081858 5284390 5476477 5225087 5276265 5337566 5212515
4317E212515j18433k71778O5033J18059J61479m6454j57430P0778n3896j13555
$$ 5212515 5094082 4822304 4887337 5005396 5166875 5120421 4962991 5033769 4979873 4866318
4307D866318l39542q2766P5072n6561j03675R1160j34347o9767j08872j38133
$$ 4866318 4526776 4444010 4519082 4462521 4358846 4450006 4315659 4245892 4137020 3998887
4297C998887M8296J17860n6082m9949j90537k9702J96078N9458J31952k42452
$$ 3998887 4047183 4165043 4108961 4059012 3868475 3838773 4034851 4094309 4226261 3983809
4287C983809j18079j6892j17698n5812J31896R5305p5379r7763O3040l79500L2863
$$ 3983809 3865730 3848838 3731140 3675328 3807224 3902529 3827150 3729387 3792427 3412927 3445790
4276C445790K53285O3773l54183m1577J16219j4934l6611j67024J2810J45058
$$ 3445790 3699075 3762848 3408665 3367088 3483307 3468373 3431762 3264738 3277548 3422606
4266C422606l261J37688j69722p709M5776M9896j10081k24328k9781K06968j11407
$$ 3422606 3419345 3557033 3387311 3379602 3425378 3475274 3365193 3140865 3111084 3318052 3206645
4255C206645j11292j0043R1061L1632J22686o9833l52924J98275n3199r583J04019
$$ 3206645 3095353 3085310 3176371 3208003 3330689 3260856 2907932 3106207 3053008 3043425 3147444
4244C147444l7125j33957p573j08291P0774N8535R4022J42259n938j34058P9390
$$ 3147444 3110319 2976362 2968789 2860498 2931272 2989807 3083829 3226088 3220150 3086092 3165482
4233C165482l4077L9208p0986j09433K9876k00785J66845N7052j51015L2343j53554
$$ 3165482 3131405 3170613 3099627 2990194 3020070 2819285 2986130 3043182 2892167 2924510 2770956
4222B770956L8085L07150j10591p0189R8785j38200m9792Q8053O3313o5945p4429
$$ 2770956 2809041 3116191 3005600 2935411 3034196 2895996 2846204 2934257 2997570 2931625 2857196
4211B857196k38848J96413M8534M8138q1562o2578l1291j34966l4976J73658K07301
$$ 2857196 2618348 2814761 2863295 2911433 2829871 2767293 2736002 2601036 2566060 2739718 2947019
4200B947019j02614j88553J66721m0555Q3189m8690Q3570K0359O1144j97257j15530
$$ 2947019 2844405 2655852 2822573 2782018 2865207 2816517 2900087 2920446 2981590 2784333 2668803
4189B668803J54813J9757J127M6646N1614J771q2586N9644r6848P6203j9238k45729
$$ 2668803 2823616 2843373 2844500 2891146 2942760 2944531 2861945 2921589 2824741 2900944 2881706 2635977
4177B635977K11701Q403J4173N9757l9670L97N7168k46043K98549K23793j21672
$$ 2635977 2847678 2856081 2870254 2930011 2890341 2890738 2947906 2701863 3000412 3224205 3102533
4166C102533j05702j45364N0880J2371p9610M9251J21267J35710L8095j46043
$$ 3102533 2996831 2851467 2902347 2914718 2835108 2884359 3005626 3141336 3179431 3033388
4156C033388j63652J42549j02359N8021L33684k1238p8236r7713K30744k16828
$$ 3033388 2869736 3012285 2909926 2967947 3301631 3280393 3202157 3104444 3335188 3118360
4146C118360k4656K2861M7703K42225K8125j89628j5527J18478p1827j61679J09875
$$ 3118360 3093704 3116565 3164268 3406493 3434618 3244990 3229463 3347941 3276114 3114435 3224310
4135C224310Q3313J65565J25082j48966j5089J37235k90436R1426J75507k9177
$$ 3224310 3307623 3473188 3598270 3449304 3434215 3571450 3281014 3372440 3547947 3518770
4125C518770K9255J34502j38543R1489j92384r5894M13351p0635J25348k281n1232
$$ 3518770 3548025 3682527 3543984 3635473 3443089 3347195 3760546 3689911 3815259 3812978 3761746
4114C761746o1910J20311L6197K910P9658K50950P3290R0162j07038N2060j13556
$$ 3761746 3699836 3820147 3856344 3859254 3938912 4189862 4263152 4353314 4246276 4298336 4184780
4103D184780J83402K19131M1394k26955Q5107J61230M2773N8959L2512p510R8582
$$ 4184780 4368182 4587313 4628707 4401752 4486859 4648089 4690862 4749821 4782333 4774823 4873405
4092D873405n9959J08136N4051j3332J91993L8051L2505q6470J74742K01011j58762
$$ 4873405 4813446 4921582 4975633 4962301 5154294 5192345 5224850 5138380 5313122 5514133 5355371
4081E355371j02775J40342K06926J70789j8480l4345J18504O2154p8950Q25K64356
$$ 5355371 5252596 5392938 5599864 5770653 5752173 5717828 5836332 5898486 5819536 5820361 6084717
4070F084717N7243k6105J04685K41482M7835J75783L9024m6549O9244J95503N2232
$$ 6084717 6141960 6115855 6220540 6462022 6509857 6685640 6724664 6678115 6747359 6942862 6995094
4059F995094P1897K92175J6352J09632R3147R0817j46684K47111J58794P3658
$$ 6995094 7066991 7359166 7375518 7485150 7578297 7669114 7522430 7769541 7928335 8001993
4049H001993K19024J888M6173K49419J82068o594K56638R7134L08661L1823J53708
$$ 8001993 8221017 8222905 8269078 8518497 8700565 8693971 8950609 9047743 9356404 9388227 9541935
4038I541935J5094J03091J59886O8007J14658J31448L32883J35064Q0629M5028
$$ 9541935 9557029 9660120 9820006 9888013 10002671 10134119 10467002 10602066 10682695 10727723
4028A0727723N5537L80652O5258L19838J37652p9252K12863J72217K66739Q4891
$$ 10727723 10783260 11163912 11229170 11549008 11686660 11607408 11820271 11992488 12259227 12344118
4018A2344118J97518J51933r6376J55730l41105k32953J81974P9583k2256j5535
$$ 12344118 12541636 12693569 12597193 12752923 12411818 12178865 12360839 12440422 12418166 12402631
4008A2402631k78166k78592L3813o7652j3457J22329J95477l03813p8049J40069
$$ 12402631 12124465 11845873 11879686 11812034 11798577 11920906 12116383 11812570 11734521 11874590
3998A1874590j87050k35101j49547j27319O8356J53488j93319j06488q7698k60674
$$ 11874590 11687540 11452439 11302892 11175573 11243929 11397417 11204098 11097610 11009912 10749238
3988A0749238J85130K30991j07445n17824P8936j09269k219l75672N1917j38833
$$ 10749238 10934368 11165359 11057914 10540090 10619026 10509757 10507538 10131866 10183783 10044950
3978A0044950j72774k8190n9888K5875p2782j11900k89972m4211l43243j62698
$$ 10044950 9872176 9843986 9784098 9809973 9737191 9625291 9335319 9291108 8947865 8785167
3968H785167K44561j42920j58226j46184L3058q5143J11610k38535j21808p5581
$$ 8785167 9029728 8886808 8728582 8582398 8615456 8530313 8641923 8403388 8281580 8205999
3958H205999k52723J7921M9689j0189l13058l00835N2150k692r8674j44258L4883
$$ 8205999 7953276 7971197 8020886 8010697 7697639 7396804 7448954 7446262 7347588 7203330 7238213
3947G238213m8053p9435k9115k19804k6981k51287p6991l9791L6611n4868p478
$$ 7238213 7190160 7110725 7081610 6861806 6834825 6583538 6506547 6466756 6503367 6448499 6441021
3936F441021J52173j52477m26697P7380J70727j92715L76776l04878l37565K51
$$ 6441021 6593194 6440717 6014020 6091400 6262127 6069412 6446188 6141310 5803745 5803996
3926E803996j75908J48993n7356j29574K20841K6395J25672N230k05278k83512
$$ 5803996 5628088 5777081 5719725 5590151 5810992 5837387 5963059 5968289 5763011 5479499
3916E479499Q9859L945j9105j20622j05162L17224r5158n3357J6462j80321n2296
$$ 5479499 5569358 5573303 5554198 5433576 5328414 5645638 5550480 5497123 5513585 5333264 5280968
3905E280968L5637J55157Q2075j52021J12230k3186O7452k70739R9279K18770
$$ 5280968 5316605 5471762 5553837 5401816 5514046 5490860 5558312 5287573 5386852 5605622
3895E605622M8015o6626P9005m9803L2952K3314o8366l8477J46328o5539J23278
$$ 5605622 5653637 5587011 5666016 5616213 5649165 5672479 5604113 5565636 5711964 5646425 5769703
3884E769703J09088L4573j05991O3911P8928j0247P5247j87703K70322Q6484o5049
$$ 5769703 5878791 5913364 5807373 5871284 5950212 5939965 6015212 5827509 6097831 6184315 6119266
3873F119266L2764O860K01881J71868J11546j80547J81007J68697m2987J13539
$$ 6119266 6152030 6158890 6360771 6532639 6644185 6463638 6644645 6813342 6770355 6883894
3863F883894R5272k3245K39715n7671L4705M40375K06214n4168j1577K22341L10573
$$ 6883894 6979166 6955921 7195636 7137965 7172670 7613045 7819259 7765091 7753514 7975855 8286428
3852H286428r4081J35871K28345K62498J13478m8947J25516J41454L33146K90752
$$ 8286428 8192347 8328218 8556563 8819061 8932539 8883592 9009108 9150562 9483708 9774460
3842I774460L0170K44637K42444K35211J5459K08014K62422K67713K70795L2183
$$ 9774460 9804630 10049267 10291711 10526922 10542381 10750395 11012817 11280530 11551325 11583508
3832A1583508K68005K25832J62487O7520K07800K00076J52816J68829N30381Q9197
$$ 11583508 11851513 12077345 12239832 12307352 12515152 12715228 12868044 13036873 13567254 13656451
3822A3656451m4367L45475K69418K3571J86519L69545K30161L23195J81625j69454
$$ 13656451 13612084 13957559 14226977 14250548 14437067 14806612 15036773 15359968 15541593 15372139
3812A5372139M58835K20511Q9607j92300l631J59287K09543K27099J10642j00935
$$ 15372139 15830974 16051485 16141092 15948792 15945161 16104448 16313991 16541090 16651732 16550797
3802A6550797o5302K61717m8709N8356J26074p4324J29976l6286J30819J68857
$$ 16550797 16485495 16747212 16698503 16756859 16882933 16808609 16938585 16902299 17033118 17201975
3792A7201975j71037L70416o291p2251j70336l06226k50505K46j33567l22123
$$ 17201975 17030938 17401354 17395063 17322812 17152476 16846250 16595745 16595991 16462424 16140301
3782A6140301n18446n90205O7913j29150l11088m00842k80479k40338j47150l49877
$$ 16140301 15621855 15031650 15099563 14970413 14659325 14258483 13978004 13737666 13590516 13240639
3772A3240639k24256j69426P2106l79629l43306J60916k31906k49420m00503k23641
$$ 13240639 13016383 12846957 12919063 12539434 12196128 12357044 12125138 11875718 11475215 11251574
3762A1251574j02300k4609k32358j30711l11934k05601j60296j46670L4643m04553
$$ 11251574 11149274 11124665 10892307 10761596 10449662 10244061 10083765 9937095 9971738 9567185
3752I567185m7004j08504j38698j18311K51620O6352l61409n21371n1707k02675
$$ 9567185 9520181 9411677 9272979 9154668 9406288 9472640 9111231 8589860 8538153 8335478
3742H335478K2471k39889k18365J05468k67028j1072l42297J88069l52891P7746
$$ 8335478 8357949 8118060 7899695 8005163 7738135 7727063 7384766 7572835 7219944 7297690
3732G297690k3037k01078M4903o545j93119j85145O1231j24336R8720l4976j87199
$$ 7297690 7274653 7073575 7118478 7111933 6918814 6733669 6794900 6670564 6769284 6734308 6547109
3721F547109l7301j25551j25495L1250k71464q6563M6373J93119j45782k2106
$$ 6547109 6509808 6384257 6258762 6290012 6018548 5931985 5978358 6171477 6025695 6003589
3711F003589j00562j8069J9746j00767K6515k19956J07978J07621j31737j51963
$$ 6003589 5903027 5884958 5904704 5803937 5830452 5610496 5718474 5826095 5694358 5542395
3701E542395N7745k3360P3333N2102k36684k0206r3755K327j7807j09174Q7702
$$ 5542395 5600140 5576780 5650113 5702215 5465531 5445325 5351570 5353897 5336090 5226916 5314618
3690E314618J31833O7680j87036k03083J9728K25264p2028O7576j3241O9005K98080
$$ 5314618 5446451 5514131 5327095 5124012 5143740 5369004 5296976 5364552 5351311 5420316 5718396
3679E718396k11912j22436L3749J92252j14829J97300J64804k7637J49837J78554
$$ 5718396 5506484 5384048 5417797 5610049 5495220 5692520 5857324 5829687 5979524 6158078
3669F158078O8094r0129q2395J36142j4086j15921K53779L72162O968k685J48443
$$ 6158078 6226172 6136043 6053648 6189790 6175704 6059783 6313562 6685724 6692692 6690007 6838450
3658F838450L980R3900n276J23398N2937K26122L59566j55778n679L98467M1144
$$ 6838450 6842430 6936330 6931054 7054452 7107389 7333511 7693077 7537299 7531620 7930087 7971231
3647G971231p89J88887k1451J10398K92288K98550K72118k5031L84627K76713
$$ 7971231 7970442 8159329 8137878 8248276 8540564 8839114 9111232 9086201 9470828 9747541
3637I747541L69636K9707M04841J47110L35207L03500L82241M95875N53721K30418
$$ 9747541 10117177 10146884 10551725 10698835 11034042 11337542 11719783 12215658 12769379 12999797
3627A2999797L81514N76835M20816O38644O08093Q58438P84903N09441M48956
$$ 12999797 13381311 13958146 14378962 15017606 15625699 16484137 17269040 17778481 18227437
3618A8227437N28254R65001R19359P28079J038560R25047J228397J069606J150402
$$ 18227437 18755691 19720692 20640051 21368130 22406690 23331737 24560134 25629740 26780142
3609B6780142J061862R84198J377276J289296J568300J592093J313793J361642
$$ 26780142 27842004 28826202 30203478 31492774 33061074 34653167 35966960 37328602
3601C7328602J449354J749234J558152J693647J774114K368772K592068K661833
$$ 37328602 38777956 40527190 42085342 43778989 45553103 47921875 50513943 53175776
3593E3175776K810528L354393L290074L801089M125701M261110M767617N347735
$$ 53175776 55986304 59340697 62630771 66431860 70557561 74818671 79586288 84934023
3585H4934023N964022P421010Q733519J0055961J1265027J3380535J6024171K0634875
$$ 84934023 90898045 98319055 107052574 117108535 128373562 141754097 157778268 178413143
3577A78413143K6953225L5652323M4161229N0727345L5780008p722536m0826880
$$ 178413143 205366368 241018691 285179920 335907265 371687273 363964737 323137857
3570C23137857m9354435m3675533l4839985k6763856k0764076j7091089j4471047
$$ 323137857 273783422 230107889 195267904 168504048 147739972 130648883 116177836
3563A16177836j1317104r405604q514856p726961p162550o401324n053894m134941
$$ 116177836 104860732 95455128 86940272 79213311 72050761 65649437 60595543 56460602
3555E6460602l298156k568205k682630k147376j839248k108729j950812k074498
$$ 56460602 53162446 50594241 47911611 45764235 43924987 41816258 39865446 37790948
3547C7790948k260629j975324j685226j515480j312918j613343j434382q69978
$$ 37790948 35530319 33554995 31869769 30354289 29041371 27428028 25993646 25123668
3539B5123668j039860q82467q01691p58612o57813n83621q60738k60490k33628
$$ 25123668 24083808 23201341 22399650 21641038 20983225 20399604 19538866 19278376 19044748
3530A9044748j42196o13354k19714m81989m05233l76869n41754n51431l08259
$$ 19044748 18902552 18289198 18069484 17587495 17182262 16805393 16263639 15712208 15403949
3521A5403949p2579p59456l77912k84100j87576l46437k50538k77281l31444m50735
$$ 15403949 15331370 14571914 14194002 13909902 13722326 13375889 13125351 12848070 12516626 12065891
3511A2065891m08419j10541k44652m43512j28882k07920k25639p9580k70128j72057
$$ 12065891 11657472 11546931 11302279 10858767 10729885 10521965 10296326 10216746 9946618 9774561
3501I774561k03752j05080K6043j27443k84125k49916m0299m07032K4948m2354
$$ 9774561 9570809 9465729 9491772 9364329 9080204 8830288 8789989 8382957 8407905 8365551
3491H365551k11678p8568k11195j71704R1392k27913p9085J49931j5385m7222
$$ 8365551 8153873 8075305 7864110 7692406 7783798 7555885 7476800 7626731 7611346 7564124
3481G564124j15054j80822J17064k20824j20946j12815j33152Q2935j30586Q3681
$$ 7564124 7449070 7268248 7385312 7164488 7043542 6930727 6797575 6880510 6749924 6833605
3471F833605M7611j54499J23666M099M0468k21886o7202P3660J2508k14415j503
$$ 6833605 6881216 6726717 6850383 6854482 6894950 6673064 6605862 6679522 6692030 6477615 6476112
3460F476112P1798k25053L3704j03409K86809o3014j22759j72751K32432p170
$$ 6476112 6547910 6322857 6356561 6253152 6539961 6476947 6354188 6181437 6413869 6406699
3450F406699N3127j65358J0507P0468o4140k76410K36011J62866r0576j1561J06082
$$ 6406699 6459826 6294468 6304975 6375443 6311303 6034893 6270904 6433770 6343194 6331633 6437715
3439F437715p774j58635J58548P0435J45946L4412o2172j32558k9098j2855R5406
$$ 6437715 6429941 6271306 6429854 6500289 6646235 6680647 6618475 6485917 6456819 6443964 6539370
3428F539370K33799J82361m5522L0944J71792J03678J85218J3365N694l842J99595
$$ 6539370 6773169 6955530 6910008 6940952 7112744 7216422 7401640 7415005 7420699 7416857 7616452
3417G616452J39439J50643J24615j08091K19565J1649J17422K62997K41132N2169
$$ 7616452 7755891 7906534 8031149 7923058 8142623 8154272 8271694 8534691 8775823 8827992
3407H827992L4318o26J37765Q5774K6092K53465q8973P346K17273J74042J53241
$$ 8827992 8862310 8861684 8999449 9085223 9111315 9364780 9275807 9283153 9500426 9674468 9827709
3396I827709j34870K50690O120R971J07637k90498R8341K66049j34960j73385
$$ 9827709 9692839 9943529 9949649 9959620 10067257 9776759 9875100 10141149 10006189 9832804
3386I832804p0384j64269k46318J20433J9713K64346j86061l2719m4221k62090
$$ 9832804 9762420 9598151 9351833 9472266 9491979 9756325 9570264 9537545 9493324 9231234
3376I231234M15871j14674r3348j91040O1585J74021j5545j75316J92573J07776
$$ 9231234 9647105 9532431 9439083 9248043 9309628 9483649 9468104 9292788 9485361 9593137
3366I593137j87338p690J66601J58407R5108L39766J05336K39676L29929K30468
$$ 9593137 9405799 9398109 9564710 9723117 9818225 10157991 10263327 10503003 10832932 11063400
3356A1063400J28384N7571o7063P3050j69399r2453n2608l03732R1265O9107k4896
$$ 11063400 11191784 11249355 11182292 11255342 11085943 10993490 10940882 10637150 10728415 10797522 10772626
3345A0772626j5605P0896J11546M5601J0311K01571K72841r4277P1151J16419
$$ 10772626 10757021 10827917 10939463 10985064 10995375 11196946 11469787 11375510 11446661 11563080
3335A1563080M9341J81311K75701J00783J47871J10362M523L2673J83635M7918
$$ 11563080 11612421 11793732 12069433 12170216 12318087 12428449 12432972 12465645 12649280 12697198
3325A2697198P4369K08332J07576P6622M7703Q4812L27957J35172K7862J2713
$$ 12697198 12771567 12979899 13087475 13164097 13211800 13296612 13624569 13759741 13787603 13800316
3315A3800316J07143K62J44436K03048k87969K95303K82819M6180J02087J42863
$$ 13800316 13907459 13907721 14052157 14255205 13967236 14262539 14545358 14591538 14693625 14836488
3305A4836488J38966N1375q193n5960J64757J36494Q0511K50558K1160O6020O4438
$$ 14836488 14975454 15026829 15018636 14962676 15127433 15263927 15344438 15594996 15616156 15682176 15746614
3294A5746614k4300j05603K410J65891o8248J07987n5432K20147Q8376l38242
$$ 15746614 15722314 15616711 15619121 15785012 15716764 15824751 15769319 15989466 16077842 15739600
3284A5739600O1828L1321K35222j84314o7419p1424J69018K13811r5710j23052
$$ 15739600 15801428 15832749 16067971 15883657 15816238 15744814 15913832 16127643 16031933 15908881
3274A5908881l1399j95530k8762O8123K7155O9960m8780j97287P8172J3561k40433
$$ 15908881 15877482 15681952 15653190 15721313 15748468 15818428 15769648 15572361 15650533 15664094 15423661
3263A5423661J7354K299O5606K86120J15536n8855k23453J70309j63017R9020
$$ 15423661 15441015 15443314 15508920 15795040 15910576 15851721 15628268 15798577 15635560 15734580
3253A5734580R2149O0692k10305k09263q240j04871J62662J29870q7593J35281
$$ 15734580 15826729 15887421 15677116 15467853 15459613 15354742 15517404 15647274 15559681 15694962
3243A5694962K03432r5178M9751O3603P5021k59109K80531J75765K89402r1919
$$ 15694962 15898394 15803216 15852967 15916570 15991591 15732482 16013013 16188778 16478180 16386261
3233A6386261P2201j81796o0068K55026J78190j74990K05472J77623Q1873P7519
$$ 16386261 16458462 16276666 16216598 16471624 16649814 16474824 16680296 16857919 16939792 17017311
3223A7017311l2579J59986J1601O7777K92825L97737Q811n8517K61914L23000
$$ 17017311 16984732 17144718 17156319 17224096 17516921 17914658 17923469 17864952 18126866 18449866
3213A8449866K2517n6580K09244J64225L38163M2139K51352J53671K06363J79353
$$ 18449866 18472383 18415803 18625047 18789272 19127435 19169574 19420926 19574597 19780960 19960313
3203A9960313P799L19450j06707J22678J11754M51891J49569M048J67839K46252
$$ 19960313 19968112 20287562 20180855 20303533 20415287 20867178 21016747 21020795 21188634 21434886
3193B1434886M0039K98937O1286L02490J94967j06829J98902J47759K52854J16457
$$ 21434886 21474925 21773862 21835148 22137638 22332605 22225776 22424678 22572437 22825291 22941748
3183B2941748J69086J47163K34787K76813J77008J26508k51502O2573J44777L13737
$$ 22941748 23110834 23257997 23492784 23769597 23946605 24073113 23821611 23884184 24028961 24342698
3173B4342698L10111r1956J44554k4510J8788K5595N1357l7921J49182P2158R6578
$$ 24342698 24652809 24560853 24705407 24680897 24699685 24725280 24776637 24738716 24887898 24960056 25056634
3162B5056634L9831L2521k0829k04296m8471J9548J2489p0322j08254K80870k14560
$$ 25056634 25096465 25128986 25108157 24903861 24855390 24874938 24887427 24817105 24708851 24989721 24775161
3151B4775161m7506j84753r9084l97500j20645n869l20534l1306j84314l11996
$$ 24775161 24727655 24542902 24443818 24046318 23925673 23919804 23599270 23567964 23383650 23071654
3141B3071654k83599k52309J61943j27021l06117k52863j79605j26533j99173
$$ 23071654 22788055 22535746 22697689 22570668 22264551 22011688 21832083 21705550 21506377
3132B1506377j67973p4058j83750l13401j23236k30619k46435k82029m1006k17399
$$ 21506377 21338404 21264346 21080596 20767195 20643959 20413340 20166905 19884876 19843870 19626471
3122A9626471j26683k70832P8231l18177k44076j01270j72209j15246l09286r4914
$$ 19626471 19499788 19228956 19307187 18989010 18744934 18643664 18471455 18356209 18046923 17952009
3112A7952009l62708j82211M8185J4015j87835j10083j18173k41720j94993j74502
$$ 17952009 17589301 17407090 17455275 17469290 17281455 17171372 17053199 16811479 16616486 16441984
3102A6441984K8120j48528O0743k15797j78646m4815J36108l10187j08658J23701
$$ 16441984 16470104 16321576 16382319 16166522 15987876 15943061 16079169 15768982 15660324 15784025
3092A5784025j39636J3589k57834j21343J86433k09019m0173k19o3305K0969j1282
$$ 15784025 15644389 15657978 15400144 15278801 15465234 15256215 15216042 15215823 15152518 15173487 15162205
3081A5162205J03583L4300j90230J79108n2299J4657k5224k26083m4725J78531
$$ 15162205 15265788 15300088 15109858 15288966 15236667 15251324 15226100 15000017 14955292 15133823
3071A5133823p8516O539J41795p8980L8163K90580J05548K41822n0495j36265
$$ 15133823 15055307 15061846 15203641 15124661 15162824 15453404 15558952 15800774 15750279 15614014
3061A5614014L9461R2242K03366K14573l2252K06585J88101J01067q4622n844
$$ 15614014 15653475 15745717 15949083 16163656 16131404 16337989 16526090 16627157 16542535 16536691
3051A6536691L48439K37860K69423L0790J82753N56034L17711N0681K81112K21411
$$ 16536691 16885130 17122990 17392413 17423203 17605956 18161990 18479701 18530382 18811494 19032905
3041A9032905K99135J14105K57682M57944L59587J87658j6192R254M89243L27088
$$ 19032905 19332040 19446145 19703827 20161771 20521358 20709016 20692824 20702078 21191321 21518409
3031B1518409K97476N56994J38585M93957N61975L75477N14710K78684N53456
$$ 21518409 21815885 22372879 22511464 23005421 23567396 23942873 24457583 24736267 25289723
3022B5289723O64877L64828M67589P84135O44258Q66310N85682N88491P81134
$$ 25289723 25954600 26319428 26787017 27571152 28215410 29081720 29667402 30255893 31037027
3013C1037027R03382P52762J033107Q23651R03628J306653Q30078R18196J097115
$$ 31037027 31940409 32693171 33726278 34549929 35453557 36760210 37590288 38508484 39605599
3004C9605599R54487J091692R93558J333766J160875Q76040R00186J023721O43450
$$ 39605599 40560086 41651778 42645336 43979102 45139977 46016017 46916203 47939924 48583374
2995D8583374J123846M43352M64723P38150N04165K11009L1871m2052j42287l05577
$$ 48583374 49707220 50150572 50615295 51353445 51857610 52068619 52100490 52058438 51916151 51610574
2985E1610574l82246m12958n81862p35280o76356o39074q57825r16010p29929
$$ 51610574 51228328 50815370 50233508 49498228 48821872 48182798 47324973 46408963 45679034
2976D5679034r61578q24725p53114j137265q62023p70644p89766p66695p04026
$$ 45679034 44717456 43892731 43139617 42002352 41140329 40369685 39579919 38813224 38109198
2967C8109198o26045n77084q39408l03423o32263n34200n83528o02948l74390
$$ 38109198 37483153 36906069 36066661 35763238 35130975 34596775 34013247 33410299 33035909
2958C3035909l56295n39729k67321j12738j15346j63029j22959O2274k20749j82705
$$ 33035909 32679614 32139885 31872564 31759826 31644480 31481451 31358492 31420766 31200017 31017312
2948C1017312k13323l16443p08194p04730p45359n10236n76745r73427o15969
$$ 31017312 30803989 30487546 29779352 29074622 28329263 27819027 27242282 26268855 25652886
2939B5652886n84209m20833k77222p70690p29698l43396n45948l08836l31128
$$ 25652886 25068677 24647844 24370622 23599932 22870234 22526838 21980890 21672054 21340926
2930B1340926m83076r4440k15158k99391L0876j43664k41501M6428K6973J29967
$$ 21340926 20857850 20763410 20548252 20248861 20279737 20136073 19894572 19941000 19967973 20097940
2920B0097940j61764m506L15316j79198o1135r7242R5526o6896j80366r7836k3808
$$ 20097940 19936176 19931670 20246986 20067788 20006653 19909411 20004937 19938041 19757675 19659839 19636031
2909A9636031K69895j9867M44642K66165n968K90749L68251L47797K29785L92449
$$ 19636031 19905926 19886059 20330701 20596866 20590898 20881647 21249898 21597695 21827480 22219929
2899B2219929M01726M62737M39609M94672O76566P52470N47377M82312L80303
$$ 22219929 22621655 23084392 23524001 24018673 24695239 25447709 25995086 26477398 26857701
2890B6857701O27664P22056O52887O54742R22395O98446L56202Q66830Q11994
$$ 26857701 27485365 28207421 28860308 29515050 30437445 31135891 31492093 32358923 33170917
2881C3170917Q87745O37621N66877J95329K7813n2156q1769k50041j85503n15439
$$ 33170917 34058662 34696283 35263160 35458489 35486302 35434146 35352377 35102336 34916833 34401394
2871C4401394m87905m92690j193559q63452q07116p02003j173622p49566p71747
$$ 34401394 33913489 33420799 32227240 31363788 30556672 29854669 28681047 27931481 27159734
2862B7159734n04888r78186j079178n39127o55270p46671m51666p82550p77517
$$ 27159734 26654846 25676660 24597482 24058355 23403085 22656414 22204748 21422198 20644681
2853B0644681o62692m72914n65767l84412j66039o11556m39869n75928m09368
$$ 20644681 19981989 19509075 18943308 18558896 18392857 17781301 17341432 16765504 16356136
2844A6356136n07388n70389k50686k89302k97634l44281m30931m97364k59155
$$ 16356136 15848748 15278359 15027673 14738371 14440737 14096456 13665525 13168161 12909006
2835A2909006l26209j17135n19148k51712j40022k13755j41747k56980k95101
$$ 12909006 12582797 12465662 11946514 11694802 11554780 11341025 11199278 10942298 10647197
2826A0647197j01398q1245k62489q4475j03279l39971k01249j37206j42084r0993
$$ 10647197 10545799 10464554 10202065 10117590 10014311 9674340 9473091 9335885 9193801 9102808
2816I102808P2506k29475n8880r3206j03515J8053Q044k52036j19179J01758k52184
$$ 9102808 9175314 8945839 8886959 8793753 8690238 8708291 8716335 8464299 8345120 8446878 8194694
2805H194694L8939L823r0045M0626o0603n2401n5834j07177j53342j13406Q2180
$$ 8194694 8233633 8237456 8147411 8188037 8127434 8075033 8019199 7912022 7758680 7645274 7727454
2794G727454l16841M29936p700j07528Q3642K3444k0386j87795j14228L08750
$$ 7727454 7410613 7840549 7832849 7725321 7808963 7832407 7812021 7624226 7509998 7818748
2784G818748p9190N4753j31208K59520Q5802J95860j74892J32869l85722j07379
$$ 7818748 7739558 7794311 7663103 7922623 8008425 8204285 8029393 8162262 7776540 7669161
2774G669161M16780P4336k2247J34458o2823P1850J81295l0872K6860K3137J91508
$$ 7669161 8085941 8160277 8138030 8272488 8209665 8281515 8462810 8431938 8458798 8481935 8673443
2763H673443K42595n6691j07959L30892J01032J44413J14562j6971K03465L59742
$$ 8673443 8916038 8859347 8751388 9082280 9183312 9327725 9442287 9425316 9628781 9988523
2753I988523K13257J13194j18961Q3945M16470L81209j64639K57727J66414K54920
$$ 9988523 10201780 10314974 10196013 10279958 10696428 11077637 10912998 11170725 11337139 11592059
2743A1592059M37797O8866K32367K70491M24734M30749K64750K59849L22568K40379
$$ 11592059 12029856 12098722 12331089 12601580 13026314 13457063 13721813 13981662 14304230 14544609
2733A4544609N07808L35169N55732K31417K98450N72290O35736O19961N21480
$$ 14544609 15052417 15387586 15943318 16174735 16473185 17045475 17681211 18301172 18822652
2724A8822652M67559O12587P61458N72648P29328M76449R10242P69714P91303
$$ 18822652 19290211 19902798 20664256 21236904 21966232 22442681 23352923 24122637 24913940
2715B4913940P53630P54945J041374P53596J136739J170831J025755J306559R22976
$$ 24913940 25667570 26422515 27463889 28217485 29354224 30525055 31550810 32857369 33780345
2706C3780345J159284J372342J360199J508180J579004J634394J784163J830655
$$ 33780345 34939629 36311971 37672170 39180350 40759354 42393748 44177911 46008566
2698D6008566K224900K069378K085048K084879K217177K330069K804551K671251
$$ 46008566 48233466 50302844 52387892 54472771 56689948 59020017 61824568 64495819
2690F4495819K584417K691031K963689K748384K702175K682363K611434K193492
$$ 64495819 67080236 69771267 72734956 75483340 78185515 80867878 83479312 85672804
2682H5672804J852272J500153J000365N58926J01918k66945q83398j494540j794863
$$ 85672804 87525076 89025229 90025594 90584520 90686438 90419493 89536095 88041555 86246692
2673H6246692k308783k622971k247852k707808k632850k887927l010547k693241
$$ 86246692 83937909 81314938 79067086 76359278 73726428 70838501 67827954 65134713
2665F5134713k366696k539123k262422k320725k212038j779097j704055j949462
$$ 65134713 62768017 60228894 57966472 55645747 53433709 51654612 49950557 48001095
2657D8001095j953289j735759j444497j738759j778829j349717j352601j471512
$$ 48001095 46047806 44312047 42867550 41128791 39349962 38000245 36647644 35176132
2649C5176132j427585j143816j202504j176638j409427j036490r88386j008845
$$ 35176132 33748547 32604731 31402227 30225589 28816162 27779672 26791286 25782441
2641B5782441j072410p25377n59615q93119q73144o71547n10514n78841q96537
$$ 25782441 24710031 23984654 23425039 22531920 21658776 20987229 20476715 19897874 19001337
2632A9001337m78906l65700m72267o37322m36440m66729l53105o17890m96216
$$ 19001337 18522431 18156731 17684464 17047142 16610702 16143973 15790868 15172978 14676762
2623A4676762j92595n31180m33533m41942m36652m18607k84397j67372l91096
$$ 14676762 14484167 13952987 13519454 13077512 12640860 12222253 11937856 11770484 11379388
2614A1379388k86577j12648l67425j44727l41891l60227j65257m0138j83792k75415
$$ 11379388 11092811 10980163 10612738 10468011 10126120 9765893 9600636 9560498 9376706 9101291
2604I101291j08117k09658k46529k30279L5286j72827k53804j95589j6245k13789
$$ 9101291 8993174 8783516 8536987 8306708 8341994 8169167 7915363 7719774 7703529 7489740
2594G489740k81682k08950r0601j53018j86071m7865k05586k5612j29611O871
$$ 7489740 7208058 6999108 6908507 6755489 6569418 6521553 6315967 6290355 6160744 6167615
2584F167615j42064m24738K0561r158j9259j97307l13825O1521q1227j13716m2495
$$ 6167615 6025551 5600813 5621374 5612216 5592957 5395650 5081825 5143346 5062119 4948403 4905908
2573D905908K57856l9900q2596l25983l24588R4902L2921R4981k32314j07457
$$ 4905908 5163764 5123864 5041268 4715285 4390697 4485599 4518520 4613501 4381187 4273730
2563D273730l7210r9163r5859O9975o4244L218j62601k64052L2644q5543p6134
$$ 4273730 4236520 4137357 4041498 4111473 4047229 4050447 3887846 3623794 3656438 3570895 3494761
2552C494761k11464K48955k12466k01163N7946Q6419j50628K33113j48041j01421
$$ 3494761 3283297 3532252 3319786 3118623 3176569 3262988 3112360 3345473 3197432 3096011
2542C096011n4897j91627k8472Q0129J72840o3032k33106M8240j38830m751O0604
$$ 3096011 3041114 2849487 2821015 2901144 3073984 3010952 2777846 2826086 2687256 2682505 2743109
2531B743109r82p8860P488J68312k21090P8483l27402J58479j84474j58690K43925
$$ 2743109 2742127 2663267 2670755 2839067 2617977 2696460 2369058 2527537 2343063 2184373 2428298
2520B428298J9458j05218o6074k28608J28438K2637k32308J26956r3932N6235
$$ 2428298 2447756 2342538 2276464 2047856 2176294 2198931 1966623 2093579 1999647 2055882
2510B055882n7048J20399k04492Q2250r8359P819J69023k35073J38367l0147p7574
$$ 2055882 1998834 2119233 1914741 1996991 1898632 1906451 2075474 1840401 1978768 1948621 1871047
2499A871047J86471p0293P1885j74310Q6576J45339k35958K01958o9372j73865
$$ 1871047 2057518 1987225 2059110 1884800 1971376 2116715 1880757 2082715 2013343 1839478
2489A839478J60953J38364k91623j98332J26450J6196J23683j33901r9416J29881
$$ 1839478 2000431 2138795 1847172 1648840 1775290 1791486 1915169 1781268 1681852 1811733
2479A811733P3260j80608n1723M3774l9729j7585k1635J67480O2141m1008N5982
$$ 1811733 1884993 1704385 1652662 1696436 1656707 1639122 1617487 1784967 1847108 1806100 1862082
2468A862082p8822J57427M5122l75381q9093P7422K78286j58457J07885J50633
$$ 1862082 1783260 1940687 1985809 1610428 1521335 1598757 1877043 1718586 1826471 1977104
2458A977104k63522j41477J7650P7891p7064N1275k59755j06640J70380K05623
$$ 1977104 1713582 1572105 1589755 1667646 1590582 1641857 1382102 1275462 1445842 1651465
2448A651465P5298l30435j16218J18922n8850j69234O1132O2537Q6845R1111k03600
$$ 1651465 1726763 1396328 1280110 1399032 1340182 1170948 1232080 1294617 1381462 1472573 1268973
2437A268973K9102P5654j56441p9750J57423m1104R3460j24257p5517j19524j05201
$$ 1268973 1298075 1373729 1217288 1137538 1294961 1253857 1347317 1223060 1147543 1028019 922818
2426I22818k753j53073Q8484L49682J09390l37006P1377K5718K8873R0160P699
$$ 922818 920065 766992 855476 1205158 1314548 977542 1048919 1074637 1103510 1193670 1201369
2415A201369q8413n3037n9815J20964N6244J55051j22957J0248r1899m4853k10909
$$ 1201369 1112956 1059919 1000104 1121068 1177312 1332363 1209406 1219654 1127755 1082902 871993
2404H71993J50503j30585k96978m3929J52218J91389M2518J2844r7874J42133
$$ 871993 1022496 891911 594933 551004 703222 894611 937129 949973 852099 994232
2394I94232j4464l02647R2508J25366k27176J8634J12556J35981o0343J5200j8503
$$ 994232 979768 677121 769629 894995 667819 686453 799009 934990 874647 889847 871344
2383H71344p4990k7083r5493O8478o0686K7268N4375q1121J07013M663q8033K43124
$$ 871344 796354 769271 673778 742256 681570 708838 763213 682092 789105 793768 705735 948859
2371I48859j46276k26567j68252K87434o1675j38505n4619J96059K95916j36268
$$ 948859 802583 576016 407764 695198 633523 495018 440399 636458 932374 796106
2361G96106K6206k37245r8639K22783J04135M4027k63042o5316K40143p3968J10558
$$ 796106 822312 585067 486428 709211 813346 857373 594331 529015 769158 695190 805748
2350H05748j37J7247N8591J63788o9581m13624M8018k2053k1153j55729l088M6080
$$ 805748 805611 822858 881449 1045237 975656 562032 610050 587997 566844 411115 408027 454107
2338D54107J15086k09389J24224K3766J16983K2996q4455O3947N997j38122k30467
$$ 454107 569193 359804 484028 507794 624777 647773 563318 627265 633262 495140 264673
2327B64673K01092r7214K63206J2602j71358L863P7388o5034J03232o357r1993
$$ 264673 465765 368551 631757 644359 473001 476864 554252 489218 592450 586093 494100
2316D94100o8405P462M7442o6566K2891K12820J58392j63710j02399j912J56501
$$ 494100 425695 433157 480599 414033 436924 649744 808136 644426 542027 540115 696616
2305F96616J29002P649r3370l28652J94829K1256n0933k35157K81773J07670r0337
$$ 696616 825618 833267 739897 411245 606074 627330 576397 341240 623013 730683 640346
2294F40346j54252K03811n2213K5738j63872l05566L00992K25961j6343M0417
$$ 640346 486094 689905 637692 663430 499558 193992 494984 720945 704602 745019
2284G45019l49901o440M2318L2943n6017L815R4613K18608j77117O2267k26768
$$ 745019 395118 388678 430996 463939 407922 411737 506350 724958 547841 610108 383340
2273C83340L2808J79440O0030M3324l21736O6542j55445K50394J01677j35899
$$ 383340 416148 595588 655618 698942 377206 443748 288303 538697 640374 504475
2263E04475o8173J01142M2664r7546J48146q3300m5268L4951o2547p850K22331
$$ 504475 436302 537444 580108 482562 630708 547408 502140 537091 474544 466694 689025
2252F89025l7832N4801p1596n1820j23045m1986K15525j73849M7950n981O1844
$$ 689025 651193 705994 634398 582578 459533 417547 633072 459223 507173 501192 563036
2241E63036p4509J52843r8759j58086J88778O3656k25812j1698Q8704L1473k00417
$$ 563036 488527 641370 542611 384525 573303 636959 411147 399449 488153 519626 319209
2230C19209J43368K2848j19544J27000M4859J89841Q7222k86631j517k2138j42475
$$ 319209 462577 485425 365881 492881 537740 727581 814803 528172 526655 504517 362042
2219C62042p6281N5040M3408P1922J54908Q8529j80083j24860J33766m0184L271
$$ 362042 285761 340801 384209 456131 611039 699568 519485 394625 528391 488207 491478
2208D91478Q0632j05427L3071j19724j7015J9255J01238m467N0272L21036r0459
$$ 491478 572110 466683 499754 380030 363015 382270 483508 479041 529313 850349 759890
2197G59890k90979k10854P8087J7866J5639l9108R9274J26337q4774J28742j35135
$$ 759890 468911 258057 336144 354010 369649 330541 429815 556152 471378 600120 464985
2186D64985Q1871j55612J78302l6902J21822o7386j44088J69383n9073j49189
$$ 464985 546856 391244 569546 532644 654466 587080 442992 612375 553302 404113
2176D04113K69407l3868N5254J0733J4834q4777p7061P1775k23620K52160o5623
$$ 404113 673520 639652 694906 705639 720473 635696 558635 630410 406790 658950 593327
2165E93327J13176J51812R4744n5343j20898k9629J54038J51008j46837q6625
$$ 593327 706503 858315 953059 897716 776818 747189 901227 1052235 905398 818773
2155H18773J63417l2686N16J51186J30825p3336J05332K89751r9050O8604M1920
$$ 818773 982190 949504 950020 1101206 1232031 1158695 1264027 1553778 1454728 1523332 1565252
2144A565252K19359n27J34528j02396j77387J91311J10078K07391K03111J06151
$$ 1565252 1784611 1784084 1918612 1816216 1638829 1830140 1940218 2147609 2350720 2456871
2134B456871J05918L1886J65418K82438M4346J78746J75684L22203J82599o3058
$$ 2456871 2562789 2594675 2760093 3042531 3086877 3265623 3441307 3763510 3946109 3883051
2124C883051J78633R8070J54289k0203K70724L40545L35200L12087N52848J07372
$$ 3883051 4061684 4159754 4314043 4293840 4564564 4905109 5240309 5552396 6105244 6212616
2114F212616M83531R64651M03832K69008O05908R57458Q45585Q13831R23149J265996
$$ 6212616 6696147 7660798 8064630 8333638 8939546 9897004 10742589 11556420 12479569 13745565
2104A3745565J014927J489826J724685K579435K939105M122702N509370P425292
$$ 13745565 14760492 16250318 17975003 20554438 23493543 27616245 33125615 40550907
2096D0550907P897203J772057n680146p628002o619785m968743l854478k864279
$$ 40550907 48448110 50220167 44540021 36912019 30292234 25323491 21469013 18604734
2088A8604734k374424j769175j395430j010469r46113j193154r26435j045922
$$ 18604734 16230310 14461135 13065705 12055236 11109123 9915969 8989534 7943612
2080G943612p88696o43814m97706l27232k74950l94839j4839l09146m46274j49595
$$ 7943612 7154916 6511102 6013396 5686164 5411214 5016375 5001536 4692390 4246116 4096521
2070D096521j98450j88960k64204k29118l67776l41631j00933J46627l52701R8229
$$ 4096521 3898071 3709111 3444907 3215789 2848013 2506382 2405449 2552076 2199375 2297604
2060B297604n3317k77868k4853o3948R5571O0517j24676j09681J25193j68242
$$ 2297604 2244287 1966419 1941566 1877618 1973189 2033706 1909030 1799349 1924542 1756300
2050A756300j3530l02696R3707n8367m2587J39394k59112J87524j95421M2780
$$ 1756300 1742770 1440074 1533781 1475414 1432827 1572221 1313109 1500633 1305212 1347992
2040A347992Q2974n2631k44406L4776M4250k7015J5823Q2596k30217l11181P9316
$$ 1347992 1430966 1378335 1133929 1168705 1212955 1185940 1201763 1284359 1054142 742961 822277
2029H22277K24066n4993M6612J14724j93896k21915J04758m2039q0763K20787
$$ 822277 1046343 991350 1037962 1152686 958790 736875 841633 799594 718831 939618
2019I39618Q367j10842j26636J46272j78898j15941J03691K06320j45773l02248
$$ 939618 947985 837143 710507 856779 677881 561940 665631 871951 726178 423930
2009D23930K58278l0906p188j42277M1012j3130j83454j69313L30038R4453l5425
$$ 423930 682208 651302 644114 501837 542849 529719 346265 176952 506990 601443 566018
1998E66018R7099j11526p0355p6961M8222L8001K21943j18044o7513J45857k40657
$$ 566018 663117 551591 481236 404275 452497 490498 712441 594397 526884 672741 432084
1987D32084j34682J4060j02461L58946p1487q3573p6096j78855P6659K35922p4790
$$ 432084 297402 311462 209001 567947 496460 412887 336791 157936 234595 470517 395727
1976C95727l7856j46877r612K46652O1374l34349K57533j83399m543P2873q6631
$$ 395727 357871 210994 201382 448034 509408 175059 432592 249193 244650 317523 230892
1965B30892p9942o6106J97878K49747j38766J70848j60601m8144j36482p2243
$$ 230892 150950 84844 282722 532469 393703 564551 403950 355806 219324 147081
1955A47081J35087n8408K10783R802k45604j46382K78620j0628k36469n1082L3327
$$ 147081 282168 223760 434543 444345 198741 52359 330979 320351 83882 32800 66127
1944F6127q755O4154K32486M9278j02771r5608j04095K60704L0035j4188j43132
$$ 66127 57372 121526 354012 403290 300519 204911 100816 361520 391555 377367 234235
1933B34235J11993J40655Q3361j64324j93195J79602l51780M379N6599r4898K33136
$$ 234235 346228 486883 570244 405920 212725 392327 40547 44926 101525 6627 239763
1922B39763L11116j81270j53718j28620Q954L11318j06094k11373j1047q3073
$$ 239763 550879 369609 215891 87271 96225 407543 301449 90076 79029 -4044
1912d044L236K42426J86230k79623J0806Q9465p5161o3623m2804J97042l5382
$$ -4044 -808 241618 427848 148225 159031 248496 173335 109712 66908 263950 228568
1901B28568K19053j59758O6922k6606k54115J86921R8582J4884j17537K14605
$$ 228568 447621 287863 354785 328179 74064 260985 359567 374451 256914 471519
1891D71519J14722j80143o3053l67882J04222L2255K53927j37056j49001P40J68698
$$ 471519 586241 406098 343045 -24837 79385 111640 365567 228511 79510 80250 248948
1880B48948p3854J4973N3524j31345J84326j56902l5145K8222j03651J01782J06872
$$ 248948 175094 190067 243591 112246 296572 139670 104525 132747 29096 130878 237750
1869B37750r7437j99154j24525L28871n1423L0299Q3584m2284Q4572j98358l5353
$$ 237750 140313 -58841 -183366 145505 94082 124381 207965 165681 250253 51895 16542
1858A6542m6039J30528N7074P9306j5778j866L5001p1589J7511J04442k05648
$$ 16542 -29497 101031 158105 237411 221633 219767 254768 183179 200690 305132 99484
1847I9484r3152r7168L45102K1032j00646j39259j26875P8299M8931J41702j61004
$$ 99484 6332 -90836 254266 275298 174652 35393 -91482 -13183 35748 177450 16446
1836A6446r9382N954j3518K12227J94244j81769R048J07174m919r9931Q1944J53540
$$ 16446 -82936 -76982 -90500 121727 315971 134202 143250 250424 245505 145574 227518 381058
1824C81058N2030j74426j66069k04553Q4794J44011r1890J02666l1664r1257J79923
$$ 381058 433088 258662 92593 -111960 -27166 116845 24955 127621 95957 4700 184623
1813A84623k8605o2558L47267j25326J54938L275k51782l941k05677J9735J59501
$$ 184623 156018 93460 440727 315401 470339 473614 221832 217891 12214 31949 191450
1802A91450j10415k3970j07772K54651J23416o7995J58018j48863n0301k19278
$$ 191450 81035 57065 -50707 203944 327360 259365 417383 268520 218219 -1059
1792a059K57824m7925m1203J30770J3398m24725J63152J2278J68998k7641j2402
$$ -1059 256765 208840 167637 298407 311805 -112920 50232 62510 231508 203867 191465
1781A91465o7564k8277j537N0305j60393R1139m5897L07571J6280j69305l1626
$$ 191465 123901 95624 94087 144392 -16001 75138 29241 336812 353092 183787 152161
1770A52161K2877o0257j80374p7921j4027J79462j577K79865Q8192j66026k45802
$$ 152161 175038 114781 -65593 -143514 -157541 21921 20344 300209 388401 222375 -23427
1759b3427K3092J164P5494k13560J57704J37354N3103r2932j52516L25044o5326
$$ -23427 -335 829 76323 -137237 20467 157821 210924 117992 -34524 290520 225194
1748B25194M4423J8658k96043O0858n7397J49375o8041J05782l6047k96046J81921
$$ 225194 269617 288275 -7768 53090 -4307 145068 77027 182809 146762 -149284 32637
1737C2637J02364k02383J65476R2565n7472j91997J8193P1428R4360k33291j15836
$$ 32637 135001 -67382 98094 190659 133187 -58810 -40617 30811 125171 -108120 -223956
1726b23956R4226n9465P1960J33486m6167L0624L6266q8401J86997L5840m51932
$$ -223956 -129730 -189195 -117235 16251 -29916 708 36974 -51427 135570 171410 -280522
1715b80522O3820K28398R5189l037k150M233j01346j20751M6141R0835K08071
$$ -280522 -216702 11696 106885 103848 101698 105931 4585 -116166 -70025 20810 228881
1704B28881o5814j1484j12760K62625k73443n6134K59097j74569q077l354j43114
$$ 228881 163067 151583 38823 301448 28005 -28129 230968 56399 48322 44968 -98146
1693i8146P7253p996J20427j77365k79080K30529n2275K30579j84809j1794J7055
$$ -98146 -20893 -28889 91538 -85827 -364907 -134378 -186653 43926 -140883 -152677 -135622
1682a35622j21383m3048K30231K81865l09896J61328J84064n2223K6342n6901
$$ -135622 -257005 -300053 -69822 212043 -97853 63475 247539 195316 221658 164757
1672A64757q93k64063l7382J25617o0321P5398k5726K01842J47421l19753k6384
$$ 164757 163864 -100199 -137581 -11964 -72285 3113 -22613 179229 326650 6897 -19487
1661a9487P3562K19045k21211M1744k58683J90562M3095k26994N4183L54857L3854
$$ -19487 54075 273120 51909 93653 -165030 25532 68627 -158367 -104184 250673 284527
1650B84527p0943q8111m7075P995J00675N7295j07901o6926j24357k0484L0146
$$ 284527 213584 125473 78398 86393 187068 244363 136462 69536 -54821 -75305 -45159
1639d5159J01426j60595n2044J35382J08381J90933J52089k87825K283O166o9172
$$ -45159 56267 -104328 -156372 -20990 87391 278324 430413 142588 144871 151037 81865
1628H1865O2213M7614r9479L0128J55457n9715k6139k30335K6679J27235j35349
$$ 81865 144078 191692 92213 122341 277798 218083 191944 -38391 -11712 115523 -19826
1617a9826M6121o9254J85247j54541J6680J43333J32557j61754j71350O8324J11547
$$ -19826 26295 -42959 142288 -12253 4427 147760 280317 118563 -52787 15537 127084
1606A27084P3269m00628J98347N3592j16706J55748J81909j78208j08236j0727
$$ 127084 200353 -200275 -1928 51664 -65042 90706 272615 94407 -13829 -24556
1596b4556R6355j671J04451r2837n0099J8580J30282j37685j20910k0238m9223
$$ -24556 71799 70128 174579 81742 31643 50223 180505 42820 -78090 -98328 -147551
1585a47551J63865O7914k57454Q4527o0699k4804M56804k37675j14892J31756
$$ -147551 16314 84228 -173226 -88699 -149398 -174202 282602 44927 -69965 61791
1575F1791r4455J839p8156j60878J68990Q1410j28647J90726R7688m8012k11304
$$ 61791 -32664 -30825 -108981 -269859 -100869 -19459 -148106 42620 140308 92296 -119008
1564a19008P0802J16278M2177L4659m867j25966Q1363N5886k04774m7417p2614
$$ -119008 -48206 68072 110249 144908 140041 14075 95438 151324 -53450 -100867 -173481
1553a73481J65662R1105j1968k17291J34536N2377R570J15662L3652q4229q6563
$$ -173481 -7819 83286 71318 -145973 -11437 40940 50510 166172 199824 115595 29032
1542B9032Q7114k51516Q1950J74220k15706J59125l6096Q0382R4995R0812l8505
$$ 29032 116146 -135370 -53420 120800 -94906 64219 28123 108505 203500 294312 255807
1531B55807j86222j77812J45249j33528n9570n3928M15086O335l67998J49978
$$ 255807 69585 -108227 37022 -96506 -156076 -210004 205082 211417 -156581 -6603
1521f603j51752l2182J04364j33656Q5869J5089O4665J7751l6854r2453l6336
$$ -6603 -158355 -190537 -86173 -219829 -133960 -118871 -54206 -36455 -73309 -165762 -202098
1510b02098K20290J07581q630J18067p6186j24647O5765p7671p6990r0933O9063
$$ -202098 18192 125773 117143 235210 159024 34377 100142 22471 -54519 -145452 -76389
1499g6389R2957k28424K17832j22224n0284j5763K2159L5785N9413K96246r7388
$$ -76389 16568 -211856 5976 -116248 -166532 -182295 -160136 -124351 -64938 231308 133920
1488A33920j38421J29504j56310j01822l6883p3860K68221k1019j34726O8560
$$ 133920 -4501 125003 -31307 -133129 -170012 -243872 24349 3330 -131396 -62836
1478f2836j25908J17731J66191k32706Q4664j90745R6669J38798O6486Q6100k20609
$$ -62836 -188744 -71013 95178 -137528 -52864 -243609 -146940 -8142 58344 144444 -76165
1467g6165L43M2180q0771L556m7666j3352O0410p4179N0819j5313J36600J0603
$$ -76165 -75822 -33642 -114413 -110857 -158523 -171875 -111465 -185644 -134825 -150138 -13538 -2935
1455b935K5265p9828J03681N2019m8019J12548p3774Q0911j10828j68646J38033
$$ -2935 22330 -57498 46183 98202 50183 162731 88957 169868 59040 -109606 28427
1444B8427N9456o7070m9440R2860J76328k6286r0658j99915O0101j36988P4699
$$ 28427 87883 20813 -28627 64233 240561 214275 123617 -76298 -16197 -153185 -78486
1433g8486O3818M9981j74599l226K1670l1963m7460K40971L9209R6492N5544j8950
$$ -78486 -14668 35313 -139286 -142512 -120842 -152805 -200265 40706 79915 176407 231951 213001
1421B13001M3677j38923k6004J60240k95257o6132L04661q8181K9852L7254k11326
$$ 213001 256678 117755 91751 251991 -43266 -109398 195263 107082 136934 174188 -37138
1410c7138j6148L3244J83377k56874O686k79236J66702Q0860K37857J00454o6414
$$ -37138 -53286 -20042 163335 -93539 -86853 -366089 -199387 -118527 119330 219784 153370
1399A53370M4877k78463K6838L8217j13497Q6187L5375J16958J28555k38562R1016
$$ 153370 198247 -80216 -53378 -15161 -128658 -42471 -7096 109862 238417 -145 90871
1388I0871J4482k15697j2640K78979p3386L0869k5012k24067K25194K5287j29054
$$ 90871 105353 -110344 -122984 155995 82609 113478 88466 -135601 89593 114880 -14174
1377a4174K0661j45937P8571k654O6585l1767P4407J21942K9866k11260J37529
$$ -14174 6487 -139450 -60879 -63533 3052 -28715 45692 167634 197500 -13760 123769
1366A23769J29615k33453k62879n6145K54829j03849L07554n74j51775O4794j05383
$$ 123769 253384 19931 -242948 -299093 -44264 -148113 159441 158867 7092 71886 -33497
1355c3497J14894p48k35936J03244K98275j60726j83231p9530J84952m884K67932
$$ -33497 81397 80649 -155287 -52043 246232 85506 -97725 -177255 7697 2813 270745
1344B70745k98896K3279J01810L5995P7671j7742k57192j29387q4644K97942P1702
$$ 270745 -28151 -4872 96938 132933 210604 192862 -64330 -193717 -278361 19581 91283
1333I1283P3917j10935R7062j26933q4881j07118o5041K8598L46382P630l19948
$$ 91283 165200 54265 151327 24394 -60487 -167605 -232646 -204048 142334 149964 -169984
1322a69984J12615J28088p4812o6191J18662k2775n5275j98847K67366N15P9302
$$ -169984 -57369 70719 -4093 -70284 48378 25603 -29672 -228519 38847 39362 118664
1311A18664P0406O6079j85750J2165j72439Q3972o9711M5450K30251j63019r0372
$$ 118664 189070 255149 69399 81564 -90875 -6903 -76614 -31164 199087 36068 -54304
1300e4304J6168j58803K07664j6540r7873L62666k8321L9311r5853K104M6480
$$ -54304 -38136 -196939 10725 -5815 -103688 258978 230657 269968 174115 176219 222699
1289B22699k09829j1470J56248j17111j35616J76760J1572l2617q0709J52831
$$ 222699 12870 1400 157648 40537 -95079 81681 93253 60636 -20073 132758
1279A32758j4016k1k37063k61107L38310J4885j46174R9179K6362M1502j20404
$$ 132758 118742 118721 -118342 -379449 -41139 -26254 -172428 -73249 -46887 -5385 -125789
1268a25789j91303K25268L8129j96810O3607K18139K0065j03685k7430J47331
$$ -125789 -317092 -91824 -53695 -250505 -186898 31241 51306 -52379 -79809 67522
1258F7522o6981K36438k07119k4973M6086J13501j41032J5472N4314O5261j76676
$$ 67522 541 236979 29860 4887 50973 164474 23442 38914 93228 158489 -18187
1247a8187j74493J26701L8796R8319j34989J24912j73120J41233M1890j38063
$$ -18187 -192680 -65979 -27183 71136 -63853 61059 -112061 29172 71062 -67001
1237f7001q4323K72572l9036R2062R3015j70955j47998M9926j25409J99587O4082
$$ -67001 -151324 121248 82212 174274 267289 96334 -51664 -1738 -127147 72440 136522
1226A36522l76263N5617K42975K5329k3945k21137K04061m0367K48032r2487j83909
$$ 136522 -239741 -184124 58851 84180 60235 -160902 43159 2792 250824 158337 -25572
1215b5572J24478j56997p0341K6587j75361K11591j35020m9729J64125K20383
$$ -25572 98906 -58091 -128432 -101845 -277206 -65615 -200635 -250364 -86239 134144
1205A34144k09524r5313m3563J66441j4962k2592J39055j24275K10756k50544
$$ 134144 -75380 -170693 -214256 -47815 -62777 -85369 53686 -70589 140167 -110377
1195a10377O2526j15495R9797k4181j09062J60689n520m4652J66483j81120J73079
$$ -110377 -47851 -163346 -63549 -87730 -196792 -36103 -41623 -86275 80208 -100912 72167
1184G2167J11893j18941j04188J06961j31737l3448R065O3176j33184J2221J19325
$$ 72167 184060 65119 -39069 67892 -63845 -97293 -88228 -25052 -158236 -146015 -26690
1173b6690K9272r732J10535r7292l1257N6823K35673k42942q8936K58719m1584
$$ -26690 2582 -7150 103385 6093 -25164 31659 267332 24390 -64546 194173 152589
1162A52589k54708K27067k63128R1364J15898j22264K850J0894P9568n5187M8848
$$ 152589 -102119 124948 -138180 -46816 69082 -53182 -50332 -39438 40130 -15057 33791
1151C3791Q959j80363j59586L05699j25798l1345J32842L2051J2898N3565m1089
$$ 33791 42750 -137613 -297199 8500 -117298 -148643 -15801 16250 29148 82713 41624
1140D1624R3309j74850j05833R8890j04298n3761N7040K263K22226M0168j42830
$$ 41624 134933 -39917 -145750 -46860 -151158 -204919 -147879 -145616 76610 116778 -26052
1129b6052l6100j03311J37945J29877m2387j12693K0734J35430q6004J15029m1059
$$ -26052 -62152 -165463 -27518 102359 59972 -52721 -31987 103443 17439 132468 91409
1118I1409j04211J97282l1873k49570J21714p1565J24402Q2923k02185N7438N3037
$$ 91409 -12802 184480 152607 -96963 24751 -46814 77588 160511 -41674 15764 68801
1107F8801O7630k79451J54643J10101l01244r429k04718L82581K3318k16489K02990
$$ 68801 136431 -143020 11623 121724 -179520 -188949 -393667 -11086 12232 -204257 -1267
1096a267K0403q4944r503j30510J51976j01104K543J26466k18301M29525j11514
$$ -1267 19136 -65808 -75311 -205821 -53845 -154949 -152406 -25940 -244241 185284 73770
1085G3770j06454M9953j59616J51530n3821P7998k27813J51614K23986j44489
$$ 73770 -32684 17269 -142347 9183 -44638 33360 -194453 -42839 181147 36658
1075C6658k0632m0948k8443j66610K25329J30571k36141J76308l4149P1044j12911
$$ 36658 16026 -24922 -53365 -219975 5354 135925 -100216 76092 41943 112987 76
1064G6j62238M8376O6387k247K13658J2725l5671K97094j10873j52240l8929q7858
$$ 76 -162162 -113786 -47399 -49646 164012 176737 141066 438160 327287 175047 136118 48260
1052D8260o4104n8078K51052k58671k6233R4403j36718r378R1279L50325j09882
$$ 48260 -15844 -73922 177130 -81541 -107774 -13371 -150089 -159467 -68188 282137 172255
1041A72255k83782o5589Q6881J4688N8179N4605j00787O2813j07877o2617p6065
$$ 172255 -111527 -177116 -90235 -75547 -17368 37237 -63550 -737 -108614 -171231 -247296
1030b47296L65280j15861M4728L402j64787O7982k9729O7840j12844L9403m0812
$$ -247296 117984 2123 46851 50253 -114534 -46552 -76281 -8441 -121285 -81882 -122694
1019a22694j50641J69277q0416l8750J06242p7300j1806J51232P0040j55527R6356
$$ -122694 -273335 -104058 -184474 -223224 -116982 -194282 -206088 -54856 15184 -140343 -43987
1008d3987o1587K59971K0084L8962l34417J36585J97002n1028l9156l9283k819
$$ -43987 -105574 154397 174481 213443 -120974 15611 212613 161585 122429 83146 80327
997H0327L8499k00662M399N2399j42048j02587L34244j08411L40198n7414l6458
$$ 80327 118826 -81836 -77437 -25038 -167086 -269673 64571 -43840 296358 238944 202486
986B02486J22334l01543L33K31634k49253j34025L43265o8770J56820j60184k6885
$$ 202486 324820 23277 23610 255244 5991 -128034 215231 146461 303281 143097 116212
975A16212j47328k19617K24610r4791K47208r0541k3305p2349P4776r439k39962
$$ 116212 -31116 -250733 -26123 -120914 126294 35753 12448 -59901 14875 5436 -234526
964b34526R2361J88838k3721j9949j66906L2847j63260K37739j77457j7298J51626
$$ -234526 -142165 46673 22952 3003 -163903 -131056 -294316 -56577 -234034 -251332 -99706
953i9706O5182K8050P6324j83984J12619J43279K685N6708l84106K35120q0869
$$ -99706 -34524 -6474 69850 -114134 -1515 141764 144449 201157 -182949 52171 -28698
942b8698q2173j12291L60331k210j55131L7342Q424J33542j72646j20407N2983
$$ -28698 -110871 -223162 137169 134959 -20172 17170 25594 159136 -13510 -133917 -80934
931h0934j49439O6554J03272j8722L2072M5816j03117J44924Q309K88527l71687
$$ -80934 -230373 -163819 -60547 -79269 -47197 -1381 -104498 40426 48735 337262 -34425
920c4425L6743q8261l1511q2278r1554K15833O5527j11163J96127o7051Q9380
$$ -34425 2318 -85943 -117454 -199732 -291286 -75453 -9926 -121089 75038 7987 97367
909I7367m3798J8597k47446J11964J89260j5275q2679r0627L6229J78133q1084
$$ 97367 53569 72166 -175280 -63316 125944 110669 27990 -62637 -26408 151725 70641
898G0641j4453J25171j75377n9275p5348Q1380K9880j13410O3260J61398K34406
$$ 70641 56188 181359 5982 -53293 -128641 -47261 -17381 -130791 -67531 93867 328273
887C28273k05547j55833J62862j52746J65061j7968k43944J47834k74783J92070
$$ 328273 122726 -33107 129755 -22991 142070 124102 -119842 27992 -246791 -54721
877e4721R3912J23711R5893k22396j51671j82917P0824Q4619J26299P0068R0845
$$ -54721 39191 162902 258795 36399 -115272 -298189 -227365 -142746 -16447 53621 144466
866A44466m9536J39967R016k8614p0719k136j07882j19119n8665J67679m0060
$$ 144466 94930 234897 243913 215299 144580 142444 34562 -84557 -143222 24457 -15603
855a5603J55170J9718j11127q2300J00230k84632L28456P1126j89819L3008K5186
$$ -15603 139567 159285 48158 -34142 66088 -218544 109912 181038 -8781 24227 49413
844D9413j2299k26621Q266n5O1820J90263J72169R274k08663j13210j05601K69463
$$ 49413 37114 -189507 -181241 -181296 -119476 70787 242956 252230 43567 -69643 -175244 94219
832I4219O405O8918O9659j05985q9750l1082J89022J12738j62691j79440p2486
$$ 94219 100624 169542 239201 133216 43466 12384 201406 314144 151453 -27987 -100473
821a00473J16392R4615k29997M6003l4863l5322m0872K25499j06167j93003L64011
$$ -100473 15919 110534 -119463 -73460 -108323 -143645 -184517 40982 -65185 -258188 105823
810A05823j7140r6169R8189p6649J07911N9551P1611j36673j69898N6278j43358
$$ 105823 88683 -7486 90703 14054 121965 181516 253127 116454 -53444 2834 -140524
799a40524j4748J68754M0629o1989k16490r1744N7569J22997M4492N5666l2301
$$ -140524 -155272 13482 54111 -7878 -224368 -316112 -258543 -135546 -91054 -35388 -67689
788f7689J07817p1444k5668K54967l9169k06502L52920k02007k34698K32029J87666
$$ -67689 40128 -31316 -56984 197983 158814 -47688 305232 103225 -131473 100556 288222
777B88222j45048k69484m6965N586j23777J32893q3743N0376J69787R7728o9063
$$ 288222 143174 -126310 -173275 -167689 -291466 -158573 -242316 -191940 -22153 75575 6512
766F512k14723J18981j82867K79151k06816R2392l6521Q6723M6597m6273m1332
$$ 6512 -208211 -89230 -272097 7054 -199762 -107370 -143891 -57168 -10571 -56844 -98176
755i8176K77236j89155j4228J0500J35341r3704l13683K06751J14061O4634q383
$$ -98176 179060 -10095 -24323 -13823 121518 27814 -285869 -79118 34943 99577 91194
744I1194j07250r354M0396N1214J3558j26245J19529J91888k9311n560j53878
$$ 91194 -16056 -25410 14986 66200 79758 -46487 73042 264930 235619 230059 76181
733G6181o9520j00145Q7169P2419k61567K47473n061k02596J22680R674J38350
$$ 76181 6661 -93484 -6315 66104 -195463 52010 46949 -155647 -32967 -23293 115057
722A15057J12804j54782k47317j2242K12030L0813j46592j57471P8680J65226
$$ 115057 227861 73079 -174238 -186480 25550 56363 -90229 -247700 -169020 -3794
712c794j40190j6740J19098R2212q5425q7353M767r930J68494p8085l02311J70323
$$ -3794 -143984 -160724 -41626 50586 -34839 -122192 -117425 -127355 41139 -36946 -339257 -168934
700a68934J26219J96153J39797k83270K07703k84566J37974j95620j31077O2810
$$ -168934 -42715 153438 293235 9965 217668 -66898 71076 -124544 -255621 -192811
690a92811J95688j34605J72503l9068j49452K39088R7326k9805k71510j4769M003
$$ -192811 2877 -131728 40775 1707 -147745 91343 188669 158864 -112646 -127415 -123412
679a23412r9930L7893K04379L22001k58452N2282J30917j88422m9487j59284o9558
$$ -123412 -223342 -185449 18930 340931 82479 134761 265678 77256 27769 -131515 -201073
668b01073O4845j1191o2258k5775k1154n4898J20324M6977p059M2006K96590j08311
$$ -201073 -136228 -147419 -209677 -235452 -256606 -311504 -191180 -144203 -151262 -109256 187334 79023
656G9023j59477j75080L26321L01680m7579k81214j23254J67843J23858k4734
$$ 79023 -80454 -255534 70787 372467 324888 43674 -79580 88263 212121 187387
646A87387p2281j52608P79K9255l5320K40752j66222M6601p958j10476J27006
$$ 187387 115106 -37502 -36723 -7468 -42788 197964 31742 78343 70385 -40091 86915
635H6915n1339m9456J09937j49396L6102j12382N0137J149n2835J11897J06836
$$ 86915 35576 -13880 96057 -53339 -17237 -129619 -79482 -78333 -131168 -19271 87565
624H7565m6835r8610j4682J2407J12645l7491j89527J33166K9179J72744L0800
$$ 87565 40730 -57880 -72562 -60155 52490 14999 -174528 -41362 -12183 160561 191361
613A91361o0947k62327M5281N7659L04721Q0563k34564l6901P3577j51255K9878
$$ 191361 130414 -131913 -86632 -28973 275748 356311 121747 84846 158423 7168 37046
602C7046J4240P3148J31342q3954k1314p8460o4933J87873j26757J13517j64725
$$ 37046 51286 124434 255776 171822 150508 72048 7115 194988 68231 181748 17023
591A7023j56069j15391J1030J01393K1844K6962M3002L8208j06945M1604P7344
$$ 17023 -139046 -254437 -243407 -142014 -120170 -93208 -50206 -11998 -118943 -77339 5
580Ej9052R6583k02402j29243K49412k01846K79951J66483Q901M4606j13500j03905
$$ 5 -19047 77536 -124866 -254109 -4697 -206543 73408 239891 248792 293398 179898 75993
568G5993L3072k40016N2613Q9525K92747j00689k14087K77385n1712k31958N949
$$ 75993 109065 -130951 -78338 11187 303934 203245 -10842 266543 214831 -17127 -11178
$$ [...]
##END NTUPLES=NMR SPECTRUM
##END=
