##TITLE=1H_EC-3329-x1
 DMSO
 8 sc, 
 12.8.2024
##JCAMPDX= 6.0         $$ Bruker NMR JCAMP-DX V2.0
##DATA TYPE= NMR SPECTRUM
##DATA CLASS= NTUPLES
##ORIGIN= UXNMR, Bruker Analytische Messtechnik GmbH
##OWNER= root
$$ XWIN-NMR		Version 3.5
$$ Mon Aug 12 14:02:56 2024 Russian Standard Time (UT+4h)  she@DPX200
##.OBSERVE FREQUENCY= 200.1318
##.OBSERVE NUCLEUS= ^1H
##.ACQUISITION MODE= SIMULTANEOUS
##.ACQUISITION SCHEME= undefined
##.AVERAGES= 16
##.DIGITISER RES= 18
##SPECTROMETER/DATA SYSTEM= spect
##.PULSE SEQUENCE= zg30
##.SOLVENT NAME= DMSO
##.SHIFT REFERENCE= (INTERNAL, DMSO, 0, 21.0149)
##AUDIT TRAIL= $$ (NUMBER, WHEN, WHO, WHERE, WHAT)
$$ ##TITLE= Audit trail, XWIN-NMR		Version 3.5
$$ ##JCAMPDX= 5.01
$$ ##ORIGIN= Bruker BioSpin GmbH
$$ ##OWNER= she
$$ F:/spectra/data/she/nmr/H-F/1/pdata/1/auditp.txt
$$ ##AUDIT TRAIL=  $$ (NUMBER, WHEN, WHO, WHERE, WHAT)
(   1,<2024-08-12 14:01:30.40 +0400>,<she>,<DPX200>,
      <created by zg, POWCHK disabled, PULCHK disabled
       configuration hash MD5:
       00 E9 B6 7A A2 85 ED C7 34 08 36 98 17 FE 4E 26
       data hash MD5: 16K
       A3 F8 E7 05 17 47 97 EB 5B DE B2 07 60 58 9C 6D>)
(   2,<2024-08-12 14:01:32.62 +0400>,<she>,<DPX200>,
      <Start of raw data processing
       efp BC_mod = 2 LB = 0.24 FT_mod = 6 PKNL = 1 PHC0 = -26003.77 PHC1 = 27.58749 SI = 16K 
       data hash MD5: 16K
       FF B2 C8 B6 1B 04 08 DA C0 41 73 0C EC BA C5 B9>)
(   3,<2024-08-12 14:02:02.64 +0400>,<she>,<DPX200>,
      <pk PHC0 = 5.833516 PHC1 = -12.2 
       data hash MD5: 16K
       B1 7D 9E 3F 94 44 AC 9C 3A D5 82 23 44 7C 99 21>)
(   4,<2024-08-12 14:02:06.14 +0400>,<she>,<DPX200>,
      <abs ABSG = 5 
       data hash MD5: 16K
       31 BB E9 BA E0 3E D4 C1 BD 82 D9 BC B7 75 50 36>)
$$ ##END=
$$ 
$$ hash MD5
$$ C3 44 3E 91 29 8F A6 9C D4 95 D7 D0 27 B2 E8 8A
##$RELAX= 
##$RELAX= 
##$RELAX= 
##$RELAX= 
##$RELAX= 
##$RELAX= 
$$ Bruker specific parameters
$$ --------------------------
##$DU= <F:/spectra>
##$EXPNO= 1
##$NAME= <H-F>
##$PROCNO= 1
##$TYPE= <nmr>
##$USER= <she>
##$AMP= (0..31)
100 100 100 100 100 100 100 100 100 100 100 100 100 100 100 100 100 100 
100 100 100 100 100 100 100 100 100 100 100 100 100 100 
##$AQSEQ= 0
##$AQ_mod= 1
##$AUNM= <au_zg>
##$AUTOPOS= <>
##$BF1= 200.13
##$BF2= 200.13
##$BF3= 200.13
##$BF4= 200.13
##$BF5= 200.13
##$BF6= 200.13
##$BF7= 200.13
##$BF8= 200.13
##$BYTORDA= 1
##$CFDGTYP= 0
##$CFRGTYP= 5
##$CHEMSTR= <none>
##$CNST= (0..31)
1 1 145 1 1 1 1 1 1 1 1 1 1 1 1 1 1 1 1 1 1 1 1 1 1 1 1 1 1 1 1 1 
##$CPDPRG= <>
##$CPDPRG1= <>
##$CPDPRG2= <>
##$CPDPRG3= <>
##$CPDPRG4= <mlev>
##$CPDPRG5= <mlev>
##$CPDPRG6= <mlev>
##$CPDPRG7= <mlev>
##$CPDPRG8= <mlev>
##$CPDPRGB= <>
##$CPDPRGT= <>
##$D= (0..31)
0 1.2 0 0 0 0 0 0 0 0.06 0 0.03 0 0 0 0 0.0002 0 0 0 0 0 0 0 0 0 0 0 0 
0 0 0 
##$DATE= 1723456889
##$DBL= (0..7)
120 120 120 120 120 120 120 120 
##$DBP= (0..7)
150 150 150 150 150 150 150 150 
##$DBP07= 0
##$DBPNAM0= <>
##$DBPNAM1= <>
##$DBPNAM2= <>
##$DBPNAM3= <>
##$DBPNAM4= <>
$$ [...]
##$SUBNAM3= <"">
##$SUBNAM4= <"">
##$SUBNAM5= <"">
##$SUBNAM6= <"">
##$SUBNAM7= <"">
##$SUBNAM8= <"">
##$SUBNAM9= <"">
##$SW= 24.0689170037331
##$SWIBOX= (0..15)
0 0 2 0 0 0 0 0 0 0 0 0 0 0 0 0 
##$SW_h= 4816.95568400771
##$TD= 16384
##$TD0= 1
##$TE= 0
##$TE2= 300
##$TE3= 300
##$TEG= 300
##$TL= (0..7)
0 120 120 120 120 120 120 120 
##$TP= (0..7)
150 150 150 150 150 150 150 150 
##$TP07= 0
##$TPNAME0= <>
##$TPNAME1= <>
##$TPNAME2= <>
##$TPNAME3= <>
##$TPNAME4= <>
##$TPNAME5= <>
##$TPNAME6= <>
##$TPNAME7= <>
##$TPOAL= (0..7)
0.5 0.5 0.5 0.5 0.5 0.5 0.5 0.5 
##$TPOFFS= (0..7)
0 0 0 0 0 0 0 0 
##$TUNHIN= 0
##$TUNHOUT= 0
##$TUNXOUT= 0
##$USERA1= <user>
##$USERA2= <user>
##$USERA3= <user>
##$USERA4= <user>
##$USERA5= <user>
##$V9= 5
##$VALIST= <valist>
##$VCLIST= <CCCCCCCCCCCCCCC>
##$VD= 0
##$VDLIST= <DDDDDDDDDDDDDDD>
##$VPLIST= <PPPPPPPPPPPPPPP>
##$VTLIST= <TTTTTTTTTTTTTTT>
##$WBST= 1024
##$WBSW= 4
##$XGAIN= (0..3)
0 0 0 0 
##$XL= 0
##$YL= 0
##$YMAX_a= 437680
##$YMIN_a= -442295
##$ZGOPTNS= <>
##$ZL1= 120
##$ZL2= 120
##$ZL3= 120
##$ZL4= 120
##$ABSF1= 20.99438
##$ABSF2= -3.074751
##$ABSG= 5
##$ABSL= 3
##$ALPHA= 0
##$AQORDER= 0
##$ASSFAC= 0
##$ASSFACI= 0
##$ASSFACX= 0
##$ASSWID= 0
##$AUNMP= <proc_1d>
##$AZFE= 0.1
##$AZFW= 0.1
##$BCFW= 0
##$BC_mod= 2
##$BYTORDP= 0
##$COROFFS= 0
##$CY= -3
##$DATMOD= 1
##$DC= 0
##$DFILT= <>
##$DTYPP= 0
##$F1P= 0
##$F2P= 0
##$FCOR= 1
##$FTSIZE= 16384
##$FT_mod= 6
##$GAMMA= 0
##$GB= 0
##$INTBC= 1
##$INTSCL= 3.70164e-10
##$ISEN= 128
##$LB= 0.24
##$LEV0= 0
##$LPBIN= 0
##$MAXI= 10000
##$MC2= 0
##$MEAN= 0
##$ME_mod= 0
##$MI= 1.114404
##$NCOEF= 0
##$NC_proc= -4
##$NLEV= 6
##$NOISF1= 3.799351
##$NOISF2= 2.8
##$NSP= 0
##$NTH_PI= 0
##$NZP= 0
##$OFFSET= 21.01495
##$PC= 1
##$PHC0= -25997.94
##$PHC1= 15.38749
##$PH_mod= 1
##$PKNL= yes
##$PPARMOD= 0
##$PSCAL= 0
##$PSIGN= 0
##$REVERSE= no
##$SF= 200.130002755821
##$SI= 16384
##$SIGF1= 3
##$SIGF2= 2
##$SINO= 5.538805
##$SIOLD= 16384
##$SREGLST= <1H.CDCl3>
##$SSB= 0
##$STSI= 16384
##$STSR= 0
##$SW_p= 4816.95568400771
##$SYMM= 0
##$S_DEV= 0
##$TDeff= 16384
##$TDoff= 0
##$TI= <>
##$TILT= no
##$TM1= 0
##$TM2= 0
##$TOPLEV= 0
##$USERP1= <user>
##$USERP2= <user>
##$USERP3= <user>
##$USERP4= <user>
##$USERP5= <user>
##$WDW= 1
##$XDIM= 16384
##$YMAX_p= 319739009
##$YMIN_p= -1535718
$$ End of Bruker specific parameters
$$ ---------------------------------
##NTUPLES= NMR SPECTRUM
##VAR_NAME=  FREQUENCY,     SPECTRUM/REAL,   SPECTRUM/IMAG
##SYMBOL=    X,             R,               I
##VAR_TYPE=  INDEPENDENT,   DEPENDENT,       DEPENDENT
##VAR_FORM=  AFFN,          ASDF,            ASDF
##VAR_DIM=   16384,         16384,           16384
##UNITS=     HZ,            ARBITRARY UNITS, ARBITRARY UNITS
##FACTOR=    0.29402158847633, 1,            1
##FIRST=     4205.72196110405, 0,            0
##LAST=      -611.233722903658, 0,           0
##MIN=       -611.233722903658, -1535718,    0
##MAX=       4205.72196110405, 319739009,    0
$$ Real data points
##PAGE= N=1
##DATA TABLE= (X++(R..R)), XYDATA
$$ [...]
7848C55577J1091l9609j6640M1711O2194r685n9664l1413j2691L035L956K2452
7836C30314k8843L2661J12509l408Q414j7857j35766J11339P6866N0213j2826
7825E23616k02Q66Q54O2520l6803m5921n5889K2096j4341O5756m194K3379N0722
7812E92459j2747o147L0396o7977K6848K9250O2113k4028M649P6165j9296m0436
7800F51249M3533O4448l6806J0905N0125n4459p0767K9925K9240m0999P1270J05462
7788H53126k4089N0855j2420p3644O3714k1465J6745K1474K4178O8239j4151p3303
7776H79259M7253l9140L0690P5636K5402r571O9210R1301p0906K3753l228P701
7764A127360p6145J5865K7794M8387J3803N7418R2234n9114j6495J3601P0454
$$ y = [355577, 366668, 327059, 310419, 352130, 414324, 404639, 344975, 313562, 300871, 303906, 307862, 330314, 301471, 334132, 446641, 443233, 451647, 433790, 298024, 409363, 486229, 536442, 523616, 523414, 524280, 525134, 587654, 550851, 504930, 449041, 471137, 456796, 522552, 518358, 541737, 592459, 579712, 573565, 603961, 535984, 562832, 592082, 654195, 630167, 634816, 710981, 691685, 651249, 694782, 759230, 722424, 733329, 783454, 728995, 658228, 688153, 717393, 676394, 747664, 853126, 829037, 879892, 867472, 793828, 857542, 836077, 852822, 874296, 898474, 966713, 952562, 879259, 926512, 887372, 918062, 993698, 1019100, 1009529, 1078739, 1170040, 1099134, 1122887, 1119659, 1127360, 1051215, 1067080, 1094874, 1143261, 1157064, 1214482, 1306716, 1247602, 1231107, 1244708, 1315162]
7753A315162j7378l256J9857j3652P1310R1817O0745J9135K072k322O5501K9377
7741A638368Q9143l3965R6848L2976K6217N0395n1141N5078R0161M4636L9230
7730B077946M0691M1996J9546L6472K2385K5633R5655M075N0160J14413P5963
7719B604935J70734J9713k3565Q3584P8589P8325R1167P1620J26996J62755Q8237
7708C553090Q5683M6347K28908P2057K9871J40377J44643J30408R6688K24013
7698D752085J42206J63104K18741J69937K03518J56795K67098K17338K09473J66857
7688F667152K33320K20015K92377L19629J88313L74309L54356L47067L19982L68904
7678I685424J94954L57715L37893M59639L86749L55871M27706M20281K73174L97544
$$ y = [1315162, 1297784, 1294528, 1314385, 1300733, 1372043, 1463860, 1524605, 1543740, 1545812, 1543490, 1608991, 1638368, 1727511, 1693546, 1790394, 1823370, 1849587, 1899982, 1848841, 1903919, 1994080, 2038716, 2077946, 2118637, 2160633, 2180179, 2216651, 2239036, 2264669, 2360324, 2364399, 2414559, 2528972, 2604935, 2775669, 2795382, 2771817, 2855401, 2933990, 3012315, 3103482, 3175102, 3302098, 3464853, 3553090, 3638773, 3685120, 3914028, 3986085, 4015956, 4156333, 4300976, 4431384, 4528072, 4752085, 4894291, 5057395, 5276136, 5446073, 5649591, 5806386, 6073484, 6290822, 6500295, 6667152, 6900472, 7120487, 7412864, 7732493, 7920806, 8295115, 8649471, 8996538, 9316520, 9685424, 9880378, 10238093, 10575986, 11035625, 11422374, 11778245, 12205951, 12626232, 12899406, 13296950]
7668A3296950L64666L87050M75388L01057K81446L49130J72255L34149K86664
7659A6248755J33751K67452J28823J06185K1663n1411j2691o0950n1600j65957
7649A6564020j70811q9426k23402k28501l14598l25861l04285l63461l18317l43249
7639A3882109m41765l59658m05779l49811l42237l46569l60316l46556m37613
7630A0491805k75850l30124l54744l13534k34861l61924k39575k66484k69778
7621G844931l01191k28240j88964j78400k52526j43706j17463j90702k78222j91682
7611E773835j73944j42422k01198j39788j43270k21774r8904j74272j46655p7298
7601D254310j49105j18940q2488r7402j46406j62636n9503j16557n1347j19014
$$ y = [13296950, 13661616, 14048666, 14524054, 14825111, 15106557, 15455687, 15627942, 15962091, 16248755, 16382506, 16649958, 16778781, 16884966, 16906629, 16855218, 16842527, 16781577, 16729977, 16564020, 16393209, 16303783, 16080381, 15851880, 15537282, 15211421, 14907136, 14543675, 14225358, 13882109, 13440344, 13080686, 12674907, 12325096, 11982859, 11636290, 11275974, 10929418, 10491805, 10215955, 9885831, 9531087, 9217553, 8982692, 8620768, 8381193, 8114709, 7844931, 7543740, 7315500, 7126536, 6948136, 6695610, 6551904, 6434441, 6243739, 5965517, 5773835, 5599891, 5457469, 5256271, 5116483, 4973213, 4751439, 4652535, 4478263, 4331608, 4254310, 4105205, 3986265, 3903777, 3806375, 3659969, 3497333, 3437830, 3321273, 3269926, 3150912]
7591C150912o5956q5176p0059r5041j16851j23755j382m4786o7883j6411o0348
7580B403264l9052j11629r6661m5926p2523p457n7687j01167K7371j3305o4203
7569A821025p9113k5638m295q5997m3609K8631j01727K576o801o4681n600k369
7557A432402j8097k9249l8580k7610m5802o8819m8482r3578M7087Q372N6584j3851
7545A160377k1085p9930m0647l6493R5115l4755j3535m7110q591k4609M196m6215
7533I06718k5271k6998j10887L5330K4904Q9507j16955L1402j4800l507J0200
7522G99643J5241n5084m4133p1287l7765O1322K513J931J0750L3800p1806p731
7510F37394j22727l7901P5170K2791k6810n0810R2969L4253l7504n0461l3094
$$ y = [3150912, 3084956, 2999780, 2929721, 2834680, 2717829, 2594074, 2592692, 2547906, 2480023, 2463612, 2403264, 2364212, 2252583, 2155922, 2109996, 2037473, 2030016, 1972329, 1871162, 1898533, 1885228, 1821025, 1741912, 1716274, 1711979, 1625982, 1582373, 1611004, 1509277, 1511853, 1505052, 1440371, 1434771, 1432402, 1414305, 1385056, 1346476, 1318866, 1273064, 1204245, 1155763, 1062185, 1109272, 1117644, 1174228, 1160377, 1139292, 1059362, 1018715, 982222, 1077337, 1042582, 1029047, 981937, 973346, 948737, 952933, 906718, 881447, 854449, 743562, 778892, 803796, 893303, 776348, 807750, 792950, 789443, 799643, 814884, 759800, 715667, 644380, 606615, 667937, 670450, 672381, 683131, 716931, 645125, 637394, 514667, 476766, 551936, 574727, 547917, 497107, 590076, 624329, 586825, 536364, 503270]
7499E03270P1j09023N7372m7521L0473N2127r1783K4845M9806J344p0621P0023
7487D70383l0761q0728N3629K7127j1723q47j038k513O184q745l2513m233m4162
7474C40060L6721n2366j6137j8918P9205R0965n1873r7331l505m1265J05904l1300
7462C40160M4938r6298L6810K1164p4458N133n6713O5999R3170m3968O599P359
7450C49895J7380n2555n679K3178j10235N3456K3235m5515L0768J5658J48m1346
7438B58388p9179J39295m8801m663o6027L9846O1372k8884q7441J3444j1821O861
7426A92390O1849J6885l7763k815j26487J26415n3228k7359R612o5019P6618Q4138
7414B55236q6658R9149o2319k7869o0293k3221M4219J04656m5891l8490K9430
$$ y = [503270, 503341, 394318, 451690, 404169, 434642, 486769, 394986, 419831, 469637, 470981, 400360, 470383, 439622, 358894, 412523, 439650, 427927, 427080, 426042, 423529, 429713, 420968, 388455, 384222, 340060, 376781, 324415, 308278, 289360, 368565, 459530, 407657, 310326, 306821, 265556, 371460, 340160, 385098, 288800, 325610, 346774, 272316, 277449, 220736, 286735, 379905, 335937, 342536, 349895, 367275, 314720, 309041, 332219, 221984, 275440, 298675, 253160, 283928, 299586, 299734, 258388, 179209, 318504, 269703, 265040, 199013, 238859, 300231, 271347, 183906, 197350, 185529, 192390, 254239, 271124, 233361, 230546, 104059, 230474, 177246, 149887, 159499, 94480, 171098, 255236, 168578, 267727, 205408, 177539, 117246, 94025, 138244, 242900, 197009, 158519, 187949]
7403A87949l2490L220j6967L2956K5435n1698N3495m3347J8571J3765J7207k2651
7391A85445p6932K5552j9023o465j10832R1462J02980k8563l3485l9698n338P7259
7379A62362n8825O7501o6J9055q6043J2833O302K3590k5596m519k5305l3180N1757
7366A09866N1148L490J29619n6027j23668Q1281R1202j6352o9011m800r3093R155
7354A12810J30401k4985p3674L5366o790q3876J3470O230L0153p2588m8L9827
7342A06296j8117J4096N6765j1646K332k543N1352m2645J3824r65n407q0725P9566
7329A62183q7394j0181J19763j9998o7561M8682n667k6758J4275k3587K8624n809
7317A26572k1987k1021Q0968m7747J9970K4595n9212R8144l2588k4709N0252L8733
$$ y = [187949, 155459, 158679, 141712, 174668, 200103, 148405, 201900, 158553, 177124, 190889, 208096, 185445, 108513, 134065, 115042, 108577, -2255, 89207, 192187, 163624, 130139, 90441, 85103, 162362, 103537, 171038, 170972, 190027, 103984, 116817, 123119, 146709, 121113, 116594, 91289, 58109, 109866, 161014, 164504, 294123, 238096, 114428, 195709, 286911, 270559, 201548, 196748, 103655, 112810, 243211, 218226, 144552, 179918, 173128, 89252, 102722, 108952, 139105, 66517, 66469, 106296, 88179, 102275, 159040, 147394, 149726, 147183, 198535, 155890, 169714, 168749, 163342, 82617, 162183, 74789, 64608, 184371, 164373, 96812, 145494, 139827, 113069, 127344, 103757, 132381, 126572, 104585, 83564, 164532, 116785, 136755, 161350, 102138, 200282, 167694, 142985, 193237, 231970]
7305B31970j52608q1514J09271K4602L4938M7457q850K58K2335O982K6488O5848
7293C27177k1743n679o1329j3985J5996J5845l6219j4762M6660j6535j7746q6335
7281A31345j4774M0876J10214l7437o6663Q637K7092k6906J64016k0188l7957
7270B78255k8144P5964O560n6875N0240L6245J04164J2062j00755n0336m3564
7259B83816M2183n2657l9075N4974N9314m2422l1825o6795J8693j1752j11332
7248A03122N6913j2281j4347J29377r5835n1695l7655M4898m1421O827K9527O8995
7236A86425j9798n4843L7383l0823l7082J1093k3862o2793N3203J8742J1612N5635
7224A44892n4654l3200o6806Q5983R9180l2595l4183p9946Q9402m5179o6171L7356
$$ y = [231970, 79362, -2152, 107119, 131721, 166659, 214116, 205266, 205524, 227859, 234841, 261329, 327177, 305434, 299755, 238426, 224441, 240437, 256282, 220063, 205301, 251961, 235426, 217680, 131345, 116571, 157447, 267661, 230224, 163561, 172198, 199290, 172384, 336400, 316212, 278255, 250111, 326075, 332635, 275760, 326000, 362245, 466409, 478471, 377716, 327380, 283816, 325999, 273342, 234267, 289241, 348555, 306133, 274308, 207513, 226206, 214454, 103122, 160035, 147754, 133407, 262784, 166949, 115254, 77599, 122497, 81076, 87903, 117430, 186425, 166627, 111784, 149167, 118344, 81262, 92355, 68493, 5700, 58903, 77645, 89257, 144892, 90238, 57038, -9768, 76215, 175395, 142800, 108617, 28671, 118073, 72894, 6723, 44079]
7212D4079O7008M1028j00262K5352m9272J608N9478o8591J48760r3379k7149p108
7200D1552L2151R8909m8260j15863J14293R1979l9976k2940q3002L1621o7976
7189C2488Q3996L4369K5277l7529p0890N9617k5834Q0667P5114k8331l2920J3000
7177B09024M1350k2999J711O4791o0958n2372p1740P7943k0028J9842r732M0492
7165B17324K2251n1854Q4540m5356K9917q398l399j4827M7638J0269K1347J2315
7153C21767k3335P1231k2623R387q3839k3616M9949m3645l2037M7995R956n5049
7141B26141k5796J5089l1138L7372J6281l8313P8145l1740N5360j2483r3769N1966
7129B47115j9858m2303K2253m4956P1630J3953r1683m1761N384j9036L5634P7535
$$ y = [44079, 111087, 152115, 51853, 77205, 27933, 29541, 89019, 20428, 169188, 75809, 48660, 41552, 73703, 172612, 124352, 8489, 122782, 214761, 174785, 151845, 68843, 100464, 32488, 116484, 150853, 176130, 138601, 67711, 127328, 101494, 182161, 257275, 228944, 196024, 209024, 250374, 227375, 229086, 293877, 232919, 180547, 108807, 186750, 166722, 186564, 176832, 217324, 239575, 187721, 272261, 226905, 256822, 248424, 245025, 230198, 277836, 288105, 309452, 321767, 298432, 369663, 347040, 356427, 272588, 248972, 298921, 255276, 223239, 271234, 281190, 226141, 200345, 215434, 184296, 221668, 237949, 199636, 277781, 246041, 301401, 288918, 195149, 247115, 227257, 184954, 207207, 162251, 233881, 247834, 156151, 114390, 119774, 100738, 136372, 213907]
7117B13907J6708m666j21218j395O4231m8302P8385l1372l5328o1152r425P4847
7105A35220m3604L8412K5643j7550L4395J1069j04017l2777L1799K0993p4638
7094B4945K2991o688J8147J0617j9094k5221l6899K4307J52250n0291q5331J1098
7082D0831k2137R214j4317k4720M2997k7240J1156j9979R2808J3387j00795J0260
7070A1465M1611O8996m3920j07554J4008J15156L1652q4095j3934q033J037n1305
7058b4916R823Q2543l7599o4653p304P8953q1267J0216O6871j0416O78j6076J33713
7045A40566n7729l0015m527K2801N1813k6271o2015n4944O5683J0413o867j9778
7033B9130k2798K5978K9707P0926o3176n8176O898m3642M787M2943K6400p217
$$ y = [213907, 230615, 225949, 104731, 103336, 167567, 119265, 197650, 166278, 130950, 69798, 60373, 135220, 91616, 130028, 155671, 138121, 172516, 183585, 79568, 46791, 78590, 99583, 24945, 47936, 41248, 59395, 70012, 50918, 25697, -11202, 13105, 165355, 115064, 29733, 40831, 18694, 27908, 13591, -11129, 31868, 4628, 15784, -4195, 88613, 102000, 1205, 11465, 53076, 122072, 78152, -29402, -15394, 99762, 131414, 47319, 33385, 25352, 26389, -24916, -15093, 67450, 29851, -34802, -42106, 36847, -44420, -34204, 32667, 22251, 22929, 6853, 140566, 82837, 52822, 48295, 71096, 122909, 96638, 34623, -20321, 45362, 55775, 48908, 29130, 6332, 32310, 62017, 132943, 69767, 11591, 18489, -25153, -20366, 22577, 48977, 41760]
7021D1760J748R498j5706P5638j3172N558l1985o3213J21901L8660j05972M551
7009F9266K3334K3360R9731n8144J5740Q920L9547J703r614o6212J5038m2302
6997A20367j2348l274N0654J2750j3460p9236P4158j944K7460j3342k7489k6942
6985A07354R0575L9735N8144l4185N0966N1303m1486K4119Q194o3444r164p3371
6973B08740l2134n5321P0178O956q0160L8237J2422Q4134m9689K0080J0131l1593
6961B01981l5506L9663L0051Q2147m0381j2676J3817m4673L7812m6977n9034k3175
6949A43049L8831n896j05455L3290m3013M7825o2368j7294k4990R2082j635l8595
6937E5831O040K2392K6909K3057j6246l0437M8954j6052l9713K2911j1224J2108
$$ y = [41760, 43508, 53006, 37300, 112938, 99766, 105324, 73339, 10126, 132027, 170687, 64715, 69266, 92600, 115960, 215691, 157547, 173287, 182207, 221754, 223457, 213843, 147631, 162669, 120367, 108019, 104745, 155399, 168149, 154689, 75453, 149611, 147667, 175127, 161785, 134296, 107354, 197929, 237664, 295808, 261623, 312589, 363892, 322406, 346525, 354719, 291275, 282111, 208740, 176606, 121285, 191463, 198419, 118259, 156496, 168918, 253052, 203363, 223443, 233574, 201981, 166475, 206138, 236189, 318336, 277955, 265279, 279096, 234423, 272235, 225258, 166224, 143049, 181880, 175984, 70529, 103819, 60806, 108631, 46263, 28969, 3979, 96061, 94426, 55831, 61871, 84263, 111172, 134229, 117983, 87546, 136500, 120448, 80735, 103646, 92422, 104530]
6925A04530K6361p384m3326p7793O8802k051m0778L2796j1256n9203P1301K3454
6913H5453o3531L1390m7803m8571J5402P1793L7260o1714l388k4474k5497L3885
6901B05J6343j9579M4092k0023j906l3172J9116R035R235J5440K0137r3450j06100
6888a40627Q6918J7842m449J847l9779K7646J33496q7154k2699K1296k422N1221
6876D3136M754j3774p0855R9282L7253j12359M5476K7199n668o0935l4908N7066
6864A5667J7540Q910R157M2734k1513p3245m304l1271j0614J1978K742n0620R3934
6851A1095J5422k6395l5344O223k3519K4308l3421L7855P6396q2221n319K7976
6839f944p2118J5979p544L6378J4853j4786N481n4051L3000l0859j790J9478P9732
$$ y = [104530, 130891, 123507, 80181, 2388, 71190, 69139, 28361, 61157, 49901, -9302, 61999, 85453, 21922, 53312, 5509, -43062, -27660, 44133, 81393, 19679, 16291, -8183, -33680, 205, 16548, -3031, 41061, 21038, 19132, -14040, 5076, 14111, 23346, 38786, 58923, -34527, -140627, -53709, -35867, -40316, -38469, -78248, -50602, 82894, -4260, -26959, -5663, -8085, 43136, 47890, 34116, -36739, 62543, 99796, -12563, 32913, 60112, 54444, -6491, -41399, 15667, 33207, 42117, 51274, 94008, 72495, -750, -5054, -36325, -46939, -34961, -32219, -82839, 11095, 26517, 122, -35222, -28999, -52518, -28210, -61631, -23776, 52620, -29601, -34920, -6944, -79062, -63083, -70627, -34249, -19396, -34182, -28701, -82752, -49752, -80611, -82401, -62923, 16809]
6826A6809O2009m5594n9124m7710P355j4786R2512Q8232j22353q5993J21785m0101
6814b6959j5755O5497o1771J5684J6029l8692Q702k5625K5125P1428j0747L798
6802B6714M025m4925n9415K1002M817O6112M8920N9831j49942J100R7095o1215
6790A4119j88K1016j60348P3561N2279J172M0639j0854k3080K2222k1041K1681
6778C1178k5247k0091N311k1826M2543l9433K2511k2266r9537R3331Q1546o9159
6766b1139N0128P0717j01161j2656K8049o823J9819j5553O1592P023o1342l7272
6754a8618p4M1347n3146P358L7845L2034o0667M7314k4502m5707k6959L6918O1089
6741C4232k3676j20559P0509J2607O779j6464j5622r178p563O7998K5041N3386
$$ y = [16809, 78818, 33224, -25900, -73610, -66255, -81041, 11471, 99703, -22650, -108643, 13142, -26959, -42714, 22783, -38988, -23304, -7275, -45967, -37265, -62890, -37765, 33663, 22916, 26714, 30739, -14186, -73601, -52599, -47782, 18330, 67250, 127081, -22861, -21761, 75334, 14119, 13931, 34947, -125401, -51840, 439, 1611, 42250, 31396, 8316, 30538, 9497, 31178, 5931, -14160, -8849, -30675, 11868, -27565, -5054, -27320, -126857, -33526, 48020, -21139, 28989, 99706, -1455, -14111, 13938, 7115, 26934, 11381, 72973, 79996, 18654, -18618, -18692, 22655, -30491, -23133, 14712, 46746, -13921, 33393, 8891, -36816, -63775, -26857, 34232, 10556, -110003, -39494, -26887, -20108, -36572, -52194, -61372, -68935, -937, 24104, 77490]
6729G7490o6198J0410m5521L6730l6937j9008k6526P9131k5377q457J9736l5280
6717c9807m7425K5625J6905j6559k2211K0804m102P4034J6380O5682l3137M693
6705F0882n0678m7578P2872k8560j0688j1382l5454P0510o4191p842P1965N744
6693B5600K5147l115m8534q2630Q0713O4356q821m6229m193n0850r61N8513j986
6680G010M3927q7375j1499J9957J5763J3545N5600j16746l3652J6545N0235K5599
6668a091m8257J21614K5671j15950K9098J1479Q726q45M7117p5806l9790P0737
6656C2703q1933J45487j2491l0905K0975l0088k9902k1218l0109J1627R9230p937
6644F5439r1568O6640o2238m2809K8887N5365j04945K9061J1995Q0293K6133j06028
$$ y = [77490, 11292, 21702, -23819, 12911, -24026, -43034, -69560, 9571, -15806, -24263, -4527, -39807, -87232, -61607, -44702, -61261, -83472, -62668, -66770, 7264, 23644, 89326, 56189, 60882, 10204, -37374, 35498, 6938, -3750, -15132, -50586, 19924, -44267, -52109, 19856, 25600, 50747, 47632, -902, -83532, -2819, 61537, 52716, 6487, 2294, -48556, -49517, 8996, 7010, 50937, -36438, -47937, -27980, -12217, 1328, 56928, -59818, -93470, -76925, -26690, -1091, -49348, 72266, 97937, -18013, 11085, 22564, 31290, 30445, 77562, 1756, -38034, 32703, -49230, 96257, 83766, 52861, 73836, 43748, 13846, -7372, -37481, -25854, 73376, 65439, -26129, 40511, -21727, -64536, -35649, 19716, -85229, -56168, -44173, 36120, 62253, -43775]
6632d3775K0373J13980n9708J5326q2254M774M7054p7992N734P2598K0006J8865
6620E4981l2226k9686r800J18062l3432j9255n1659q0190L8948k0140Q1732m3929
6608b6594n9LM9793L1578k7665q5897k0059N2115K1848m920N672q7868m2334M5683
6594h8704J2975J8415l8993j7566N0973N1472L5900o6361J9688R3955n8913K4513
6582C7354K7469q7046L2690l5911m8926j2048L4332P6841m6580j7571q41l7639
6570g7876R2529L9768m4965K284L4181p251j9184l6099K5530K8560o9574K6113
6558e984J2172m4319K1192n6086j0953K3967N5038L6594j2447l2874k5175K422
6546c6453N1519R496N2247p1689k1755p705K261J6605J0039n0444R4824J9958
$$ y = [-43775, -23402, 90578, 30870, 46196, -36058, -31284, 15770, -62222, -56488, 16110, 36116, 54981, 22755, -6931, -16731, 101331, 67899, 48644, -3015, -83205, -44257, -64397, 17335, -26594, -26653, -26650, 23143, 54721, 27056, -58841, -78900, -26785, -4937, -9857, -4185, -92053, -134387, -88704, -75729, -57314, -96307, -113873, -62900, -11428, 24472, -41889, -22201, 71754, 12841, 37354, 64823, -22223, 10467, -25444, -74370, -86418, -52086, 24755, -21825, -39396, -40237, -77876, 14653, 54421, 9456, 11740, 45921, 38670, 19486, -16613, 8917, 37477, -32097, -5984, 6188, -38131, -16939, -73025, -83978, -60011, -4973, 31621, 19174, -13700, -38875, -36453, 15066, 24562, 76809, 5120, -16635, -24340, -22079, -5474, 4565, -45879, 48945, 68903]
6534F8903o5756j1070m5956j1664J01361m2739N5352M2921j17642l9607N9329
6523f568M3992j7042m8455L5575J92O8528m4743m3192R930n3756R301P627N8434
6510A9823q3343l243M8429l0815O521j026q5007P0765r031L491M1494P8831l6417
6497B0472J682r4760M1082l3043O749j1246L8556M1976J4868j6994M83k6692L2792
6484A5925l2795o0623M8235j2820n733j02364J03362m59r696L8332l4271N0352
6472b555L488O886J3604M9596j7348m129R459l5945n7694P1764R295O9206j9943
6459I5684m1649J7313j02581P03q3128M8194j4821k4751J3828P9453m472l1130
6447d7357l1062K3411j4632N1640P553K029K9352r7528Q816L6313m3329L4650
$$ y = [68903, 3147, -7923, -53879, -65543, 35818, -6921, 48431, 91352, -26290, -65897, -6568, 37424, 20382, -28073, 7502, 7694, 76222, 31479, -11713, -1783, -55539, -46238, -38611, 19823, -63520, -66763, -18334, -49149, -42628, -43654, -128661, -57896, -66927, -63436, -21942, 56889, 20472, 22154, -72606, -31524, -64567, -57818, -69064, -30508, 11468, 26336, 9342, 9825, -16867, 15925, -16870, -77493, -29258, -42078, -47811, -150175, -46813, -47272, -56968, -18636, -52907, -2555, 933, 7819, 21423, 71019, 53671, 49542, 59001, 23056, -34638, 37126, 46421, 115627, 95684, 54035, 71348, -31233, -30530, -113658, -65464, -80285, -105036, -91208, -11755, -16227, -47357, -78419, -55008, -69640, -18000, -10447, -8418, 20934, -76594, -67778, -31465, -74794, -40144]
6435d0144j9826k4929O3086m7366k4317O9565m2246L5816J2681Q778N3508n0319
6423e713j0109N0674n5677m1423K9291M0919m4558j0129K987J5513l8360K708
6411f3877K0461J6306J13088j08245m1884K9937M9809n1451K666K7328j8731j6913
6399d1506K8896j32K7686j1834m0458J555L526p865O4796n2207J1571j6883r454
6386d2309M3345p7483j913N6612m4461N4728O1023K6294o5863j7546l516J7972
6374F883l1086j2676j4738J9611j5858P3680m5256o6554J03111p043j5510m8108
6362e3544L8043l0578m1581K7863J10112j8751j2136o3756N7097o1051l7708M2510
6350d3480K2528n6083J839l6341J32040P977n4266j9339l5097K7220n2311K7427
$$ y = [-40144, -59970, -84899, -21813, -69179, -93496, -23931, -66177, -30361, -17680, -8902, 44606, -5713, -15822, 34852, -20825, -62248, -32957, 7962, -36596, -46725, -43738, -28225, -66585, -63877, -43416, -27110, 85978, -22267, -64151, -34214, 15595, -35856, -33190, -5862, -24593, -41506, -12610, -12742, 14944, 3110, -37348, -35793, -32267, -40132, 24664, -27543, -15972, -32855, -42309, 1036, -76447, -78360, -21748, -66209, -11481, 49542, 75836, 9973, -7573, -11089, 6883, -24203, -36879, -51617, -32006, -47864, 25816, -19440, -85994, 17117, 10074, -5436, -53544, -15501, -46079, -87660, -59797, 50315, 31564, 19428, -44328, 12769, -48282, -85990, -43480, -20952, -77035, -75196, -111537, 20503, 28480, -25786, -45125, -80222, -53002, -105313, -77886]
6338g7886J19304o0455j7198N190q722J28473o7008o309n911k249r40M4457k5017
6325B5729J5428J4407j4508O4026p9797o0774L3086k315K0670K2361m4600q4839
6313i1126m5120r62J62008O8061r2143q1969O6578K8794j4163L2408k9856m5087
6301d2577l3910L0172p457L8063J479M827Q381m7132J9093N7019j1868j633l0573
6288a6116L1469q6627N6422K2745K6788L309o0746L717p6903Q969K7088N5726
6276d159J4780K2372j9548p4838n677R508p175O8657J7916O565m7059O2217L440
6263D6999n1413o7716O7752p458M948L1341o5094M1735o248l9665p6494P6992
6251d4321k4202k3036R5902L3781p3146K5044N9456K1817k7995k610j2444m7825
$$ y = [-77886, 41418, -19037, -36235, -31045, -39767, 88706, 21698, 15389, 9478, 7229, 6289, 50746, 25729, 41157, 55564, 41056, 105082, 25285, -35489, -2403, -4718, 15952, 38313, -6287, -91126, -136246, -137208, 24800, 92861, 718, -81251, -14673, 14121, -42, 32366, 2510, -42577, -76487, -46315, -53772, -15709, -14230, -9403, -1022, -48154, -29061, 27958, 16090, 14457, -16116, 15353, -71274, -14852, 7893, 34681, 37990, -22756, -19039, -95942, -86973, -59885, -4159, 10621, 32993, 13445, -61393, -67070, -57562, -64737, 3920, 21836, 28401, -18658, 43559, 46999, -4414, -72130, -4378, -11836, -6888, 24453, -40641, 1094, -5154, -44819, -121313, -44321, -68523, -91559, 4343, 38124, -35022, -9978, 49478, 71295, 43300, 40690, 28246, -19579]
6239a9579j7721r13k5819m4806M2273J7593o205m6000k4376P838L6711l3798k1973
6226a36775K1072M0583M3744n2998P4295O0544l5341j30747K6928J04758J2894
6215B8957J612j2799j5268l1324J4921m785n917N6666p4369j8156L7136J7474
6203e852R0492o2229j9442k8571q4437O1723Q5105k3474q0994p320N5901l1809
6191e0907M756K9026J609q2982N9904K3977K1598n5019K5226l1361k0063J4305
6179e9931M5186p0601N9250K2187J609M1985n3163P5188q2019N8404M7689K8802
6167A14586j14137j3698M1258j2830k6355q8814P8884O5760j8729j213K1018k3324
6155B2406k6149l9540K5275j071n695M8419L9509n7204k0167J1435k7031M5002
$$ y = [-19579, -37300, -38213, -64032, -108838, -66565, -48972, -55177, -101177, -125553, -117715, -81004, -114802, -136775, -115703, -75120, -31376, -84374, -10079, 50465, 15124, -115623, -88695, 16063, 28957, 30569, 17770, 2502, -28822, -13901, -18686, -24603, 32063, -42306, -60462, -23326, -5852, 84640, 22411, 2969, -25602, -110039, -48316, 36789, 13315, -67679, -74999, -19098, -50907, -46151, -17125, -15516, -98498, -38594, -14617, 6981, -48038, -22812, -54173, -74236, -59931, -14745, -85346, -26096, -3909, -2300, 39685, -13478, 61710, -20309, 38095, 85784, 114586, 449, -13249, 28009, 15179, -11176, -99990, -21106, 44654, 25925, 24712, 45730, 22406, -3743, -43283, -18008, -19079, -24774, 23645, 63154, 5950, -14217, -2782, -29813, 15189]
6143A5189l4989L4091J2386k6207O3791Q2945q3779l8360j2223n8589M7348O303
6131G906k4064J5798l8633J12307l2868r1510J7897L3968N6859q9232m9392O9107
6119a1857J3414k553M3491k9393N470o0700m2951j0984N4264j1347l4520m1843
6107a29509O0463Q104M0267L6361n3046j4667j2601J41666r616o5883k1493O7547
6095D7593J0340o4166j0835N3390n3122N8710j1583k4471l0477J2537O902m7285
6083e2467j2047Q6981M0370j6357n6892j0308p5056J7285P8067Q0726j7267o720
6071E6315o4401j8297q319K4972M0985o4667N7078n0530K7469j5714N2618K6658
6059F4167k7681k8484J1050M0647K220l4757Q179J9847k4843m5449P347m5297
$$ y = [15189, -19800, 14291, 26677, 470, 64261, 147206, 63427, 25067, 12844, -45745, 1603, 7906, -16158, -360, -38993, 73314, 40446, -51064, -33167, 801, 57660, -31572, -80964, -11857, 1557, -996, 42495, 13102, 18572, -42128, -85079, -96063, -41799, -53146, -87666, -129509, -69046, -60942, -20675, 15686, -37360, -52027, -64628, 77038, 67422, 1539, -19954, 47593, 57933, -6233, -17068, 36322, -16800, 41910, 30327, 5856, -24621, -12084, -5182, -52467, -64514, 22467, 62837, 46480, -10412, -20720, -95776, -78491, -424, 80302, 63035, 56315, -8086, -26383, -34702, -9730, 31255, -33412, 23666, -26864, 605, -15109, 37509, 64167, 36486, 8002, 19052, 59699, 61919, 27162, 35341, 55188, 30345, -15104, -7757, -53054]
6047e3054R0520K2037m6176j1338K579o349n0772m9314Q6868N734m6121k55k1417
6034g7058O548M2438l1041j1101J9875M4528K4844L1155l0967j11676L8110N0138
6022d207j156m3919j00152P8162K6510j0038M5061k1113L1385J9265k2704j5486
6010a8392o5184K5528L3571J0821N2144p7014m9025j0436k68O941j8041Q138L8113
5997f3104J7827j4235M8864o1015j5203N2876M935m7803P1094j7722j01754M4875
5985h0365N0305j8019K8910O4599o5096K2549J7731k1168K8543L0718P816n6090
5973A0433M1266l3321j8046l4911j9371O6874P60m4040L306Q943j04740J2162
5961a10685O1147N8731K6962L0680n3919j0124k7841N4439j48438R843P4883m4313
$$ y = [-53054, 37466, 59503, 13327, 1989, 4568, -1781, -52553, -101867, -14999, -9265, -55386, -55641, -77058, -70510, -28072, -59113, -70214, -50339, -5811, 19033, 50188, 19221, -92455, -54345, -4207, -5363, -49282, -149434, -71272, -44762, -54800, -9739, -30852, 533, 19798, -2906, -18392, -83576, -58048, -24477, -13656, 38488, -38526, -87551, -97987, -98255, -91314, -109355, -101217, -63104, -45277, -59512, -10648, -71663, -86866, -33990, -29055, -76858, -5764, -23486, -125240, -80365, -30060, -48079, -19169, 45430, -19666, 2883, 20614, -554, 27989, 58707, 66523, 10433, 51699, 18378, 332, -34579, -53950, 12924, 13684, -30356, -27050, -18107, -122847, -110685, -49538, 9193, 36155, 66835, 12916, 2792, -25049, 29390, -119048, -109205, -34322, -78635]
5949g8635l0608O9878p71L4239k0886k440k1536J0567m831O762K5880J23113K9704
5936A40436j22216j32R36m2288K1020j4470m975K2449p5471L9651J8420O602K3556
5923A3518O6015r0360l0794j6434j4397L7258l5291J01154j5885K2210k0110o4559
5911d7675K9221k6591k6675L0905M2468n7056K3182R120l4623J8553L0632K3966
5899A5427K1262m9032J4029p4644M7471L4068K1298j5685l6408k4410N3004p963
5887a583P309r1996K4423M8861p3173J2765R1679k7013J1708K7715K1353J9646
5875G1694j1523j7846m8654m9256K186K7779N3368l631l2050k1081N9858o3465
5863c2621m4992Q9427o6344K092M7528m99l0801o7960O3164K2213K9531K7049
$$ y = [-78635, -109243, -39365, -40136, -5897, -26783, -29223, -50759, -40192, -45023, -38261, -12381, 110732, 140436, 18220, 18088, 19024, -23264, -2244, -16714, -21689, 760, -74711, -35060, -16640, -10038, 13518, 79533, -10827, -41621, -58055, -72452, -35194, -70485, 30669, 14784, 36994, 16884, -47675, -18454, -45045, -71720, -40815, 1653, -55403, -32221, -23101, -57724, -39171, -8539, 15427, 36689, -12343, 1686, -72958, -25487, 8581, 29879, 14194, -22214, -46624, 6380, -1583, 5726, -86270, -61847, -12986, -86159, -73394, 18285, -8728, 2980, 30695, 52048, 71694, 60171, 42325, -6329, -55585, -53399, -25620, 27748, 24117, -7933, -29014, 30844, -32621, -77613, 11814, -54530, -52438, -4910, -5409, -36210, -104170, -41006, -18793, 10738, 37787]
5851C7787m2320N447P6656l9635o5269j1556M0703N9689k1820k7693j25640J43991
5839C0340m925o6850j0123P9043K990k3100n5642O1683l2904n3751p974N6556
5827b4657n7287P1203L0271P804m4520p902n80M1661Q838j10600J8732L9431k0348
5814d7954N6727m1110o2369K0489J2016M8175k4428p403R8921k577n5120L2443
5802B7810n7767m1855L8394J9986k7835L4804L3165Q5896j06535M7093K4338q4414
5790f920N769K3629K2187m8168q0036j0492N8449P5260m4577j6878p1846J2877
5778h0746J13441M2915j09207m511l8122m797K572L9514Q726K2085L3785J7347
5766D3002o7530p676K0474J1529K2783m8265K3062j826k0687J5497l5165k9215
$$ y = [37787, -4533, 914, 77570, 37935, -27334, -38890, 1813, 61502, 39682, 11989, -113651, 30340, 25415, -41435, -51558, 27485, 30475, 7375, -48267, 13416, -19488, -73239, -81213, -24657, -81944, -10741, 19530, 27334, -17186, -25088, -25668, 15993, 24831, -85769, -67037, -27606, -47954, 8773, -32337, -94706, -74217, -62201, -14026, -38454, -45857, 53064, 50487, -4633, 27810, -29957, -71812, -33418, -13432, -41267, -6463, 26702, 112598, 6063, 53156, 77494, -6920, -1151, 22478, 44665, -3503, -83539, -94031, -35582, 39678, -4899, -21777, -93623, -80746, 32695, 75610, -33597, -38108, -76230, -81027, -78455, -38941, -30215, -8130, 25655, 43002, -24528, -32204, -11730, -201, 22582, -25683, -2621, -4447, -25134, -9637, -44802, -74017]
5754g4017Q0381j2540k1621r3951N3332N9582n315n0601q3782Q8251P6853L5359
5742E1931l922k0824l4672K2985n3575m8906N6094K4523n0130L5639j394n4993
5730g7244M744R6661m6640N6521Q4099n1341m8988o261q2502L4924J9685p3771
5718i0113K6780R023J3499P5191j12229J05102J7056q3020k50j0907O6745p7299
5706f0422L8475j0337M3321r4547O7936M5412m691o7050Q2384r3388n9498J816
5694a10589P7945N180o0579M0893P3113K5052n762q900p7835N7596j4579n6633
5682e5098j764N6493O961p3856l429K6590O852q2839M578M9819J14150k1564n0235
5669b3342P1301l5111j2843M4853L444k2821N933q6180p569O9432J2228L1844
$$ y = [-74017, 6364, -6176, -27797, -121748, -68416, -8834, -14149, -64750, -148532, -60281, 16572, 51931, 48009, 27185, -7487, 15498, -38077, -86983, -30889, -6366, -56496, -20857, -22251, -77244, -72500, 24161, -22479, 34042, 118141, 66800, 17812, 11551, -70951, -36027, -16342, -90113, -63333, -54310, -40811, 34380, -77849, 27253, 44309, -38711, -38961, -49868, 16877, -60422, -21947, -32284, 11037, -83510, -15574, 29838, 25147, -41903, 40481, -52907, -112405, -110589, -32644, -27464, -88043, -47150, 25963, 51015, 45253, 36353, -41482, 16114, 1535, -55098, -56862, -369, 6592, -67264, -70693, -44103, -37251, -120090, -115512, -65693, 48457, 26893, -23342, 47959, 12848, 5, 44858, 48302, 25481, 31414, -54766, -62335, 7097, 19325, 51169]
5657E1169r600m90n5749l3215n2725L4467K1440L5186j68l860K80O7669q4090
5644b9686p8344M178N5664L5516O792M242n2964N744n6856k9128J08789K2323
5632c730k445L2024o734m4847q662N2110m0172L9417n6364j1470k8620o335N1039
5619c4789K4474O6468k6372j22293Q3093K8795J7749J487J8666j06136L7320J0669
5607h69k6704k479J6344M4116J6172R13m577m8097r300j8830L405q655R7679q5871
5593b6753r6942N9530J6135J356K5605K1733r819N9511k0642m6360o6379Q3309
5581B84K8726j9060J1520m587k1954j340l2344M038J9167o0969O8179m8745p034
5568f4119K576J6251L8113k7689k1398j9260L6025o0295l612N0888k3821l7496
$$ y = [51169, 41569, 41079, -14670, -47885, -100610, -66143, -44703, -9517, -9685, -13545, -13265, 54404, -29686, -108030, -103852, -48188, -12672, -5880, -1638, -54602, -48858, -105714, -134842, -26053, -3730, -6175, 25849, 19115, -25732, -34394, 17716, -22456, 16961, -39403, -50873, -79493, -85828, -34789, -10315, 56153, 29781, -92512, -9419, 19376, 37125, 38612, 57278, -48858, -11538, -869, -27573, -30052, -13708, 30408, 46580, 47493, 42916, -5181, -14481, -33311, -29906, -38561, 59118, -26753, -123695, -64165, -48030, -46674, -21069, 664, -9155, 50356, 29714, -16646, -83025, 284, 29010, 9950, 21470, 16883, -5071, -6411, -38755, -34717, -15550, -76519, -8340, -57085, -64119, -61543, -45292, -7179, -34868, -56266, -75526, -39501, -99796, -103408, -52520, -76341, -113837]
5556a13837R9412l3288n0797M5449R673k2991k0182O3969J5263k422P4977k5222
5544D0004m5851L5003p522k3778k1162j1243K4646J2869M2130k985r5069l0837
5532h3795N2481N6955J5651j12722o5219R6294N0005l2711l0358m0104J4620L0918
5520d7985N9257L8182j23756l8383J10112l8034M3824L7113q4559k7161n0223
5509a21613P4875J9037Q6097j41252K0597n1623J15732J5448p8217O176k4357
5498g9100j5297M841O3914l2826M9516k9510N3561q940K2813k0744j7547j02907
5486a12226L3071L0260R9328j3298p3787q323K9115k1600J9334P2768l6251r578
5474H813k9003l9091J7441J8890J311R3032n283j3474l3498Q924n3499K802P8621
$$ y = [-113837, -14425, -47713, -98510, -53061, -43388, -66379, -86561, -22592, -7329, -9751, 65226, 40004, -5847, 29156, 21634, -2144, -23306, -34549, -9903, 2966, 45096, 42111, -52958, -83795, -31314, 25641, 41292, -71430, -136649, -40355, 9650, -23061, -53419, -93523, -78903, -47985, 11272, 49454, -74302, -112685, -2573, -40607, 3217, 40330, -44229, -71390, -121613, -46738, -27701, 58396, -82856, -62259, -113882, 1850, 17298, -60919, -54743, -79100, -94397, -89556, -25642, -58468, -8952, -38462, 15099, 6159, 28972, 8228, -9319, -112226, -79155, -48895, 50433, 37135, -36652, -44975, -15860, -37460, -18126, 54642, 18391, 8813, -20190, -59281, -41840, -22950, -21639, 71393, 66110, 52636, 19138, 28062, -25437, -22635, 55986]
5461E5986p3127l5686K2135N9843p0830l9966Q057O0937k1351j6807L8587k2293
5449c4515J6193L168J1036Q0334n7932l7690k4656P446m6161l1194J52140o8028
5437b9859n2888o466l2851J31928L903k3568l8743r502k0190O0273K6209j87l5046
5424b6987o813k3335L2353l7013p4011J17338M8521p5845Q4001K5253j10798l1551
5412g8887M9193j736J9762R495k8467k6373N8624N192L5059L1289q9626k1396
5400c7871m010p4031Q9836M7253n9101k3778K3850K2049q4281P9565N4919r424
5388B4976J4387O8430r8735K1755M598o6845q641N0187q950N5514j1132N4453
5376I9997p0544J633L9948L972q3344P083k4835K916m285O7500j5878n8168j1372
$$ y = [55986, -17141, -52827, -30692, 29151, -41679, -81645, -73588, -12651, -34002, -50809, -12222, -34515, -18322, -15154, -4118, 76216, 18284, -19406, -44062, -36616, -82777, -113971, 38169, -29859, -82747, -89213, -122064, 9864, 13767, -9801, -48544, -58046, -78236, -17963, 8246, 8059, -26987, -33800, -57135, -24782, -61795, -135806, -18468, 30053, -45792, 38209, 63462, -47336, -78887, -29694, -31430, -11668, -2173, -30640, -57013, 1611, 6803, 41862, 73151, -16475, -37871, -41881, -115912, -26076, 21177, -37924, -61702, -37852, -15803, -100084, -20519, 34400, 24976, 39363, 107793, 9058, 30813, 35411, -31434, -40075, 10112, 1162, 56676, 45544, 99997, 29453, 31086, 71034, 75006, -8338, -1255, -26090, -23174, -27459, 40041, 24163, -34005, -45377]
5363d5377m7778J078k4748J4860k0215J06072l2305K4205k2175J3364J0658k7805
5351e0166l4261L8452J01463o1413n2912O8123l6144l0128j434P9536K0346q0861
5339c9399j9429P1946l8799l2499N955M8278R5358L8066j6335j39568l4072J1940
5327d8558J24350l1505K6741l8913m3824k9576q6778K6367P1835r4179L4718J16083
5315B6761l4219n3227m2036O8013l3175N3734K9212l2339j8966p6950M7747P5258
5303I813l276K061k7200K2155J0035J5718k9879j5216R07n222l094J056k5526
5290d7668m2320L8865k151M0769m398k0093k4695O6736O939O5710o7507m2441
5278c2254m0791L1363P2125o7305M9786j9192n416N0966R776q6519J5858K3154
$$ y = [-45377, -93155, -92077, -116825, -101965, -122180, -16108, -48413, -24208, -46383, -33019, -22361, -50166, -84427, -45975, 55488, -5925, -58837, 9286, -26858, -56986, -58420, 21116, 41462, -39399, -58828, 13118, -25681, -58180, -52225, -3947, 91411, 129477, 113142, -26426, -60498, -48558, 75792, 44287, 71028, 32115, -11709, -41285, -128063, -101696, -29861, -124040, -89322, 26761, -7458, -60685, -102721, -34708, -67883, -14149, 15063, -17276, -36242, -113192, -65445, 9813, 6537, 8598, -18602, 3553, 13588, 29306, -573, -15789, -14882, -20104, -23198, -22142, -47668, -89988, -51123, -53274, -12505, -16903, -36996, -61691, 5045, 11984, 77694, 10187, -32254, -73045, -41682, 30443, -36862, 12924, -6268, -11684, 39282, 49058, -37461, -21603, 1551]
5266A551o3104N0022n238n9282k751M5943L5114M4920o4271K1053M0668r7223
5254e2598R6004l2420j3348k9054n8209N5158k7622J31628n1494m7993O2027L9015
5242G1094k5797L6687M5398j00768P5181p1059o1116O6729K2948k3205J3965n9880
5230i823O9809J2608O626l9242k0075k2931j4181J5740j4391Q2992l1882M2176
5218G7426M6691j07782J06032P7648k2502j02619q148n117P0016k27L31j606m6799
5205H3344J0618L5468L7331R688j2301R7049m5352n2938O5657k628P1622k9725
5193B67833J0496r3743m8940L8343N2278k6276o3221r6138J5297M0893o3235Q9375
5181A22962O180O2330j2551n5133M7799N8007l7662K3620j4004R897k8815r1353
$$ y = [1551, -61553, -11531, -16769, -76051, -78802, -32859, 2255, 47175, -17096, 3957, 44625, -52598, 43406, 10986, -2362, -31416, -89625, -34467, -62089, 69539, 18045, -29948, 32079, 71094, 45297, 81984, 127382, 26614, 101795, 30736, -30380, 36349, 59297, 36092, 50057, -9823, 59986, 72594, 79220, 39978, 19903, -3028, -17209, -1469, -15860, 67132, 35250, 77426, 124117, 16335, 122367, 200015, 177513, 74894, 66746, 61629, 131645, 131418, 131749, 130143, 83344, 93962, 129430, 166761, 176449, 164148, 261197, 215845, 162907, 228564, 225936, 297558, 267833, 278329, 184586, 135646, 173989, 226267, 199991, 136770, 40632, 55929, 96822, 33587, 122962, 129142, 191472, 178921, 123788, 171587, 229594, 191932, 215552, 201548, 211445, 182630, 91277]
5169I1277N1345O56n9555m0427P7477P2847n0451q5760Q96J07790m6056o0050
5157E9989l5508m7240J37689k2035n2937l538o1430K0857L4015M3977r839l7113
5145B6887P0010J8583M6089j55087k0417k0166M7847L1459k9914m3739K1288N4802
5133D7642k8795P2450j1106m3358q1492k7895J17456k8956j9719N9006O1679M1282
5121A58194r1012n6680l674P8633o2962n7929M1624j6027N824L0365J232l1576
5109c988J6768K6286q0577N1154k811j373L6608q1771N6606P1440q0506o9060
5097f1224j713r217R1409J61J2862K2061J8100J608m2152N7765k4903l0384J1581
5084D5954k6116K4178m1051n1506j015P6375J2343k1925n7463L2814L1777l8317
$$ y = [91277, 142622, 143278, 83723, 43296, 120773, 193620, 143169, 57409, 58305, 166095, 120039, 59989, 24481, -22759, 114930, 92895, 39958, 36420, -25010, -4153, 29862, 73839, 64000, 26887, 96897, 115480, 161569, 6482, -13935, -34101, 13746, 45205, 15291, -28448, -7160, 47642, 18847, 91297, 80191, 36833, -44659, -72554, 44902, 15946, -3773, 55233, 116912, 158194, 67182, 10502, 6828, 85461, 22499, -35430, 6194, -9833, -4009, 26356, 27588, -3988, 12780, 39066, -41511, 9643, 6832, 5459, 42067, -39704, 16902, 88342, 7836, -61224, -62937, -72154, 19255, 19416, 32278, 54339, 72439, 74047, 31895, 89660, 64757, 34373, 45954, 19838, 44016, 2965, -48541, -49556, 26819, 39162, 17237, -40226, -7412, 24365, -13952]
5072a3952O1620n4459j2649R2624N5733j00268p7250Q1354o6417L2193J1270J3490
5060B3289O8357k5095m4907n5329J5680O6806k5705j8799O5360M3223r1342J06548
5048A28086K8232o2180l8609J0282J0403l3992N8006N5503p0088m9932O2068p858
5036H9921k8192q4828K2232K9168o4002L590Q0225q5989L5318j4132M4645r4462
5024f6506j08K4071J3085n51M0209M4862j2919o8863J6605m2910o18N8137o0400
5011e5906J1342J5728O7702m0262J1107O701j29107m206K4606O9586j0625L0181
4999c153O5947k7643j1231j2443K5355j2007l40r0337l5160Q338N985J1089k9357
4986a04957P195R8070M2069j0736l1783J543J609N7853N7446l3482q9592P603
$$ y = [-13952, 47668, -6791, -19440, 73184, 128917, 28649, -48601, 32753, -33664, -1471, 9799, 23289, 91646, 66551, 21644, -33685, -18005, 48801, 23096, 4297, 69657, 112880, 21538, 128086, 156318, 94138, 55529, 65811, 76214, 42222, 100228, 155731, 85643, 35711, 97779, 89921, 61729, -23099, -867, 28301, -35701, -32111, 48114, -37875, -2557, -16689, 27956, -66506, -66614, -42543, -29458, -30009, 10200, 55062, 42143, -26720, -10115, -53025, -53643, 4494, -55906, -44564, -28836, 38866, -1396, 9711, 16412, -112695, -116901, -92295, -22709, -33334, -3153, 62794, 35151, 23920, 11477, 36832, 24825, 24485, -65852, -101012, -92674, -86689, -75600, -104957, -97762, 308, 42377, 31641, -142, 1401, 3010, 60863, 118309, 84827, -4765, 2838]
4974B838j4197K5195j8254L4399q4111J5925J6034L4374J6139K8248l0451r0631
4962f4492k8199J5741k1283O1691K9358k551j8878K0238n4123M7656M5992n453
4950B5697l9011p979R825N1366K5824l096L7356p3210k4702n7624N0105p786o6314
4937g9549l3865J5086J6508Q6144p5688o168Q200N823k3370L2089M3642p7739
4925h8887K6093N4860j50939J3952R9430K6481l2363O8327q2431n2079J141P0964
4913d5451J4192J53695p0746j01835L8608O1257K2445j7026n599l450J8109L5829
4901A00028k09899j0321Q7931O2180l8115j02479J13534M5428L4960l1640o7622
4890a6015K4228P1963n6468m6564M7550m2453l8162K8839k0707O7156n0399L1408
$$ y = [2838, -11359, 13836, -4418, 29981, -54130, -38205, -22171, 12203, 28342, 56590, 26139, -64492, -92691, -76950, -98233, -36542, -7184, -9735, -28613, -8375, -62498, -14842, 31150, 25697, -13314, -21293, -11468, 39898, 65722, 62626, 99982, 26772, 2070, -55554, -5449, -13235, -79549, -113414, -98328, -81820, 4324, -71364, -77532, -69332, -63509, -86879, -54790, -11148, -88887, -62794, -7934, -158873, -144921, -45491, -19010, -51373, 16954, -65477, -117556, -116415, -45451, -31259, 122436, 51690, -50145, -11537, 49720, 72165, 55139, 49540, 46090, 64199, 100028, -109871, -120192, -32261, 29919, -8196, -110675, 2859, 48287, 83247, 51607, -16015, 8213, 80176, 23708, -22856, 24694, -17759, -55921, -27082, -47789, 19367, -31032, 376]
4878C76l3293J09208n2182L9926L9271j0957o765n5001p2160L6351L4105l4220
4866e341O4221j4828r7710o8769J32536K2310J9014m5462K2940k7445Q4165k3568
4854F2063m8018O2112l4894N6482l5653J068J0048n4635J5858M9450o591m6147
4842C1143m7709N5358O0720L3871L761p6431K9355m9091j19Q434o5694P0050n1764
4829A884k0415N7378k6871l1974O731K4402R33J7983K2586m2021K2588O7167n9971
4816D0400j7013k9280k7867N7769K7731Q940p9075l243n6439Q4716M1365J19653
4804A67657q4311n4675N1223n5561R272M8976j1560k8969j8476q740j2873P196
4792I159J6351r169r466M7858j7072k0729r44n987M0658K5829p4743L0004K617
$$ y = [376, -32917, 76291, 24109, 64035, 103306, 92349, 85584, 30583, -41577, -5226, 28879, -5341, 58880, 44052, -53658, -122427, 10109, 32419, 51433, 5971, 28911, 1466, 85631, 62063, 14045, 76157, 41263, 97745, 62092, 63160, 73208, 18573, 34431, 83881, 77290, 31143, -16566, 38792, 99512, 133383, 137144, 60713, 90068, 40977, 40858, 49292, -16402, 53648, 1884, -18531, 38847, 11976, -19998, -13267, 11135, 12068, 30051, 52637, 10616, 33204, 100371, 40400, 23387, -5893, -33760, 24009, 51740, 60680, -18395, -21638, -78077, 6639, 48004, 167657, 83346, 28671, 79894, 24333, 33605, 82581, 71021, 42052, 23576, 14836, 1963, 9159, 25510, 16341, 6875, 54733, 37661, 16932, 15988, 10001, 50659, 76488, 1745, 31749, 34366]
4779C4366j592R475m1320m212L596m1857o869N0971n2407j0569K8751Q4238k850
4766D9721N3004N0015k6071M0581o3362o5087M7566L1182L095O02L9956m5223
4754A15979n2726o3541l7018O0948J1189m2392M1035J428m321l7440K7992m1012
4742a9879L4333Q8386J6638n8092J3542O3645m3277l9184j1997J9597K8689J17734
4730B10135J829m4039j74454k3697O2765R2691K7321k1216q943M6983l166L2483
4718A98692o6887k55p8566O7578j2424K2715J193n7223K7426L1462q7101Q1960
4706A28570k1364K1890R8917o1058O1254q7969N2064j7609N5756l5544N1330L3753
4694B79990j7426M0032Q6375j02539m06N5001j8848n7522O3123J6421N782j6669
$$ y = [34366, 32774, 42249, 929, -3283, 313, -41544, -48413, 2558, -49849, -60418, -31667, 52571, 49721, 102725, 152740, 126669, 167250, 103888, 38801, 86367, 117549, 120644, 121246, 161202, 115979, 63253, -288, -37306, 23642, 34831, -7561, 33474, 34902, 30581, -6859, 21133, -19879, 14454, 102840, 119478, 61386, 74928, 138573, 95296, 56112, 44115, 63712, 92401, 210135, 211964, 167925, -6529, -30226, 32539, 125230, 152551, 131335, 122392, 169375, 166209, 198692, 131805, 131550, 52984, 120562, 108138, 130853, 132046, 74823, 102249, 133711, 46610, 128570, 107206, 129096, 228013, 166955, 228209, 140240, 192304, 174695, 230451, 194907, 246237, 279990, 262564, 302596, 388971, 286432, 286026, 341027, 322179, 264657, 327780, 344201, 349983, 333314]
4682C33314j1906j3329M6744l7366k0438M8023P1601n3007j4996M0123j05958
4671B82805p083J34556q2468j069m9348j1841j15377Q5301M5301P9753o0907m0470
4659B59153O9132O1362k4896L5410n4422j4001k2802l3960K0854J984O1572l3743
4647C25643m3153O783j4667L8303k468n5411L9341m1493j1430K2844P0420Q460
4635C43172o4816M341N2075k1547n3927K8830j436n0271N2095j6347j3154K482
4623B61497J1441j23K5823p8707N2652n8389Q2334L6977M2163n4206N2472n7342
4611C16592J7981r544L9936O9130L7283m6799m3830q4222M0445K5419k3618K8176
4599C66949N9831o1528n8630R5798K4773Q1406j14893n6387p890Q7959L7992k3660
$$ y = [333314, 321408, 308079, 354823, 317457, 297019, 345042, 416643, 363636, 348640, 388763, 282805, 275722, 410278, 327810, 326741, 277393, 265552, 150175, 235476, 280777, 360530, 299623, 259153, 328285, 389647, 364751, 400161, 345739, 331738, 308936, 274976, 295830, 297814, 359386, 325643, 282490, 289273, 274606, 312909, 310441, 255030, 294371, 252878, 241448, 264292, 334712, 343172, 278356, 282697, 334772, 313225, 259298, 288128, 286692, 236421, 288516, 272169, 259015, 261497, 272938, 272815, 298638, 219931, 272583, 214194, 296528, 333505, 375668, 321462, 373934, 316592, 334573, 325029, 364965, 434095, 471378, 424579, 380749, 296527, 336972, 362391, 338773, 366949, 426780, 365252, 306622, 402420, 427193, 508599, 393706, 337319, 329429, 417388, 455380, 431720]
4587D31720j1857r544k2344K2376N1869O0721L103k9268k7058J4591N9204k1198
4575E22315M6496R6189j09840L5793l0965j8254J36703J5489R672l2303M121L9625
4563G15041j8459n8260O8386N3554N175n3373N6699n973l9604q7986J15287Q5964
4551H36451p1034l7172O3880O0524j2057j6276J0736O9022M1475P9830K715N5115
4539A083209m2899o4153O3416N4770m6273m4569Q0574L2339j9054k6154m6221
4528A024985P2638P2295Q6149k2067O2543R453j33809O4788N4153l7777p1705
4517A181646K8463n8466J6989M4887K0280k3207o0756l889n719m9067P0787M5751
4505A207699M2602k2357Q1458P1975K6721R4561J35139p0445k7762R2178l8764
$$ y = [431720, 419863, 410319, 387975, 410351, 462220, 522941, 526044, 496776, 469718, 484309, 543513, 522315, 568811, 665000, 555160, 590953, 559988, 541734, 678437, 693926, 703598, 671295, 675416, 715041, 696582, 638322, 706708, 760262, 765437, 712064, 768763, 762790, 723186, 635200, 750487, 836451, 765417, 728245, 792125, 852649, 840592, 824316, 835052, 904074, 945549, 1025379, 1028094, 1083209, 1040310, 976157, 1039573, 1094343, 1048070, 1003501, 1084075, 1116414, 1097360, 1071206, 1024985, 1097623, 1169918, 1256067, 1234000, 1296543, 1305996, 1172187, 1236975, 1291128, 1253351, 1181646, 1210109, 1151643, 1168632, 1213519, 1233799, 1210592, 1149836, 1145947, 1140228, 1091161, 1161948, 1207699, 1250301, 1227944, 1309402, 1381377, 1408098, 1502659, 1637798, 1567353, 1539591, 1631769, 1593005]
4494A593005K4102L0189Q1296J29710l0998j6803J31795K0994R9591O5818Q592
4483B137291Q3182J1913J1326R0340M2217O8801L799k4120R6734j6833J0491J08010
4471B623151O8672O6871J02475m2590J04313J10659L3427m9918M7824J72697R1819
4460C329400J64461N1414q442L8515Q6008J24286Q0428J07943J12173R7433J25404
4449D309023J62188K0990K19139K66709J45839J75833K38815K39263K84700L17970
4439F380469K49354K99523L21522L88553L95400M47905N09645M85858O00143P31849
4429A0810221Q65207R01151R48535J396222J720719K113199K633735L284793L901477
4420B8575259M072768K968373K037376K305533K814559K923012L439464M008977
$$ y = [1593005, 1617107, 1647296, 1728592, 1858302, 1827304, 1810501, 1942296, 1963290, 2062881, 2128699, 2137291, 2220473, 2232386, 2243712, 2334052, 2376269, 2445070, 2448869, 2424749, 2521483, 2504650, 2515141, 2623151, 2691823, 2758694, 2861169, 2818579, 2922892, 3033551, 3066978, 3017060, 3064884, 3237581, 3329400, 3493861, 3545275, 3536833, 3575348, 3661356, 3785642, 3866070, 3974013, 4086186, 4183619, 4309023, 4471211, 4492201, 4711340, 4978049, 5123888, 5299721, 5538536, 5777799, 6062499, 6380469, 6629823, 6929346, 7250868, 7639421, 8034821, 8482726, 8992371, 9478229, 10078372, 10810221, 11675428, 12576579, 13525114, 14921336, 16642055, 18755254, 21388989, 24673782, 28575259, 32648027, 35616400, 37653776, 39959309, 42773868, 45696880, 49136344, 53145321]
4412E3145321M956606N900943P471574Q995218J1051669J2878651J5400747J8397060
4404A38197789K2462999K7049618L3757989L9734585M0219247J8316782p615433
4397C12123576j8095129k5045452l5139656l7929428l1084252k4496875j8253964
4390A22078820j4373669j1461103r659460q294474p431354o469735n924081m977597
4382E3487347m416272l839323l892907l243833k907833k451863k302390j977606
4374B8455320j971254j693392j548729j295906j261233j157157j020039r76210
4366A7531400r05385p66656p87063o61607o37946n18838n67324o55303o07165
4357A1424113n25640m93018m94554m53794l82927l88771k57683l96750k65153
$$ y = [53145321, 58101927, 64002870, 71474444, 80469662, 91521331, 104399982, 119800729, 138197789, 160660788, 187710406, 221468395, 261202980, 301422227, 319739009, 312123576, 294028447, 268982995, 233843339, 195913911, 164829659, 140332784, 122078820, 107705151, 96244048, 86584588, 78290114, 70858760, 64389025, 58464944, 53487347, 49071075, 45231752, 41338845, 38095012, 35187179, 32735316, 30432926, 28455320, 26484066, 24790674, 23241945, 21946039, 20684806, 19527649, 18507610, 17531400, 16626015, 15859359, 15072296, 14410689, 13772743, 13253905, 12686581, 12031278, 11424113, 10898473, 10405455, 9910901, 9457107, 9074180, 8685409, 8427726, 8030976, 7765823]
4348G765823k17722k62129k59946j66763k34571k85598k34950j74729k61712k04658
4338E463045j38660j30012j58256r0298j76073k03645j49395j95054j46392r6048
4328C979212k1881j73314j24256j05126l1323j57720o2709p2932j35322j52464
4318B942165o1859j09168o6378k9784o8587J5954k27545k475q3703j5104p4985
4307B218531j14371k27K33p8234q0222q1745q3133P791m5656R4382o601n9408
4295A771340p0467k3418p7851Q495p6767J2827Q5977j39991r4445m6834p0200
4284A278666M2617k6004j24314l4526M4908p3992j20008n5128p078j4493Q154
4273I18802l814m1485p5368j7986J9813K4751K4796l9537j2142J4986j79807J2355
$$ y = [7765823, 7548101, 7285972, 7026026, 6859263, 6624692, 6339094, 6104144, 5929415, 5667703, 5463045, 5324385, 5194373, 5036117, 4945819, 4769746, 4566101, 4416706, 4221652, 4075260, 3979212, 3957331, 3784017, 3659761, 3554635, 3523312, 3365592, 3302883, 3229951, 3094629, 2942165, 2880306, 2771138, 2704760, 2674976, 2606389, 2622343, 2394798, 2392323, 2308620, 2293516, 2218531, 2104160, 2103933, 2104166, 2025932, 1945710, 1863965, 1780832, 1788623, 1742967, 1837349, 1830748, 1771340, 1700873, 1677455, 1599604, 1608099, 1531332, 1544159, 1630136, 1490145, 1395700, 1348866, 1278666, 1321283, 1295279, 1170965, 1136439, 1181347, 1107355, 987347, 932219, 925141, 910648, 918802, 914988, 873503, 798135, 780149, 799962, 824713, 849509, 809972, 797830, 812816, 633009, 645364]
4261F45364L8242l8360K8799L0635j00347M0345M2861o2185j4523p355k2194l36
4249E80946m2920K954L3670p8158j1253j3576N3555j0850J150k745l4780j2781
4237D65212k5221p786O5070l4097n1265q5382R4486q222j3532P1325o4680J3777
4225D19685J774O9319j45226p893m149M1495J3036N1263K5545m8258L9085k7842
4213D27834o1053j4951O2060M83R186J1332q341K6966L2342P3755j00760K1244
4201D80097n0904Q583j1477K4515N9877j24823M9779K7234m298m3392l7775Q5426
4189D62842q4086l6707l6002P3711j24188K849K9033j6255Q3393J06846m2311
4178D19125m3469m803M8101n5966R302q413l1816L5909m0477r353N6213l5032
$$ y = [645364, 683606, 645246, 674045, 704680, 604333, 644678, 687539, 625354, 610831, 603476, 581282, 580946, 538026, 540980, 574650, 496492, 485239, 471663, 525218, 514368, 515518, 512773, 477993, 465212, 439991, 432205, 497275, 463178, 411913, 326531, 421017, 412795, 399263, 470588, 405908, 419685, 421459, 490778, 345552, 337659, 333510, 375005, 388041, 439304, 464849, 416591, 455676, 427834, 366781, 351830, 413890, 414373, 423559, 434891, 426550, 453516, 485858, 559613, 458853, 480097, 429193, 437776, 426299, 450814, 510691, 385868, 435647, 462881, 458583, 415191, 377416, 462842, 378756, 342049, 306047, 379758, 255570, 258419, 287452, 271197, 354590, 461436, 419125, 375656, 370853, 418954, 362988, 372290, 363877, 332061, 367970, 327493, 318140, 374353, 339321]
4166C39321n0429L4206k1183K6755N3395J2610j5936l578P237l2394K8587J6442
4154C95033l859L332o3924M1337j42P526M1764k4356n4309O4139K0748K1499r5505
4141C53283l9699O7302L825n9098k7634Q4948M4154J6446J12476r8318n4307j10506
4129B92872m0183M2327R2795o9759l643j0232q752K854L5671R941j4120K1062
4117C50833J3444l9382m0888K4149J3382j37072M4666L2018M8081K3376m5338
4106B87269l3667K4542K4431n7240J3225j6451p1104J06241J3589n995n8734j5320
4094B10786N0406k637J5646K4856K511o1739K5869j27220J08837O0908q746l8549
4082B60928O5443l436j00171N3521J4832K5391r4553l0618K959J8164N6335J05634
$$ y = [339321, 288892, 323098, 301915, 328670, 382065, 394675, 378739, 375161, 382398, 350004, 378591, 395033, 391174, 394506, 330582, 371919, 371777, 379303, 421067, 396711, 342402, 406541, 427289, 448788, 353283, 313584, 380886, 384711, 325613, 297979, 382927, 427081, 443527, 556003, 457685, 403378, 292872, 252689, 295016, 387811, 318052, 314409, 304177, 295425, 298279, 333950, 343891, 329771, 350833, 364277, 324895, 284007, 308156, 321538, 184466, 229132, 261150, 309231, 332607, 287269, 253602, 278144, 302575, 245335, 258560, 242109, 171005, 277246, 290835, 284840, 226106, 210786, 261192, 258555, 274201, 299057, 301568, 239829, 265698, 138478, 247315, 308223, 299477, 260928, 326371, 322935, 222764, 276285, 291117, 316508, 221955, 191337, 194296, 212460, 268795, 374429]
4070C74429m102j15694o8837J9786q63L5699M5417Q6834m2083m2950o6535P5224
4058B96325k0572l9604M0015M3028n8008R1305n5213p4366N2888R8722n5558q9132
4046B29830M0520n9307l1557j3274J03370N532K0343n9282m940J8613M6535j6724
4034B79659l2898n9004Q1152J21603q2014j8501L9875L1685N3527M075k1208K5578
4022D23529K3959M374R3779p0211J6135j3182j05838M0516Q8842p6711n6499n511
4010C63182O5091n9704J0501J6728L5190l0473l1395n0957k7900m6749K9023J1733
3998B84270O3338l3594n9008l8683j1719J9145m6183K3167M1915k4630n875P3250
3986B85393O424l4490K7750J6540p4979N2067j5158n5736j6382l3520Q9977K1364
$$ y = [374429, 370327, 254633, 185796, 205582, 204719, 240418, 285835, 372669, 330586, 287636, 221101, 296325, 275753, 236149, 276164, 319192, 261184, 352489, 297276, 222910, 275798, 374520, 318962, 229830, 270350, 211043, 179486, 166212, 269582, 275114, 295457, 236175, 231235, 249848, 296383, 279659, 246761, 187757, 268909, 390512, 308498, 289997, 329872, 361557, 415084, 419159, 397951, 423529, 447488, 451862, 545641, 475430, 491565, 478383, 372545, 413061, 501903, 425192, 368693, 363182, 428273, 368569, 379070, 395798, 430988, 400515, 369120, 318163, 290263, 243514, 272537, 284270, 347608, 314014, 255006, 216323, 204604, 223749, 177566, 200733, 242648, 218018, 212143, 285393, 291817, 257327, 285077, 301617, 226638, 278705, 263547, 207811, 191429, 157909, 247886, 269250]
3974B69250l1728M2234M900J6444j1830l1581K2265j2316j1123R6531K2050K5419
3962D00515j7756o3622j5697j6681O8169k6725p033Q2815k1107k7680k6143K2250
3950C51305O0183k8517p242J3576O1722m8341o1181k132O0405k1788M8957J0676
3938D37623j05016R4292j426q7901K1237P0162q1882l8213P9434k760N995J7870
3926D09415J16428q3365o4618P0260k8356r4962O3871Q5518o0179L7102L3917
3915D85031k9079J6973j2630n0703K9104M908k0584m8019j3721k4707q5055N9923
3903C11441Q9981J3765n2572Q290o826L4423K9098O867n6958J547J6177l7425
3891C57808J2866P0498J4448J0839l7400j0809K5432j5787M3961r7317J00724
$$ y = [269250, 237522, 279756, 284656, 301100, 289270, 257689, 279954, 267638, 256515, 353046, 375096, 400515, 382759, 319137, 303440, 286759, 354928, 328203, 321170, 403985, 382878, 355198, 329055, 351305, 411488, 382971, 375729, 389305, 451027, 402686, 341505, 339373, 399778, 377990, 426947, 437623, 332607, 426899, 425473, 337572, 358809, 428971, 347089, 308876, 388310, 385550, 391545, 409415, 525843, 442478, 377860, 448120, 419764, 324802, 388673, 474191, 414012, 451114, 485031, 455952, 472925, 460295, 409592, 438696, 443604, 423020, 375001, 361280, 336573, 251518, 311441, 401422, 415187, 362615, 370905, 364079, 398502, 427600, 434467, 377509, 379056, 395233, 357808, 370674, 441172, 455620, 466459, 429059, 418250, 443682, 427895, 471856, 374539, 475263]
3880D75263O1332p3257j9425O7035m2890O7420k0267o4570J9841Q6045k584K751
3868E56694m788k5750o1141M8216J019R1612k1105l793l6355r269J2803j2468
3856E35675N7956N9200m6960M6218n3300K1508k0666L5327N6062j1709L9054o7676
3844F50689o915J15689o6040J00262R6983k1262O4288K0320r806m4912P5980R1496
3832A066772k5206J04112P9643M2861Q5987K5541J27368R4650J18028R3039J87705
3821B000500K20442J38722K67982L16268K88058L57067K42195L86717M87280L89229
3811E094460M78609O79817O91519Q10940P40563R70409J160087J320939J589434
3802A3536777J710331J668776J650225J689245J662476J882299K087375K119190
$$ y = [475263, 536595, 463338, 443913, 510948, 468058, 535478, 515211, 450641, 470482, 556527, 553943, 556694, 551906, 526156, 465015, 513231, 514250, 605862, 584757, 580964, 544609, 535340, 548143, 535675, 593631, 652831, 605871, 652089, 598789, 620297, 599631, 634958, 691020, 679311, 718365, 650689, 643774, 759463, 693423, 793685, 890668, 869406, 933694, 954014, 944208, 899296, 975276, 1066772, 1041566, 1145678, 1225321, 1268182, 1354169, 1379710, 1507078, 1601728, 1719756, 1812795, 2000500, 2220942, 2359664, 2627646, 2943914, 3231972, 3589039, 3831234, 4217951, 4705231, 5094460, 5573069, 6252886, 6944405, 7755345, 8495908, 9466317, 10626404, 11947343, 13536777, 15247108, 16915884, 18566109, 20255354, 21917830, 23800129, 25887504, 28006694]
3794B8006694J651221J314006J299797J195582J211341J243517Q30390o0530l86569
3785C6305449n36792p73623r45481j100194j381836j789743j823586j715036j802796
3776B4436362j808144j765184j828013j806023j562388j652986j435790j304197
3768A1273637j155794r86728q60806o57884n84739n24797m95984n16804k86443
3759E203658l07928k82849k64358k56080l18407j99276k65915r8988j11168j65436
3749B933253j18641j12317j69403j13154o2968j19125j20114q478j47143j07409
3739A854501r7642r8328N665j31219p9055k8567k0834n3515k384j37967L1179
3728A241834J2679p9853p6171n6156L2696P7644j79681q6528K4210j2747l5035
$$ y = [28006694, 29657915, 30971921, 32271718, 33467300, 34678641, 35922158, 36752548, 36692018, 36305449, 35768657, 34995034, 34049553, 32949359, 31567523, 29777780, 27954194, 26239158, 24436362, 22628218, 20863034, 19035021, 17228998, 15666610, 14013624, 12577834, 11273637, 10117843, 9131115, 8270309, 7612425, 7027686, 6502889, 6006905, 5490101, 5203658, 4895730, 4612881, 4348523, 4092443, 3774036, 3574760, 3308845, 3209857, 3098689, 2933253, 2814612, 2702295, 2532892, 2419738, 2356770, 2237645, 2117531, 2109053, 1961910, 1854501, 1756859, 1658531, 1664196, 1532977, 1453922, 1425355, 1404521, 1351006, 1348622, 1210655, 1241834, 1254513, 1174660, 1098489, 1042333, 1075029, 1152673, 972992, 886464, 910674, 897927, 862892]
3717H62892o9517j0192q892n9864j7448M3974n066J5157K6907O249J481n4995
3705G30686O746o4507l1794p0330J0503j8652l7297j9669l4978Q170N3075o2707
3693D69246J1675N1395l9524m290k4901m5497l0511q4071M8294J2527J04598l8008
3681D30933p6159M9640L4427J1164n5176J5120O4837j22813k1515O6819m9283
3670C47994M3437l8687o478k9400O8470n3601m1577p72L1800o1886M4814L13q6385
3657B18042L6889l1450L7544k9330L6648M9007j9548m3922J3318m5983K5002Q3357
3645C29574k1395j8586J3582M5198K602l1730R921q867j12900j1337J8850l0577
3633A84335J3975J1331M3698O2124P386r0317P46O4740o9851J6157Q3036m6988
$$ y = [862892, 793375, 783183, 774291, 714427, 696979, 740953, 735887, 751044, 777951, 784200, 785681, 730686, 737432, 672925, 641131, 570801, 581304, 562652, 525355, 505686, 470708, 478878, 531953, 469246, 480921, 532316, 492792, 488502, 463601, 418104, 387593, 303522, 351816, 364343, 468941, 430933, 354774, 404414, 438841, 450005, 394829, 409949, 474786, 351973, 330458, 397277, 347994, 391431, 352744, 346266, 316866, 385336, 331735, 290158, 289386, 321186, 259300, 304114, 304427, 218042, 254931, 223481, 261025, 231695, 268343, 317350, 297802, 253880, 267198, 221215, 246217, 329574, 308179, 289593, 303175, 348373, 350975, 319245, 329166, 320299, 207399, 196062, 214912, 184335, 198310, 209641, 253339, 315463, 322849, 232532, 233278, 298018, 228167, 244324, 327360, 280372]
3621B80372P7514o3580l7816J5262K037M6838J1168k866L1948Q1323l9511J0722
3609D13411r9528L4795L3263n2458P2846K2409Q423l9326P171j1637n8480R5894
3597D26783M4991M3386l856k091L167j0730Q1732K1197L3042O8687L7189N2384
3585G95881J4768K401Q8687k0104R8537L1099R5435J60951J0193J07482J70391
3574A555721J24518K14127R3366J12323K21118J92247J20604L07289L12853J66125
3564C420291K31170L20107L04337K70662L79100K73221L33148L42604L53247L25111
3554F552998M31512L58239L37549L57451L58366K21973K53041J79113J73734L10113
3544I534089J67412J80248K14504J70598J5409M0873o471j35434j70793j67676
$$ y = [280372, 357886, 294306, 256490, 271752, 273789, 320627, 331795, 328929, 360877, 442200, 402689, 413411, 313883, 348678, 381941, 329483, 402329, 424738, 433161, 393835, 401006, 389369, 330889, 426783, 471774, 515160, 511304, 509213, 512380, 501650, 583382, 604579, 637621, 706308, 743497, 795881, 810649, 813050, 901737, 881633, 980170, 1011269, 1106704, 1267655, 1277848, 1385330, 1555721, 1680239, 1894366, 1987732, 2100055, 2321173, 2513420, 2634024, 2941313, 3254166, 3420291, 3651461, 3971568, 4275905, 4546567, 4925667, 5198888, 5532036, 5874640, 6227887, 6552998, 6984510, 7342749, 7680298, 8037749, 8396115, 8618088, 8871129, 9050242, 9223976, 9534089, 9701501, 9881749, 10096253, 10266851, 10282260, 10323133, 10316662, 10181228, 10010435, 9842759]
3534I842759j85373k00589j38225q9353j47537l33171k83389l58764l15691l69457
3524G421210l53800l65227l47530k84826k57724k69116l20282k99914l49202k87590
3514D285999k67064l24148j93876j54930k11130j80819k00159j13352n3480j25786
3504B461255j33861q0985j9133j42859r6000q7698j68837j42021o3756j20445
3494A405660j15345o2948o5502k3557q2767r7679n3621J2485p5449L81m9436o4581
3482G27641K399n1079j25305L7694n6913N2245J2816m0363K1391r2459l8258N3426
3470E03235p3902j5824k1355l6357L3799N8276p837k1310l8435o907n0653K8215
3458C50945k8984m0369M0663k5754O2415o3144r139l0609P0734k4429M3066L0689
$$ y = [9842759, 9657386, 9456797, 9318572, 9229219, 9081682, 8748511, 8465122, 8106358, 7790667, 7421210, 7067410, 6702183, 6354653, 6069827, 5812103, 5542987, 5222705, 4922791, 4573589, 4285999, 4018935, 3694787, 3500911, 3345981, 3134851, 2954032, 2753873, 2640521, 2587041, 2461255, 2327394, 2246409, 2227276, 2084417, 1988417, 1900719, 1731882, 1589861, 1526105, 1405660, 1290315, 1227367, 1161865, 1138308, 1055541, 957862, 904241, 916726, 841277, 841658, 792222, 727641, 730040, 678961, 553656, 591350, 534437, 586682, 599498, 559135, 580526, 488067, 449809, 503235, 429333, 413509, 392154, 355797, 389596, 447872, 440035, 418725, 380290, 373383, 322730, 350945, 321961, 281592, 322255, 296501, 358916, 295772, 286633, 256024, 326758, 302329, 345395, 376084]
3446C76084J3972o4237q050M8610p9589l290N6382n6526l1572m3765O701K5084
3434B39804J47558j06975q590R4421j6120r4332n8945L2397K2263L5644J0365
3423B97490R8455j1370L439m6401J3824o9810K1101r2397L9705Q0641K7300K212
3411C64189p8506J8920J3143L5851p1947K2281k4536p390K904J9904k9273m6708
3399B18832O4275J7015j1131j1209o6914O5592k6186q844J7137p1298P649j0360
3387A84558m7417J5475M0887l0069R2539K7368O0759m9301K7517k4236n1055m317
3375B42708Q1797j10274o280M6792L3074l6923l5665J159L9962K3610M719K177
3363B86856j9248l926M7822n459R392l0728K663P7325p2888K550K2339m0155K1420
$$ y = [376084, 390056, 325819, 317769, 366379, 286790, 283500, 339882, 283356, 251784, 208019, 214720, 239804, 387362, 280387, 271797, 366218, 350098, 255766, 196821, 229218, 251481, 287125, 297490, 395945, 384575, 388014, 341613, 355437, 285627, 306728, 214331, 254036, 334677, 361977, 364189, 285683, 304603, 317746, 353597, 281650, 303931, 279395, 272005, 274909, 294813, 265540, 218832, 283107, 300122, 288991, 277782, 210868, 276460, 250274, 241430, 258567, 187269, 194918, 184558, 137141, 152616, 193503, 163434, 255973, 283341, 344100, 294799, 322316, 298080, 247025, 242708, 324505, 214231, 207951, 254743, 287817, 250894, 215229, 216388, 256350, 279960, 284679, 286856, 267608, 263682, 311504, 306045, 315437, 284709, 287372, 364697, 291809, 294359, 316698, 276543, 297963]
3350B97963M3119K4011o3126N0047m2939M0015k934j66k2423K1236j1599k0327
3338C12877N6098P2514j5510m3581N4160m2533K4308k7723M7279j36816j0814
3327B90259L7688Q3013K1988K6243L7459J680p7384o9374M8553J3762m6791N5799
3315D22895n994r878K0236p0028J10246J09322k9137l0211m4750l7787L0040N9940
3303E24894m0163J03856r128K4383k2303j29356j2301J30457J41693k9927l1983
3292F50122k7873k5847P1213J3733k1326l6244K7359P6655L5008n154k8824K1411
3280G50233J22666q443k3923p278P7974k8183q506J160K1847j12738P7145K271
3268H64225M1468L4139K6528r659n8642n9463L9949M6390j1638M521l0751L5083
$$ y = [297963, 341082, 365093, 301967, 352014, 309075, 349090, 346156, 345990, 323567, 344803, 333204, 312877, 368975, 441489, 425979, 382398, 436558, 394025, 418333, 390610, 437889, 301073, 290259, 327947, 410960, 432948, 459191, 496650, 498330, 420946, 351572, 400125, 413887, 367096, 422895, 416901, 407023, 427259, 357231, 467477, 576799, 547662, 517451, 472701, 434914, 464954, 524894, 484731, 588587, 579459, 603842, 581539, 452183, 439882, 570339, 712032, 682105, 650122, 622249, 596402, 667615, 681348, 660022, 623778, 651137, 727792, 762800, 757646, 728822, 750233, 872899, 864456, 840533, 833255, 911229, 883046, 874540, 875700, 897547, 784809, 861954, 864225, 905693, 939832, 966360, 956701, 898059, 838596, 878545, 924935, 913297, 917818, 887067, 922150]
3256I22150Q7955M0847k0232M1310p0690J08698j1424L3741L2407J00986K1436
3245A287184Q6772M7124J4835L9207O1892Q3190J18373O2527N2547R8052R3873
3234B045576P2820K08721K20312J71087J03582J62210K70760K19376L02682L46557
3224D123683L45743K77394L87748L20055M66385N06378N91951P18004P19644P31737
3214I188722R29255J037154J064009J257102J335116J462216J546269J463931
3206A9283774J455495J364568J156358R83263O92357M98072K66210J21849L3088
3197B5855034r708r1259j47601l19049m37658p31297q53708j103629j218654j402980
3187A9539491j449813j360626j338000j235122j244218j071336q65182q39829
$$ y = [922150, 1010105, 1050952, 1030720, 1072030, 1001340, 1110038, 1098614, 1132355, 1164762, 1265748, 1287184, 1373956, 1421080, 1435915, 1475122, 1537014, 1620204, 1738577, 1801104, 1853651, 1951703, 2045576, 2118396, 2327117, 2547429, 2718516, 2822098, 2984308, 3255068, 3474444, 3777126, 4123683, 4469426, 4746820, 5134568, 5454623, 5921008, 6427386, 7019337, 7737341, 8456985, 9188722, 10117977, 11155131, 12219140, 13476242, 14811358, 16273574, 17819843, 19283774, 20739269, 22103837, 23260195, 24243458, 24935815, 25433887, 25700097, 25821946, 25855034, 25845326, 25754067, 25606466, 25287417, 24849759, 24118462, 23264754, 22161125, 20942471, 19539491, 18089678, 16729052, 15391052, 14155930, 12911712, 11840376, 10975194, 10135365]
3179A0135365p47666o98059n95368n02121m15311m54361l42895l96176k69489
3170E713919l18766k29197k08290j98282k16750j77401j30436j82999n4385r8575
3160C898838q3364j52196j61978j58890j25872j1740p1745j25802K060n8467j49588
3149B801256m0703L2021p8022m8547r5094q4832L3889J0630r2884Q4467p8065
3138B444116M0616J00134p9096K6129K4999n4461O3729L7406J84119j4000J8126
3127B791817J14011Q025K15523J13727O5753R4956J58646J37323K99293K78589
3117D277663K03722K30393K83364K66158L59199L93544K66487K85784J61943L6904
3107F765161p3341P1635j01559n6016o4203k42989m9998P3512R5385k1646J10544
$$ y = [10135365, 9387699, 8689640, 8094272, 7592151, 7176840, 6722479, 6379584, 5983408, 5713919, 5395153, 5165956, 4957666, 4759384, 4542634, 4365233, 4234797, 4051798, 3997413, 3898838, 3815474, 3663278, 3501300, 3342410, 3216538, 3204798, 3133053, 3007251, 3009311, 2950844, 2801256, 2760553, 2792574, 2714552, 2666005, 2570911, 2486079, 2519968, 2530598, 2437714, 2522181, 2444116, 2484732, 2584866, 2505770, 2531899, 2556898, 2502437, 2566166, 2603572, 2787691, 2773691, 2791817, 2905828, 2913853, 3129376, 3243103, 3308856, 3403812, 3562458, 3699781, 3999074, 4277663, 4481385, 4711778, 4995142, 5261300, 5620499, 6014043, 6280530, 6566314, 6728257, 6765161, 6691820, 6763455, 6661896, 6605880, 6541677, 6298688, 6248690, 6322202, 6417587, 6395941, 6506485]
3096F506485K60518K11156L08098K29379L48323M31625M39175N40702N74480O51820
3086A0501761P96881Q27238Q93302J053456J293629J421575J541785J832050J959707
3077B2121384K171585K403476K328745K489864K523891K253573K049481J840478
3069D0182477J490198J095887Q54164N85707L22018O7658k3198k26933l43228
3060D4004750n28970o10687r70982j281972j406282j721633j800609k062469k319047
3051C1302099k242218k163452k081683j925524j742284j690609j416196j277428
3043A6762705j225336j050338r29136r24377o92929o35209o64974n03583l16635
3034I820188l29120l73029l36782l58998j18452j28935p2181k8503L5132M026
$$ y = [6506485, 6767003, 6978159, 7286257, 7515636, 7863959, 8295584, 8734759, 9275461, 9849941, 10501761, 11298642, 12125880, 13019182, 14072638, 15366267, 16787842, 18329627, 20161677, 22121384, 24292969, 26696445, 29025190, 31515054, 34038945, 36292518, 38341999, 40182477, 41672675, 42768562, 43622726, 44208433, 44530451, 44598109, 44574911, 44347978, 44004750, 43475780, 42865093, 41894111, 40612139, 39205857, 37484224, 35683615, 33621146, 31302099, 29059881, 26896429, 24814746, 22889222, 21146938, 19456329, 18040133, 16762705, 15537369, 14487031, 13557895, 12633518, 11940589, 11305380, 10640406, 10136823, 9820188, 9491068, 9118039, 8781257, 8422259, 8303807, 8174872, 8102691, 8074188, 8109320, 8113346]
3024H113346m764J0894J49146J36652J26135N4163J00264l3767j51011j33991
3014H367067k42911k71302k89374k45259k17684k81693k52183j64425j26930j96239
3004F079067k48100j8419l8275l5260j14183n9982l7484R8856L3215o6566M1338
2993E634207J17281J94670J37728J51683K16251L12141K66640L19188L55279L61850
2983H066918N75235O40250N29604N95225P11909Q71270P68415R68309J055888
2974A4783023J203220J369953J509000J640891J923923K043883K363100K572228
2966B9409221K703344K971620L002040K959958K752666K373310K042786J542644
2958D9757589J019436O74767L15216J03894K5888k18660k92260o15539j032857
$$ y = [8113346, 8108582, 8119476, 8268622, 8405274, 8531409, 8585572, 8685836, 8652069, 8501058, 8367067, 8124156, 7852854, 7563480, 7318221, 7100537, 6818844, 6566661, 6402236, 6275306, 6079067, 5830967, 5812548, 5774273, 5739013, 5624830, 5564848, 5527364, 5626220, 5659435, 5592869, 5634207, 5751488, 5946158, 6083886, 6235569, 6451820, 6763961, 7030601, 7349789, 7705068, 8066918, 8642153, 9282403, 9812007, 10407232, 11119141, 11990411, 12758826, 13727135, 14783023, 15986243, 17356196, 18865196, 20506087, 22430010, 24473893, 26836993, 29409221, 32112565, 35084185, 38086225, 41046183, 43798849, 46172159, 48214945, 49757589, 50777025, 51451792, 51767008, 51870902, 51896790, 51678130, 51385870, 50770331, 49737474]
2949D9737474j337998j939072k271755k691194k866651k908158k865850k757677
2941C0099119k486467k315502k067481j965306j546808j536353j277391j125269
2933A5778542j146288q98596q88107q39990o56101o04980n62697n35298m72465
2924I174020l59935l96641l70562k03835k64795l62112k39030j87514k20663k39003
2914F329930j26862j19229j89963j29350r9655j5956j24669n7864n1827l1589
2904E382966q7753k7807R2578J52636K7666o556J47734J59337O3235Q7423M8601
2893F040060L3526K3091r4209j19795j41407r7363j79478j87563k10011j40770
2883D926081j43594q0871q2956k8360n8959m8703Q5907J05586K3143R7160K64601
$$ y = [49737474, 48399476, 46460404, 44188649, 41497455, 38630804, 35722646, 32856796, 30099119, 27612652, 25297150, 23229669, 21264363, 19717555, 18181202, 16903811, 15778542, 14632254, 13733658, 12845551, 12005561, 11349460, 10744480, 10181783, 9646485, 9174020, 8814085, 8417444, 8046882, 7843047, 7578252, 7216140, 6977110, 6789596, 6568933, 6329930, 6203068, 6083839, 5893876, 5764526, 5664871, 5648915, 5524246, 5466382, 5414555, 5382966, 5295213, 5267406, 5359984, 5512620, 5540286, 5533730, 5681464, 5840801, 5904036, 5991459, 6040060, 6073586, 6096677, 6002468, 5882673, 5741266, 5643903, 5464425, 5276862, 5066851, 4926081, 4782487, 4701616, 4618660, 4590300, 4531341, 4482638, 4568545, 4674131, 4697274, 4794434, 5059035]
2872E059035J73801J84044K67012K72651J75086L62636L29116L90247L51213M16142
2862G980983M72376N53418O59690O62064Q59128Q67415R35293R12461R05579Q67089
2852A5675496Q28556N54755M85809K73032O3444j01372k39778m09596m15509m97896
2842A6216941l53025k25967j91784j35015J01186K83053L02121L47233M18217
2833A6762960L57396L02805Q2196m9648k04463l89301o40709q34137r16752r27359
2823A3542988r07737r56084q25626p95285q17807o45251o90275n16372l77734
2814G010817l89551m00188m42226k85776j96254k49505l12226j93543j09637p1646
2804D360265j42253k6486l7632j95407j9282J35644l9707J5165K9370J68309P7937
$$ y = [5059035, 5232836, 5416880, 5683892, 5956543, 6131629, 6494265, 6823381, 7213628, 7564841, 7980983, 8453359, 9006777, 9666467, 10328531, 11187659, 12055074, 12990367, 13902828, 14808407, 15675496, 16504052, 17058807, 17544616, 17817648, 17881092, 17779720, 17539942, 17130346, 16714837, 16216941, 15863916, 15637949, 15446165, 15311150, 15412336, 15695389, 15997510, 16344743, 16762960, 17120356, 17423161, 17505357, 17455709, 17251246, 16861945, 16221236, 15387099, 14470347, 13542988, 12635251, 11679167, 10853541, 10058256, 9240449, 8595198, 7904923, 7388551, 7010817, 6621266, 6221078, 5778852, 5493076, 5296822, 5047317, 4735091, 4541548, 4431911, 4360265, 4218012, 4191526, 4153894, 3958487, 3939205, 4074849, 4035142, 4050307, 4079677, 4247986, 4325923]
2793D325923J6803J83085J61888Q1622L3485O6398j0170p6849j85146o6983k21430
2782D308626j75037k62176k47085j85432j69146j30205j76243j35900k01437l2099
2772B593866o0916q6171k31623M35n9803o9670j04331m816l1413q6929K1184l2358
2760A847455o3794K7026L0159q4034N277K6600K3143o656j5062M9190J5470l6117
2748A818657o2290m2602J09400M2538O4937k8864l1665N9421K5230j8514q817
2737A927431N0320R967m8851k3896O6028k6228N3725K2127m3045n7993J1580K6906
2725A968071N8874l6880j6480K4791j4950K0757J3871l26O1193J06830K5968j3339
2713B198380Q0743N4528J2023L307m1302J18041J15603P2448J8744P4957N8402
$$ y = [4325923, 4342726, 4525811, 4687699, 4769321, 4802806, 4869204, 4859034, 4782185, 4597039, 4530056, 4308626, 4133589, 3871413, 3624328, 3438896, 3269750, 3139545, 2963302, 2827402, 2625965, 2593866, 2532950, 2446779, 2215156, 2215591, 2155788, 2086118, 1981787, 1976971, 1945558, 1858629, 1879813, 1847455, 1783661, 1810687, 1840846, 1756812, 1762089, 1788689, 1811832, 1805176, 1790114, 1839304, 1854774, 1818657, 1756367, 1713765, 1823165, 1865703, 1930640, 1901776, 1870111, 1929532, 1954762, 1936248, 1927431, 1977751, 1987718, 1938867, 1914971, 1980999, 1954771, 2008496, 2030623, 1987578, 1929585, 1941165, 1968071, 2026945, 1990065, 1973585, 1998376, 1983426, 2004183, 2018054, 2017728, 2078921, 2185751, 2211719, 2198380, 2279123, 2333651, 2345674, 2348981, 2307679, 2425720, 2541323, 2613771, 2632515, 2707472, 2765874]
2702B765874J73542K1626K08595J06118J93769J43381M8750K25526J57610K43614
2692D288405K06369J59874L27620L20945L06806M54575M29782N21730N79593O42737
2682H238436P71595Q56219J008091J080757J311988J527704J608632J526906J465331
2673A9395659J503883J573208J772399J992673K297850K703097L117962L658851
2665C8015582M250930M978750N754771O603188P496327Q569152R804317J0318269
2657I5791286R980281P783029L729507p95941m429237p083864r104185r905782
2649H5965094r596945q484073p311884o265618n271545m621464m090534l624520
2641C6698511l157239k806708k483918k277456j967439j844551j630454j412447
$$ y = [2765874, 2939416, 2961042, 3169637, 3275755, 3469524, 3612905, 3661655, 3887181, 4044791, 4288405, 4494774, 4654648, 4982268, 5303213, 5610019, 6064594, 6494376, 7016106, 7595699, 8238436, 9010031, 9866250, 10874341, 11955098, 13267086, 14794790, 16403422, 17930328, 19395659, 20899542, 22472750, 24245149, 26237822, 28535672, 31238769, 34356731, 38015582, 42266512, 47245262, 53000033, 59603221, 67099548, 75668700, 85473017, 95791286, 105771567, 113554596, 117284103, 116488162, 112058925, 104975061, 95870876, 85965094, 76368149, 67884076, 60572192, 54306574, 49035029, 44413565, 40323031, 36698511, 33541272, 30734564, 28250646, 25973190, 24005751, 22161200, 20530746, 19118299]
2633A9118299j214038j153492j087630j039674r04713p75153p10285p07878o04163
2624A0921273n65052m85806n02213l83725l62881l79138l55232l63016k92207
2615G232003l73897l43888l25487k62853k74975k09479j47836j97383k19478k02787
2605D673940r5620j93270j39334j69451j22231r6425j65860j53111j24252j11019
2595C303367j89522j03543l6141n3953r6996j08722J064p5588r6302m3961m002
2584B495701r5929r2854q7775o9213p3063m9164n0373n9615j34635m0072M576
2573A747584j66665k1291L1414r2226o1721P4913l5644m9181n5838J7917q8682
2562A300580q5740M8180k1660q8580R1101n9551l0980k1066o4089L4662r238k5749
$$ y = [19118299, 17904261, 16750769, 15663139, 14623465, 13718752, 12943599, 12233314, 11525436, 10921273, 10356221, 9870415, 9368202, 8984477, 8621596, 8242458, 7887226, 7524210, 7232003, 6858106, 6514218, 6188731, 5925878, 5650903, 5441424, 5293588, 5096205, 4876727, 4673940, 4578320, 4385050, 4245716, 4076265, 3954034, 3857609, 3691749, 3538638, 3414386, 3303367, 3113845, 3010302, 2974161, 2920208, 2823212, 2714490, 2715554, 2639966, 2543664, 2499703, 2495701, 2399772, 2306918, 2219143, 2149930, 2076867, 2027703, 1977330, 1917715, 1783080, 1743008, 1747584, 1580919, 1559628, 1591042, 1498816, 1437095, 1512008, 1476364, 1427183, 1371345, 1389262, 1300580, 1214840, 1263020, 1241360, 1152780, 1243881, 1184330, 1153350, 1132284, 1068195, 1102857, 1093619, 1067870]
2550A067870O310m9780l2502m8555m1134J31051q8698j14845K6782k6449O2493
2539H92543L7508o9795n8269l0942o9168k2800Q1191K6782j75131M9990J3054
2528F74963r1358p5049K6856m1703J22912l3856M1765m6840k3556j2069p8064
2517D64001J0404l6220M3888j1463N165p8583N6489O2653k2858J5999N8933m0673
2505E27735k5971n6262k4370o033J1618n9361R4009L7140j79317n9714P6953O1805
2493C98232j4524K1322j9318l3511N900J5848k4104M7872j5962l0966O5792j06795
2481C09786R204k628M9745j2519n0854R4361j3530N812M746O8176p034j2957j9885
2468D22423J1055l3058m796P452O6313q6255O610M0783P7220r5673l1894N1509
$$ y = [1067870, 1074180, 1024400, 991898, 943343, 902209, 1033260, 944562, 829717, 856499, 830050, 892543, 930051, 860256, 801987, 771045, 701877, 679077, 760268, 787050, 611919, 661909, 674963, 583605, 508556, 535412, 493709, 616621, 582765, 624530, 577690, 554134, 542065, 464001, 474405, 438185, 482073, 470610, 475775, 397192, 453681, 516334, 493476, 509475, 568408, 527735, 501764, 445502, 421132, 415099, 426717, 367356, 461365, 498505, 319188, 259474, 336427, 398232, 383708, 405030, 385712, 352201, 358101, 373949, 349845, 397717, 381755, 350789, 416581, 309786, 318990, 316362, 366107, 353588, 302734, 397095, 383565, 389377, 394123, 462299, 455265, 442308, 422423, 433478, 400420, 395624, 403076, 469389, 383134, 389744, 430527, 507747, 412074, 380180, 431689]
2456D31689j0519M515L8591L1655R1754p5386j9691J41597N2913J8582M3948l8956
2444G10692N2283J59692l8106j44531l428O8558q0179l5232l5456K1631j23604
2433E52320K3150J343K629j31841K7749n377j09033p722O6706l7193M5816k415
2421D26132l5632k1387K2309J9646o295l2602q6237l9197J5371p6602M7813N760
2409B39079R3386o2483k8043l3304M4446M5259p6645L6517K8399k5046q409O7048
2397C20204j27218L9665L9501k3499m4574J2606J4039r0586M5841M5417k5277
2386B06119m4172P7964m8281l7689P906j100K5072P2948l6124q8129M5448N2788
2374B32750j4404j0761k6271K0344k1107N1490K2508m9293L1411r2775K5015Q1863
$$ y = [431689, 421170, 425685, 464276, 495931, 587685, 512299, 492608, 634205, 687118, 705700, 749648, 710692, 762975, 922667, 884561, 740030, 736602, 805160, 724981, 689749, 654293, 675924, 552320, 575470, 576813, 579442, 447601, 475350, 469973, 360940, 353218, 419924, 382731, 428547, 426132, 390500, 369113, 391422, 411068, 404773, 372171, 285934, 246737, 262108, 185506, 233319, 239079, 332465, 269982, 241939, 208635, 253081, 298340, 221695, 258212, 286611, 261565, 253156, 320204, 192986, 232651, 272152, 248653, 204079, 216685, 230724, 140138, 185979, 231396, 206119, 161947, 239911, 191630, 153941, 161847, 160747, 185819, 258767, 222643, 134514, 179962, 232750, 218346, 207585, 181314, 201658, 180551, 232041, 254549, 205256, 236667, 143892, 168907, 250770]
2362B50770J738m0300k8195l7180M2992K4712m7679K5943J9569j0863J6534M4824
2350B62865j06108K9385Q230k0477l6l2591j8967N3574K716m2531L0773J2398
2338A79231L970k3427J1597m0210J06178J1056l4485n6039q1330K4582j3125N1137
2326A39135N0644o3572J1112l2515j0455N4255k7696m6818K0894J323k0787J31671
2314B07191k5158m5100M1432q5952M619N4175J1977o1954K6956j3207O2855n1134
2302A26700K8721J520M288o0176r432J06411o1738K215J6156o9416J7535m2426
2290F0358R1938j7695N221r190K4031K9234p1121J6218K1738R660l9347P044L3724
2277A61813n7831m3311m631N5638q408m4245j4601N2326n2971M1792Q2118l0833
$$ y = [250770, 252508, 212208, 184013, 146833, 189825, 214537, 166858, 192801, 212370, 201507, 218041, 262865, 156757, 186142, 194372, 173895, 173859, 141268, 122301, 175875, 178591, 136060, 166833, 179231, 183201, 159774, 171371, 131161, 237339, 248395, 213910, 157871, 76541, 101123, 87998, 139135, 189779, 126207, 137319, 104804, 94349, 148604, 120908, 74090, 94984, 96307, 75520, 207191, 182033, 136933, 178365, 92413, 97032, 151207, 163184, 101230, 128186, 114979, 177834, 126700, 155421, 156941, 161229, 101053, 91621, 198032, 136294, 138509, 154665, 85249, 102784, 60358, 152296, 134601, 139822, 130632, 154663, 183897, 112776, 128994, 150732, 160392, 121045, 128089, 161813, 103982, 60671, 56040, 111678, 103270, 59025, 44424, 96750, 43779, 85571, 167689, 136856]
2265A36856j8481L2527K4112l0119O373o0983K3674L9738p0146L2356L5909l6232
2253A15584R72l5745M977j9014n2790J01303n640n7157L978J5065k036K8648l5434
2240F2711O7825K3427n1243j806J15716j1965j30083p930P9142M1926k5964l908
2228A57848o5664K2660J5673p6157O8062m1817n464n4385K9174R3923m2767M0997
2216A42083m7293P9353r4870q1085M0078J0160L7862K6357p2890N5131j6552M9177
2204A27511j5790J1215l1967m3055m4545L5058K5390j4248J6123P791K4554p0663
2192B7374P9630k0597J8193O1644j36572J7340M6986K4274k1732k5378q4187Q8927
2180G5902k0338m7537l4284P8580N3773k3045m1103Q0372l0731m7129N5015k9889
$$ y = [136856, 118375, 150902, 175014, 144895, 151268, 90285, 113959, 153697, 83551, 115907, 151816, 115584, 116556, 80811, 85788, 66774, 13984, 115287, 109647, 52490, 56468, 71533, 69497, 98145, 62711, 130536, 153963, 102720, 100914, 216630, 204665, 74582, 66652, 145794, 187720, 161756, 157848, 92184, 114844, 130517, 54360, 122422, 80605, 75141, 20756, 49930, 143853, 101086, 142083, 94790, 174143, 79273, -1812, 38266, 48426, 86288, 112645, 39755, 94886, 78334, 127511, 111721, 122936, 90969, 47914, 3369, 38427, 63817, 49569, 65692, 73483, 98037, 27374, 107004, 86407, 104600, 166244, 29672, 47012, 93998, 118272, 96540, 71162, -13025, 75902, 55564, 8027, -26257, 52323, 106096, 83051, 41948, 122320, 91589, 44460, 99475, 69586]
2168F9586K1157n6522m7359J12306N63M1152L0230r7671J9652j1802J7603N9049
2156A57944m9875k3896l1266Q3397k3225M633N7060j02265k364k0869R9471k3359
2144A25386m2539k7923j0834j5390J64508j4231l2009j1693m8522j522L7649o0950
2132F1930j0014O1031J9894p7544m5343K0555L3613O3773r2963P6700n5182K1233
2120G7683J000r3010M3220j7221q5618J38469N1970m4598l9495N7268L3355l8742
2108H4281q6945J10496J9183j6484m9954l5829N6083m1681J7592O643M4883M0784
2096A49052R567M971J9230K081l9193J2919Q21Q4493j6694n8445N4224Q7355L5389
2083C45770Q5552N6286J08233J54337m4685j01447o1225j3558O042k3015j48322
$$ y = [69586, 90743, 34221, -13138, 99168, 99731, 140883, 171113, 73442, 93094, 81292, 98895, 157944, 108069, 84173, 52907, 136304, 113079, 117712, 174772, 72507, 70143, 49274, 148745, 125386, 82847, 54924, 44090, 28700, 193208, 178977, 146968, 135275, 86753, 85231, 122880, 61930, 51916, 112947, 132841, 55297, 9954, 30509, 64122, 127895, 34932, 111632, 56450, 77683, 78683, -14327, 28893, 11672, -73946, 64523, 116493, 71895, 32400, 89668, 123023, 84281, -2664, 107832, 127015, 110531, 60577, 24748, 80831, 39150, 56742, 63385, 108268, 149052, 158619, 163590, 182820, 184901, 145708, 158627, 159448, 243941, 227247, 168802, 223026, 310381, 345770, 431322, 487608, 595841, 750178, 705493, 604046, 542821, 529263, 535305, 512290, 363968]
2072C63968k3026p6631n3975L0175L9913p5606q9439j7665J9845J4995l0388Q0810
2060A82976j8668n2478k9816k5742K2360k9217R5570M3631o3425m6351o8719k5005
2048a4884Q4660j11555J13726M3025j7227o4005M7864j0810J2039q174Q45o8066
2036G438J4263P8491m111p3170j5984O236J0239Q065L300N9396L3144j09758N3687
2023G1236M062m4065o0480M7387J6568L4984N9198l3233J2238k1846l20J3477
2011I9206k1181n2094Q2274l8556n5947M525j6140p4098M3447P9077M3867N2442
1999A46822m4669q4987K0943L7007J5088j2110j9006m3701j7285N3277k4157J0845
1987C8067L7725o0587M5203K0993n7149l2045N8119J6883L14j900N843o8812l5116
$$ y = [363968, 340942, 264311, 210336, 240511, 280424, 204818, 115379, 97714, 117559, 132554, 102166, 182976, 164308, 111830, 82014, 56272, 78632, 49415, 144985, 188616, 125191, 78840, 10121, -14884, 69776, -41779, 71947, 114972, 97745, 33740, 81604, 70794, 82833, 74659, 75504, 7438, 21701, 100192, 96081, 22911, 6927, 13163, 23402, 31467, 34767, 94163, 127307, 17549, 71236, 75298, 31233, -29247, 18140, 34708, 69692, 128890, 95657, 107895, 86049, 85729, 99206, 78025, 25931, 108205, 69649, 13702, 18227, 2087, -72011, -28564, 50513, 94380, 146822, 102153, 17166, 38109, 75116, 90204, 78094, 59088, 15387, -1898, 51379, 27222, 38067, 75792, 15205, 60408, 81401, 24252, -7793, 50326, 67209, 67523, 65623, 71466, 2654, -32462]
1974c2462M5127p3659O0467M1687k0516q2830O0575J02795j6456k0341j9080m3026
1962B281N8696j2944N803j4694l4235R8299J0904j8166l5532P3447j8506m4309
1950G1044p4217L0540K1050n4668N6023N8546n8095L5818j4358o1310j893P2528
1938H1008k4640p4829J3901N5377n4443M3617O4544K9470n0677k2091m4360Q4346
1926A01223m9880n2798L6682L281n4792J21407M2116n6856p6368R197K1791l328
1914D1675M7330o5181K0422K4037K5238Q804m5945K6625j06529l0755L0861J09520
1902H6102p9834k4538Q2268q0934r1794M3858L5242l88L1514N2848n101K3899
1890G3142K0347o390j4553n3893J6746k6769J8830M8511k0389m8358Q5753p1524
$$ y = [-32462, 12665, -60994, -527, 41160, 20644, -62186, -1611, 101184, 84728, 64387, 45307, 2281, 60977, 48033, 53836, 39142, 4907, 103206, 114110, 95944, 60412, 133859, 115353, 71044, -3173, 27367, 48417, -6251, 49772, 108318, 50223, 86041, 71683, 10373, 8480, 81008, 56368, -18461, -4560, 50817, -3626, 39991, 104535, 134005, 83328, 61237, 16877, 101223, 51343, -1455, 35227, 38508, -16284, 105123, 147239, 90383, 14015, 23212, 45003, 41675, 89005, 23824, 44246, 68283, 93521, 102325, 56380, 83005, -23524, -54279, -23418, 86102, 6268, -18270, 63998, -16936, -108730, -64872, -29630, -30018, 1496, 54344, 49243, 73142, 93489, 87099, 72546, 18653, 35399, 8630, 27460, 75971, 55582, 7224, 92977, 21453]
1878B1453L0115r027J5542m12N6895m6959j366K3064k725j1617r4403J3027Q3477
1865G7064J0171n0780K5878l303n5309J9531M2950l5884o8954L0832N4618M1056
1853H7870P5674l6091j36093R780K5209J0438L6142m4486n0914P1770l6989K6900
1841C9210o750R307j617k8394M3492n662L9302m4261J9432k062p6687k1353Q2084
1828D6041k8018k1441J7513l4575N0446J5530r69N4836o122n3746m0018J4597
1816A4074J9790q434P5336m2671M5114L1474o6940j3060j5003j17339N2827Q5066
1804F0234n4450R832r529J9880J4756P2192j29553m6842K0184K3416M8625N7426
1792H6171r987o673n088o8102j5947O0644o108J1122O7771q3877L2385k9070m5732
$$ y = [21453, 51568, 42541, 58083, 57671, 114566, 67607, 66241, 89305, 86580, 74963, -19440, -6413, 77064, 87235, 36455, 62333, 59030, 3721, 23252, 66202, 30318, -38636, -7804, 46814, 87870, 163544, 127453, -8640, 1140, 26349, 36787, 72929, 28443, -22471, 49299, 12310, 39210, 32460, 41767, 40150, 11756, 55248, 49586, 88888, 44627, 64059, 61997, -14690, -36043, 46041, 18023, -3418, 14095, -20480, 29966, 45496, 44527, 99363, 93241, 39495, -523, 14074, 33864, 25430, 100766, 58095, 103209, 134683, 67743, 54683, 39680, -77659, -24832, 60234, 5784, 15616, 6087, 25967, 40723, 112915, -16638, -63480, -43296, -19880, 28745, 86171, 76184, 69511, 64423, -3679, -19626, 41018, 34910, 46032, 113803, 29926, 62311, 33241, -12491]
1779a2491k1878M2896J7999K2702p0973P6228j03660o9848M2694Q1782O162L3309
1767D4922L8306m7126J6813J0723k7189J3716l4538j5625K0067P472j2381m7375
1755c2215j9798j4507R9211j1784m0342k0412K2950N1969l4054L8554l8816r8283
1743i7527M7198J18466K473l1764K0996m9941j4597k3545o935K0932K167j4499
1731b6576o442m440P3692K9169N4116o1075o0175L758k0329L1376L6899o4502
1719a4529p439M9994m5909O5706n2556p314R2844q23o9241j9923J1082n3262m0460
1706i1830R802P8869P1094p6170K3327L0131l5380r1171R5632L3485q2375Q5115
1694E0529m1896J7250j3670J517l57N3087o7258j4551N9360K3903N788J1906P904
$$ y = [-12491, -34369, 8527, 26526, 49228, -21745, 54483, -49177, -119025, -76331, 5451, 11613, 44922, 83228, 36102, 52915, 63638, 36449, 50165, 15627, 2, 20069, 27541, 15160, -32215, -52013, -66520, 32691, 20907, -19435, -39847, -16897, 35072, 1018, 39572, 756, -97527, -50329, 68137, 70610, 38846, 59842, 9901, -4696, -28241, -35176, -14244, -12077, -26576, -33018, -37458, 36234, 65403, 119519, 58444, -1731, 2027, -18302, 13074, 49973, -14529, -21968, 28026, -17883, 47823, -4733, -12047, 80797, 79974, 10733, -9190, 1892, -51370, -91830, -82028, -3159, 67935, -8235, 15092, 45223, 9843, -81328, 14304, 47789, -34586, 50529, 8633, 25883, 12213, 13730, 13373, 66460, -798, -15349, 44011, 67914, 73702, 85608, 93512]
1681I3512j23401j8439K6483J8549n87O941M8430j995o3895L7568J204j9297K146
1668G219n4360M0422O3038j2033l1199J4575j3296J8816k4983M0623k0515L3270
1656F1577r0121r607N4429K4266N0980L5742o1808L804O1768k2595o7980m9182
1644h727j9139Q2995l2324q2118L3343j1354O438N9436m6171L0665L8503j5751
1632C5796l6262O5985k4820m0560p0322p010R3635L3481L4444j0948k1684j2328
1620C9407k6823J2629k4322J2871n0501K7798J08741j5257K8988j12826l0352
1609b9647N0085J5007n5885j8396J1599J12837o9442L698n960k8820J77736j17477
1597D5335n7440n7326K4573R7571L9585l0165p524n2718p7930J08532R479m5378
$$ y = [93512, -29889, -48328, -21845, -3296, -3883, 3058, 51488, 49493, -14402, 23166, 24370, 5073, 7219, -47141, -6719, 56319, 44286, 13087, 27662, 14366, 33182, 8199, 48822, 28307, 61577, -28544, -38151, 16278, 40544, 91524, 127266, 65458, 69262, 131030, 108435, 40455, -8727, -27866, 55129, 22805, -59313, -25970, -37324, -30886, 28550, -17621, 13044, 51547, 35796, -466, 65519, 40699, 139, -70183, -77193, 16442, 49923, 84367, 73419, 51735, 39407, 12584, 25213, 891, 13762, -36739, -8941, 99800, 84543, 113531, 705, -29647, 20438, 35445, -20440, -38836, -27237, 85600, 16158, 19856, 13896, -14924, 162812, 45335, -12105, -69431, -44858, 52713, 92298, 62133, 54609, 1891, -76039, 32493, 41972, -3406]
1585c406j5895J1712M630j2171j8224O9087q022p8218j7134M1255j0134N1840
1573A5320O5746r3872J2389Q1037n7209l8883P7894n2277r1854O5510m4458L8271
1561b2386p637J3427J0746k880N337K8919L628J4427m6622n8855j713L6185K926
1548b4498P4682j9372k3544P2819p9864n7093N221J6386N7213j3162l4448o2020
1536h7680m0680R0087P8075m3738O4411K6779n6260j05928Q4246M5341o8946j5526
1524b9819j3831R6527o9756J0348K5852q3657O7456l6463L2588r90N014m3662
1512d0393M0968r816l1750r445L3865N2476L2837p0977l42j0515K8534q4267K3590
1499d5235Q0576m7773m4838R903K0874L2478j1580p3875R2585k085j2763m9821
$$ y = [-3406, -19301, -7589, -2959, -15130, -33354, 35733, 27711, -50507, -67641, -26386, -36520, 15320, 81066, -12806, -417, 80620, 23411, -15472, 62422, 10145, -81709, -16199, -60657, -22386, -30023, -16596, -5850, -8730, -3393, 25526, 29154, 43581, -3041, -61896, -63609, -27424, -24498, 50184, 30812, 7268, 80087, 223, -56870, -51649, -35263, 21950, 8788, -25660, -87680, -128360, -38273, 39802, -3936, 60475, 87254, 30994, -74934, 9312, 54653, -14293, -29819, -43650, 52877, -16879, -6531, 19321, -64336, 3120, -33343, -755, -1745, 3269, -40393, 575, -9241, -40991, -50436, -16571, 35905, 68742, -2235, -2577, -13092, 15442, -68825, -45235, 35341, -12432, -57270, -47367, -26493, 5985, -5595, -79470, 13115, 11030, -1733, -51554]
1487e1554M0767l4422O281q7107Q0719L5965j8m0991O1936K9339q9779p311J08589
1474E2414l7062l8433M4693O780K5308j3230j2321l5705m367O110p4298q355R7929
1461I463J1206j1305l1762L3616l0555N1822M2363n3651l427k5280N6191k6011
1449B2670q139m5778j597Q4647j7197j9046M5777k958L139k0635l6228l1174P0174
1436D3655p8141P506Q5311n7710K5363K9196o8952K212P4733l686j41192L3133
1424d8572K659p2069R5395P9832J855k8365k4015l6021k3975P8816N102p4767
1412d4125m5219Q446O5769R2594r9293J3438O2953j45026P7688K4368l3740J8669
1400c478N3621O530r336K8204j26376J2041P3903p3036K0962n5532P8521O9950
$$ y = [-51554, -10787, -45209, -38928, -126035, -45316, -9351, -9369, -50360, 11576, 40915, -48864, -56175, 52414, 15352, -23081, 21612, 28392, 53700, 40470, 28149, -7556, -11923, -5813, -80111, -88466, 9463, 20669, 9364, -22398, 11218, -19337, 32485, 74848, 21197, 17770, -7510, 48681, 22670, 14531, -31247, -32844, 51803, 34606, 15560, 61337, 58379, 61518, 40883, 4655, -26519, 43655, -34486, -26980, 58331, 621, 25984, 55180, -13772, -11560, 63173, 59487, -81705, -48572, -45913, -117982, -22587, 57245, 59100, 30735, 6720, -29301, -53276, 25540, 30642, -44125, -89344, -80898, -15129, 77465, -21828, -8390, 54563, -90463, -12775, 11593, -22147, -3478, 50143, 56673, 47337, 75541, -50835, -38794, 35109, -37927, -16965, -72497, 6024, 75974]
1388G5974l4757M715m894j0255o1492K5123k3475L654p874j2356m4876N1914N4245
1375A5646L85m628k676L081j5959R4758J0760l5369j7614K8023P974j00686K4409
1362H104j4113N697K9342m0275J18716k5275m5512K9874p6883M3549k4277l3471
1350b4524R5605k675k6605k1850N7235r985j16484M5069K3899j5515m1966L5486
1338b310m8395N4394K0922l9727K9403o6130P1416j2089J9456j068p676Q23m1523
1325b2504L4748n0305p1272J26611O281m7183j5551L4027M3353k9292M9361K0446
1313G8720q8809p987O69J3231k2070M0127k5923J0472J8640K61K8361j3040k0191
1300A2461J3211o2638L258N1767k2879q6824O6078M5770N6065k784p2831n3511
$$ y = [75974, 41217, 45932, 41038, 30783, -30709, -5586, -29061, -25407, -33281, -45637, -90513, -38599, 15646, 16031, 11403, 8727, 11808, -4151, 90607, 101367, 65998, 48384, 76407, 84381, -16305, 8104, -6009, -312, 29030, -11245, 107471, 82196, 36684, 66558, -10325, 33224, 8947, -24524, 71081, 68406, 41801, 19951, 77186, 67201, -49283, -4214, 19685, 4170, -37796, -2310, -50705, 3689, 24611, -15116, 14287, -51843, 19573, 7484, 26940, 25872, 18196, 19019, -22504, 12244, -38061, -109333, 17278, 23559, -23624, -39175, -5148, 38205, 8913, 58274, 78720, -10089, -18076, -17407, -4176, -26246, 13881, -12042, -1570, 17070, 17331, 45692, 32652, 12461, 25672, -36966, -33708, 18059, -4820, -91644, -25566, 20204, 76269, 73485, 654, -52857]
1288e2857M1436j5982R0436L4879q1404j395m4320L7622J5302K9235l2676J9098
1276C9374N5340o2649l0898N0945j1275K8872o7832J919j7829J3579o12k1545
1264b2611L0140L0444m0948p5157O3310K0969n7595L3061J8935J0678m1500L763
1252b6511L7740m5797o0376N3157M8570l2850m095r690N7037m3003p674M4093
1240A0601r4261J908P0112L3894r3652k9301R7480l8712q2213N0378K9093N7881
1228A3208M5491J8983K913m5575o6312j1295J5604K0497K2548N4403l9247l8096
1216f878m2383J2810O9457o536j2008n6637L1059K8862J3107o8764J8776j4298
1204c3433j4981L6455k586n6445N3277K0407m2576J2104n786p638l2481M412o4744
$$ y = [-52857, -11421, -27403, 63033, 97912, 16508, 15113, -29207, 8415, 23717, 52952, 20276, 39374, 94714, 32065, 1167, 52112, 40837, 69709, 1877, 3796, -14033, -454, -1066, -22611, 7529, 37973, -2975, -78132, -14822, 6147, -51448, -18387, 548, 11226, -30274, -26511, 11229, -34568, -94944, -41787, 6783, -26067, -30162, -39852, 17185, -25818, -33492, 10601, -83660, -81752, -11640, 22254, -71398, -100699, -3219, -41931, -124144, -73766, -44673, 13208, 58699, 77682, 80595, 35020, -31292, -42587, -26983, -6486, 16062, 70465, 31218, -6878, -49261, -36451, 33006, 26470, 14462, -42175, -11116, 17746, 30853, -37911, -19135, -33433, -48414, -11959, -14545, -70990, -17713, 2694, -39882, -27778, -33564, -41202, -73683, -69271, -134015]
1191a34015Q4405L8581r8997K0735K7118P8892q1570j6503L2704k3626k3411N8639
1179c7048l2645R904J12961l3863m9621j7043m7026K0192p656j5726J46875k6559
1167B2745k2745L7622K1709k9637N2568O6212j40061j9945k7648k0529M9290K3988
1155A3569L3188k8352J7867l817P379n622m9524N1714J3231j536N089M0620n239
1142H8567r5899k9363j6496L8242k544O0243k7301n943o488L053J1854N7684n2136
$$ y = [-134015, -49610, -11029, -110026, -89291, -62173, 16719, -64851, -81354, -48650, -72276, -95687, -37048, -69693, -59789, 53172, 19309, -30312, -47355, -94381, -74189, -81845, -97571, 49304, 22745, 0, 37622, 59331, 29694, 82262, 148474, 8413, -11532, -39180, -59709, -10419, 13569, 46757, 18405, 36272, 32455, 39834, 34212, -15312, 36402, 49633, 48097, 53186, 93806, 88567, -7332, -36695, -53191, -14949, -17493, 42750, 15449, 9506, 3018, 6071, 17925, 75609, 23473]
$$ [...]
##END NTUPLES=NMR SPECTRUM
##END=
