##TITLE=1H_EC-3329(II-3)
 CDCl3
 8 sc, 
 8.8.2024
##JCAMPDX= 6.0         $$ Bruker NMR JCAMP-DX V2.0
##DATA TYPE= NMR SPECTRUM
##DATA CLASS= NTUPLES
##ORIGIN= UXNMR, Bruker Analytische Messtechnik GmbH
##OWNER= root
$$ XWIN-NMR		Version 3.5
$$ Thu Aug  8 13:55:54 2024 Russian Standard Time (UT+4h)  she@DPX200
##.OBSERVE FREQUENCY= 200.1313
##.OBSERVE NUCLEUS= ^1H
##.ACQUISITION MODE= SIMULTANEOUS
##.ACQUISITION SCHEME= undefined
##.AVERAGES= 8
##.DIGITISER RES= 18
##SPECTROMETER/DATA SYSTEM= spect
##.PULSE SEQUENCE= zg30
##.SOLVENT NAME= Acetone
##.SHIFT REFERENCE= (INTERNAL, Acetone, 0, 21.5586)
##AUDIT TRAIL= $$ (NUMBER, WHEN, WHO, WHERE, WHAT)
$$ ##TITLE= Audit trail, XWIN-NMR		Version 3.5
$$ ##JCAMPDX= 5.01
$$ ##ORIGIN= Bruker BioSpin GmbH
$$ ##OWNER= she
$$ F:/spectra/data/she/nmr/H-F/1/pdata/1/auditp.txt
$$ ##AUDIT TRAIL=  $$ (NUMBER, WHEN, WHO, WHERE, WHAT)
(   1,<2024-08-08 13:54:38.71 +0400>,<she>,<DPX200>,
      <created by zg, POWCHK disabled, PULCHK disabled
       configuration hash MD5:
       00 E9 B6 7A A2 85 ED C7 34 08 36 98 17 FE 4E 26
       data hash MD5: 16K
       65 B6 57 90 57 D2 20 9D 83 F0 C8 13 BA CE 94 42>)
(   2,<2024-08-08 13:54:41.15 +0400>,<she>,<DPX200>,
      <Start of raw data processing
       efp BC_mod = 2 LB = 0.24 FT_mod = 6 PKNL = 1 PHC0 = -25639.32 PHC1 = 14.38749 SI = 16K 
       data hash MD5: 16K
       29 69 CE DC 8F 99 50 C6 C2 6F 3F 16 72 30 7F 7B>)
(   3,<2024-08-08 13:55:01.10 +0400>,<she>,<DPX200>,
      <pk PHC0 = -79.4137 PHC1 = 0 
       data hash MD5: 16K
       A0 93 32 78 9A 70 A6 1E AF CC 48 BC 07 59 C6 5A>)
(   4,<2024-08-08 13:55:04.81 +0400>,<she>,<DPX200>,
      <abs ABSG = 5 
       data hash MD5: 16K
       30 50 BC C7 E6 C5 BD 04 4B AF 58 FC 56 5D 39 6F>)
(   5,<2024-08-08 13:55:22.17 +0400>,<she>,<DPX200>,
      <abs ABSG = 5 
       data hash MD5: 16K
       42 E9 CB B2 42 EA 6C 6B 30 3C 38 D3 F6 69 D2 48>)
$$ ##END=
$$ 
$$ hash MD5
$$ DF E0 A6 87 FA 2D CE 0A EF 92 E2 06 F7 BC 3C 24
##$RELAX= 
##$RELAX= 
##$RELAX= 
##$RELAX= 
##$RELAX= 
##$RELAX= 
$$ Bruker specific parameters
$$ --------------------------
##$DU= <F:/spectra>
##$EXPNO= 1
##$NAME= <H-F>
##$PROCNO= 1
##$TYPE= <nmr>
##$USER= <she>
##$AMP= (0..31)
100 100 100 100 100 100 100 100 100 100 100 100 100 100 100 100 100 100 
100 100 100 100 100 100 100 100 100 100 100 100 100 100 
##$AQSEQ= 0
##$AQ_mod= 1
##$AUNM= <au_zg>
##$AUTOPOS= <>
##$BF1= 200.13
##$BF2= 200.13
##$BF3= 200.13
##$BF4= 200.13
##$BF5= 200.13
##$BF6= 200.13
##$BF7= 200.13
##$BF8= 200.13
##$BYTORDA= 1
##$CFDGTYP= 0
##$CFRGTYP= 5
##$CHEMSTR= <none>
##$CNST= (0..31)
1 1 145 1 1 1 1 1 1 1 1 1 1 1 1 1 1 1 1 1 1 1 1 1 1 1 1 1 1 1 1 1 
##$CPDPRG= <>
##$CPDPRG1= <>
##$CPDPRG2= <>
##$CPDPRG3= <>
##$CPDPRG4= <mlev>
##$CPDPRG5= <mlev>
##$CPDPRG6= <mlev>
##$CPDPRG7= <mlev>
##$CPDPRG8= <mlev>
##$CPDPRGB= <>
##$CPDPRGT= <>
##$D= (0..31)
0 1.2 0 0 0 0 0 0 0 0.06 0 0.03 0 0 0 0 0.0002 0 0 0 0 0 0 0 0 0 0 0 0 
0 0 0 
##$DATE= 1723110878
##$DBL= (0..7)
$$ [...]
##$SUBNAM3= <"">
##$SUBNAM4= <"">
##$SUBNAM5= <"">
##$SUBNAM6= <"">
##$SUBNAM7= <"">
##$SUBNAM8= <"">
##$SUBNAM9= <"">
##$SW= 24.0689771365484
##$SWIBOX= (0..15)
0 0 2 0 0 0 0 0 0 0 0 0 0 0 0 0 
##$SW_h= 4816.95568400771
##$TD= 16384
##$TD0= 1
##$TE= 0
##$TE2= 300
##$TE3= 300
##$TEG= 300
##$TL= (0..7)
0 120 120 120 120 120 120 120 
##$TP= (0..7)
150 150 150 150 150 150 150 150 
##$TP07= 0
##$TPNAME0= <>
##$TPNAME1= <>
##$TPNAME2= <>
##$TPNAME3= <>
##$TPNAME4= <>
##$TPNAME5= <>
##$TPNAME6= <>
##$TPNAME7= <>
##$TPOAL= (0..7)
0.5 0.5 0.5 0.5 0.5 0.5 0.5 0.5 
##$TPOFFS= (0..7)
0 0 0 0 0 0 0 0 
##$TUNHIN= 0
##$TUNHOUT= 0
##$TUNXOUT= 0
##$USERA1= <user>
##$USERA2= <user>
##$USERA3= <user>
##$USERA4= <user>
##$USERA5= <user>
##$V9= 5
##$VALIST= <valist>
##$VCLIST= <CCCCCCCCCCCCCCC>
##$VD= 0
##$VDLIST= <DDDDDDDDDDDDDDD>
##$VPLIST= <PPPPPPPPPPPPPPP>
##$VTLIST= <TTTTTTTTTTTTTTT>
##$WBST= 1024
##$WBSW= 4
##$XGAIN= (0..3)
0 0 0 0 
##$XL= 0
##$YL= 0
##$YMAX_a= 71039
##$YMIN_a= -92278
##$ZGOPTNS= <>
##$ZL1= 120
##$ZL2= 120
##$ZL3= 120
##$ZL4= 120
##$ABSF1= 21.55857
##$ABSF2= -2.510635
##$ABSG= 5
##$ABSL= 3
##$ALPHA= 0
##$AQORDER= 0
##$ASSFAC= 0
##$ASSFACI= 0
##$ASSFACX= 0
##$ASSWID= 0
##$AUNMP= <proc_1d>
##$AZFE= 0.1
##$AZFW= 0.1
##$BCFW= 0
##$BC_mod= 2
##$BYTORDP= 0
##$COROFFS= 0
##$CY= -3
##$DATMOD= 1
##$DC= 0
##$DFILT= <>
##$DTYPP= 0
##$F1P= 0
##$F2P= 0
##$FCOR= 1
##$FTSIZE= 16384
##$FT_mod= 6
##$GAMMA= 0
##$GB= 0
##$INTBC= 1
##$INTSCL= 3.70164e-10
##$ISEN= 128
##$LB= 0.24
##$LEV0= 0
##$LPBIN= 0
##$MAXI= 10000
##$MC2= 0
##$MEAN= 0
##$ME_mod= 0
##$MI= 1.114404
##$NCOEF= 0
##$NC_proc= -7
##$NLEV= 6
##$NOISF1= 3.799351
##$NOISF2= 2.8
##$NSP= 0
##$NTH_PI= 0
##$NZP= 0
##$OFFSET= 21.55857
##$PC= 1
##$PHC0= -25718.73
##$PHC1= 14.38749
##$PH_mod= 1
##$PKNL= yes
##$PPARMOD= 0
##$PSCAL= 0
##$PSIGN= 0
##$REVERSE= no
##$SF= 200.129393974038
##$SI= 16384
##$SIGF1= 3
##$SIGF2= 2
##$SINO= 5.538805
##$SIOLD= 16384
##$SREGLST= <1H.CDCl3>
##$SSB= 0
##$STSI= 16384
##$STSR= 0
##$SW_p= 4816.95568400771
##$SYMM= 0
##$S_DEV= 0
##$TDeff= 16384
##$TDoff= 0
##$TI= <>
##$TILT= no
##$TM1= 0
##$TM2= 0
##$TOPLEV= 0
##$USERP1= <user>
##$USERP2= <user>
##$USERP3= <user>
##$USERP4= <user>
##$USERP5= <user>
##$WDW= 1
##$XDIM= 16384
##$YMAX_p= 274994968
##$YMIN_p= -667386
$$ End of Bruker specific parameters
$$ ---------------------------------
##NTUPLES= NMR SPECTRUM
##VAR_NAME=  FREQUENCY,     SPECTRUM/REAL,   SPECTRUM/IMAG
##SYMBOL=    X,             R,               I
##VAR_TYPE=  INDEPENDENT,   DEPENDENT,       DEPENDENT
##VAR_FORM=  AFFN,          ASDF,            ASDF
##VAR_DIM=   16384,         16384,           16384
##UNITS=     HZ,            ARBITRARY UNITS, ARBITRARY UNITS
##FACTOR=    0.29402158847633, 1,            1
##FIRST=     4314.50372152167, 0,            0
##LAST=      -502.451962486039, 0,           0
##MIN=       -502.451962486039, -667386,     0
##MAX=       4314.50372152167, 274994968,    0
$$ Real data points
##PAGE= N=1
##DATA TABLE= (X++(R..R)), XYDATA
$$ [...]
5490D142009J45454J56797J77518J44799J81084J81821K05473K22144K37764K32185
5480F027048K56491K74777K91488L12049L42305L52622L74926M05302M40389M72124
5470I549521M86205N58694N50705O01753O50964O45461O78027P03961P05908P58140
5460A5889339P73766P88565Q34212Q60927R15504R75361J027578J090404J234629
5451B4390285J299574J385815J490011J619945J751094J868925J994417K125821
5443C7925887K294518K416107K565804K682286K796976K897616K913309K878244
5435E9370747K760204K508063K114507J627781J060842M13380k44574q87843j474194
5426F7248913j968828k371566k648013k861813k950019k973199k954269k868996
$$ plain form
5490 4142009 4287463 4444260 4621778 4766577 4947661 5129482 5334955 5557099 5794863 6027048
5480 6027048 6283539 6558316 6849804 7161853 7504158 7856780 8231706 8637008 9077397 9549521
5470 9549521 10035726 10594420 11145125 11746878 12397842 13043303 13721330 14425291 15131199 15889339
5460 15889339 16663105 17451670 18285882 19146809 20062313 21037674 22065252 23155656 24390285
5451 24390285 25689859 27075674 28565685 30185630 31936724 33805649 35800066 37925887
5443 37925887 40220405 42636512 45202316 47884602 50681578 53579194 56492503 59370747
5435 59370747 62130951 64639014 66753521 68381302 69442144 69855524 69610950 68723107 67248913
5426 67248913 65280085 62908519 60260506 57398693 54448674 51475475 48521206 45652210
5418D5652210k762750k616936k460922k295477k165819j982511j870761j747565
5410B7749469j606992j500532j377510j265102j188185j098397j031918r65997
5402A7714836r23869q39295p82376p28997o73885o61326n92635n78615n31449
5393A1402389m99640m74327m56003m34854l73405l79414l33957l43130l39168
5384G768491k94329k71384k82527k54481k45306k25946k25202k13941j96068j96339
5374E362968k04245j68227j53867j64810j73834j27758j38448j46896j25231j10769
5364C848883j21631q8173r6028j00991j19414j02518q0273r8975p8511p9468q8306
5353B794595o9296n8119p0660n2685o7949p6083o9213o4658m3274o0599m7737
$$ plain form
5418 45652210 42889460 40272524 37811602 35516125 33350306 31367795 29497034 27749469
5410 27749469 26142477 24641945 23264435 21999333 20811148 19712751 18680833 17714836
5402 17714836 16790967 15951672 15169296 14440299 13766414 13105088 12512453 11933838 11402389
5393 11402389 10902749 10428422 9972419 9537565 9164160 8784746 8450789 8107659 7768491
5384 7768491 7474162 7202778 6920251 6665770 6420464 6194518 5969316 5755375 5559307 5362968
5374 5362968 5158723 4990496 4836629 4671819 4497985 4370227 4231779 4084883 3959652 3848883
5364 3848883 3727252 3639079 3543051 3442060 3322646 3220128 3139855 3040880 2962369 2882901 2794595
5353 2794595 2725299 2667180 2596520 2543835 2475886 2399803 2330590 2265932 2222658 2162059 2114322
5342B114322m7270m5129o8441m8779l3529l7584p3805m0005l5827m2344k7960
5331A613649m1182m4286m2010k2030n3554m0532j9143k8398l9736l535l2313l7214
5319A209716l0410q990k9101k8039k0583K655k7560k6166l5281j9724j4646o351
5307I65520k5448k888q714k2443j4503k2017j5483j9738k8564m856r427n107j1896
5294G74436m873j2235j8539l323n308k0325j1156m325j7231l179k875j7535k806
5281F50726q774j9671p413L081j1991j3401n201P11p762k4035j916l1106q889
5268E14359Q131n697K070q150j3177o586p842J545k4497n262J4965j3729n752
5255D50378q382q263m43k674j0299j4386p671N391J593k578q885M50n553p434
$$ plain form
5342 2114322 2067052 2021923 1953482 1904703 1871174 1833590 1759785 1719780 1683953 1641609 1613649
5331 1613649 1572467 1528181 1486171 1464141 1410587 1370055 1350912 1322514 1282778 1279243 1246930 1209716
5319 1209716 1179306 1170316 1141215 1113176 1092593 1095248 1067688 1041522 1006241 986517 971871 965520
5307 965520 940072 937184 928470 906027 891524 869507 854024 834286 805722 800866 791439 786332 774436
5294 774436 769563 757328 738789 735466 730158 709833 698677 694352 677121 673942 671067 653532 650726
5281 650726 641952 622281 614868 617949 605958 592557 587356 588067 580305 556270 554354 523248 514359
5268 514359 522490 516793 518863 510713 497536 490950 483108 484653 460156 454894 469859 456130 450378
5255 450378 441996 433733 433290 430616 420317 405931 398260 403651 405244 402666 393781 394231 388678 381244
5241C81244j51r712m132m812J6764o392j6752K323O806j5028j3687o709m000j4721
5227C11041J2222j2192k1873q76j2538j0622n203P273j9633r270R09m252k0971
5214B14015J4315j1101N893k285J6815r264p033O17j1112Q614j6958j934J2190
5201B12772k4953L534J7157J573j3392j068k0571j1929M860q721O744K970P066
5188A76042J830r614j0818K0105r568m557M858m1371J0065J7473n231l352j2638
5175A33224J2737q780L654m330j3923k305O642j204l442L293J0256j1085K391
5162A27128P370p121j1703O852R287L14j4092m883r667o480Q79J5906r666P844
5148A11968n356j1830r492M821M442j1726q085J4932l605r098J3446l514n267
$$ plain form
5241 381244 381093 371381 367249 362437 379201 372809 356057 358380 365186 350158 336471 329762 325762 311041
5227 311041 323263 311071 289198 288322 275784 265162 259959 267232 247599 238329 239238 234986 214015
5214 214015 228330 217229 223122 220837 237652 228388 221355 221972 210860 219474 202516 200582 212772
5201 212772 187819 191353 208510 210083 196691 195623 175052 163123 167983 159262 166006 168976 176042
5188 176042 177872 168258 157440 177545 167977 163420 168278 126907 136972 154445 149214 145862 133224
5175 133224 145961 137181 140835 136505 122582 120277 126919 125715 122273 125566 135822 124737 127128
5162 127128 134498 127377 115674 122526 131813 132127 118035 113152 103485 97005 97884 113790 104124 111968
5148 111968 106612 94782 85290 90111 94553 82827 74742 89674 86069 76971 90417 86903 81636
5135H1636r080k046J4951O940J6825m376l113k909m811M606j1025K964n607O388
5121I1343k912k5040l152K0981q710j0964J3918j0728R804k434k744j4539O096
5108F0919J1460j4287q841K2072j8328r531Q860R699Q84l1593J2580K643M694
5095E1231j2781k8691J7056J4806j2145k0901K302K325m414J4952J2968N688j1626
5082C0770M785O52n792L651n772j4176O462P503j1877J200J1015l991p20k0108
5068C602O332P347k311L305j8654l016J3227L924M595p749j6216M264J5706M815
5054A9171l197q817O198N773r446J501j0379j351J0981N40P716k458K426j0165
5040H493M290k738J572J2738J1086k0918K0436K491j4642o846J1066n6r841j676
$$ plain form
5135 81636 72556 70510 85461 92401 109226 104850 101737 98828 94017 98623 87598 90562 84955 91343
5121 91343 88431 63391 60239 81220 72510 61546 75464 64736 74540 72106 69362 54823 60919
5108 60919 72379 58092 49251 71323 52995 43464 52324 62023 62907 31314 43894 46537 51231
5095 51231 38450 9759 26815 41621 29476 8575 10877 13202 8788 23740 36708 42396 30770
5082 30770 35555 36207 30415 34066 28294 14118 20580 28083 16206 17406 28421 24430 23710 3602
5068 3602 9934 17281 14970 18275 -379 -3395 9832 13756 18351 10602 -5614 -1350 14356 19171
5054 19171 15974 7157 13355 19128 9682 11183 804 -547 10434 10974 18690 16232 18658 8493
5040 8493 12783 10045 11617 24355 35441 14523 34959 37450 22808 15962 27028 26972 17131 15455
5026A5455N867J0085p113j973j6463j000m252n982K0607N108Q289J0013k2300
5013A6341j6736K0300M878j1074N239J217O651j1524k546o772j0760m08Q073l727
4999h48j585L568j2377J197j437J2685j0499J1723j5871J257L813K662P53m683
4985i642l619j088j3598n838J2583M91M770o532J0073K450O898O369j2408k538
4971a1629j1726q599K4059n097j2530K083j2780k0129P827J5738j611J3922J2800
4958g672l038J2313j4331o766K584M084N383K2755j021O131j1207j5146k664k10
4944h805k4223p877J596m447N680M43M943J0302J4882N44Q775M753J0219k2139
4930e354J036l398n852M657j0751k981m5q51j0489j82j3142J7863o577N61L360
$$ plain form
5026 15455 21322 31407 24294 22321 5858 4858 606 -5376 15231 20339 28628 38641 16341
5013 16341 -395 19905 24783 13709 18948 20165 26816 15292 12746 5974 -4786 -5194 2879 -848
4999 -848 -2433 1135 -11242 -10045 -11482 1203 -9296 2427 -13444 -12187 -8374 -5712 -4959 -9642
4985 -9642 -13261 -14349 -27947 -33785 -21202 -20711 -15941 -22473 -12400 -9950 -3052 3317 -9091 -11629
4971 -11629 -23355 -31954 -7895 -12992 -25522 -23439 -36219 -56348 -48521 -32783 -34394 -20472 -7672
4958 -7672 -10710 1603 -12728 -19494 -16910 -12826 -7443 15312 14291 20422 9215 -5931 -8595 -8805
4944 -8805 -33028 -40905 -39309 -43756 -38076 -37633 -32690 -22388 -7506 -6962 1813 6566 16785 -5354
4930 -5354 -4318 -7716 -13568 -8911 -19662 -22643 -22688 -23539 -34028 -34210 -47352 -29489 -36066 -35505 -32145
4915c2145J0834O235J1327j2420q961J9789M565m583R380l179m825j9186K1523
4902a646J864j8673r06n401k584R066J3388M711o671J327K162p937K0253J9339
4888B8292J588q553j1365P643n930j1513J501M257m128m030N053J5771q704m20
4874I462K497j541J4940k8375M164j7924O971q027J1075l714L379p777O200O161
4860b509q699j3927Q026Q831p252o619P370M181q15O232N594J3451j3308q319
4846g763J4777j0058J260J5939k039L310j3859J0473k325J7473J2476j0590Q15
4833B9889O467J133L331L066J0317J7133r908K1283Q257R213K573j3385J9649
4820A09018J0471j411j619J4446Q326J3937K2166J3578K5333L257R227L3515J5025
$$ plain form
4915 -32145 -21311 -15076 -3749 -16169 -25130 -5341 -776 -5359 4021 842 -3983 -23169 -1646
4902 -1646 218 -18455 -19361 -24762 -27346 -18280 -4892 -181 -6852 -5525 -3363 -11300 8953 28292
4888 28292 29880 21327 9962 17605 11675 162 1663 5920 1792 -2238 2815 18586 9882 9462
4874 9462 11959 10418 25358 -3017 1147 -16777 -9806 -17833 -6758 -10472 -7093 -14870 -8670 -2509
4860 -2509 -11208 -25135 -17109 -8278 -15530 -22149 -14779 -10598 -11413 -5181 413 13864 556 -7763
4846 -7763 7014 -3044 -1784 14155 12116 15426 1567 12040 9715 27188 39664 29074 29889
4833 29889 36356 37489 40820 43886 54203 71336 61428 82711 90968 100181 102754 89369 109018
4820 109018 119489 118078 116459 130905 139231 153168 175334 188912 214245 217502 226729 260244 275269
4807B75269L8620M7199K6941M2034L2824L3342N9232M7475P1946O6658R5227R4877
4795I31644Q2102N5987Q489n1829n0831m1473k5075j6959k2123Q632M875J9996
4783I03435M3823L8132O8240P1996R4774J42541J36363J61048J82604J46916K8757
4772B018629n7335j64724j93894j87424j48020j23385j01873q3580m6544j8757
4762H93093k8253r742l642K1102N3803K6748P2815P3222M4998K1797k2446p1030
4750A072465r3260j05823j20007o4443r0838p9806p1191n0133l4838m3687l3895
4739B84544k5199k7639k8940j2242k4788P783j0075k2415J9104k0744j915p917
4727A29557j4658r911j345j0107q185j410j8804R155k686k2225J452j0889l290
$$ plain form
4807 275269 313889 361088 388029 430063 462887 496229 555461 602936 674882 741540 836767 931644
4795 931644 1013746 1069733 1078222 1026393 975562 934089 909014 892055 869932 878564 883439 903435
4783 903435 947258 985390 1053630 1125626 1220400 1362941 1499304 1660352 1842956 1989872 2018629
4772 2018629 1961294 1796570 1602676 1415252 1267232 1143847 1041974 958394 911850 893093
4762 893093 864840 855098 851456 872558 926361 953109 1025924 1099146 1144144 1165941 1143495 1072465
4750 1072465 979205 873382 753375 688932 598094 518288 447097 396964 362126 318439 284544
4739 284544 259345 231706 202766 190524 165736 173519 163444 141029 160133 139389 137474 129557
4727 129557 114899 104988 103643 93536 85351 83941 65137 74292 71606 49381 50833 39944 36654
4714C6654n781J436j2778r169Q112p526k250P806P139l691p575p209M780j1060
4700a112p857j0935J9461K098j5697m818J0542J4994j0303P18q69m703l308J763
4686a0026K349J1937J1953k2510M802J572j4732N161q52J1895J317N869Q256L943
4672B0934j0611K526l196O260j343q839J0688m690J1608k6749o401J3870o848
4659b791o481P005J548k862R001o092R38P393j9026L763q78j771K0434K744j1833
4644A092k178o738k566l095k767J2290K853j2762N063J4313q245n866k942J4767
4630C219m716J828J0187k981J4858o054j6016j2609r539R102r773J5414o227r717
4616b3024J5542j2152j8202J3839J3661k4475K6150R51n431m40P70l15Q540j0390
$$ plain form
4714 36654 30873 32309 19531 10362 18474 10948 8698 16504 23643 19952 12377 5168 9948 -1112
4700 -1112 -8969 -19904 -443 1655 -14042 -18860 -8318 6676 -3627 -2909 -3778 -8481 -11789 -10026
4686 -10026 -7677 4260 16213 -6297 -1495 77 -14655 -9494 -10346 1549 2866 8735 16991 20934
4672 20934 10323 12849 9653 15913 14570 5731 16419 11729 23337 -3412 -9813 4057 -2791
4659 -2791 -9272 -2267 -719 -3581 5420 -672 266 7659 -11367 -7604 -8482 -10253 10181 12925 1092
4644 1092 -1086 -7824 -10390 -13485 -16252 -3962 -1109 -13871 -8808 5505 -2740 -8606 -11548 3219
4630 3219 -1497 331 10518 7537 22395 16341 325 -12284 -21823 -12721 -22494 -7080 -13307 -23024
4616 -23024 -7482 -19634 -37836 -23997 -10336 -34811 -8661 -7710 -13141 -13581 -12811 -13126 -4586 -14976
4602a4976J045k05j4627m298n710P938K91j400J4310J1303J1628k101k7990J359
4588b3433J1885J1142o175Q426n383j690m001q802J364L212q831q900K384m476
4574c3278J6011J434N341N241j4179q967n569M074N393M80P917j860j6913L2618
4560b257L36k606k189R0J817J7031j7353j0291K9845L217k084l350K755j5499
4546e38R059J4251j3087Q249j147O910m246J164L860o413j634O815j1875j3162
4532a794O23K916J9788l453j0593P635j9208j3662J1010J1003q8j0900J4939l406
4518D810j1316M057J2706j8389q204J9377K6050q406j1702Q092j4033k221J9305
4505B0126R67q126L690m776M049p380P053R566r482k422m229M223O219j5397Q459
$$ plain form
4602 -14976 -13931 -14136 -28763 -33061 -38771 -30833 -30542 -31942 -17632 -6329 5299 3198 -24792 -23433
4588 -23433 -11548 -406 -6581 1845 -3538 -5228 -9229 -18031 -16667 -13455 -22286 -31186 -28802 -33278
4574 -33278 -17267 -15833 -10492 -5251 -19430 -28397 -33966 -29892 -24499 -24019 -16102 -17962 -34875 -2257
4560 -2257 -1921 -4527 -6716 -6626 -4809 12222 -5131 -15422 14423 17640 15556 12206 14961 -538
4546 -538 8521 22772 9685 17934 16787 23697 19451 20615 24475 18062 16428 23243 11368 -1794
4532 -1794 -1171 1745 21533 18080 7487 15122 -4086 -17748 -6738 4265 4177 -6723 8216 4810
4518 4810 -6506 -2449 10257 -8132 -16336 3041 29091 20685 8983 17075 3042 821 20126
4505 20126 21093 12967 16657 11881 15930 8550 15603 25169 15687 13265 9036 13259 19478 4081 12540
4490A2540k164J024J6936J9477J521k3853K393n972q802J2126q540R910K1504
4477D8100j8740o583J1337Q990l305K8375K5013J5364K1898N862k685L367r196
4464A27797K786k0871j1555Q928l721M128J99m616J2363O360K1885J9067J9845
4451A82595J3026J8835J5076M7827J8849J2126n949l6857j5487k5116k4511k7020
4439A73394r975j1019n293L722J8407J1072J2131L3488R143N409L1146M9858N8623
4426C80106J3243p912k8837m3926k1599l8349k6562r218m79l806j9625j7601K8185
4413B03620J820j8087K6808L0611K0799J1670L1390N0305K5502j0504j7421n5038
4401C01475j4844k3115j8151J2439q428j8936J1814J6330l283J1197j6469J8984
$$ plain form
4490 12540 10376 11400 28336 47813 49334 25481 27874 21902 13100 25226 16686 26596 48100
4477 48100 29360 22777 34114 43104 39799 68174 93187 108551 130449 136311 133626 136993 127797
4464 127797 130583 109712 98157 107085 103364 107492 107691 103075 115438 121798 143683 162750 182595
4451 182595 195621 214456 229532 277359 296208 308334 302385 265528 250041 224925 200414 173394
4439 173394 163419 152400 147107 150829 169236 180308 192439 225927 235070 240479 271625 321483 380106
4426 380106 393349 385437 356600 312674 291075 252726 226164 216946 216467 212661 193036 175435 203620
4413 203620 205440 187353 214161 244772 265571 277241 308631 358936 384438 373934 356513 301475
4401 301475 286631 263516 245365 257804 249376 230440 242254 258584 255301 266498 250029 269013
4389B69013J6958K3662L834L5415M7900l717n332O753J7236O317L3708K1015Q772
4376D81534M6583L2941L6777M1997N7141N7939R1491Q8231Q0056J17320J08290
4365A240300N3501q431k9124p1488p2556o5193m3843m6933j9498R50J0592L3945
4353I82222L6132N9679Q5097Q1805J27637J58442K12113J90292J50676N6576q2682
4342B057989j84988k02190j75603j55525j27803j02639q0581p1974o9470k7230
4332H59986j1854j8263J9068K4345L4658M8392L8179O2165M6247L625o5445q5020
4320I56083r2782q5934p9864n8796o5995m2227l2415o8441l2515k6249j8397j9812
4308C32656j3092p555k5318k7267K2646J431k1308p633l754o571J3667N870j3381
$$ plain form
4389 269013 285971 309633 313467 348882 396782 393065 387733 394486 411722 418039 451747 472762 481534
4376 481534 528117 561058 597835 639832 696973 754912 846403 934634 1014690 1132010 1240300
4365 1240300 1293801 1285370 1256246 1184758 1112202 1047009 1003166 956233 936735 937685 948277 982222
4353 982222 1018354 1078033 1163130 1244935 1372572 1531014 1743127 1933419 2084095 2140671 2057989
4342 2057989 1873001 1670811 1495208 1339683 1211880 1109241 1028660 956686 887216 859986
4332 859986 848132 829869 848937 873282 907940 956332 994511 1056676 1102923 1106548 1041103 956083
4320 956083 863301 777367 697503 638707 572712 530485 498070 429629 397114 370865 352468 332656
4308 332656 319564 312009 286691 259424 282070 283501 262193 254560 250806 244235 257902 263772 250391
4295B50391Q725j0445j3028j4297p873n663K607j004o365J0303j4079k6123K3363
4282A96512P364j6474j201l230j885J8337j4088J386j482l079K5134J0163r382
4269B08075J2073J9477p684J6627J0698K888O206n012q448N058n382r697n993
4256B38886K5283j7775N826K5962J0305K128K2759J9059K6344J4262P771K3641
4244D04451J078J0777O924K4064P595n258M6176M5931O0786O7623M7005R5128
4232H12280Q2419J1931k2448m3474n2981o5684m3168M267n951J0771K7766N940
4220G21668K1204M3779L8429M9178N2248O8512Q6629J00091J26658J84120K41572
4209A734088L01656K24533K4065j17655k29815k16423j62144j07481j00201l2065
$$ plain form
4295 250391 259116 248671 235643 221346 213473 207810 210417 209413 203048 213351 199272 173149 196512
4282 196512 203876 187402 186201 182971 181086 199423 185335 186721 185239 182160 207294 217457 208075
4269 208075 220148 239625 231941 248568 259266 262154 268360 263348 254900 259958 254576 244879 238886
4256 238886 264169 246394 252220 278182 288487 290615 313374 332433 358777 373039 380810 404451
4244 404451 405529 416306 423230 447294 454889 449631 495807 541738 602524 670147 717152 812280
4232 812280 894699 906630 884182 840708 787727 722043 678875 683142 677191 687962 715728 721668
4220 721668 742872 786651 825080 874258 926506 995018 1081647 1181738 1308396 1492516 1734088
4209 1734088 2035744 2260277 2284342 2166687 1936872 1720449 1558305 1450824 1350623 1318558
4199A318558j6801P172J0731L0460K9522K8536L2252M6610P2013P8658R7213J42236
4187A877160K01390K60146L56047K47063M5925j00510k03941j77131j39665r7839
4177B268645n6158m8180n1703m5396j438J5644L6231Q0565R7426J51383J60792
4166B607811K16854L01308L23277K65167J33022K5257j19884k34701k92482k95384
4156B930245k90768k50911k12593j90443j36407j12643j02517p8515m5445n3338
4146A456665l0745j6729K886n714q708L379n930n3678o0183l9012m3872m1476
4134A156883q332l5467j9415L728K373M1486j0857J9171K3859K4595K5060N5594
4122A278678M4958O5496L5395M1423O1174M6739M0796M7598N2141P1485P9401
$$ plain form
4199 1318558 1301757 1308929 1319660 1350120 1379642 1408178 1440430 1487040 1559053 1637711 1734924 1877160
4187 1877160 2078550 2338696 2694743 2941806 2987731 2887221 2683280 2506149 2366484 2268645
4177 2268645 2212487 2164307 2112604 2067208 2065770 2081414 2117645 2198210 2295636 2447019 2607811
4166 2607811 2824665 3125973 3449250 3714417 3847439 3872696 3752812 3518111 3225629 2930245
4156 2930245 2639477 2388566 2175973 1985530 1849123 1736480 1633963 1555448 1510003 1456665
4146 1456665 1425920 1409191 1412077 1406363 1397655 1401034 1395104 1341426 1281243 1242231 1198359 1156883
4134 1156883 1148551 1113084 1093669 1097397 1099770 1141256 1130399 1149570 1173429 1198024 1223084 1278678
4122 1278678 1323636 1389132 1424527 1465950 1527124 1573863 1614659 1662257 1714398 1785883 1865284
4111A865284J00188Q8830J02367Q0232R7450J19428J40148J78606J61419J92111
4101C126063K35893K28561K27764K26576K37963K07941J72493J14837O3709J2870
4091D854670l5551j13688j68733k05303k26669k16967j87295j76666j84394j59150
4081C180254j41326p4554m7822j9698l1808n2786p4371j25023j16594j21186r7562
4070B277524n1557m6329l3377q659K9342O682K8883N5586Q6220J11246Q3194N5698
4058B594453k8463j08706j35466j45935j54769j43495j35258q5883p1894l9382
4048A545202l4710r522L50J5822N4797M2465O7550O0835J6801l6368p9408r7734
4036A546080j09474q7490p2282n3675m9836l8501j8606m730Q098J7539M497L2617
$$ plain form
4111 1865284 1965472 2054302 2156669 2236901 2334351 2453779 2593927 2772533 2933952 3126063
4101 3126063 3361956 3590517 3818281 4044857 4282820 4490761 4663254 4778091 4841800 4854670
4091 4854670 4819119 4705431 4536698 4331395 4104726 3887759 3700464 3523798 3339404 3180254
4081 3180254 3038928 2964374 2916552 2896854 2865046 2812260 2737889 2612866 2496272 2375086 2277524
4070 2277524 2225967 2179638 2146261 2137602 2166944 2173626 2202509 2258095 2344315 2455561 2538755 2594453
4058 2594453 2565990 2457284 2321818 2175883 2021114 1877619 1742361 1656478 1584584 1545202
4048 1545202 1510492 1500970 1501320 1517142 1571939 1614404 1681954 1742789 1759590 1723222 1643814 1546080
4036 1546080 1436606 1349116 1276834 1223159 1173323 1134822 1116216 1111486 1119584 1137123 1141620 1174237
4024A174237N3606M9067N8628R1424R3490J13909J62825J88578K58158L41098
4014B585020N12135P46165R06789K30091j49343m75612q54202o38003n15337m22944
4004A924759k96894k37461j76329j27710q5982r4909q4682o5023n4250l4013m5555
3993F21951m5859k6810k3737m0554j3461q025j6638j7123L341J7055p093l1543
3981D11504j8216k1669j8803k4735j6202o461o826k3572j9620r160o06m64k3493
3968B21677p242R010j9979k5171M498p644m537Q221J2094k0865k1748R663j0949
3955A47028N879j445p040K985J840O055L715K138o937j492O964o680j5807N449
3941A42652o44N170m03K770j3465Q100L153k5358K2150o809p68L359j9369Q867
$$ plain form
4024 1174237 1227843 1276910 1335538 1426962 1520452 1634361 1797186 1985764 2243922 2585020
4014 2585020 3097155 3843320 4750109 4980200 4830857 4355245 3501043 2863040 2347703 1924759
4004 1924759 1627865 1390404 1214075 1086365 1000383 905474 820792 755769 701519 667506 621951
3993 621951 576092 549282 525545 484991 471530 463505 446867 429744 433085 450140 443047 411504
3981 411504 393288 371619 352816 328081 311879 305418 298592 275020 255400 246240 245634 245170 221677
3968 221677 214435 223445 203466 178295 182793 175149 170612 178833 190927 170062 148314 157977 147028
3955 147028 152907 151462 144422 147407 149247 155302 159017 161155 154218 152726 159690 153010 137203 142652
3941 142652 142008 147178 146775 149545 136080 144180 147333 121975 144125 137316 136548 139907 120538 129405
3927A29405P486J878k931J2643k679o024m854P415l803l952r054m098q968j1687
3913A00777J6342k455j4103r080O426l500K555k152p518L824n504K668J620r641
3899H0259J7449j3821J9078j2218M14N564L96J2900O739J982J0608m66m306M403
3885A28981M585J2253l426l405j6961J2709J393J3591J0761p059J8834j0612o892
3872A54752K1951p404M143J779K1748J1928L223J2400J7502P288q855Q490q394
3859B40551R534J1734r82J3577L2498R552K3153L5067N9757L6595N8431M6840
3847E76307K2843q294o3598m9533l5704m0564l2659k5175j3480l0186l6838m863
3835B58256K05k5143m177o611m846p312k0054n130M536P708L244q701L870k819
$$ plain form
3927 129405 136891 138769 135838 148481 145802 139778 134924 142339 138536 134584 125530 121432 112464 100777
3913 100777 117119 114664 100561 91481 97907 94407 96962 94810 87292 91116 85612 88280 89900 80259
3899 80259 97708 83887 102965 90747 91161 96725 97121 110021 116760 118742 129350 128884 124578 128981
3885 128981 133566 145819 142393 138988 122027 134736 136129 149720 160481 153422 172256 161644 154752
3872 154752 176703 169299 173442 175221 196969 208897 212120 224520 242022 249310 240455 248945 240551
3859 240551 250085 261819 260837 274414 306912 316464 339617 374684 434441 471036 529467 576307
3847 576307 599150 590856 527258 477725 442021 401457 368798 343623 330143 299957 263119 258256
3835 258256 258461 233318 229141 222530 217684 210372 190318 185188 189724 197432 200676 191975 195845 193026
3821A93026K3508p103K6018M769j6534n877l247n743O277m839j0057k412j3668
3808A84118K4100j6870p164Q451J390k53J4465N631l367k09M707O584q622j1925
3794B01036K0583P554k7715N023j2986J328O138K795n427N794J8824j3027K3871
3781B33791Q612J6686o67l360Q070O570Q442J2580L680O118N812J50j9199K7301
3767C14586R106l954j1946K682J2391R792l431P286K2227L5284n723R598R713
3754D07611K4072R376N058K3377Q69K4215j1601J5483J3442k2839L780R443J4584
3741E16870j0807P920k7772J4111K4655L0674Q342r95J0477K203J103O329M0809
3728F23919r527P536J3215j4044K4004Q536J2890O995Q65Q999m755p581J0458
$$ plain form
3821 193026 216534 209431 235449 240218 223684 217807 214560 208817 215094 210255 200198 197786 184118
3808 184118 208218 191348 184184 192635 194025 193772 208237 213868 210501 210292 214999 221583 212961 201036
3794 201036 221619 229173 201458 206481 193495 194823 200961 203756 198329 204123 222947 209920 233791
3781 233791 242403 259089 258422 255062 263132 269702 278144 290724 294404 300522 306334 306484 287285 314586
3767 314586 323692 319738 307792 310474 322865 332657 329226 336512 358739 394023 388300 397898 407611
3754 407611 431683 441059 446117 469494 470363 494578 482977 498460 511902 489063 492843 502286 516870
3741 516870 506063 513983 486211 500322 524977 555651 563993 562998 573475 575678 576781 583110 623919
3728 623919 614392 621928 635143 621099 645103 653639 666529 673524 674389 683388 678633 671052 681510
3715F81510Q150R331K864R037K6276o580J8905N980O970J3620J4684J4186J3095
3702H18028K5485J8640K977L2548J8203K3332K0345J3015M13L4722J3535K3944
3690A045187L2257L2610J0378K7179N0560L8054L5867M7332L1077M1360M9627
3679A441488O9324N8785M3639O0001N5976P7289N5505Q3138P6827Q3160R0892
3668B196024J02464J07595J14791J35618J70210J85103J59100J62775K26770K40312
3658C800762K58200K93422L32755L86206M42631M94981N35704N88143O29521O57055
3648H419380N43111L48594K77719L42312M27943M80184N17363N92643O55347P27726
3638A3332322P87226Q89376R88470J104249J232059J413886J627305J846891K065218
$$ plain form
3715 681510 689660 698991 701855 710892 737168 730588 749493 755473 762443 776063 790747 804933 818028
3702 818028 843513 862153 865130 897678 915881 939213 959558 972573 972986 1007708 1021243 1045187
3690 1045187 1077444 1110054 1120432 1147611 1198171 1236225 1272092 1319424 1350501 1391861 1441488
3679 1441488 1510812 1569597 1613236 1673237 1729213 1806502 1862007 1945145 2021972 2105132 2196024
3668 2196024 2298488 2406083 2520874 2656492 2826702 3011805 3170905 3333680 3560450 3800762
3658 3800762 4058962 4352384 4685139 5071345 5513976 6008957 6544661 7132804 7762325 8419380
3648 8419380 8962491 9311085 9588804 9931116 10359059 10839243 11356606 11949249 12604596 13332322
3638 13332322 14119548 15008924 15997394 17101643 18333702 19747588 21374893 23221784 25287002
3629B5287002K331090K698301L173122L869346M794758N963713P492677R352023
3621F4962032J1112169J0709976N668065k134021q618130j1312121j0816795r341062
3613E0230113p641134o127883m943069l932408l169447k609135k146902j805955
3605A7854180j560340j363373j187781j064700r21353q43882p36306o70332n90339
3596H915774n36678m95331m24596l67206l52568l21602k91881k64478k74547k74247
3586E312640k46326k53377k45798k23348k28140k16507j79638j86563j61438j51291
3576C220214j47556j47756j08181j08460j15956j01247o6957o9465q3393q1561
3566B189682o4106m9843p5978n3218n4672o0397m0282m0846l3448k5792m7522
$$ plain form
3629 25287002 27618092 30316393 33489515 37358861 42153619 48117332 55610009 64962032
3621 64962032 76074201 86784177 92452242 90318221 81700091 70387970 59571175 50230113
3613 50230113 42588979 36461096 31518027 27585619 24416172 21807037 19660135 17854180
3605 17854180 16293840 14930467 13742686 12677986 11756633 10912751 10176445 9506113 8915774
3596 8915774 8379096 7883765 7459169 7091963 6739395 6417793 6125912 5861434 5586887 5312640
3586 5312640 5066314 4812937 4567139 4343791 4115651 3899144 3719506 3532943 3371505 3220214
3576 3220214 3072658 2924902 2816721 2708261 2592305 2491058 2424101 2354636 2271243 2189682
3566 2189682 2125576 2075733 1999755 1946537 1891865 1831468 1791186 1750340 1716892 1691100 1643578
3555A643578m1508j6364k1537k3944k2452j4457Q659J936P069Q296q077M869K9213
3542A555281L4446M2283M4836O9753O9253Q5406Q0528L3173M6j2637n2935p1410
3530A878023m7285l5875n3467j2521K6417p946L2020L8195P1941R4428J13605
3519B097535J19169J22596N3146L045j00949j12328j59667j36191j44622j20461
3509A621273q4190p4048m2788n4285k2360j9625k1501K0436K5397M4739J2696
3498A405744P401o3596p2314r5135p8212j10685j02466n7776p3252m2952l1477
3487F85280l5529l2719l1721k3780j3328k3919k129r442k2530j4639Q322k6464
3475D57402n215p0j4178j5942j0320l21M489j4657j4017J5555J4391k9713j6823
$$ plain form
3555 1643578 1602070 1585706 1564169 1540225 1517773 1503316 1511975 1513911 1520980 1529276 1521199 1526068 1555281
3542 1555281 1589727 1632010 1676846 1746599 1815852 1901258 1981786 2014959 2015005 2002368 1949433 1878023
3530 1878023 1830738 1794863 1741396 1728875 1755292 1747346 1779366 1817561 1889502 1983930 2097535
3519 2097535 2216704 2339300 2392446 2395491 2294542 2182214 2022547 1886356 1741734 1621273
3509 1621273 1537083 1463035 1420247 1365962 1343602 1323977 1302476 1322912 1348309 1393048 1405744
3498 1405744 1413145 1349549 1277235 1182100 1103888 993203 890737 832961 759709 716757 685280
3487 685280 649751 617032 585311 561531 548203 524284 522155 512713 490183 475544 483866 457402
3475 457402 452187 452117 437939 421997 411677 411356 415845 401188 387171 402726 417117 387404 370581
3462C70581n859j1715q465p321k501p193l986p728j674m886j58j3075m708J6938
3448C08250n87K2474k923L296p455k276j974m142j1337K9896J4526l057k522J6657
3434C58826k4790k1310J4470j29Q046l36J9808J7621r408J6166N116l57P994k296
3420C89421k3141J0687J5172j4207N178Q011K772n237j7766Q073L216j076N18
3407C81621M863K251K301N242J9429J4277J03R314K1861M402J1995o89J8993L0093
3393E26056L0689K6648M1258K8386M7361J9801n524m4940p4629n0021n1162l8422
3381D55501j6230k0950k0910n236k6754j1635q287j6905M303j402j1112l387p696
3368C09300M715j2697l5298K596P712O774j8246n966j705k77J945r155J69O333
$$ plain form
3462 370581 364722 353007 344542 337221 334720 327527 323541 315813 314139 309253 309095 296020 291312 308250
3448 308250 307663 330137 327214 330510 323055 320779 318805 314663 303326 333222 347748 344691 342169 358826
3434 358826 334036 312726 327196 327067 335113 334777 354585 372206 362798 378964 384080 383723 391717 389421
3420 389421 366280 376967 392139 377932 383110 391121 393893 388656 370890 378963 382179 381103 381621
3407 381621 386484 388735 391036 396278 415707 429984 430087 439401 461262 465664 477659 476970 495963 526056
3393 526056 556745 583393 624651 653037 700398 720199 714675 669735 595106 545085 493923 455501
3381 455501 439271 418321 397411 392175 365421 353786 345499 328594 332897 331495 320383 316996 309300
3368 309300 314015 301318 266020 268616 276328 283102 264856 258890 257185 256908 258853 249698 249867 256200
3354B56200j5649j268P810l361m333J5663j2360k2122P622m006p881N041M565
3341B25921l171K1861j8655K9279K120M277j8m241k0399K0962M371J1479k582
3328B71204L905R638J8729P825J3091m390m081J7018O54m040O896J0811K7228
3315C74488j0144P052O140q369L744J0122k01J3096o353M479m153K7721j027k807
3301D13788J1959j2334J3043j136K922r99P288m930K0504K835N398q408J1500
3288D61430j0347J3692K1155k261j2583k609R424N816K2706Q640l64P933J6015
3275E38647J1791O432J0498M392L3180N744N688K7167J5049M500K998P389N858
3262F79333J1440N517K4914L3505J6293J8380K5179J2138K1927J8891M6809K9530
$$ plain form
3354 256200 240551 239283 247093 243732 239399 255062 242702 220580 228202 224196 216315 221356 225921
3341 225921 222750 244611 225956 255235 257355 261632 261614 257373 236974 257936 262307 273786 271204
3328 271204 275109 284747 303476 311301 324392 320002 315921 332939 333593 329553 336449 347260 374488
3315 374488 364344 371396 377536 369167 372911 383033 382832 395928 389575 394054 389901 417622 416595 413788
3301 413788 425747 413413 426456 425320 428242 427243 434531 429601 450105 452940 458338 449930 461430
3288 461430 451083 464775 485930 483669 471086 468477 477901 483717 506423 515063 514699 522632 538647
3275 538647 550438 556870 567368 571760 604940 610684 616372 643539 658588 663088 666086 673475 679333
3262 679333 690773 696290 721204 754709 771002 789382 814561 826699 848626 867517 914326 943856
3250I43856L3991L6529L2315L2771L4061O6863Q1215M9050O4102N8152N1077Q6097
3238A570079O5541Q9125R1424R6718P6254J15472J41074J14535J31476J66327
3228B658025J55881J87000J67539K16387K09703K44352K49764K46389L09459L14405
3218D958904L37065L61880L76334L93703L98485M40343M79413N20852N78209O21293
3208I466481O62435O76109O79845O42507O33036O18378O44106P22391P49729Q17464
3198A6312481Q94413Q60376Q36067O94260N12778L86051L05686K92974L53318
3189B1448404M50334M66600M96678M69376K96271M1935k09420l98567m77601m97760
3179B2086250m49077l72100l05585l39065l45338m66753o55842p69290q73221
$$ plain form
3250 943856 977847 1014376 1046691 1079462 1113523 1180386 1261601 1310651 1374753 1432905 1483982 1570079
3238 1570079 1635620 1724745 1816169 1912887 1989141 2104613 2245687 2360222 2491698 2658025
3228 2658025 2813906 3000906 3168445 3384832 3594535 3838887 4088651 4335040 4644499 4958904
3218 4958904 5295969 5657849 6034183 6427886 6826371 7266714 7746127 8266979 8845188 9466481
3208 9466481 10128916 10805025 11484870 12127377 12760413 13378791 14022897 14745288 15495017 16312481
3198 16312481 17206894 18067270 18903337 19597597 20110375 20496426 20802112 21095086 21448404
3189 21448404 21898738 22365338 22862016 23331392 23627663 23669598 23460178 23061611 22584010 22086250
3179 22086250 21637173 21265073 20959488 20620423 20275085 19808332 19152490 18383200 17509979
3170A7509979r09695q76447p78296p15376o44993o20075n82495o20508o53799
3161A1108295o49547o35727o55703o08120n21417m86162m65623l98829l61161
3152F326006l51391l32822l15784l01690k98992k73285k44216k38078j93289j92870
3142C583589j63203j54092j49688j52859j48351j53481j21999j37060j12715r9864
3132B190277j01851q7996r2882o1161q6214p6203o9364o3862o8412m3360o5945
3121A373027l0970n4387l4441m1040n9874m9841r778j9427m4878k9436j6899k7243
3109I54813l7753j3692j3599j5643k4915j7563r251o995k309j8411M546j9355
3097G79873n39k4750k9399q096j857k1318J0451m883R52l073P796j7939k0085
$$ plain form
3170 17509979 16600284 15723837 14945541 14230165 13585172 12965097 12382602 11762094 11108295
3161 11108295 10458748 9823021 9167318 8559198 8037781 7551619 7085996 6687167 6326006
3152 6326006 5974615 5641793 5326009 5024319 4725327 4452042 4207826 3969748 3776459 3583589
3142 3583589 3420386 3266294 3116606 2963747 2815396 2661915 2539916 2402856 2290141 2190277
3132 2190277 2088426 2000430 1907548 1846387 1760173 1683970 1614606 1550744 1482332 1438972 1373027
3121 1373027 1342057 1287670 1253229 1212189 1152315 1102474 1092696 1073269 1028391 998955 982056 954813
3109 954813 917060 903368 889769 874126 849211 831648 822397 815402 813093 794682 799228 779873
3097 779873 779334 754584 725185 717089 715232 693914 704365 699482 700434 697361 705157 687218 667133
3084F67133J0856k0991N590K073o986J685R96N738j0767n037P568N367J1327p58
3070F73794j994N537K8992j4841J5939K3778J2807j523K5366k62Q323J1453k1295
3057G66074J3074M797n459m505N154q91k1114K3228k4233n478l473j8376m719
3044G24079l483j6644j2212J530j1447k8375R815q729k0138n498k321J281R722
3031F37580j4091j2543J5203R80r523O605l1009K2289J6060k8851J6239J5346
3019F34285j090R878p249r941N775R166P213O324p5O814j676j3182P440J1939
3005F65621K805j810J9592K5538N378K72L0152n528m154j5405K2080J6171o84
2992G60028J6037O0J4549K0246L862J1068p822K4632o65K3630J8046N986K7084
$$ plain form
3084 667133 677989 656998 662588 664661 657675 659360 660356 666094 655327 650290 657858 663225 674552 673794
3070 673794 671800 677337 706329 691488 707427 731205 744012 742489 767855 767593 775916 787369 766074
3057 766074 779148 783945 778486 773981 779135 778244 757130 780358 756125 750647 747174 728798 724079
3044 724079 720596 703952 691740 693270 681823 653448 663263 654534 634396 628898 626577 627858 637580
3031 637580 623489 610946 626149 627129 617606 624211 593202 615491 631551 602700 618939 634285
3019 634285 633195 643073 635824 625883 631658 640824 648037 654361 654286 661100 659424 646242 653682 665621
3005 665621 668426 666616 686208 711746 717124 717396 747548 742020 737866 722461 744541 760712 760028
2992 760028 776065 776125 790674 810920 814782 825850 818028 842660 841995 865625 883671 889657 916741
2979I16741Q462J5662J4407J2710J1870J6691K7712K0367J3544L0291J0053K2814
2967A121324K4425J6286K2681j263K8336L9582J3596J6422R945L1566J7666K3693
2955A364259j293l826K2864K7778O202k725K2914J3542Q480J0404R794N450K3583
2942A507426J9622k096K1085J6433P78L6591L2333J3922J1718K1499L2227M4449
2930A755987J2369L2286L7074M4205L7118K2478L8517N4453L3801M6702L0510
2919B145500K0721O6236K3196L4182L5133N2440O2802L9610N7122K9470O2265
2908B628677P4286M3158N6776N4425N6843N4310N8727M5891N9501Q4458O2011
2897C279063P0791O3876Q9615P8657J09612J14329J04362J24918J44857J54629
$$ plain form
2979 916741 925203 940865 955272 967982 979852 996543 1024255 1044622 1058166 1088457 1098510 1121324
2967 1121324 1145749 1162035 1184716 1183453 1211789 1251371 1264967 1281389 1291334 1322900 1340566 1364259
2955 1364259 1362966 1359140 1382004 1409782 1415984 1413259 1436173 1449715 1458195 1468599 1478393 1483843 1507426
2942 1507426 1527048 1524952 1546037 1562470 1563248 1599839 1632172 1646094 1657812 1679311 1711538 1755987
2930 1755987 1768356 1800642 1837716 1881921 1919039 1941517 1980034 2034487 2068288 2114990 2145500
2919 2145500 2166221 2232457 2255653 2289835 2324968 2377408 2440210 2479820 2536942 2566412 2628677
2908 2628677 2702963 2746121 2802897 2857322 2914165 2968475 3027202 3073093 3132594 3217052 3279063
2897 3279063 3349854 3413730 3503345 3582002 3691614 3805943 3910305 4035223 4180080 4334709
2887D334709J49137J88144K01993K25267K33217K67511K68549L06515L25479L47684
2877F848205L75122M04125M06874M20292M64598M55690M90128M98902N23128N77208
2867A1464272O11450O37830O84528P58312P88722Q37736R21704R72773J091182
2858A8768509J183605J301261J432857J588516J790963J993370K231526K486281
2850C2776888K761177L026616L195676L291457L255314K989853K533357J954651
2842E5784989J305187P19805K30500j12931k98118l81400m15168m94640o90548
2833E5647676j009796j453491j965636k456817k919407l205901l331966l299549
2825C6005113l149135k903757k616933k358645k078055j815207j581313j390927
$$ plain form
2887 4334709 4483846 4671990 4873983 5099250 5332467 5599978 5868527 6175042 6500521 6848205
2877 6848205 7223327 7627452 8034326 8454618 8919216 9374906 9865034 10363936 10887064 11464272
2867 11464272 12075722 12713552 13398080 14156392 14945114 15782850 16704554 17677327 18768509
2858 18768509 19952114 21253375 22686232 24274748 26065711 28059081 30290607 32776888
2850 32776888 35538065 38564681 41760357 45051814 48307128 51296981 53830338 55784989
2842 55784989 57090176 57809981 58040481 57927550 57629432 57248032 56832864 56338224 55647676
2833 55647676 54637880 53184389 51218753 48761936 45842529 42636628 39304662 36005113
2825 36005113 32855978 29952221 27335288 24976643 22898588 21083381 19502068 18111141
2817A8111141j228475j070752r60195q47317p44896o63633o32605n32446m86005
2808A0944817m55615l82312l79677l26982k77711k90492k53599k61776k32075
2799H084578k12223k17786j72170j35552j47638j48940j05861q6595r1020j00234
2789F666559j01637p9615n9881p5888m9687m2991k4984r921M37J1178J1583L9342
2777F284495N2437O8589O3369O3241Q1590Q9284P7294J17454R5949J17628J42321
2766G253651J50983J68157J94482J92316K30135K42869K74566L19229L40027L82529
2756I748944M42868M68637N30538O21223O77658P63472Q45619R43348J029796
2747A6072103J096415J119648J065571R50637P43184M69041J78636n3666k32925
$$ plain form
2817 18111141 16882666 15811914 14851719 14004402 13259506 12595873 11963268 11430822 10944817
2808 10944817 10489202 10106890 9727213 9400231 9122520 8832028 8578429 8316653 8084578
2799 8084578 7872355 7654569 7482399 7346847 7199209 7050269 6944408 6857813 6766793 6666559
2789 6666559 6564922 6485307 6425426 6349538 6299851 6256860 6231876 6221955 6222392 6233570 6245153 6284495
2777 6284495 6336932 6405521 6468890 6532131 6613721 6703005 6780299 6897753 6993702 7111330 7253651
2766 7253651 7404634 7572791 7767273 7959589 8189724 8432593 8707159 9026388 9366415 9748944
2756 9748944 10191812 10660449 11190987 11812210 12489868 13253340 14098959 15042307 16072103
2747 16072103 17168518 18288166 19353737 20304374 21047558 21516599 21695235 21641569 21408644
2738B1408644l13638k69618k13075j04044O866J09564K19279L48276M15176N31945
2728B2139375N90449O83552P85843Q59947R36532J046226J173900J314157J464358
2719C0994339J615243J794122K004408K216226K454463K756835L058526L449463
2711E0343625L873661M321621M732936N060155N213180N080057M624919L865557
2703H7115711K780170J660601O66938k34259q17786j109930j189505j110745q38122
2694H6923073o04078l82147k39744k69483m59193p90057j280181j850966k445850
2685G8601374l057774l531696l906880m141508m239538m190822m051257l769822
2677D7712077l435346l111812k732470k376185k048435j741268j445185j208024
$$ plain form
2738 21408644 21095006 20825388 20612313 20508269 20515135 20624699 20843978 21192254 21607430 22139375
2728 22139375 22729824 23413376 24199219 25059166 25995698 27041924 28215824 29529981 30994339
2719 30994339 32609582 34403704 36408112 38624338 41078801 43835636 46894162 50343625
2711 50343625 54217286 58538907 63271843 68331998 73545178 78625235 83250154 87115711
2703 87115711 89895881 91556482 92223420 91989161 91171375 90061445 88871940 87761195 86923073
2694 86923073 86318995 85936848 85697104 85427621 84968428 84178371 82898190 81047224 78601374
2685 78601374 75543600 72011904 68105024 63963516 59723978 55533156 51481899 47712077
2677 47712077 44276731 41164919 38432449 36056264 34007829 32266561 30821376 29613352
2669B9613352r62073p69325n48635l68717j99890l0568J05331J93494K33835K79462
2659B7546266K66315K48172K62141L10512L87039M94418O30734O76775P09655
2650C1532027O49546N22246L54643J54498k8906k23094l54706m50226m72437m36758
2640C1246833l63938k29694p6955L4012J85873L62834N47852P14755Q71245J104053
2630C4396870J285765J487183J738028K031555K282985K603545K945043L234982
2622E2005956L549089L724049L799199L704784L466518L065121K649879K280339
2614G8244934K015691J889085J876619K000270K053138K013514J826253J465877
2606I3385381R16139K09342m73381j090277j597886j939002k119494k207613k184164
$$ plain form
2669 29613352 28651279 27881954 27333319 26964602 26764712 26734144 26839475 27032969 27266804 27546266
2659 27546266 27812581 28060753 28322894 28633406 29020445 29514863 30145597 30822372 31532027
2650 31532027 32181573 32703819 33058462 33212960 33184054 32960960 32606254 32156028 31683591 31246833
2640 31246833 30882895 30653201 30576246 30610258 30796131 31158965 31706817 32421572 33292817 34396870
2630 34396870 35682635 37169818 38907846 40939401 43222386 45825931 48770974 52005956
2622 52005956 55555045 59279094 63078293 66783077 70249595 73314716 75964595 78244934
2614 78244934 80260625 82149710 84026329 86026599 88079737 90093251 91919504 93385381
2606 93385381 94301520 94510862 94037481 92947204 91349318 89410316 87290822 85083209 82899045
2597H2899045k144442k131033k157758k259865k435507k666161k893146l083159
2589F3127974l183234l221998l193876l084821k920074k760392k550643k355254
2581C9857682k202483k014546j830626j627544j468844j250728j093434r75963
2573B7393514q71389p80210p09682o29499n55535m74451l27783k00883j24666
2564B2719416k8383L1496R4838J01701J52324K00049K67080J10658j54193l81700
2554B3113286m84990m64486m59329m57669m75343m81065n14280n33278n50569
2545A8692277n13155n17072m64247m55744l98882l16834k59341j62843m5181R3277
2535A5652255L26315N25983L55186K6852k49150k05248J16964J19867j59161m86952
$$ plain form
2597 82899045 80754603 78623570 76465812 74205947 71770440 69104279 66211133 63127974
2589 63127974 59944740 56722742 53528866 50444045 47523971 44763579 42212936 39857682
2581 39857682 37655199 35640653 33810027 32182483 30713639 29462911 28369477 27393514
2573 27393514 26522125 25741915 25032233 24402734 23847199 23372748 23044965 22844082 22719416
2564 22719416 22691033 22722529 22817367 22919068 23071392 23271441 23538521 23649179 23494986 23113286
2554 23113286 22628296 22163810 21704481 21246812 20771469 20290404 19776124 19242846 18692277
2545 18692277 18179122 17662050 17197803 16742059 16343177 16026343 15767002 15604159 15558978 15652255
2535 15652255 15978570 16504553 16859739 16886591 16637441 16432193 16549157 16669024 16509863 16022911
2525A6022911n31722l82405j85734j9345J20490K29233L39286M30162M73509N38140
2515A7034525O10002P02092P79242R08884J084832J264258J323681J300659R55911
2506B5964086N08412K42835K69910N32390Q01905J061077J357818J648971J920199
2497C4307603K246025K604636L005189L429274L851666M248821M553404M668267
2489F2914885M515738M072193L247356K072276O08092r37733k345536l621947
2481G0525324m535380n050661n189179n069924m749500m307486l828760l339503
2473C4454931k905911k526861k183243j872917j644399j417890j225001j098921
2465A9579788r90698q97359p85879p32356o80522o35237n89743n36143n20306
$$ plain form
2525 16022911 15491189 15108784 14923050 14903705 15024195 15253428 15592714 16022876 16496385 17034525
2515 17034525 17644527 18346619 19125861 20034745 21119577 22383835 23707516 25008175 25964086
2506 25964086 26472498 26715333 26985243 27517633 28319538 29380615 30738433 32387404 34307603
2497 34307603 36553628 39158264 42163453 45592727 49444393 53693214 58246618 62914885
2489 62914885 67430623 71502816 74750172 76822448 77430540 76492807 74147271 70525324
2481 70525324 65989944 60939283 55750104 50680180 45930680 41623194 37794434 34454931
2473 34454931 31549020 29022159 26838916 24965999 23321600 21903710 20678709 19579788
2465 19579788 18589090 17691731 16905852 16173496 15492974 14857737 14267994 13731851 13211545
2456A3211545m98929m79110m51631m05135l96868l77551l68045l58022l51540
2447I524714l27643l47775l43452l28891l12038k99735k78915k55608k26753k01088
2437F602816j97613j75199j42743j21199j37508j07600j00888j12763q9667o5976
2427E351660q4538o8877o0721p0119p9457o3067n5266p7313o3758p2408l0198
2416D625938l0288l6754j3675j7631k838l261j1050J0078Q379J1707J6405L949
2404D560959j229o614N432K138n508j0100j7606j3541l7301p988K5978K57q478
2391D486399J3464K3879L13J1242J6062k2500k671J7189J58K1293o544R410M9194
2378D616888L4202L9628L2738N1416N4786L4378L5743O8920N9741L7615N4630
$$ plain form
2456 13211545 12712616 12233506 11781875 11376740 10979872 10602321 10234276 9876254 9524714
2447 9524714 9197071 8849296 8505844 8176953 7864915 7565180 7286265 7030657 6803904 6602816
2437 6602816 6405203 6230004 6087261 5966062 5828554 5720954 5620066 5507303 5417636 5351660
2427 5351660 5267122 5198245 5137524 5067405 4987948 4924881 4869615 4792302 4728544 4656136 4625938
2416 4625938 4595650 4558896 4545221 4527590 4524752 4521491 4510441 4520519 4528898 4540605 4557010 4560959
2404 4560959 4559730 4553116 4558548 4560686 4555178 4545078 4527472 4513931 4476630 4468642 4494620 4494877 4486399
2391 4486399 4499863 4523742 4524055 4535297 4551359 4528859 4526188 4543377 4543535 4564828 4558284 4567694 4616888
2378 4616888 4651090 4690718 4723456 4774872 4829658 4864036 4899779 4968699 5028440 5066055 5120685
2367E120685P1070R3127R6078J06066J01388J24729J29590J37021J60712J59437
2357F299903J85066J80967K08351K21504K36022K60860K60648K77296L10022L53980
2347H794619L64402M20757M25624M55159N24572N67183O01782O67224P16335Q01940
2337A4339597Q77367R87992J111973J253091J393633J531909J676119J831319
2329B5003000J958954K019711J975034J738040J479774J381963J486397J647443
2321C8690316J842671K028457K241479K451196K684429K958217L268094L690685
2313E9855544M101603M595940N200759N820962O513926P309979Q221488R385978
2305A11006179J0743300J2480835J4656268J7326683K0408696K3484838K5281670
$$ plain form
2367 5120685 5191755 5284882 5380960 5487026 5588414 5713143 5842733 5979754 6140466 6299903
2357 6299903 6484969 6665936 6874287 7095791 7331813 7592673 7853321 8130617 8440639 8794619
2347 8794619 9159021 9579778 10005402 10460561 10985133 11552316 12154098 12821322 13537657 14339597
2337 14339597 15216964 16204956 17316929 18570020 19963653 21495562 23171681 25003000
2329 25003000 26961954 28981665 30956699 32694739 34174513 35556476 37042873 38690316
2321 38690316 40532987 42561444 44802923 47254119 49938548 52896765 56164859 59855544
2313 59855544 63957147 68553087 73753846 79574808 86088734 93398713 101620201 111006179
2305 111006179 121749479 134230314 148886582 166213265 186621961 210106799 235388469
2298B35388469K3247008J4966346J393145j2498801k1903472k5532339k5124822
2291A89935534k2627700j9463541j6525647j3922410j1664802r716341q006616
2284H8008477o607933n595796m965436m514922m059852l532097k890542k294740
2276E3547159k016373k209210k683364l083917l183975k988238k685211k417480
2268C2279391k170282j929605j742201j555106j430596j306603j211255j081124
2260A9852619r98652r24625q55963p85070p44748p00823o25802o12946n51626
2251A3052364n32788n11250m49778m39469m17375l96076l51512l67808l34460
2242I251848l14871l04994k80253k60827k45293k42090k28705j97297j93942j82736
$$ plain form
2298 235388469 258635477 273601823 274994968 262496167 240592695 215060356 189935534
2291 189935534 167307834 147844293 131318646 117396236 105731434 96015093 88008477
2284 88008477 81400544 75804748 70839312 66324390 62264538 58732441 55841899 53547159
2276 53547159 51530786 49321576 46638212 43554295 40370320 37382082 34696871 32279391
2268 32279391 30109109 28179504 26437303 24882197 23451601 22144998 20933743 19852619
2260 19852619 18853967 17929342 17073379 16288309 15543561 14842738 14216936 13603990 13052364
2251 13052364 12519576 12008326 11558548 11119079 10701704 10305628 9954116 9586308 9251848
2242 9251848 8936977 8631983 8351730 8090903 7845610 7603520 7374815 7177518 6983576 6800840
2232F800840j48328j68518j41504j49809j70553j60468j77906j85677j61522j52944
2222E183611j73262j45648j33273j44300j23485r6737j10369r7381j03263j03460
2212C952433p7871r1257q0966q5981q9240q1266p5945p5767q2647r5100o4626
2201C051767o7151o9209p6192p6946o1876p8428p7860o9041p3822n4859n9994
2190B286389m7495l5273l2001l3347l6243l5103l0094l9212k3545m7095l9444
2179A887537l443k4573j6230n3819m9129j8691n9058l4088l9737m5724j2508j2865
2167A517672l6029j389O104j1925o876j0381N026k1398j5243j0564j243L752J2433
2154A429939j9611k5529r130k7576k1338j9248j7963j2785l5621l5202O099P397
$$ plain form
2232 6800840 6652512 6483994 6342490 6192681 6022128 5861660 5683754 5498077 5336555 5183611
2222 5183611 5010349 4864701 4731428 4587128 4463643 4366906 4256537 4159156 4055893 3952433
2212 3952433 3874562 3783305 3702339 3616358 3527118 3445852 3369907 3294140 3211493 3116393 3051767
2201 3051767 2984616 2915407 2839215 2762269 2700393 2621965 2544105 2475064 2401242 2346383 2286389
2190 2286389 2238894 2203621 2171620 2138273 2102030 2066927 2036833 1997621 1974076 1926981 1887537
2179 1887537 1884094 1859521 1843291 1789472 1740343 1721652 1662594 1628506 1588769 1543045 1530537 1517672
2167 1517672 1481643 1480254 1486358 1474433 1467557 1457176 1462202 1440804 1425561 1414997 1413754 1417506 1429939
2154 1429939 1410328 1384799 1375669 1348093 1326755 1307507 1289544 1276759 1241138 1205936 1212035 1219432
2142A219432k7769k1991o404p320k2682k3861l388k4276j4399J000k4922j2197
2130A031223j1541j0236j0876m896p553n255N313m137k4520R786K6191j3120j2326
2117I68053l385n352j3289J0753K828k0678j5112R750m482J7736k020k2888J5781
2104I37695L6871R422K0367J2925K5131K8981K4814J8439M6616K2105K7624M6874
2092A257864L9390O3460N7194R2002Q3535R5189R7753R2936N3272n055p1059r2656
2080A763825j27765j11326j15651j03811q2947q9970o6518k6894m2199o3917l0069
2069I02758m9075k7134n500l3152l1380k7187j6358k6014k3718k4723j9903j2957
2057F05657j3679k6676k7550k547N160k7282m727j7961J917l720k7302r452n892
$$ plain form
2142 1219432 1191663 1169672 1163268 1155948 1133266 1109405 1106017 1081741 1067342 1068342 1043420 1031223
2130 1031223 1019682 1009446 998570 993674 986121 980866 986179 982042 957522 967308 993499 980379 968053
2117 968053 964668 959316 946027 956780 959608 938930 923818 933568 929086 946822 944802 921914 937695
2104 937695 974566 983988 1004355 1017280 1042411 1071392 1096206 1114645 1161261 1183366 1210990 1257864
2092 1257864 1297254 1360714 1417908 1509910 1593445 1688634 1786387 1879323 1932595 1927540 1856481 1763825
2080 1763825 1636060 1524734 1409083 1305272 1222325 1132355 1065837 1038943 996744 932827 902758
2069 902758 853683 826549 821049 787897 756517 729330 712972 686958 663240 638517 618614 605657
2057 605657 591978 565302 537752 535205 540365 513083 508356 490395 492312 488592 461290 451838 445946
2044D45946o460o426J151j3394o78j8175j3489j0713l544P383j363k4960L625
2031C58903j7999L673j2181K938O2j0731N377K758j2894o854J1013k4087J8765
2018C18743j6182O592l75M298j3296k7228J2780L51k3601M771M308l371P287P209
2004B82286J5280j3670j8835J6567J5769j3288j2740j4939J182j0678l483J2922
1992B56373R400k35J3951n970k3116q50n900q779K675M035k725q677j2565K84
1978B17901J153p470k2548K6267L158j5444K084j4514J3380l544j3155n892R887
1965A91263j2684L15L249l899j4973L117n245o260Q759J4724q391n751m532n584
1951A54108k084J4181l533O67j772J2539K841J621q500k29n603J564k6942P018
$$ plain form
2044 445946 439486 433060 434211 420817 420139 401964 388475 377762 374218 381601 380238 355278 358903
2031 358903 340904 344577 332396 335334 335396 324665 330042 332800 319906 313052 324065 299978 318743
2018 318743 302561 309153 308778 313076 299780 272552 285332 285683 262082 266853 271161 267790 275077 282286
2004 282286 297566 283896 265061 281628 297397 284109 271369 256430 257612 246934 243451 256373
1992 256373 265773 265538 279489 273519 250403 249553 243653 234874 237549 241584 238859 230182 217617 217901
1978 217901 219054 211584 189036 215303 218461 203017 205101 190587 203967 200423 187268 181376 191263
1965 191263 178579 178894 182143 178244 163271 166388 161143 154883 163642 178366 169975 164224 159692 154108
1951 154108 152024 166205 162672 163339 161567 174106 176947 178568 170068 169839 164236 165800 138858 145876
1937A45876K2744j3945q039j8202O720K256k706O739r601q845n467j58j313n144
1923A10915K5501O557l77j0573m844m638P115j3973R917J3464o677p025l257p412
1909A14693n871L693J1784L871P684p428N410J0436K3345k1692l937P90O53k451
1895A40980j2894k7402K152J721l167k3733O741N620k5005k368J7562r641J1367
1882H1933J9816j862j329K546n749j2899j929j6018M335O78K86L799k2659n119
1868D5829O387j1833m958j2544J4632J4021P111J5925J2836K072k2432o369J3093
1855G3770o791p647p028J120r249O579j6035J0537j308J3236k3874O218J9208
1842E8736k481O860r535O337q346j0573M130J2030j163O013j899j5131p027n383
$$ plain form
1937 145876 168620 154675 146636 128434 135154 137410 134704 141443 131842 122997 117530 117372 116059 110915
1923 110915 136416 142973 142596 132023 127179 122541 129656 115683 125600 139064 132387 125362 122105 114693
1909 114693 108822 112515 124299 128170 135854 128426 133836 144272 167617 145925 141988 142778 143431 140980
1895 140980 128086 100684 102836 104557 101390 77657 84398 90018 65013 62645 80207 70566 81933
1882 81933 101749 99887 98558 101104 95355 82456 80527 64509 68844 69522 69808 73607 50948 45829
1868 45829 52216 40383 35425 22881 37513 51534 58645 74570 87406 89478 67046 60677 73770
1855 73770 66979 59332 52304 53424 44175 50754 34719 45256 43948 57184 33310 39528 58736
1842 58736 56255 63115 53580 59917 51571 40998 45128 57158 55995 62008 60109 44978 37951 32568
1828C2568J7382m321J1801j0500j3309L140o215P796o965m53Q080L184n678L161
1814C9671R043N837m540P080k1211j3475J0931J0867q602N658J432l232q759j506
1800B9194J570Q59n92j1865j0099J3899k016J4711k1579p906J0190j173N216l476
1786A6933J8439k1563J4687r023k3878K7507J2787M366n89j1130M142j052J082
1773C2708K1820j614o843J2231j3990j5848J6051j5614Q859K6100r756k537J8812
1760G0379o310p430O009P24r860K696P931R310J0822r573j2474O316l604j0504
1746E4432K6980O230J4976n048m146K2443J5822J2931k1230j2086J5013P634O414
1733A40365j7377J1843O818j4404J398L1198N855J3747N245O207K0222L6725K0227
$$ plain form
1828 32568 49950 45629 57430 46930 33621 36761 30546 38342 31377 30924 39004 42188 36510 39671
1814 39671 48714 54551 50011 57091 35880 22405 33336 44203 35601 41259 42691 39459 30700 29194
1800 29194 30764 31623 31031 19166 9067 22966 20950 35661 14082 6176 16366 15193 20409 16933
1786 16933 35372 13809 28496 19473 -4405 23102 35889 40255 39666 28536 32678 31626 32708
1773 32708 54528 52914 46071 58302 44312 28464 44515 28901 37760 63860 54104 51567 70379
1760 70379 64069 56639 62648 63372 53512 56208 64139 73449 84271 74698 62224 68540 64936 54432
1746 54432 81412 87642 102618 97570 93424 115867 131689 144620 123390 111304 126317 133951 140365
1733 140365 122988 134831 141649 127245 128643 159841 165696 179443 184688 190895 211117 247842 268069
1720B68069L668R894L1395K7561L4445N8616O7486J09821J61888K09527K10137
1709A192507l934j66472j99997j68594j19232j05113o9046n5428k3079k0932l7544
1698B23136j5497k8356k3403j3023k0621m293j0554n166K603k9094q185J1055
1686G8602p966r287L368r220J3621J2982j9798m339j5180o879O0L170j8850K1916
1672D2200j122j8218M951k057m159J171j1960q482M097N310o212j2380l430Q526
1658a765M064r558M655M204j1050J5233k945l099L886J2360p69r162j695j3354
1644h995P91L1881j060p247J942j1000J199O294j0728J4810j416m995j9259M934
1630b849n393o750J3841j471l029J0950o089j4458R665j7178o136J3737J2306
$$ plain form
1720 268069 271737 281631 313026 340587 375032 433648 501134 610955 772843 982370 1192507
1709 1192507 1188573 1022101 822104 653510 534278 429165 360119 304691 281612 260680 223136
1698 223136 207639 179283 155880 142857 122236 117943 107389 102223 104826 75732 67547 78602
1686 78602 70636 61349 64717 55497 69118 82100 62302 57963 42783 35904 35964 39134 20284 42200
1672 42200 41078 22860 27811 25754 21595 22766 10806 2324 6421 11731 5519 -6861 -10291 -1765
1658 -1765 2299 -7259 -2604 1600 -9450 5783 2838 -261 3625 15985 15216 6054 4359 -8995
1644 -8995 -8204 23677 22617 15370 17312 6312 7511 13805 3077 17887 16471 11476 -7783 -2849
1630 -2849 -8242 -14992 -1151 -2622 -5651 5299 -790 -15248 -5583 -22761 -28897 -15160 -2854
1617b854o987k1866J0097K254J62K0210j9557L636m487N538J968l07O149j883
1603g927J9370k0639J3594r92N652j1367J5391r072K649q076j1924k956k30J0867
1589e660j0395N904p059L817o112M975r812P036l589P991J380o810q290J1343
1575a5281p709j1079J9349M731r279m265J9223J5345j1115o887j7481R820O258
1562h370j8907n854J7000Q491j2131n991J5446M340L098j1281n338j5235J1493
1549b3239J057J9985k0922p303N442j0882R392J0647j129o996J3625J019j4345
1536b3649k00n110K2787m268r552r503J0865p846J3157J4302q733N847j1517K0886
1522G466l0899j1937L7014R763m539Q28l953M900j8223J9995j0146l553j0514
$$ plain form
1617 -2854 -9841 -31707 -21610 -19356 -19194 1016 -18541 -14905 -19392 -13854 -11886 -12193 -6044 -7927
1603 -7927 11443 -9196 4398 3406 9058 -2309 13082 4010 6659 -1417 -13341 -16297 -16527 -5660
1589 -5660 -16055 -10151 -17210 -13393 -19505 -14530 -24342 -17306 -20895 -12904 -11524 -18334 -26624 -15281
1575 -15281 -22990 -34069 -14720 -9989 -19268 -23533 -4310 11035 -80 -6967 -24448 -14628 -8370
1562 -8370 -27277 -33131 -16131 -7640 -19771 -25762 -10316 -5976 -2878 -14159 -19497 -34732 -23239
1549 -23239 -22182 -2197 -23119 -30422 -24980 -35862 -26470 -15823 -16952 -23948 -10323 -9304 -23649
1536 -23649 -23849 -28959 -6172 -10440 -19992 -29495 -18630 -26476 -13319 983 -7750 -1903 -13420 7466
1522 7466 -23433 -35370 1644 11407 6868 7696 3743 8643 -9580 10415 269 -3284 -13798
1509a3798L02j797J4617M115n759J697j1660k637J1894j2022P072L843k3093q428
1495c5654Q262J2530M123K409q034j406J940P752N154j9596r063J9016L232j0902
1481b0237q658M169K490P582Q166q090O231k377O244m207q752J6189o135j7792
1467b5177R74J4153j0637m216K493O219m934n811l010L171J2776k319r24m917
1453b2159K2458K745j1269j70o829M273R194r309p262O410k521M522j4388J117
1439b3188j3953o57J7272P533O345o482k781J9789N173p560k1225O457j1177J4292
1425a0162P381j6272R272r555M608J2082j4359J9190N368K693O66J433j4521j34
1411b310K379q961k162j6305P946k580N688m912K1088q190j5721Q681K3639n668
$$ plain form
1509 -13798 -13496 -15293 -676 3439 -2320 -623 -12283 -14920 -3026 -15048 -7976 -4133 -27226 -35654
1495 -35654 -27392 -14862 -10739 -8330 -16364 -17770 -15830 -8078 -2924 -22520 -31583 -12567 -9335 -20237
1481 -20237 -28895 -24726 -22236 -14654 -6488 -14578 -8347 -10724 -4480 -8687 -17439 -1250 -7385 -25177
1467 -25177 -24203 -10050 -20687 -24903 -22410 -16191 -21125 -26936 -29946 -26775 -13999 -16318 -17242 -22159
1453 -22159 299 3044 -8225 -8395 -15224 -10951 -1757 -11066 -18328 -11918 -14439 -9917 -24305 -23188
1439 -23188 -37141 -37798 -20526 -12993 -6648 -13130 -15911 3878 9051 1491 -19734 -13277 -24454 -10162
1425 -10162 -2781 -19053 -9781 -19336 -14728 -2646 -17005 2185 7553 10246 10912 12345 -2176 -2310
1411 -2310 69 -8892 -11054 -27359 -19413 -21993 -16305 -21217 -129 -8319 -24040 -15359 8280 2612
1397B612j7064q67J2963J6444n397k2681J9998J24j8208J2217L430j7981o265
1384b0675Q837o677O181Q340J3286N767j1000J5743J246k1627O101J0218K219
1371A7959j4220L014k804L084k0187j9212J5076l67o333M471N329j5751N99R198
1357b0144J3600q668J338J3931k1266p691J3838j1554M183j5048J5481P222l212
1344a7990j1992r875j0157l857R873p045J2037j67J2830n797n022J0933n908L819
1330b8318J1413J8059j3879K392p381o983P75J0934j2844k559J169J1095L678
1317a2449K232q662j2721N801l690L088L841j3855M296K514L276j099J9967q515
1303a5976O069M519j8655Q799P208n771j6729R69J683J3377R478j483J1756J2954
$$ plain form
1397 2612 -14452 -15319 -2356 14088 8691 -13990 6008 6132 -12076 141 3571 -14410 -20675
1384 -20675 -11838 -18515 -12334 -3994 9292 15059 4059 19802 21048 -579 5522 15740 17959
1371 17959 3739 6753 3949 7033 -13154 -32366 -17290 -17657 -23990 -19519 -14190 -29941 -29342 -20144
1357 -20144 -6544 -15212 -13874 57 -21209 -28900 -15062 -26616 -22433 -37481 -22000 -14778 -17990
1344 -17990 -29982 -39857 -50014 -53871 -43998 -51043 -39006 -39173 -26343 -32140 -37162 -26229 -32137 -28318
1330 -28318 -16905 1154 -12725 -10333 -17714 -24697 -23922 -12988 -25832 -28391 -27222 -16127 -12449
1317 -12449 -10217 -18879 -31600 -25799 -29489 -26401 -22560 -36415 -32119 -29605 -26329 -27428 -7461 -15976
1303 -15976 -9907 -5388 -24043 -15244 -8036 -13807 -30536 -29567 -27884 -14507 -5029 -6512 5244 18198
1289A8198q366O674p950L399j3484R671k4052M664l817K0076o045j75M840J3903
1275A7536j4338O921o765j5443n337L466O145j0058Q097J9594k1004O767r985
1262a4404j4339J5889m301j0977p580J419Q542p267m22M098q358K0289J6680o746
1248g477j3846k930k30j850J888R726L715l62m100P016j2229n823Q261K0194j3051
1233a1098n194M345j887p004j8947J436K2429o750J1383P576j5355O479P312o529
1219a1804j830J7029M47j5260j680j262j6813p023M79J285k0901m611R527J5744
1205c6673J2173l55L438q417N290L041l286k79K828J225J0185j0426o476J362
1191b6370j1754k632k766R374o787j5624p119K8453R808k214N076r194K3901K51
$$ plain form
1289 18198 9832 16506 8556 11955 -1529 8142 -15910 -11246 -15063 5013 -1032 -1207 3633 17536
1275 17536 3198 10119 3354 -12089 -17426 -13960 -7815 -17873 -9776 9818 -11186 -4419 -14404
1262 -14404 -28743 -12854 -17155 -28132 -35712 -34293 -25751 -33018 -33440 -29342 -37700 -17411 -731 -7477
1248 -7477 -21323 -24253 -24483 -26333 -24445 -14719 -11004 -11366 -15466 -8450 -20679 -26502 -18241 1953 -11098
1233 -11098 -16292 -11947 -13834 -20838 -39785 -38349 -15920 -22670 -11287 -3711 -19066 -12587 -5275 -11804
1219 -11804 -13634 3395 3842 -11418 -13098 -14360 -31173 -38196 -37717 -36432 -57333 -61944 -52417 -36673
1205 -36673 -24500 -24855 -21417 -29834 -24544 -21503 -24789 -25068 -22240 -21015 -10830 -21256 -27732 -26370
1191 -26370 -38124 -40756 -43522 -34148 -40935 -56559 -63678 -35225 -25417 -27631 -22555 -31749 -7848 -7597
1177g597n74O093O708j0184J4140L108j6547N894J0118j5488j0389Q747J574k1589
1163b5986J7330j2733Q077P909M954L48J0330J697l812K079m401k340r971j12
1149f631m787K635r382k067Q944k2144j3116J3249J4549k3112J1063O681N424
1136a8694j694q234J7437J1403J0175j6427o413L364j9906J6464J6546k9129J046
1123b4062j1839k467L982j5029J7667O520n056j7768J7298J3127M890J870l052
1110a3919O371k7075Q645n105r020J206O908J782Q890q242J2163j4780L144r678
1096c8710K1296j3375j48O746j5749r342J1289J4876k061q32m51j591O045l217
1082b5224P759L598j5714n040j21Q336p656j106J765k526P5R154J6349j8484j0625
$$ plain form
1177 -7597 -8171 -2078 4630 -5554 8586 11694 -4853 1041 11159 -4329 -14718 -5971 -4397 -25986
1163 -25986 -8656 -21389 -13312 -5403 -449 -101 10229 11926 8114 10193 5792 3452 -6519 -6631
1149 -6631 -11418 -8783 -18165 -20232 -11288 -33432 -46548 -33299 -18750 -41862 -30799 -24118 -18694
1136 -18694 -20388 -28622 -11185 218 10393 -6034 -12447 -9083 -28989 -12525 4021 -25108 -24062
1123 -24062 -35901 -38368 -34386 -49415 -31748 -25228 -30284 -48052 -30754 -17627 -12737 -10867 -13919
1110 -13919 -7548 -34623 -25978 -31083 -40103 -38897 -31989 -30207 -21317 -29559 -17396 -32176 -29032 -38710
1096 -38710 -17414 -30789 -30937 -24191 -39940 -49282 -37993 -23117 -25178 -26010 -26461 -28052 -22007 -25224
1082 -25224 -17465 -13867 -29581 -34621 -34742 -26406 -34062 -35168 -33403 -35929 -35854 -26700 -10351 -28835 -39460
1067c9460j486j3205M570J6441K6872j2875k3759K775P909q70p212J403N880J9871
1053a3146O410p400j9797p63K8342r001J3132p187j810j7304j447J8685j8860
1040c0146J5861m83k0664n208K1301o943J4329O803j1395O270p698r718j057M457
1026b4291m3J1595o12l128m112q808K332m265J8532j0724j6329K4069K5929K381
1012A2526j1730N073p084J536k1517j8886O339J4423k6265q240l663J2468r47
999d5967J2282N605j4357l370J6642K2087J521J7767J3082Q743k570j2671K0713
986C9507J2398J8504k262l254j6420l6830j7852k5014l1403j3423L866J505o473
973g7151k492J8643L5544K8699K1720J9237J3601L383j791J0139n878p121r879
$$ plain form
1067 -39460 -40946 -54151 -49581 -33140 -6268 -19143 -42902 -40127 -32218 -33088 -40300 -38897 -33017 -13146
1053 -13146 -6736 -14136 -33933 -34696 -6354 -15355 -2223 -9410 -11220 -28524 -29971 -11286 -30146
1040 -30146 -14285 -14768 -35432 -40640 -19339 -26282 -11953 -5150 -16545 -10275 -17973 -27691 -28748 -24291
1026 -24291 -24334 -12739 -13351 -16479 -20591 -29399 -27067 -31332 -12800 -23524 -39853 -15784 10145 12526
1012 12526 796 5869 -1215 321 -21196 -40082 -33743 -19320 -45585 -53825 -57488 -45020 -45967
999 -45967 -33685 -28080 -42437 -45807 -29165 -7078 -5557 12210 25292 34035 31465 18794 39507
986 39507 51905 70409 68147 64893 48473 11643 -6209 -31223 -62626 -76049 -72183 -70678 -77151
973 -77151 -79643 -61000 -25456 3243 24963 44200 57801 61184 59393 69532 63654 56533 46654
960D6654l502q346j5229r646k8288j3154O318j3482j835O372J130K50o216J8506
946b0468j2636O815J2894p436R78l48J182J2747q363j0416J1478o385p54k567
932b3279j3987J6686r145K367K0843j708m542m122J1588J451n879j5789J5020
919a0496l132J56o297J1556m835O23J2119K267N859k5197k1276J7883k0913J3265
905b8418J928J4577L201J959P457r01j0520O458J631j2234J0707m095N934N008
891B692j3022q5J8003n443j0075l953N010j5159O695n614j4449k645L942J2398
877b1705j4241J3104n459K849o626J607O273l646k489m93M485L338k99j2687J1383
862b4606q092J183O228j922J3603J0106j4198j0896J3358J1106k39j4377m577
$$ plain form
960 46654 43152 34806 19577 9931 -18357 -31511 -25193 -38675 -40510 -34138 -33008 -32758 -38974 -20468
946 -20468 -33104 -26289 -13395 -20831 -19853 -20201 -19019 -6272 -14635 -25051 -13573 -19958 -20712 -23279
932 -23279 -37266 -20580 -29725 -27358 -6515 -8223 -12765 -16887 -5299 -3848 -9727 -25516 -10496
919 -10496 -13628 -13472 -19769 -8213 -13048 -12425 -306 1961 7820 -17377 -38653 -20770 -41683 -28418
905 -28418 -26490 -11913 -8712 -6753 704 -197 -10717 -4259 -2628 -14862 -4155 -8250 -2316 2692
891 2692 -10330 -10415 7588 2145 -7930 -11883 -6873 -22032 -15337 -20951 -35400 -38045 -34103 -21705
877 -21705 -35946 -22842 -28301 -25452 -32078 -30471 -24198 -27844 -30333 -30826 -26341 -23003 -23302 -35989 -24606
862 -24606 -32698 -31515 -25287 -27209 -13606 -3500 -17698 -28594 -15236 -4130 -4369 -18746 -23323
849b3323K1588o61r244O707j2217O009J1817n312Q133j1158J2407k0611j170P007
835a0028J419j3152J0638l5351M347J7471K850J7494q655j1846K3693q005l419
822a2544O688j043J5135P410L81n431J9356j9743k207j087j2454K798N303j2309
808i747j0512j0278l972J1815q817J9720j0477j4831J1508m375J902J1638o452
795b2878O831J7086j3956J4992N078Q130K12J380K0898p563j3782K76L170l306
781A6568o247o904J56J8564l8152j6534q939J0474l309o966j583J3706J3261n617
767b1522K126N709k893o268J0858k808J6624J4959j7738p337J8073J0305j8127
754A961K0702j1645j337J5659k1461j1764j5448Q296k461o493M210L764k18p805
$$ plain form
849 -23323 -1735 -2396 -11640 -4933 -17150 -11141 676 -4636 3497 -7661 4746 -15865 -17035 -10028
835 -10028 -8609 -21761 -11123 -46474 -42127 -24656 -21806 -4312 -12967 -24813 -1120 -9125 -12544
822 -12544 -5856 -6899 8236 15646 16027 10596 29952 10209 8002 6915 -5539 -2741 2562 -9747
808 -9747 -20259 -30537 -34509 -22694 -31511 -11791 -22268 -37099 -25591 -29966 -28064 -16426 -22878
795 -22878 -16047 1039 -12917 2075 7153 15283 15495 16875 37773 30210 16428 16704 19874 16568
781 16568 10321 3417 3573 22137 -16015 -32549 -41488 -31014 -34323 -41289 -42872 -29166 -15905 -21522
767 -21522 -19396 -13687 -16580 -22848 -11990 -14798 1826 16785 -953 -8290 9783 20088 1961
754 1961 22663 11018 9681 25340 3879 -7885 -23333 -15037 -17498 -23991 -19781 -16017 -16235 -24040
740b4040Q485k768m14J0768J9287n018m392J8410j9732M793M514j081l022O502
726A2292Q620p060j2625n898j0986R201K405O716J21O931j6919J8844l993q024
712c75l570O967P759j777J6919l029q951R8q17m567J0432O80m417j1511m326j309
696a794j2282K2362j6764j2597O289J840K510q51l683j374J6988l227L905r396
682h074M41K575K4788q43j2677j7149J1358J1292L590r453l759l521P116p141
668a457N084K0453j6128j2789J4656P270q631j8899J8914l390p143n919q729J9054
654B346P57j3995n931J4771M547K594j0937M534n40l524Q396j9636J2443K0008
640A5833j0911r207j4902l251L978r11J0597K115K9232j345j8558j4520M938K3382
$$ plain form
740 -24040 -15555 -18323 -18737 -7969 11318 6300 1908 20318 586 5379 9893 8812 5790 12292
726 12292 20912 13852 1227 -4671 -15657 -6456 -4051 2665 2786 9717 -7202 11642 7649 -375
712 -375 -3945 3022 10781 9004 25923 22894 13943 14041 13224 8657 19089 19769 15352 3841 -485 -1794
696 -1794 -14076 8286 -8478 -21075 -14786 -12946 -10436 -11287 -14970 -16344 644 -2583 1322 -8074
682 -8074 -7633 -5058 19730 18887 6210 -10939 419 11711 15301 5848 2089 -1432 5684 -1457
668 -1457 3627 24080 7952 -4837 9819 17089 8458 -10441 8473 5083 -2060 -7979 -16708 2346
654 2346 3103 -10892 -16823 -2052 2495 5089 -5848 -1314 -1854 -5378 3018 -16618 -4175 15833
640 15833 4922 -4285 -19187 -22438 -18460 -19371 -8774 -6659 22573 21228 2670 -11850 -6912 16470
626A6470j1363l862O835j3417q38O683k364j573J8795O998j9395j7206J0874J0471
612G108J1098j5565j7212j866Q234J139m25p982j343J3588j9917J5575Q34k071
598h805L23q782Q400L26j302J5843j2513q804L33J0209K291j2617R453P504R785
583A1644q797k113j010m635O771j8796P924j3536K4633N812j1356J991K690R002
569A0224o233j4131K1473R49j1311P015r645Q346q679L75L954j209m916j3561
555a7349J3803m862K5134O012j2031l618Q197Q95J2717m754M690k799o801j2078
541G156k53j035J7187J0051j2304n410l852j1199k11K0667o913J2695j223k771
527B2585K608j208j4311l098J4901l432Q071j3696j5194K4130J276l582k842J823
$$ plain form
626 16470 5107 1245 8080 -5337 -6175 508 -1856 -3429 15366 22364 2969 -14237 -3363 7108
612 7108 18206 2641 -14571 -16437 -8203 -7064 -7489 -15471 -16814 -3226 -23143 -7568 -6734 -8805
598 -8805 -8482 -17264 -8864 -8538 -9840 6003 -6510 -15314 -14981 -4772 -2481 -15098 -5645 1859 11644
583 11644 2847 734 -276 -4911 1860 -16936 -9012 -22548 2085 7897 -3459 -1468 1222 10224
569 10224 3991 -10140 11333 12282 971 7986 -1659 6687 -1992 -1617 2337 1128 -3788 -17349
555 -17349 -3546 -8408 16726 22738 10707 7089 15286 16181 28898 24144 28834 26035 19234 7156
541 7156 6903 5868 23055 33106 20802 15392 11540 341 130 20797 13884 26579 25356 22585
527 22585 25193 23985 9674 6576 21477 18045 26116 12420 -2774 21356 22632 19050 16208 18031
513A8031j2225q315p412J1508M400r945J2272J5012j4541J8973n593m592O916
500B4489m000J2676p737K692N627L423q221j305j0483j084J142p250k058P125
486A5036m954l90N682j591k116r229J0360p071J4632p188K1623L200l182J897
472C6709j2291M375j1258N06K1839q930k5396l467R501M125n984k1657J3256K2149
458B3477J0633j06j4238p221M595j6361m464J8140J1578j9249J976M516J085m46
444A3915k301J322n630o348K027P423J2803M479j0867M289N256k434j889j762
430B0283j4391p250L845J5854n017j205m534L568J046o113L024J282j3810P701
416D283k849K591o324k768p600J25L2035P011m4q97Q015L273j889J334R95L234
$$ plain form
513 18031 5806 -2509 -9921 1587 5987 -3958 8314 23326 8785 27758 22165 17573 24489
500 24489 20489 33165 25428 28120 33747 37170 28949 27644 17161 16077 17219 9969 7911 15036
486 15036 10082 9692 15374 13783 11667 2438 12798 5727 20359 13171 34794 37994 34812 36709
472 36709 24418 28793 17535 18041 39880 30950 5554 2087 11588 15713 9729 -11928 1328 23477
458 23477 34110 34004 19766 12545 17140 779 -3685 14455 26033 6784 8760 13276 14361 13915
444 13915 11614 12936 7306 958 2985 10408 23211 27690 16823 21112 26368 23934 22045 20283
430 20283 5892 -1358 2487 18341 13324 12119 7585 11153 12199 6086 9110 10392 -3418 4283
416 4283 1434 4025 -2299 -5067 -12667 -12542 19493 26504 26460 25563 33578 36851 34962 36296 37291 40525
400D0525K099j2569k243m365q196N659j0538N21k839n756J2519M055O50p574j3137
385a189n839J5433K4213r110k0674J0567J6939o967j825J3688r638J885j4451
372A3032O891p949j693J4779N535k279r970J3434j3162o200q982P385K740o595
358F966N510K401o923j2297N255K129l086K1385m119r87p388j192m321l872N483
343D944M606q438Q627K250j075R919J0502L954K5706j4321j6687R610L715k0402
329B2910J4545J1549j5198j4542M433O459q861p58l857p679O24q253J3929L491
315A8792j4499l071R136Q253j2325m789j5792J8078P505N404p320J2209O683j6836
301A1428j5193K7170N205j201k502o815J0950O885j577J895j2881j875l864j1904
$$ plain form
400 40525 42624 30055 27812 23447 15251 20910 10372 10893 8054 2298 14817 18872 19522 11948 -1189
385 -1189 -7028 8405 32618 23508 2834 13401 30340 23373 21548 35236 25598 27483 13032
372 13032 19923 11974 10281 25060 30595 28316 18346 31780 18618 12418 3436 10821 13561 6966
358 6966 12476 14877 7954 -4343 912 3041 -45 21340 17221 16234 8846 7654 3333 -539 4944
343 4944 9550 1112 9739 11989 10914 20833 31335 35289 60995 46674 29987 39597 43312 22910
329 22910 37455 49004 33806 19264 23697 30156 21295 20537 16680 9001 9625 1372 15301 18792
315 18792 4293 1222 10358 18611 6286 1497 -14295 3783 11288 16692 9372 21581 28264 11428
301 11428 -3765 23405 28610 27409 24907 18092 29042 35927 34350 36245 23364 21489 17625 5721
287E721o181J303J1812J7777p207j1684J242p719K31Q385N565j666k0828J982
273a267R636r444l456J8306l413m909K0142j0551J876P258j6815n744P856m267
259E208N87K257R312L59l787P432l438l106K813J4978N424j3693j923J316K519
244B6258k167J085q561j4668M28j014L302P370O499J4968O649j7072M564n002
230B2639j0525O808L585n329O223J895j195J681j968K759q565J930j6156J0622
216A4404R744r057j4279Q654r193M770J1052J1897j6209l264l540j0556K7850
203B2273o917L468n4Q467j5977k625M312j2738O966J6348j3573p87M809j0556
189C416Q757q563K969J1138J181j562k1242n674m660L430M029Q351j74m382J131
$$ plain form
287 5721 -460 843 12655 30432 23225 11541 12783 5064 5295 13680 19245 17579 -3249 -1267
273 -1267 8369 -1075 -4531 13775 10362 5453 25595 15044 16920 24178 7363 1619 9475 5208
259 5208 5795 8052 17364 17723 13936 21368 17930 14824 17637 32615 38039 24346 22423 23739 26258
244 26258 24091 25176 16615 1947 2375 1361 4663 12033 18532 33500 40149 23077 27641 22639
230 22639 12114 18922 22507 17178 23401 25296 24101 25782 23814 26573 18008 19938 3782 14404
216 14404 24148 15091 812 9466 273 5043 16095 27992 11783 8519 4979 -5577 22273
203 22273 15356 18824 18770 27237 11260 8635 12947 209 7175 23523 9950 9163 13972 3416
189 3416 12173 3610 6579 17717 18898 17336 -3906 -9580 -14240 -10810 -6781 1570 1396 -2986 -1855
174a855r114L998J6589j2510p216M899J5718p271j1430o515J5368O180k183m855
160a97o449J0967m527j2866J0888l551m066Q342k702q746L755J1582k4499J8336
146c733p545j0840J9043M469r629J560L96J4226j8335P93J027j209N707Q203K076
131F209j2251q611R081N695k278n255L613l096j8982j1348j996p30N429K402k265
116c4383M499J374o173N863M10n777P457p02j1262l401K2377k624j1228N129K3502
101d939n549j1569n566j0549L853k379l155J85l158J71j253j743J3562j5932O234
86d1787o141j660o180M114K3481j4574l382j0517R27j613M696K559j1105M40P318
71e3424l46M942p392P145o672O115o454j0202J955O712J0009n50N27n391M491
$$ plain form
174 -1855 -10969 -6971 9618 -2892 -10108 -5209 10509 3238 -8192 -14707 661 6841 4658 -197
160 -197 -6646 4321 -206 -13072 -2184 -5735 -9801 -1459 -4161 -12907 -9152 2430 -22069 -3733
146 -3733 -11278 -22118 -3075 1394 -8235 -6675 -6279 7947 -10388 -9595 -8568 -9777 -4070 4133 6209
131 6209 -6042 -14653 -5572 123 -2155 -7410 -3797 -6893 -25875 -37223 -39219 -39949 -34520 -32118 -34383
116 -34383 -29884 -28510 -34683 -28820 -28410 -34187 -26730 -27432 -38694 -42095 -19718 -22342 -33570 -28441 -4939
101 -4939 -10488 -22057 -27623 -38172 -34319 -36698 -39853 -39668 -42826 -42655 -43908 -45651 -32089 -48021 -41787
86 -41787 -47928 -49588 -55768 -51654 -28173 -42747 -46129 -56646 -55719 -57332 -52636 -50077 -61182 -60742 -53424
71 -53424 -53770 -48828 -56220 -49075 -55747 -49632 -56086 -66288 -64333 -57621 -47612 -48162 -47635 -53026 -48535
56d8535J424l62M477m755j707j4845R384P277o921j4096O328q698o425n080P006
41g5528K968J3275p545j8724K229J0922J1499n517j5611J3938K651K82j2431O482
27g1110o036j3414l712r262J7206J1971K930j4905P239l818q319o304J6716m967
13h5785q8K441m912n070m067Q538K76n856n072j5249J2728n625N614
0a02127
$$ plain form
56 -48535 -47111 -47473 -42996 -47751 -49458 -64303 -54919 -47642 -54563 -68659 -62331 -71029 -77454 -82534 -75528
41 -75528 -72560 -59285 -66830 -85554 -83325 -72403 -60904 -66421 -82032 -68094 -65443 -65161 -77592 -71110
27 -71110 -77146 -90560 -94272 -103534 -86328 -74357 -71427 -86332 -79093 -82911 -91230 -97534 -80818 -85785
13 -85785 -85873 -83432 -88344 -93414 -97481 -88943 -88667 -94523 -99595 -114844 -102116 -107741 -102127
0 -102127
$$ Imaginary data points
##PAGE= N=2
##DATA TABLE= (X++(I..I)), XYDATA
16383a227051J5414J0443K9203J5947J3591P052J1057n92O848J5228J5864N644
16371a081352J8461K2102K069R691J2301P753J4535J3962K5351P952R892l429
16359i40712J3733J2995M65J8157J7139K4934P743R847R319K360Q173P609L0906
16346g77332K5359M183M471J6981J5235O123J5407L279o2L9871j203J6711R520
16333f21457j815J5979K3691R237R525m388J9881K3501J0610O341K131O908J4218
16320d85638P181K0536J7411J2989N741N683J0695n08K7131P728M274O524J4087
16307c46166J3456R581J4960J0459N754J5369M905J2133L316L4412J0501k0682
16295b32002J6393K850J2293J7250K1255J3907m348K632J4036m045J3526K4394
$$ plain form
16383 -1227051 -1211637 -1201194 -1171991 -1156044 -1142453 -1135401 -1124344 -1124936 -1118088 -1102860 -1086996 -1081352
16371 -1081352 -1062891 -1040789 -1038720 -1029029 -1016728 -1008975 -994440 -980478 -955127 -947175 -937283 -940712
16359 -940712 -926979 -913984 -913519 -895362 -878223 -853289 -845546 -835699 -826380 -824020 -815847 -808238 -777332
16346 -777332 -751973 -747790 -743319 -726338 -711103 -704980 -689573 -686294 -686356 -646485 -647688 -630977 -621457
16333 -621457 -623272 -607293 -583602 -574365 -564840 -569228 -549347 -525846 -515236 -508895 -506764 -499856 -485638
16320 -485638 -478457 -457921 -440510 -427521 -421780 -416097 -405402 -405910 -378779 -371051 -366777 -360253 -346166
16307 -346166 -332710 -323129 -308169 -297710 -291956 -276587 -271682 -259549 -256233 -221821 -211320 -232002
16295 -232002 -215609 -212759 -200466 -183216 -161961 -148054 -152402 -149770 -135734 -139779 -126253 -101859
16283a01859k519K199J1166P321J2164M704J2632J9246p98J4204J7225L056J893
16270F34O71K5961K835O745K2533J5147j1324R412J3094J1286J683J1686L03N395
16256A16061J5040J1990q35J3625j67p200J3955J6616M122J3328M366J0041J8045
16243B28987j40R382J408J3031l94J1661J232M694O441J1839q125J6488k428K2843
16229C16919P248M568k753R23J3558J210J4994l085J744N452N110J9213J756M587
16215C91444O171n46j290M07K1564J7944p975J94J1001J5127L00L192M421n985
16201D55969J5927n121O402M478J5806n724j0497M877K2126M460K387J8951j1432
16188E18609J2094O303m830q560R572k53R512J2573M274J59Q151Q24O375l426
$$ plain form
16283 -101859 -104378 -102179 -91013 -83692 -71528 -66824 -54192 -34946 -35744 -21540 -4315 -1259 634
16270 634 1305 27266 30101 36846 59379 74526 63202 72614 85708 96994 98677 110363 110666 116061
16256 116061 131101 143091 142256 155881 155714 148514 162469 179085 183207 196535 200901 210942 228987
16243 228987 228847 238229 239637 252668 252274 263935 265167 269861 276302 288141 280016 296504 294076 316919
16229 316919 324167 328735 325982 326905 340463 341673 356667 353582 355326 360778 365888 385101 386857 391444
16215 391444 397615 397069 395779 396186 417750 435694 427719 427913 438914 454041 454341 457533 461954 455969
16201 455969 471896 466775 473177 477655 493461 487737 477240 482117 504243 508703 511090 530041 518609
16188 518609 530703 537006 532176 523616 533188 532935 542447 555020 559294 559453 567604 568428 574803 571377
16174E71377J3361j385k048K0191k151l334l53J2946J0586j2266r302R377K569
16161F09568P651L721J3642l333q768j0200k90K2479o510K4588j5718J4130M272
16148F55232o925N147n96J9662P882j1672P53J3004j7646k315K2784L859k4827
16135F64342L234l484J9980J074j2061J8892J6309r959Q379o61j1885P531K349
16122G04040J967j4518Q298P524l664J1445K616r452j3241K6522Q756j3194P579
16109G24678k301j636J845j358K066Q850l462J6075l025m340M038M781k171m202
16095G39838Q051N424M604j0368o414J348R69R873J4378j6536l46j259p719J3046
16081G54889Q477j3673L048j5388J2330p79J0189J1016o394J8148N680j0385j4990
$$ plain form
16174 571377 584738 583353 581305 601496 599345 596011 595658 608604 619190 606924 597622 606999 609568
16161 609568 617219 620940 634582 631249 622481 612281 611991 634470 627960 652548 636830 650960 655232
16148 655232 648307 653454 652858 672520 680402 668730 669483 682487 664841 662526 685310 689169 664342
16135 664342 667576 664092 684072 685146 673085 691977 708286 698327 706706 706045 694160 701691 704040
16122 704040 706007 691489 699787 707311 703647 715092 717708 708256 695015 721537 730293 717099 724678
16109 724678 722377 720741 722586 721228 723294 732144 728682 744757 741732 737392 741430 746211 744040 739838
16095 739838 747889 753313 757917 747549 741135 742483 743452 753325 767703 751167 750821 749562 741843 754889
16081 754889 763366 749693 752741 737353 749683 748904 759093 770109 763715 781863 787543 777158 762168
16068G62168j7183J0547m711J0567j853k506j586O81K1035m173k7736K0500J4005
16055G79755p592n554J3107l902k4220J0386l274J1390R215p389r588j2755L0901
16042G80480p683N255m806o859O698K419K1146J2310k0512j6605J9269j0598j108
16029G79406K033K242O134M914j9490R665j2282K467J0602L043l170J616O779
16016G93959j665K90k4760L190K176J0981J2805k7783N724J0408M200P05j200
16003G89030L299j1109m732M432p45R120Q879j6911K318k575J3724J5395J1707
15990H21832k5566k023M620q453L022Q93n441j4586J7063n936L884m714R407M923
15976G98925j003L654L245j8059n682J290l37r014K2048J1m658Q277l786j4125
$$ plain form
16068 762168 744985 755532 750821 761388 759535 757029 755443 756124 777159 772986 745250 765750 779755
16055 779755 772163 766609 779716 775814 751594 761980 758706 770096 779311 771922 762334 749579 780480
16042 780480 772797 778052 773246 766387 773085 775504 796650 808960 788448 771843 791112 780514 779406
16029 779406 781439 783681 789815 794729 775239 784904 772622 775089 785691 788734 785564 787180 793959
16016 793959 792294 792584 767824 771014 773190 784171 796976 769193 774917 785325 789525 790230 789030
16003 789030 792329 781220 776488 780920 780175 789295 798174 781263 783581 781006 794730 810125 821832
15990 821832 796266 794243 798863 790410 793432 794325 788884 774298 791361 785425 789309 784595 794002 798925
15976 798925 797922 801576 804821 786762 781080 782370 782033 773019 795067 795078 790420 798697 794911 780786
15962G80786J306J6803o531O622m769l727M965j2695k90k305P672J9559j2293
15949G95103P266J3183j5707Q503k371j6434N539j5756r661J9863k985J2047k1754
15936G76836j525M930J8630r561o894N697J3257p95j4352Q65R424j0813k37J2595
15922G98057j738k105q299J6434k1501o554M566J2387R201M429j0343P293P620
15909H09447p745M87n635j807O012j5555k782K657k151L735m565J410n412k356
15895G75740J6718J2610L178j1511p107J5867R583o557L101j0826q384J0395p16
15882H02091j923O488r146O920P28j6342Q459m401m630P106J739n676J2384O470
15868H10267m449j649j222j9547L398J0837P586l462M792R24k2632l819J5782
$$ plain form
15962 780786 782092 798895 792364 798986 794217 790490 795455 782760 782470 780165 787837 807396 795103
15949 795103 802369 815552 799845 808348 805977 789543 795082 779326 769665 789528 786543 798590 776836
15936 776836 775311 780241 798871 789310 782416 788113 801370 800575 786223 787088 796512 785699 785462 798057
15922 798057 796319 794214 785915 802349 780848 774294 778860 791247 800448 804877 794534 801827 809447
15909 809447 801702 802189 796554 794747 800759 785204 782422 785079 782928 786663 782098 783508 778096 775740
15895 775740 792458 805068 808246 796735 789628 805495 815078 808521 811622 800796 792412 802807 802091
15882 802091 800168 806656 797510 804430 805158 788816 797275 792874 788244 795350 797089 791413 803797 810267
15868 810267 805818 804169 802947 783400 786798 797635 805221 801759 806551 807475 784843 781024 796806
15855G96806O272n640M665k705L932l490J0729l003l661q752P908Q374j1556m966
15841G94913K3732j7789J2662m532m403o060J3387l476q678j816j304l028j141
15828G92467KM772Q954L090j9472q419J0503M805J6602k643l878J0746K942m379
15814H16092j0932j0538l966k133l484K2752p413k570K0271j5138M866o769k526
15801G98512l336O642K189J4079Q933p222j3520n746l002J154o529Q944J4125
15788H15223j3536J460J3359J718J4928j1251l101n764j981p958q275O872J3263
15775H14957J923o678L513M18j6693P95J1390N06r447J5349j2738j8489L4750
15762H19556n43l0221j4356J2324K1105K2558k4644p000J02p095M577J1581R81
$$ plain form
15855 796806 803078 797438 802103 799398 803330 799840 810569 807566 803905 795153 803061 811435 799879 794913
15841 794913 818645 800856 813518 808986 804583 798523 811910 808434 799756 797940 796636 793608 792467
15828 792467 792469 797241 806195 809285 789813 781394 791897 796702 813304 810661 806783 817529 820471 816092
15814 816092 805160 794622 790656 788523 785039 807791 800378 797808 818079 802941 807807 801038 798512
15801 798512 795176 801818 804007 818086 827019 819797 806277 800531 797529 798683 792154 801098 815223
15788 815223 801687 803147 816506 818224 833152 821901 818800 813036 811055 803097 794822 801694 814957
15775 814957 816880 810202 813715 814133 797440 798235 809625 810131 800684 816033 803295 784806 819556
15762 819556 819013 788792 774436 786760 807865 830423 805779 798779 798881 791786 796363 807944 808925
15749H08925l663J771P919Q233q457j1193k401N655P783N651q192K463q389o196
15735G99909J2513j317O028Q876j6121m951J6241r193j9572J1723j0266J1626
15723H05496J457k3044K5248k484k073J6616M22N793j5184m714l585Q090J0150
15710H22188m9r587l108R058j4300j0890J4971l086J869n970J1663P923r218n147
15696H06317R204P361j33k7317R526R950O3j6952J004O177j1429O166L697o365
15682G97269K167J5302k554K758o675O025j713J0825n272K04j2251m172R878j978
15668H09813K649J7832n015k788p842M384k911L824Q094q155O913p366j2365O094
15654H13161j0756M014L52j4768L6655o97j3886l701j2831J770J0667l932j260
$$ plain form
15749 808925 805262 807033 814952 823185 814728 803535 801134 806789 814572 820223 812031 814494 806105 799909
15735 799909 812422 811105 817133 826009 809888 804937 821178 811985 792413 804136 793870 805496
15723 805496 806953 783909 809157 806673 804600 821216 821638 827431 812247 807533 803948 812038 822188
15710 822188 822139 812552 809444 818502 804202 793312 808283 805197 807066 801096 812759 820682 811464 806317
15696 806317 815521 822882 822749 795432 804958 814908 814971 798019 799023 805200 793771 799937 803634 797269
15682 797269 799436 814738 812184 814942 808267 814292 812579 823404 818132 818336 806085 801913 811791 809813
15668 809813 812462 830294 825279 822491 814649 819033 816122 819946 828040 819885 826798 819432 807067 813161
15654 813161 802405 806419 806771 792003 828658 827961 814075 810374 797543 799313 809980 806048 804788
15641H04788P700J171k972k808k811P824L700J0104J09j1072J0819q033l976J5997
15627H30540j3819j0960M51O33R112O0m612k779o613J1044M222m953j7227N261
15613H00360J2219n045J877L313J0022J4233P34r934j4159o400J2114J8904M049
15600H42287q285k3492M717J6445j1607L631Q295j4857Q52j0247o456J6134m900
15587H12517J0139K739J8540k4601J2431j0773p60Q166M140p679k462J1190j0279
15574H23308J083j4184J204p460R843L811M320n226J825N556j2935L700q730Q907
15560H15022m723M08N059P094p228J893k319J3415r484q013Q648O162L445r03
15546H28476J151j627Q366o401k0058k2N090P778J2853r81j3159R46j0590J6328
$$ plain form
15641 804788 812488 813659 810687 807879 805068 812892 816592 826696 826805 815733 826552 818519 814543 830540
15627 830540 816721 805761 806212 806845 815957 816017 811405 808626 802013 813057 817279 812326 795099 800360
15613 800360 812579 807534 809411 812724 822746 836979 837713 827779 813620 807220 819334 838238 842287
15600 842287 834002 810510 815227 831672 820065 823696 831991 817134 817986 807739 801283 817417 812517
15587 812517 822656 825395 843935 819334 831765 820992 820232 828398 832538 824859 822397 833587 823308
15574 823308 824391 810207 811411 803951 813794 817605 821925 816699 818524 824080 811145 814845 806115 815022
15560 815022 810299 810707 815766 822860 815632 817525 815206 828621 819137 811124 819772 825934 829379 828476
15546 828476 829627 828000 836366 829965 809907 809885 814975 822753 835606 834625 821466 822412 811822 828150
15532H28150P412j5045n274j1337J4150J4929p861p081L868N794P660j0739J8178
15519H42804j2967J7j200P392k272p655l069M423j1117j443L25k482r887M587
15505H07456J4592j0240r917O335L775R449O653r320L928l376n322M587L282K821
15491H24703J82n609R34M067R654q260j467n480R432o193p410M194j2748K1638
15477H27637j6351R025J3004P4n682P777Q84j1935m897o606j1293L740J4838P438
15463H27653J2228r090j9248J6342J9969k1453M128R57j1751J6094N418K896J1337
15450H55480k6129k126J2598n408j4520J4949m087q215L449m615O961O02j2884
15437H16055J6346l674k1370k870J4193P06j760J2728m578J1824r957l172J0749
$$ plain form
15532 828150 835562 820517 815243 803906 818056 832985 825124 818043 821911 827705 835365 824626 842804
15519 842804 829837 829854 828654 836046 833774 826119 823050 827473 816356 814913 815238 812756 802869 807456
15505 807456 822048 811808 801891 808226 812001 821450 828103 818783 822711 819335 814013 818600 821882 824703
15491 824703 824885 819276 820210 824277 833931 825671 824204 818724 828156 821963 814553 818747 805999 827637
15477 827637 811286 820311 833315 833389 827707 835484 836368 824433 819536 812930 801637 805377 820215 827653
15463 827653 839881 830791 811543 827885 847854 826401 830529 831486 819735 835829 841247 844143 855480
15450 855480 829351 827225 839823 834415 819895 834844 830757 822542 825991 821376 828337 828939 816055
15437 816055 832401 828727 807357 804487 818680 819386 817626 830354 825776 837600 827643 824471 835220
15424H35220O099q431K396r299K956J054r37r628J7747M068j3918J1437j8007
15411H20757O564N153j2919J5870L454m858m849j3377J147J4754J0014n330j7013
15398H19367K0506J1309k715j4376o146O128n669m352K674p681R545P178q002
15385H27766J187j1503J7467R62j1297j2387L733J8982J4779j1851m309J0465
15373H43994N95o973K737o199j5719P540J2428j081R293K366Q770j2265j6902
15360H28584J2503k944k412Q690m781k3170J4452k164L680N719K301j4210K45
15347H26493j807k264M147o061P193k534N974j4023M373J825O383J188r44k830
15333H27113K1827L764p840j2049j0606R043m317J1556O912q282m790J0008j2855
$$ plain form
15424 835220 841319 832888 835284 825985 828941 829995 829058 819430 837177 841245 827327 838764 820757
15411 820757 827321 832474 819555 835425 838879 834021 829172 815795 816942 831696 841710 836380 819367
15398 819367 839873 851182 848467 834091 827945 834073 828404 824052 826726 819045 828590 835768 827766
15385 827766 828953 817450 834917 835879 824582 812195 815928 834910 849689 837838 833529 843994
15373 843994 844589 837616 840353 834154 818435 825975 838403 837322 846615 848981 857751 845486 828584
15360 828584 841087 838143 835731 844421 839640 816470 830922 828758 832438 838157 840458 826248 826493
15347 826493 824686 822422 826569 820508 827701 825167 831141 817118 821491 823316 829699 830887 829943 827113
15333 827113 848940 852704 844864 832815 822209 831252 826935 838491 845403 837121 832331 842339 829484
15320H29484L697P876n776R230j9897K960M0O065M8n084p199J3006q453K505K1130
15305H49632J487r432o651j5435O743j083J158J1438o800j1142J1908L589QN662
15291H41082q773N681M487J3177j1850o794l74K1176p223n94r215j9J3252q411
15277H45602K3874k3097j4128O55J2922j765M117j2126j015O716m955m968J783
15264H33615J0044M74j4123Q278K946p938o880J6157j0108r369J4437j3210K0553
15251H44876j0465J3995j5385k118J6178l25J5550j9014j480J1232q138R394j5012
15238H39288q684l103P883J7339p000L699R979k1512J678M130p634j0563J2931
15225H38431Q934M601j5527m085j6228K5805P744M620n639j6227J1958L536O701
$$ plain form
15320 829484 833181 841057 835281 844511 824614 827574 827614 833679 833727 828643 821444 834450 825997 828502 849632
15305 849632 851119 841687 835036 819601 826344 825261 826419 837857 831057 819915 831823 835412 835420 841082
15291 841082 832309 837990 842477 855654 843804 837010 836636 857812 850589 849995 840780 840761 854013 845602
15277 845602 869476 846379 832251 832906 845828 844063 848180 836054 835039 841755 836800 831832 833615
15264 833615 843659 844133 830010 838288 841234 833296 826416 842573 832465 823096 837533 824323 844876
15251 844876 834411 848406 833021 830903 847081 846756 862306 843292 841812 853044 844906 854300 839288
15238 839288 830604 827501 835384 852723 845723 849422 859401 837889 839567 843697 836063 825500 838431
15225 838431 847365 851966 836439 832354 816126 841931 849675 854295 848656 832429 844387 847923 854624
15212H54624o923J1022K315j4882j6032j616M879K326M411p465K0608j380M153
15199H56040k0868O453J3860q836J3976J248j3632k3302M779K724q0J3489o361
15186H39490R904n164J3678j1371j1319K3973o361R456L552j203q674p404J081
15173H49638M377j2500J5384J0111n50q224j1583j0444Q610m309m574j1829K735
15160H26842J8111O263P408j9993K632J0591L809p41k0389Q008J0900R806j4194
15147H49053M93J694N831j1004j1398J4834K56m862j0329K8293n744m028o002
15134H47087J785n482J035K4723r340j2596l437R837j6222q85J8219j4340J7711
15121H58095j0594j1316K4346K489R156o270J474j5071k781L518L159m005M912
$$ plain form
15212 854624 847701 858723 861038 846156 830124 828508 833387 835713 840124 832659 853267 851887 856040
15199 856040 835172 841625 855485 846649 860625 861873 848241 824939 829718 832442 832362 845851 839490
15186 839490 849394 844230 857908 846537 835218 859191 852830 862286 865838 864635 855961 848557 849638
15173 849638 854015 841515 856899 867010 866460 858236 846653 836209 844819 840510 835936 824107 826842
15160 826842 844953 851216 858624 838631 841263 851854 855663 854922 834533 842541 853441 863247 849053
15147 849053 849546 851240 857071 846067 834669 849503 849759 844897 834568 862861 857117 853089 847087
15134 847087 848872 843390 844425 869148 859808 847212 843775 853612 837390 836505 854724 840384 858095
15121 858095 847501 836185 860531 863020 872176 865906 867380 852309 849528 853046 856205 852200 857112
15108H57112q82J9875o551n952p143J865j0873K45k930J4949L037j3054j3661
15095H36037M593P532O687q335R622R268l542J5224r494O363p592o201q924J1945
15081H63183o564j6714J1603K1003k0758N86Q962J739Q678j2904j6629j3555Q397
15068H37027O473j152k462j041j327R165J1056p852R872O827m329j8765j1199
15055H32293K2927q775l778p47J6806Q274J770K166j6851P217j9042K440K4949
15042H69649k0368J461J5671M744O783p792P656p963l016k811K0253j2497m276
15029H67494p926k788K800n341R693R255k9377l456K3401j0232J1481J3668k2573
15016H56099M122r601J3478J748J1782J001r089Q043m566J9646j3590k5161O817
$$ plain form
15108 857112 856230 876105 869554 863602 856459 858324 847451 847696 844766 859715 862752 849698 836037
15095 836037 840630 848162 854849 846514 856136 865404 861862 877086 867592 873955 866363 860162 851238 863183
15081 863183 856619 839905 851508 872511 851753 852339 861301 863040 871718 858814 842185 828630 837027
15068 837027 843500 842348 839886 838845 837518 846683 857739 849887 859759 866586 862257 843492 832293
15055 832293 855220 846445 842667 841920 858726 867000 868770 870936 854085 861302 842260 844700 869649
15042 869649 849281 850742 866413 871157 877940 870148 877804 869841 866825 864014 884267 871770 867494
15029 867494 859568 856780 859580 854239 863932 873187 843810 840354 863755 853523 865004 878672 856099
15016 856099 860221 850620 864098 865846 877628 878629 869540 877583 873017 892663 879073 853912 860729
15003H60729J7025l787j077M624j4675j7445M352J0455Q678l7j2170k2407Q595
14990H42860J3926K1659r229K758j5553j271J0926l667l932M193J637k481J7965
$$ plain form
15003 860729 877754 873967 872890 877514 862839 845394 849746 860201 868879 868842 856672 834265 842860
14990 842860 856786 878445 869216 871974 856421 855150 866076 862409 858477 862670 864307 861826 879791
$$ [...]
##END NTUPLES=NMR SPECTRUM
##END=
