##TITLE=1H_EC-3329(II-2)
 CDCl3
 8 sc, 
 8.8.2024
##JCAMPDX= 6.0         $$ Bruker NMR JCAMP-DX V2.0
##DATA TYPE= NMR SPECTRUM
##DATA CLASS= NTUPLES
##ORIGIN= UXNMR, Bruker Analytische Messtechnik GmbH
##OWNER= root
$$ XWIN-NMR		Version 3.5
$$ Thu Aug  8 13:50:28 2024 Russian Standard Time (UT+4h)  she@DPX200
##.OBSERVE FREQUENCY= 200.1313
##.OBSERVE NUCLEUS= ^1H
##.ACQUISITION MODE= SIMULTANEOUS
##.ACQUISITION SCHEME= undefined
##.AVERAGES= 8
##.DIGITISER RES= 18
##SPECTROMETER/DATA SYSTEM= spect
##.PULSE SEQUENCE= zg30
##.SOLVENT NAME= Acetone
##.SHIFT REFERENCE= (INTERNAL, Acetone, 0, 21.5292)
##AUDIT TRAIL= $$ (NUMBER, WHEN, WHO, WHERE, WHAT)
$$ ##TITLE= Audit trail, XWIN-NMR		Version 3.5
$$ ##JCAMPDX= 5.01
$$ ##ORIGIN= Bruker BioSpin GmbH
$$ ##OWNER= she
$$ F:/spectra/data/she/nmr/H-F/1/pdata/1/auditp.txt
$$ ##AUDIT TRAIL=  $$ (NUMBER, WHEN, WHO, WHERE, WHAT)
(   1,<2024-08-08 13:48:56.18 +0400>,<she>,<DPX200>,
      <created by zg, POWCHK disabled, PULCHK disabled
       configuration hash MD5:
       00 E9 B6 7A A2 85 ED C7 34 08 36 98 17 FE 4E 26
       data hash MD5: 16K
       23 BD 33 F4 63 84 2D 88 B2 12 69 8C B4 54 99 C1>)
(   2,<2024-08-08 13:49:47.35 +0400>,<she>,<DPX200>,
      <Start of raw data processing
       efp BC_mod = 2 LB = 0.24 FT_mod = 6 PKNL = 1 PHC0 = -25639.32 PHC1 = 14.38749 SI = 16K 
       data hash MD5: 16K
       7F B1 2D 2F 43 7D 8F 9E 38 49 FB 41 AE 6A A3 8E>)
(   3,<2024-08-08 13:49:54.10 +0400>,<she>,<DPX200>,
      <abs ABSG = 5 
       data hash MD5: 16K
       B0 9C 43 FF B5 69 5C C2 F7 81 17 AA 7B 75 96 4A>)
$$ ##END=
$$ 
$$ hash MD5
$$ 47 B1 BB A2 FF E5 D1 91 B6 3A 8A C2 4C 17 68 C9
##$RELAX= 
##$RELAX= 
##$RELAX= 
##$RELAX= 
##$RELAX= 
##$RELAX= 
$$ Bruker specific parameters
$$ --------------------------
##$DU= <F:/spectra>
##$EXPNO= 1
##$NAME= <H-F>
##$PROCNO= 1
##$TYPE= <nmr>
##$USER= <she>
##$AMP= (0..31)
100 100 100 100 100 100 100 100 100 100 100 100 100 100 100 100 100 100 
100 100 100 100 100 100 100 100 100 100 100 100 100 100 
##$AQSEQ= 0
##$AQ_mod= 1
##$AUNM= <au_zg>
##$AUTOPOS= <>
##$BF1= 200.13
##$BF2= 200.13
##$BF3= 200.13
##$BF4= 200.13
##$BF5= 200.13
##$BF6= 200.13
##$BF7= 200.13
##$BF8= 200.13
##$BYTORDA= 1
##$CFDGTYP= 0
##$CFRGTYP= 5
##$CHEMSTR= <none>
##$CNST= (0..31)
1 1 145 1 1 1 1 1 1 1 1 1 1 1 1 1 1 1 1 1 1 1 1 1 1 1 1 1 1 1 1 1 
##$CPDPRG= <>
##$CPDPRG1= <>
##$CPDPRG2= <>
##$CPDPRG3= <>
##$CPDPRG4= <mlev>
##$CPDPRG5= <mlev>
##$CPDPRG6= <mlev>
##$CPDPRG7= <mlev>
##$CPDPRG8= <mlev>
##$CPDPRGB= <>
##$CPDPRGT= <>
##$D= (0..31)
0 1.2 0 0 0 0 0 0 0 0.06 0 0.03 0 0 0 0 0.0002 0 0 0 0 0 0 0 0 0 0 0 0 
0 0 0 
##$DATE= 1723110535
##$DBL= (0..7)
120 120 120 120 120 120 120 120 
##$DBP= (0..7)
150 150 150 150 150 150 150 150 
##$DBP07= 0
##$DBPNAM0= <>
##$DBPNAM1= <>
##$DBPNAM2= <>
##$DBPNAM3= <>
##$DBPNAM4= <>
##$DBPNAM5= <>
##$DBPNAM6= <>
##$DBPNAM7= <>
##$DBPOAL= (0..7)
0.5 0.5 0.5 0.5 0.5 0.5 0.5 0.5 
##$DBPOFFS= (0..7)
0 0 0 0 0 0 0 0 
##$DE= 6
##$DECBNUC= <off>
##$DECIM= 24
$$ [...]
##$SUBNAM3= <"">
##$SUBNAM4= <"">
##$SUBNAM5= <"">
##$SUBNAM6= <"">
##$SUBNAM7= <"">
##$SUBNAM8= <"">
##$SUBNAM9= <"">
##$SW= 24.0689771365484
##$SWIBOX= (0..15)
0 0 2 0 0 0 0 0 0 0 0 0 0 0 0 0 
##$SW_h= 4816.95568400771
##$TD= 16384
##$TD0= 1
##$TE= 0
##$TE2= 300
##$TE3= 300
##$TEG= 300
##$TL= (0..7)
0 120 120 120 120 120 120 120 
##$TP= (0..7)
150 150 150 150 150 150 150 150 
##$TP07= 0
##$TPNAME0= <>
##$TPNAME1= <>
##$TPNAME2= <>
##$TPNAME3= <>
##$TPNAME4= <>
##$TPNAME5= <>
##$TPNAME6= <>
##$TPNAME7= <>
##$TPOAL= (0..7)
0.5 0.5 0.5 0.5 0.5 0.5 0.5 0.5 
##$TPOFFS= (0..7)
0 0 0 0 0 0 0 0 
##$TUNHIN= 0
##$TUNHOUT= 0
##$TUNXOUT= 0
##$USERA1= <user>
##$USERA2= <user>
##$USERA3= <user>
##$USERA4= <user>
##$USERA5= <user>
##$V9= 5
##$VALIST= <valist>
##$VCLIST= <CCCCCCCCCCCCCCC>
##$VD= 0
##$VDLIST= <DDDDDDDDDDDDDDD>
##$VPLIST= <PPPPPPPPPPPPPPP>
##$VTLIST= <TTTTTTTTTTTTTTT>
##$WBST= 1024
##$WBSW= 4
##$XGAIN= (0..3)
0 0 0 0 
##$XL= 0
##$YL= 0
##$YMAX_a= 530560
##$YMIN_a= -412151
##$ZGOPTNS= <>
##$ZL1= 120
##$ZL2= 120
##$ZL3= 120
##$ZL4= 120
##$ABSF1= 21.52919
##$ABSF2= -2.540016
##$ABSG= 5
##$ABSL= 3
##$ALPHA= 0
##$AQORDER= 0
##$ASSFAC= 0
##$ASSFACI= 0
##$ASSFACX= 0
##$ASSWID= 0
##$AUNMP= <proc_1d>
##$AZFE= 0.1
##$AZFW= 0.1
##$BCFW= 0
##$BC_mod= 2
##$BYTORDP= 0
##$COROFFS= 0
##$CY= -3
##$DATMOD= 1
##$DC= 0
##$DFILT= <>
##$DTYPP= 0
##$F1P= 0
##$F2P= 0
##$FCOR= 1
##$FTSIZE= 16384
##$FT_mod= 6
##$GAMMA= 0
##$GB= 0
##$INTBC= 1
##$INTSCL= 3.70164e-10
##$ISEN= 128
##$LB= 0.24
##$LEV0= 0
##$LPBIN= 0
##$MAXI= 10000
##$MC2= 0
##$MEAN= 0
##$ME_mod= 0
##$MI= 1.114404
##$NCOEF= 0
##$NC_proc= -5
##$NLEV= 6
##$NOISF1= 3.799351
##$NOISF2= 2.8
##$NSP= 0
##$NTH_PI= 0
##$NZP= 0
##$OFFSET= 21.52919
##$PC= 1
##$PHC0= -25639.32
##$PHC1= 14.38749
##$PH_mod= 1
##$PKNL= yes
##$PPARMOD= 0
##$PSCAL= 0
##$PSIGN= 0
##$REVERSE= no
##$SF= 200.12939985361
##$SI= 16384
##$SIGF1= 3
##$SIGF2= 2
##$SINO= 5.538805
##$SIOLD= 16384
##$SREGLST= <1H.CDCl3>
##$SSB= 0
##$STSI= 16384
##$STSR= 0
##$SW_p= 4816.95568400771
##$SYMM= 0
##$S_DEV= 0
##$TDeff= 16384
##$TDoff= 0
##$TI= <>
##$TILT= no
##$TM1= 0
##$TM2= 0
##$TOPLEV= 0
##$USERP1= <user>
##$USERP2= <user>
##$USERP3= <user>
##$USERP4= <user>
##$USERP5= <user>
##$WDW= 1
##$XDIM= 16384
##$YMAX_p= 365364770
##$YMIN_p= -343381
$$ End of Bruker specific parameters
$$ ---------------------------------
##NTUPLES= NMR SPECTRUM
##VAR_NAME=  FREQUENCY,     SPECTRUM/REAL,   SPECTRUM/IMAG
##SYMBOL=    X,             R,               I
##VAR_TYPE=  INDEPENDENT,   DEPENDENT,       DEPENDENT
##VAR_FORM=  AFFN,          ASDF,            ASDF
##VAR_DIM=   16384,         16384,           16384
##UNITS=     HZ,            ARBITRARY UNITS, ARBITRARY UNITS
##FACTOR=    0.29402158847633, 1,            1
##FIRST=     4308.62388673787, 0,            0
##LAST=      -508.331797269841, 0,           0
##MIN=       -508.331797269841, -343381,     0
##MAX=       4308.62388673787, 365364770,    0
$$ Real data points
##PAGE= N=1
##DATA TABLE= (X++(R..R)), XYDATA
$$ [...]
5277d7031l2242L7820k9105l284j1620k194J7323R905K3303m966Q8947K3678l1251
5264C9283m1998m0448j2506J24021n8935n369Q303N486n870L8686K8700O801J4518
5251A00672o4374l260M8196J209p3981N8943K201k0922q1164N2781O1399l2069
5239D9631J5320l5061J1846m3778L0285K9770J3363q6358P0570n1845j7850Q1137
5227F7030N1843L1421L5220M5854k6405p9300k340p422M7253j9062k4864j8626
5215A00602J7155N308j8114l7043J6658l3720o1787J5355j2145L5732N5676K8308
5203A11985q0018L4016n2587J911K2131n0196l1970P3976J2308l3711o215l7637
5191c6007M2760N6587P629l9818r331N217Q6395r2273R5766P84p4373k5909L0246
$$ y = [-47031, -79273, -41453, -70558, -73842, -85462, -87656, -70333, -60428, -37125, -42091, 46856, 70534, 39283, -2715, -43163, -55669, 68352, 9417, 4048, 12351, 17837, 11967, 50653, 79353, 86154, 100672, 36298, 33038, 81234, 82443, 8462, 67405, 69606, 48684, -32480, 20301, 81700, 49631, 64951, 29890, 41736, -2042, 28243, 58013, 71376, -14982, 55588, 3743, -14107, 67030, 118873, 150294, 185514, 231368, 204963, 125663, 123323, 115901, 163154, 144092, 119228, 100602, 117757, 123065, 104951, 67908, 84566, 50846, -10941, 4414, -7731, 28001, 83677, 111985, 31967, 65983, 13396, 15307, 37438, -12758, -44728, 29248, 41556, 7845, 1630, -36007, 6753, 63340, 70969, 31151, 21820, 27037, 113432, 21159, 116925, 117709, 43336, 17427, 47673]
5178D7673k0748l950N3034m4788Q240L9083Q998q2969K24l2684J9486N1979k9922
5165A3656j99Q3072q0550l5443M9256l7535J9365P918P372K6081n6626r7320O8099
5152c2854l198r302M3535k248J04400q792l1576o9398L2828q909Q2892k4030J9414
5139I2762j961m996k342l1919o9150N8000N6499l6360q2502N5083J8866j2929
5127C9051O0189n9424l0017J6546m450J02431m5806M493L8978p6853r902m3617
5115h381M0066L1990q8357K5936j4463M8520J8367m912K4701j8329K6989r571
5103G2556m1583M5765m8080K2580K8408o9507N3253M0585M3942n988j7385o0072
5091F4474J0879K1778o7739J5659L5597l2920q1020K6117J6345L9043j2514P364
$$ y = [47673, 26925, 22975, 76009, 31221, 39461, 78544, 87542, 4573, 4797, -27887, -8401, 43578, 13656, 13457, 96529, 15979, -19464, 29792, -7743, 11622, 19540, 26912, 52993, -3633, -100953, -32854, -36052, -45354, -1819, -4067, 100333, 91541, 59965, -9433, 23395, 14486, 97378, 73348, 92762, 90801, 85805, 83463, 51544, -17606, 40394, 96893, 60533, -21969, 33114, 51980, 39051, 99240, 39816, 9799, 26345, 21895, 124326, 78520, 83013, 121991, 45138, 35236, -8381, 31685, 63675, -24682, 1254, -13209, 35311, 53678, 48766, 73467, 55138, 82127, 72556, 30973, 76738, 28658, 51238, 79646, 10139, 63392, 103977, 147919, 141931, 124546, 64474, 75353, 97131, 29392, 45051, 80648, 47728, -33292, -7175, 9170, 48213, 35699, 43063]
5079D3063m3982j3592Q1154n784k8143L6687K1260N2643M5929p9881N9694o0945
5067A08103j8029N35Q8461k8356q2695m1605J05336O6570m6332j3763K8808l3136
5055A33897J6752k1889q547K6589l3398l8063J2024L723m571L6837M8386n8681
5043A13059P7021K6262M6729m773m6050K441P1366O666j09829K1065o3092N3164
5031A94029N2415P888P4311n6407l5580k4760o5980L2993Q6605l8063j3713Q0236
5019B93974j968n6311j1550M431j2130j9144K7503J591j6788Q320P2715l6436
5007B54207k9880J3158m9762k7936J4664K8086J6036j4148L0980N1717K0114l4945
4995B72291j2097j7866J9493p9326o2134J20461p5647N1601N3063k623o6004P5140
$$ y = [43063, -919, -14511, 66643, 60859, 32716, 69403, 90663, 143306, 189235, 109354, 169048, 108103, 90074, 90609, 179070, 150714, 68019, 26414, 131750, 198320, 151988, 138225, 167033, 133897, 150649, 128760, 120213, 146802, 113404, 75341, 87365, 91088, 86517, 123354, 171740, 113059, 190080, 216342, 263071, 258298, 212248, 214689, 286055, 292721, 182892, 203957, 140865, 194029, 246444, 254332, 328643, 272236, 236656, 211896, 145916, 178909, 265514, 227451, 213738, 293974, 292006, 235695, 224145, 228576, 216446, 197302, 224805, 226396, 209608, 217928, 290643, 254207, 224327, 237485, 187723, 159787, 174451, 202537, 218573, 204425, 235405, 287122, 307236, 272291, 260194, 242328, 261821, 182495, 120361, 240822, 165175, 216776, 269839, 267216, 201212, 276352]
4983B76352o2070j6081j119K6894O1847o1045r7952M0396Q0407P6319o6890q3010
4971A74048O8923N669j7528j9890o9013N3313L0011l9375J6611M131n49K2237
4959B28588J6993O054L2831n2187k1543R9017j9807l9498J1546j3166o666O6478
4947C08640J410k5748K4296L5288l2571n2800M7309L5308n3631L1551J03791n5181
4935C67662N8328k0633L4357j4492n9646m5128O00K2144N319R4884k9743m2901
4923C70751M7470l4400K9696M8132M5353j00784o2033K726O606N6757r1m6996
4911C63187L381q4J06385P7630m3764O8979M9424p3990K4562O550j2536J6041
4899E85765P2883K8305k7596N2662N6720n4898j0862j08262p313R1609l4969m8663
$$ y = [276352, 214282, 198201, 197082, 223976, 285823, 224778, 126826, 167222, 247629, 323948, 257058, 174048, 242971, 248640, 231112, 211222, 142209, 195522, 225533, 186158, 202769, 206900, 206351, 228588, 245581, 251635, 284466, 232279, 210736, 309753, 289946, 250448, 261994, 248828, 242162, 308640, 310050, 284302, 308598, 343886, 311315, 258515, 305824, 341132, 287501, 319052, 422843, 367662, 425990, 405357, 439714, 425222, 365576, 320448, 321048, 343192, 348511, 443395, 413652, 370751, 418221, 383821, 413517, 461649, 507002, 406218, 344185, 346911, 353517, 410274, 410183, 363187, 366568, 366484, 472869, 550499, 506735, 575714, 625138, 551148, 575710, 582260, 569724, 585765, 658648, 686953, 659357, 712019, 768739, 713841, 702979, 594717, 587404, 679013, 644044, 595381]
4887E95381l8704M5420l7244L8850M7497M9169l6251J14135k2080p5864Q0900
4876G61209r0891J5657M5154O5132J00192K1084q1495J5422M5980l5162P719J4684
4864H84685m9123J9564R3455M6341O2622k5778Q5285Q8933r256N086K4865M0195
4852A266874J02812O0961P0814P3982J06104J10460J9822L7846O4007N1603R1751
4841B057036P8242N9310P9675J39831Q7864K08461N7968J38350J51327J06445
4831C164509K71107J80105J08574K02294J53371K81747K37314K94247K72816K78774
4821E444858L77546L49369M67779M11619N81469O71855O51393P84976R93595J295420
4811A2029879J462642J820724K081887J560865O73661l58096q73734j080124r96317
$$ y = [595381, 556677, 602097, 564853, 603703, 651200, 700369, 664118, 778253, 756173, 680309, 761209, 670318, 685975, 731129, 796261, 896453, 917537, 836042, 851464, 897444, 862282, 870001, 884685, 835562, 855126, 948581, 994922, 1057544, 1031766, 1117051, 1205984, 1196728, 1201814, 1226679, 1266874, 1369686, 1430647, 1501461, 1575443, 1681547, 1792007, 1811829, 1849675, 1913682, 1965285, 2057036, 2135278, 2194588, 2274263, 2414094, 2501958, 2710419, 2768387, 2906737, 3058064, 3164509, 3435616, 3615721, 3724295, 3926589, 4079960, 4361707, 4599021, 4893268, 5166084, 5444858, 5822404, 6171773, 6639552, 7051171, 7632640, 8304495, 8955888, 9740864, 10734459, 12029879, 13492521, 15313245, 17395132, 18955997, 19629658, 19271562, 18397828, 17317704, 16321387]
4802A6321387o71715n05473l04406L6063K76188L46308P73665J103983J142761
4793A8518761J558427J790069K211555K703147L398221L965035L359337J017759
4785C8522311j789226l350778l698184l391400k665824k148683j623820j194568
4777A8659828p62860m76657p6839K90182O16501O14492P77820R11848R13187J123705
4767B2591207J134683Q49139l61498j461454k089879k254122k185882j800669
4759A4421525j496285j250461j053417p57952n61387l47061l37198k16222k38948
4750H162594k95516m17127m39665n04801n79691m00312m04603k36044l82547l36383
4740D165905j48961j77098k58421j32617l25477j58951l8740j51861j16983q2001
$$ y = [16321387, 15649672, 15144199, 14839793, 14875856, 15152044, 15498352, 16272017, 17376000, 18518761, 20077188, 21867257, 24078812, 26781959, 30180180, 34145215, 37504552, 38522311, 36733085, 33382307, 29684123, 26292723, 23626899, 21478216, 19854396, 18659828, 17896968, 17420311, 17343472, 17633654, 18250155, 18864647, 19642467, 20554315, 21467502, 22591207, 23725890, 24575029, 24213531, 22752077, 20662198, 18408076, 16222194, 14421525, 12925240, 11674779, 10621362, 9863410, 9302023, 8954962, 8617764, 8401542, 8162594, 7867078, 7449951, 7010286, 6505485, 5925794, 5525482, 5120879, 4884835, 4502288, 4165905, 4016944, 3839846, 3581425, 3448808, 3123331, 2964380, 2925640, 2773779, 2656796, 2574795]
4730B574795m4924j83232o728o2377j05906l3286p4228k8155l2379o9551k2983
4719A911046j6538q5029j47409P5270m4015m2423K9398q6867n3220K7090L8263
4708A605566k1751j9303J7025K6037j6244k4272L5583K7577L3526L0472P4759
4697A768975P9475O6688M7930J24113J10801J66158K16807K31532K50776K95825
4687C359080K75391J05778k8544j68573j39788j72556j66593j47494p572p4770
4677B834359L9699J06459O7311N7415K76701K53953K92017M60802N35147O35568
4667E559431N37683K02701k78873m81048n91023n08004m09670m24837l68996k25227
4657C012137j44587j37438p4203p4202M3784N5132J86981R9681K51241K18811
$$ y = [2574795, 2529871, 2346639, 2339911, 2277534, 2171628, 2138342, 2064114, 2035959, 2003580, 1934029, 1911046, 1894508, 1809479, 1662070, 1737340, 1693325, 1650902, 1680300, 1593433, 1540213, 1567303, 1605566, 1583815, 1564512, 1581537, 1607574, 1591330, 1567058, 1602641, 1630218, 1663744, 1694216, 1768975, 1848450, 1915138, 1963068, 2087181, 2197982, 2364140, 2580947, 2812479, 3063255, 3359080, 3634471, 3740249, 3711705, 3543132, 3403344, 3230788, 3064195, 2916701, 2909129, 2834359, 2874058, 2980517, 3047828, 3105243, 3381944, 3635897, 3927914, 4388716, 4923863, 5559431, 6097114, 6299815, 6020942, 5539894, 4948871, 4440867, 4031197, 3606360, 3237364, 3012137, 2867550, 2730112, 2655909, 2581707, 2625491, 2680623, 2867604, 2967285, 3218526, 3437337]
4647C437337K54066Q0125k12430l61144l52458l25671j92948k30489k81143j34704
4637A680541k15980j41983n0599q1157o7423n8326j18132k5056n7756k5987k9189
4626H08953o7677r537N8816k1619J4005j08327L3815k1415J5542K1123n2976O7632
4614G38335K1635j18548l4897O403K3077p6262M6663N877o5625j661M6826q320
4602E83503Q179k5845n013l6723l033K5028m5083J104J14077p463l6063k602n2810
4589E17256J9684n6484j2232m4373O5323q939o3352L4067n0620k503K0169K6403
4577D44399P2721l0878l5920l972K4791K2377P4041j6495k0231K0k5427P0108
4565E75534M3785l9147l0733j9312L0965Q2526j9038j25537K5236Q8672J2983
$$ y = [3437337, 3691403, 3771528, 3559098, 3197954, 2845496, 2519825, 2326877, 2096388, 1815245, 1680541, 1464561, 1322578, 1271979, 1190822, 1123399, 1065073, 946941, 921885, 864129, 838142, 808953, 741276, 731739, 790555, 768936, 782941, 674614, 708429, 687014, 702556, 723679, 670703, 738335, 759970, 641422, 606525, 612928, 636005, 559743, 606406, 612283, 546658, 544997, 591823, 583503, 591682, 565837, 560824, 524101, 521068, 546096, 501013, 502117, 616194, 608731, 572668, 570066, 517256, 536940, 480456, 468224, 423851, 489174, 480235, 416883, 450950, 400330, 397827, 417996, 444399, 517120, 486242, 450322, 446350, 471141, 493518, 567559, 551064, 530833, 530853, 505426, 575534, 619319, 580172, 549439, 530127, 561092, 643618, 624580, 499043, 524279, 612951, 625934]
4554F25934k7716O5072k9343n9140k7876J4034K9891l697q1865K49N530n636L6658
4541E42095o3046M9163n809l1840O1598m0952o4813L2419M173P885J01328k2314
4529E69887l8327o2579m5937M1394K9213j0828l960O2913j622m7310J3296P1536
4517E77676q9848J6896O0789J9173l6494k853p1456L4677M8840J7994r5690k4400
4505D55304Q267O1347O2764o1711L4981N7909o2108p345Q5945M8305K5809o0424
4493F49043Q9876k4643Q1762o1599j1374J0187L2580l279o333q3282m388J8232
4481F86782J3753K3114M0941J9333j9381P2410L1408J22032O9799O1219P882K6149
4469A155441j3135L728j55901K3601J2086m0010j3708j5533r48L1917Q712N4475
$$ y = [625934, 598218, 663290, 633947, 574807, 546931, 560965, 590856, 587159, 505294, 505543, 511073, 505437, 542095, 479049, 528212, 522403, 490563, 552161, 511209, 446396, 478815, 482988, 490873, 592201, 569887, 531560, 468981, 423044, 464438, 493651, 482823, 478863, 541776, 540154, 492844, 506140, 577676, 487828, 504724, 565513, 584686, 548192, 545339, 473883, 508560, 557400, 575394, 479704, 455304, 463571, 524918, 587682, 525971, 560952, 618861, 556753, 549408, 635353, 683658, 709467, 649043, 738919, 714276, 796038, 734439, 723065, 733252, 765832, 762553, 756220, 672938, 668550, 686782, 700535, 723649, 764590, 783923, 764542, 836952, 868360, 990392, 1060191, 1121410, 1129292, 1155441, 1142306, 1146034, 990133, 1013734, 1025820, 985810, 972102, 956569, 955621, 987538, 996250, 1050725]
4457A050725K030j4141Q5236l2719R4844P4619Q6308Q8885P6913p2857q9280j3496
4445A337067j11874o2444L6918o1258k7010Q2511J02244l6238q2795R0904L3916
4434A301941J6050N1058M2748P7860Q0422P7360O4005L3011n9355j5032O2937
4423A733005l7022K4902k268R7867L3109P1826N6448O1237R0356O8432N6009M8662
4411B302563M9611J49196P7441O2971J52129R0089R9748J41989Q5033R9283J56909
4400C466962J34724J51245J18644J77163J86945K02078J81959K79838K76221K98359
4390E474138K18631L41022L68731L87597N37970N22361M89456O24794P59168R37037
4380A0660905J167384J344534J593415K058891K358450K331588J321866j27667
$$ y = [1050725, 1052755, 1038614, 1123850, 1091131, 1185975, 1260594, 1346902, 1435787, 1512700, 1439843, 1350563, 1337067, 1225193, 1162749, 1199667, 1138409, 1111399, 1193910, 1296154, 1259916, 1177121, 1268025, 1301941, 1317991, 1369049, 1411797, 1489657, 1570079, 1647439, 1711444, 1744455, 1685100, 1670068, 1733005, 1695983, 1720885, 1718617, 1816484, 1849593, 1921419, 1977867, 2039104, 2129460, 2197892, 2253901, 2302563, 2352174, 2501370, 2578811, 2641782, 2793911, 2884000, 2983748, 3125737, 3210770, 3310053, 3466962, 3601686, 3752931, 3871575, 4048738, 4235683, 4437761, 4619720, 4899558, 5175779, 5474138, 5692769, 6033791, 6402522, 6790119, 7328089, 7850450, 8339906, 8964700, 9723868, 10660905, 11828289, 13172823, 14766238, 16825129, 19183579, 21515167, 22837033, 22709366]
4372B2709366j158292j466990j431219j220110q71225o08032l27240l3784J09479
4363A5701953M43108O60975J017115J241188J759447K111702K698424L630049
4355B9263961M582254M333707J646421j208659l107538l803693l587621l080786
4347B5038046k580061k059830j490851j112743r32236o22849l23344j19905R3228
4338A5889455M45888P43266J032987J363602J645702J668928Q22113m07938j424314
4329B1779689j960091j958120j842230j506434j450532j170878j095794q69436
4321I926174o93572o67223m58307l88809k13423k38445k39404j56396j08564l8444
4311F723587n8558q1712j36103k33745k74387k29718l81792k51857l53594k36658
$$ y = [22709366, 21551074, 20084084, 18652865, 17432755, 16561530, 15953498, 15626258, 15592474, 15701953, 16145061, 16806036, 17823151, 19064339, 20823786, 22935488, 25633912, 29263961, 33846215, 38179922, 39826343, 38617684, 35510146, 31706453, 28118832, 25038046, 22457985, 20398155, 18907304, 17794561, 16862325, 16239476, 15916132, 15796227, 15889455, 16335343, 17078609, 18111596, 19475198, 21120900, 22789828, 23611941, 23204003, 21779689, 19819598, 17861478, 16019248, 14512814, 13062282, 11891404, 10795610, 9926174, 9232602, 8565379, 8107072, 7718263, 7504840, 7266395, 7026991, 6870595, 6762031, 6723587, 6665029, 6583317, 6447214, 6213469, 5939082, 5709364, 5327572, 5075715, 4722121, 4485463]
4301D485463k64810j39381j70868j00033j47468r3680j02866j52661o7672j27379
4291C118645r5304p5123r5701l6082p7157l8626m5334k9162K3192j7317n1m5543
4279B586437r465j4204l0980l1025m3128p5069P1550n9021l8534L5304k0911K8726
4267B399680P6461M0075J25422K9784j3383R4692P3449k6123l2305J7962K6797
4256B812511J9145N739K3447P0848P7980O5765L1734Q2744J89826R1165O4929
4245C535833J47983J75904K46346K14172L45411L91736M91396K88423J47371j74940
4235E809635k51287k32689r5294q7258r9087m9988l0430r459q133J65133J55214
4224E266357K38257K87093K74668N53800P36733P94422N78969R4227l32796n66834
$$ y = [4485463, 4220653, 4081272, 3910404, 3810371, 3662903, 3569223, 3466357, 3313696, 3246024, 3118645, 3023341, 2948218, 2852517, 2816435, 2739278, 2700652, 2655318, 2626156, 2649348, 2632031, 2631980, 2586437, 2576972, 2562768, 2531788, 2500763, 2457635, 2382566, 2454116, 2395095, 2356561, 2391865, 2370954, 2399680, 2476141, 2516216, 2641638, 2671422, 2658039, 2752731, 2826180, 2800057, 2767752, 2785714, 2812511, 2831656, 2837395, 2860842, 2931690, 3009670, 3075435, 3107169, 3189913, 3379739, 3470904, 3535833, 3683816, 3859720, 4106066, 4320238, 4665649, 5057385, 5548781, 5837204, 5984575, 5809635, 5558348, 5325659, 5230365, 5143107, 5044020, 4994032, 4963602, 4954143, 4946010, 5111143, 5266357, 5504614, 5791707, 6066375, 6620175, 7356908, 8151330, 8730299, 8824526, 8491730, 7924896]
4214G924896m68601n59385m97074l13326l08360k47103r2167r5324n6938j9610
4204E267008j6548J38336J13024K25497L26032M02000J82006J034k07278k85538
4194F145573k47727l07589p5960j09869r4348j17043n3282P0076J28689J25699
4184E464219L7134M7435m0139j08412p8794j01071L250K6394o1698o9526J26784
4173E245576N1109j814P1503R2718O3587J44953J44663P2867R4695R9509R1086
4162F170452J23322K19607J37285J62538J85406K34887K59710J39457K58911K14304
4152H105879K60606K20863L56408K85415L40244M09554L58843M92412M05348N55922
4142A1791494N54963O13987O06074O30802N21036N91970N97975P15360P39959
$$ y = [7924896, 7456295, 6896910, 6399836, 6086510, 5778150, 5531047, 5438880, 5343556, 5286618, 5267008, 5250460, 5388796, 5501820, 5727317, 6053349, 6455349, 6637355, 6638389, 6431111, 6145573, 5897846, 5590257, 5514297, 5404428, 5310080, 5193037, 5139755, 5209831, 5338520, 5464219, 5501353, 5548788, 5508649, 5400237, 5321443, 5220372, 5223622, 5250016, 5188318, 5118792, 5245576, 5296685, 5294871, 5366374, 5459092, 5522679, 5667632, 5812295, 5885162, 5979857, 6079366, 6170452, 6293774, 6513381, 6650666, 6813204, 6998610, 7233497, 7493207, 7632664, 7891575, 8105879, 8366485, 8587348, 8943756, 9229171, 9569415, 9978969, 10337812, 10830224, 11235572, 11791494, 12346457, 12960444, 13566518, 14197320, 14718356, 15310326, 15908301, 16623661, 17363620]
4133A7363620P72381Q45051R95779J098751J181981J231129J413577J379838J257990
4124B7540097J310355J626112J912664J997312J712351J495860J662724K079448
4116D1336923K647326L362435M122409M616300N413719N866502N622676N855669
4108G8843959O514982O025704M535075K604505P34211j679556l517539m010453
4100I0050888l792316l616675l244775l288167l684249l686803l347807l058845
4092F2331251k970331k602198k258125k108967j733397j322995o74595J4360O78399
4083D9353402J540988K284753K877223K510262N80274j292527k632738l899399
4075E1322238m419055m261452l793824l044992k367487j745391j453788j221828
$$ y = [17363620, 18136001, 18981052, 19976831, 21075582, 22257563, 23488692, 24902269, 26282107, 27540097, 28850452, 30476564, 32389228, 34386540, 36098891, 37594751, 39257475, 41336923, 43984249, 47346684, 51469093, 56085393, 61499112, 67365614, 72988290, 78843959, 85358941, 91384645, 95919720, 98524225, 99258436, 97578880, 94061341, 90050888, 86258572, 82641897, 79397122, 76108955, 72424706, 68737903, 65390096, 62331251, 59360920, 56758722, 54500597, 52391630, 50658233, 49335238, 48660643, 48675003, 49353402, 50894390, 53179143, 56056366, 58566628, 59146902, 57854375, 55221637, 51322238, 46903183, 42641731, 38847907, 35802915, 33435428, 31690037, 30236249, 29014421]
4067B9014421j137817p92249n98267k03388J91477N26531Q22771L16541q54325
4058B7285695j852330k298329k235127k077718j897524j583657j390877j017958
4050A2932175r64576q17365p36019o42160n89154m60946l93904l59810l32079
4041G636162l10083k51465k69853k60396k16517j54069j95291j76505j37565p1916
4031E592502j03634j47348p7275m4167j47118o2394n7992j8402l3652J3466J77630
4020E091616K1342l299o3420j3604j4455O4846n305K5669Q0163J33793J25639
4009E442985N6407R3172J72787J89739K19508K33988L00916L10793M31393N01009
3999G952697P27191J002838J285436J794566J402273j03383j009231j332754j354147
$$ y = [29014421, 27876604, 27084355, 26486088, 26282700, 26474177, 27000708, 27823479, 28140020, 27285695, 25433365, 23135036, 20899909, 18822191, 16924667, 15341010, 13950133, 12932175, 11967599, 11150234, 10414215, 9772055, 9182901, 8721955, 8328051, 7968241, 7636162, 7326079, 7074614, 6804761, 6544365, 6327848, 6173779, 5978488, 5801983, 5664418, 5592502, 5488868, 5341520, 5264245, 5220078, 5072960, 5010566, 4952574, 4934172, 4900520, 4913986, 5091616, 5112958, 5109659, 5046239, 5032635, 5018180, 5083026, 5077721, 5103390, 5183553, 5317346, 5442985, 5499392, 5592564, 5765351, 5955090, 6174598, 6408586, 6709502, 7020295, 7451688, 7952697, 8679888, 9682726, 10968162, 12762728, 14165001, 14061618, 13052387, 11719633, 10365486]
3990A0365486j074280q92577p49757n25143n19316m10576l32223k06340l19573
3981E335701k88319l62045l50531k33181j94893j94108j18137j01554q6638p8390
3971C327905j18197L0314l6217J7991Q1051R2098O0323O2645J07185J73067J61713
3960C959878L18749J99549j120k66616k14439m46252l15796k37756k57456j77063
3950B561678j37289n1171n4030j47244l9724M724k1435l1551K6746R1096J09112
3939B310912J11764J30224K12153K53004L36786J43406j19357l62274k68316k68948
3929B479354j68051k01663j55462j13690j06628j43412j27330N555o1255j4411
3919A393007N6401n2983p8108J03984N3297M600Q1907P8942P5675L1912L2330
$$ y = [10365486, 9291206, 8398629, 7648872, 7123729, 6604413, 6193837, 5861614, 5655274, 5335701, 5047382, 4685337, 4334806, 4101625, 3906732, 3712624, 3594487, 3492933, 3406295, 3327905, 3209708, 3240022, 3203805, 3221796, 3302847, 3394945, 3455268, 3517913, 3625098, 3798165, 3959878, 4278627, 4478176, 4477056, 4210440, 3996001, 3549749, 3233953, 2996197, 2738741, 2561678, 2424389, 2373218, 2319188, 2171944, 2132220, 2136944, 2115509, 2083958, 2110704, 2201800, 2310912, 2422676, 2552900, 2765053, 3018057, 3354843, 3498249, 3378892, 3016618, 2748302, 2479354, 2311303, 2109640, 1954178, 1840488, 1733860, 1590448, 1463118, 1468673, 1407418, 1393007, 1449408, 1396425, 1318317, 1422301, 1475598, 1480198, 1562105, 1641047, 1716722, 1748634, 1780964]
3908A780964j52929p9404n6797o7308o7277j00853m7397L56J807j14433K1262
3897A117991m6029k4566o4950j9397J2651M738l3644m7222J02217J791k0389N0387
3885A033578n1574m322J6527J8130N0945O680m6358J48553L3789m7829r088j2286
3873A136745M1733n4173N817L940p4489n63M2478K7185o5384j10285o6745Q0246
3861I66505P165j6228J690N330K9875O9611j6372k1002K8054J8146k9710l4879
3849A008185L5647r6129l8651m310k0182m8342m2598Q8393K6267o3385p2501J6396
3837G88790o1077k5758N8727l4879l5656M3596o9971p2481P2259Q248n0462J2913
3825F34249j0644r9536L6946L5777M6520k3393j2885L1770n1728K804k863o2181
$$ y = [1780964, 1628035, 1548631, 1491834, 1424526, 1357249, 1256396, 1208999, 1209355, 1211162, 1096729, 1117991, 1071962, 1047396, 982446, 963049, 975700, 980438, 946794, 899572, 1001789, 1003580, 983191, 1033578, 982004, 977682, 994209, 1012339, 1063284, 1069964, 1023606, 1172159, 1205948, 1158119, 1149031, 1136745, 1178478, 1124305, 1130122, 1134062, 1059573, 1059010, 1101488, 1128673, 1063289, 953004, 886259, 966505, 973670, 957442, 959132, 964462, 994337, 1063948, 1047576, 1026574, 1054628, 1072774, 1043064, 1008185, 1043832, 947703, 909052, 904742, 884560, 836218, 793620, 882013, 908280, 844895, 772394, 788790, 727713, 701955, 760682, 725803, 690147, 733743, 663772, 591291, 663550, 671798, 621336, 634249, 623605, 524069, 561015, 596792, 643312, 619919, 607034, 638804, 587076, 589880, 587017, 524836]
3813E24836M5655r5174k8207n4744J9155N0219K13J1594P472K1899L390j4958
3801D91350J1863J4984J2888o9017L222N084k5255J8307k4711l2759m3065K8222
3789C91113K3998K8340k0852K058J4743n0238Q595K5811L9392K3971k6464J4754
3777D75221K4954l8145l6065l9342N0265q497J0553P7749r3670J0648Q3342k4029
3765D92984j1709M8281l9306k8230P852p2494O8646o490o7803J5144J4250P48
3753D21873k576k8913k25K292O2553J5106M57o0907n8978L9684M993K7983m9535
3740C73807J5309J9961o8840K5808j3388l791M6483l1881L9028m8869o0782K4094
3728C16939L2101j017k1913O4133K3553L0531J3893k4692m7840m8734J6360k2296
$$ y = [524836, 570491, 475317, 447110, 392366, 411521, 461740, 461953, 473547, 481019, 502918, 506308, 491350, 503213, 518197, 531085, 462068, 465290, 470374, 445119, 463426, 438715, 405956, 362891, 391113, 415111, 443451, 422599, 424657, 439400, 389162, 397757, 423568, 462960, 486931, 460467, 475221, 500175, 462030, 425965, 386623, 436888, 428391, 438944, 516693, 423023, 433671, 517013, 492984, 481275, 529556, 490250, 462020, 469872, 397378, 466024, 459534, 391731, 406875, 421125, 421873, 419297, 390384, 390159, 392451, 455004, 470110, 470567, 409660, 350682, 390366, 395359, 423342, 373807, 389116, 409077, 340237, 366045, 352657, 348866, 395349, 363468, 402496, 353627, 292845, 316939, 349040, 348023, 326110, 390243, 413796, 444327, 458220, 433528, 385688, 336954, 353314, 331018]
3716C31018P4218p3722J8020N8403K1041m7396O6468j7997J1822O1423k5018K2269
3704E00549k4045m3819K6340N4616k4830p6360L9489J18384k4044j013L5945n0148
3692E31064l7882L9559P0495j3811K6960L9948o7064O9575R4071r268r6823N6076
3680G02900J08818l334K8507q2115L5499J17665Q2087o3642N2859L9932j1000
3669A008176Q4752j19309Q4202K4438J15650K6683J34476O3191j3754Q7624O4014
3658A560143N9518l864J36424M1425J20594J15521J02018J98602J02679R8611
3648B531671K07536K85887J82158J36056J49379L29918K79966L42076O16427P33747
3638E794821J209548J038070R1520k55748n66692n17478k89953j64488J09608
$$ y = [331018, 405236, 331514, 349534, 407937, 428978, 381582, 448050, 430053, 441875, 503298, 478280, 500549, 476504, 432685, 459025, 513641, 488811, 412451, 451940, 570324, 546280, 545267, 581212, 531064, 493182, 532741, 603236, 589425, 616385, 656333, 589269, 658844, 752915, 743647, 646824, 702900, 811718, 808384, 836891, 754776, 790275, 907940, 990027, 926385, 979244, 1019176, 1008176, 1092928, 973619, 1057821, 1082259, 1197909, 1224592, 1359068, 1422259, 1408505, 1496129, 1560143, 1619661, 1615797, 1752221, 1793646, 1914240, 2029761, 2131779, 2330381, 2433060, 2531671, 2739207, 3025094, 3207252, 3343308, 3492687, 3822605, 4102571, 4444647, 5061074, 5794821, 7004369, 8042439, 8133959, 7878211, 7311519, 6794041, 6504088, 6339600, 6449208]
3629F449208L94001M53530o7863m86210p10007o91042o13121m90761m04212k37459
3619C596064j50953j41191k13385j16021j1167j3574N2660Q862J5774j1850k4081
3608B991138j8811o9439p3075L1502K6829K325R0000M6423L9513K5070M6075J72526
3596C310076J17474J60381Q9631J16228J47493q4866J21431L7764J03341K936
3586D121889K9072J21241P7772J71905K30833P9624K43571J84405J89855J75292
3576E625459K99567L91427L16642L95470M42638M35607N65901O05275O56324P24458
3566A0458768P92885J023500J159709J427378J683653K012534K056331J366076
3558B1980834j7594p95196j163542j154604r91007p61164k35269o5098J66559
$$ y = [6449208, 6843209, 7296739, 7228876, 6742666, 6032659, 5341617, 4728496, 4237735, 3833523, 3596064, 3445111, 3303920, 3090535, 2974514, 2963347, 2949773, 3002433, 3011295, 3027069, 3015219, 2991138, 2972327, 2902888, 2829813, 2861315, 2888144, 2890469, 2980469, 3026892, 3066405, 3091475, 3137550, 3310076, 3427550, 3587931, 3677562, 3793790, 3941283, 3856417, 3977848, 4015612, 4118953, 4121889, 4150961, 4272202, 4349974, 4521879, 4752712, 4832336, 5075907, 5260312, 5450167, 5625459, 5925026, 6316453, 6633095, 7028565, 7471203, 7906810, 8472711, 9077986, 9734310, 10458768, 11251653, 12275153, 13434862, 14862240, 16545893, 18558427, 20614758, 21980834, 21963240, 21168044, 20004502, 18849898, 17858891, 17097727, 16862458, 16797360, 16963919]
3549A6963919M09101N91309Q80252J294310J753730K173646K760158K580891J945864
3540C1353180P53869r32414k231394k841501k793750k324669j910616j333290
3532A7739415j128429q96363o92917m34576j13562R8560L23127P19982R86393
3523A6601630J070844N47400n97604j375320j682064j802819j542269j360140
3515I859658j079364r99361p67684o50005n28874n26688l47247l15045l58219
3506D287171k38522k65923k01157j72344j43981j37350j34151j44953j60372o9928
3496B618490n2139j63022o9473p7784r0412o4516k4589p2081o9074L4880l6870
3485A933410l6460m4889j43053j10036L6622J9646k9030L4221j28475O8832p6268
$$ y = [16963919, 17373020, 17964329, 18844581, 20138891, 21892621, 24066267, 26826425, 29407316, 31353180, 32107049, 31174635, 28943241, 26101740, 23307990, 20983321, 19072705, 17739415, 16610986, 15714623, 15021706, 14587130, 14473568, 14572128, 14895255, 15615237, 16601630, 17672474, 18219874, 17622270, 16246950, 14564886, 12762067, 11219798, 9859658, 8780294, 7780933, 7013249, 6363244, 5834370, 5307682, 4960435, 4645390, 4287171, 4048649, 3782726, 3581569, 3409225, 3265244, 3127894, 2993743, 2848790, 2688418, 2618490, 2566351, 2403329, 2333856, 2256072, 2165660, 2101144, 2076555, 2004474, 1935400, 1970280, 1933410, 1896950, 1852061, 1709008, 1598972, 1635594, 1655240, 1626210, 1660431, 1531956, 1600788, 1524520]
3474A524520k2011L8828J5779k4839K6277P9771J01715l0820K12M4432P0623K5422
3462A849909M80n2669j16639r7070J3668m4230p1291J9321L4206q139l8758J23193
3450A611981N1118K9011K2014J45539N8288j21704m9956K7860j13953p9423j49033
3439A431742j77175k4237n0960q182N863Q3931n2793p1320R1071l799L7450L5088
3427A296679K0421j44959j39283n4139j17298L140l2455r5917M890k4316m2439
3416F74324R9878p7365o3176m573l9763m1765J0918Q734j5791K2227L9722r7189
3404E16181k1050P3679N21l8187M5517l6337N4750j0070k146p2463N7728j287
3392E66836q7607J7014R1886J0508l8231o7065j033R677O332K9752r867m0306
$$ y = [1524520, 1502509, 1541337, 1557116, 1532277, 1558554, 1638325, 1740040, 1709220, 1709432, 1753864, 1824487, 1849909, 1850389, 1797720, 1681081, 1584011, 1597679, 1553449, 1482158, 1501479, 1535685, 1527546, 1488788, 1611981, 1663099, 1692110, 1714124, 1859663, 1917951, 1796247, 1746291, 1774151, 1660198, 1580775, 1431742, 1254567, 1230330, 1179370, 1171188, 1177051, 1260982, 1208189, 1136869, 1227940, 1224141, 1261591, 1296679, 1317100, 1172141, 1032858, 978719, 861421, 864561, 832106, 736189, 741079, 716763, 674324, 774202, 696837, 633661, 629088, 589325, 547560, 558478, 567212, 551421, 573648, 613370, 516181, 495131, 568810, 569331, 531144, 576661, 540324, 595074, 585004, 582858, 510395, 568123, 566836, 479229, 496243, 588129, 598637, 560406, 493341, 492308, 501985, 508317, 538069, 528202, 487896]
3380D87896m6544M8558K2580Q706J6837M8700j41166l301n3404L7958N6262j0532
3368D72550j7268n2570m7990j9909Q0177j2621k3515K1432M854j9474m0360l5085
3356C10221Q48J04010j3137q3022N534O4141l681J4697J5223P501p5426o1944
3344B84965N9022R9549k7726o175K7135K07l2370J6795k6127r940J3688P3272
3332D72295k964m7498R9761O2461j12698m6546L7840N3863k8766j572k838L373
3320D86711L920k1988L5530Q931J4190K5752N0403j7022j4355l7721j3773K2751
3308E43329J0574j2903k8894k3300O7520k2304K0901L350j3153N9315n6249J8286
3296E66472M4143j3928n4446M2835J4042r303n3499O2353L483l1347N1900l9389
$$ y = [487896, 441352, 489910, 512490, 521196, 538033, 586733, 445567, 442266, 388862, 426820, 483082, 472550, 455282, 402712, 354722, 334813, 414990, 402369, 378854, 400286, 405140, 385666, 345306, 310221, 311069, 415079, 401942, 318920, 324454, 388595, 384914, 399611, 414834, 422335, 346909, 284965, 343987, 443536, 415810, 409635, 436770, 436977, 404607, 421402, 395275, 385335, 399023, 472295, 469331, 421833, 521594, 584055, 471357, 424811, 462651, 516514, 487748, 486176, 483338, 486711, 490631, 468643, 504173, 513104, 527294, 553046, 603449, 586427, 572072, 534351, 520578, 543329, 553903, 541000, 512106, 488806, 556326, 534022, 554923, 558273, 545120, 604435, 548186, 566472, 610615, 596687, 542241, 585076, 599118, 589815, 536316, 598669, 602152, 570805, 622705, 583316]
3284E83316o6335K5512Q6743p7865l548P8555K1108J2129k445K2441l8154j9973
3272F21484r8974J0054P1944P0343R1582j3636J1231p642L8674N8159J2016j7700
3260H47535m6558n7203j1406K8095l0800m153l288J35340L7752p961j7140Q265
3248H78478j1716m169J0980O033O3967m7692N0260j4909K185J34165K1610l6642
3236A052550K6002L6016M7180J6018J20750q110K2475P3455J08984L5716Q3608
3225A614644N1989O6924o93N0711J17648O4559J82132R1301N5745N9394Q1210
3214B435564R9011J35552Q5482J22516P1384J64198K64426J17335K38905J22613
3204C856986J69824K98431J52794K94529K29181L23443M01416M51601L24863L33642
$$ y = [583316, 516981, 542493, 629236, 551371, 547823, 626378, 647486, 659615, 657170, 679611, 641457, 621484, 522510, 532564, 604508, 674851, 766433, 752797, 764028, 756386, 795060, 853219, 865235, 847535, 800977, 743774, 732368, 760463, 729663, 725510, 722222, 857562, 895314, 887353, 870213, 878478, 866762, 862593, 873573, 879606, 943573, 895881, 946141, 931232, 933417, 1067582, 1089192, 1052550, 1078552, 1114568, 1161748, 1177766, 1298516, 1290406, 1312881, 1386336, 1495320, 1531036, 1614644, 1666633, 1733557, 1732864, 1783575, 1901223, 1965782, 2147914, 2239215, 2294960, 2354354, 2435564, 2534575, 2670127, 2755609, 2878125, 2949509, 3113707, 3378133, 3495468, 3734373, 3856986, 4026810, 4325241, 4478035, 4772564, 5001745, 5325188, 5726604, 6178205, 6503068, 6836710]
3194F836710M70421M69915M95960O02316O52067P35873P54020O93618P46811N44527
3184A3002238N09118M65703O63606P99504Q78951J049730J231376J115887R43515
3175B0659628O38713J98600Q7693L3563J72778L52256N63220Q42793R33609P90719
3165B5273572L76445o7427n83050q74523r98093p72482o65459l35520J10234O3066
3155B1526763n3846k58403q49209j098783j255803j290534j263548r79166p19590
3146A3757881n16862m27563m55904n34562o40624q42577p76097q96951p93218
3137G873523o31803m47051l87502m22290l50873l19036l02104l13462l36771k94810
3127D067821k63318k56443q5477k33588j48134r2263j17826j13945j44130l4649
$$ y = [6836710, 7307131, 7777046, 8273006, 8875322, 9527389, 10263262, 11017282, 11710900, 12457711, 13002238, 13511356, 13977059, 14640665, 15440169, 16319120, 17368850, 18600226, 19716113, 20659628, 21298341, 21496941, 21584634, 21618197, 21790975, 22143231, 22706451, 23549244, 24482853, 25273572, 25650017, 25582590, 24999540, 24125017, 23126924, 22354442, 21688983, 21353463, 21463697, 21526763, 21472917, 21214514, 20365305, 19266522, 18010719, 16720185, 15456637, 14477471, 13757881, 13241019, 12813456, 12357552, 11822990, 11182366, 10339789, 9563692, 8666741, 7873523, 7241720, 6794669, 6407167, 5984877, 5634004, 5314968, 5012864, 4699402, 4362631, 4067821, 3804503, 3548060, 3462583, 3228995, 3080861, 2988598, 2870772, 2756827, 2612697, 2578048]
3117B578048k5652l6668r7903j42196q9455l8590P0837k7322P7782p6420r1871
3106B100590m4507p1708p604N3964l8616l8404J7467J8599j72736o409n122j03797
3094A701717j0142M9025o4028k3547L0469q6496r29O6016r2905j3387l5563o9407
3082A450823j0436J0598m5722j2929m950L116j27624k8326K520J6212o0782m4053
3070A148447N2163K6596j022L5093k1989N8269k2368l0901l5672j118l5895n5374
3058A116229J61651q6353p7405P3541p4070L3871L2691R8777L3678n0086q2257
3047A180267k9182J3535j4066J5185J3900n1029P829N4485J1693K236J1269L7885
3035A254007j2891l6136M5881k0656J7882O3243k302M2513j027l8366q192m1965
$$ y = [2578048, 2552396, 2515728, 2417825, 2275629, 2186174, 2147584, 2218421, 2191099, 2268881, 2192461, 2100590, 2056083, 1984375, 1976771, 2030735, 1992119, 1953715, 1971182, 1989781, 1817045, 1810636, 1805514, 1701717, 1691575, 1740600, 1676572, 1653025, 1683494, 1596998, 1596069, 1662085, 1569180, 1555793, 1520230, 1450823, 1440387, 1450985, 1405263, 1392334, 1387384, 1390500, 1262876, 1234550, 1237070, 1253282, 1192500, 1148447, 1200610, 1227206, 1226184, 1261277, 1239288, 1297557, 1275189, 1244288, 1208616, 1207498, 1171603, 1116229, 1277880, 1191527, 1114122, 1187663, 1113593, 1147464, 1180155, 1278932, 1312610, 1262524, 1180267, 1151085, 1164620, 1150554, 1165739, 1179639, 1128610, 1136439, 1190924, 1202617, 1204853, 1216122, 1254007, 1241116, 1204980, 1250861, 1230205, 1248087, 1311330, 1309028, 1351541, 1350514, 1312148, 1303956, 1261991]
3023A261991Q1122K6667j7735R1658J2708K0897r3148M187P8858M5421j9917o6305
3011A426404j7160O0847M6200O1886J6023K0178M1781p484l9262M5737M9926O6564
2999A771640R581M6445l3624R8887n2721J5355O5377O1133J3568K1468q5106P0827
2987B002830R5856N4634Q8498J0442Q9940n2977P0730J01258m9528O1293O3633
2976B536609L5645O6782k6324P3035R2810P2119P0224P5008J46710Q6786R5697
2965C325101P6694J39030K5767J17980R7277O0885J25408J65443Q8686J62110
2955D384381J97751J30434J28048J89365J68067J58934J66339J75761K18911J73301
2945F091292K47536K83898J42166K49204K62037J81980L15767K86405J92372L31735
$$ y = [1261991, 1343113, 1369780, 1352045, 1443703, 1456411, 1477308, 1384160, 1388347, 1467205, 1512626, 1492709, 1426404, 1409244, 1470091, 1516291, 1578177, 1594200, 1614378, 1656159, 1648675, 1609413, 1655150, 1705076, 1771640, 1781221, 1827666, 1794042, 1892929, 1840208, 1855563, 1920940, 1982073, 1995641, 2017109, 1932003, 2002830, 2098686, 2153320, 2241818, 2252260, 2342200, 2289223, 2359953, 2461211, 2411683, 2472976, 2536609, 2572254, 2639036, 2612712, 2685747, 2778557, 2850676, 2920900, 2995908, 3142618, 3229404, 3325101, 3401795, 3540825, 3566592, 3684572, 3781849, 3842734, 3968142, 4133585, 4222271, 4384381, 4582132, 4712566, 4840614, 5029979, 5198046, 5356980, 5523319, 5699080, 5917991, 6091292, 6338828, 6622726, 6764892, 7014096, 7276133, 7458113, 7773880, 8060285, 8252657, 8584392]
2935H584392K76456K70862L49408L61781L46016M31436M45683M55348M27763M70720
2925A2419865M94462O29906O23723O86871P54246P09557P62977R13158J027341
2916A9022106R46944J109989J106383J183462J290130J411776J472296J519049
2908B9062135J557636J891926J810452J830455K026795K037569J951996J989718
2900D4158682J743388J537717J261722Q22380L50528j60121o66317j099483j531514
2891D6416982j825093j998519k203507k233266k278274k094150k081044k033351
2883B9669778j800460j771905j662488j505986j307965j219145j146205j110282
2875A8145342r05013q88904p80563q33078p37219o39356n74936o39790n34132
$$ y = [8584392, 8860848, 9131710, 9481118, 9842899, 10188915, 10620351, 11066034, 11521382, 11949145, 12419865, 12914327, 13544233, 14167956, 14854827, 15609073, 16318630, 17081607, 17994765, 19022106, 19969050, 21079039, 22185422, 23368884, 24659014, 26070790, 27543086, 29062135, 30619771, 32511697, 34322149, 36152604, 38179399, 40216968, 42168964, 44158682, 45902070, 47439787, 48701509, 49523889, 49874417, 49714296, 49047979, 47948496, 46416982, 44591889, 42593370, 40389863, 38156597, 35878323, 33784173, 31703129, 29669778, 27869318, 26097413, 24434925, 22928939, 21620974, 20401829, 19255624, 18145342, 17240329, 16351425, 15570862, 14737784, 14000565, 13361209, 12786273, 12146483, 11612351]
2866A1612351m20439m86527l72837m44101l20807l65590k80716l29814k75827
2857H315693k72429k97083j58828k27176j71807k53900k86678n3197k12982j97774
2847F183839j03631r5666q7898j68827j85887j02781k8662j15196p7672j51820
2837E065799K7955j13722j27202r7600o7994k5068r9362l939q020q6046k0919
2826D443882k7470k0550l3825N1700r9925N1658K7540n2649k9381M1814K1361
2815D374155j581O9742P5462K6095l3407J7365M9230l1122k5750k8652j1181M3860
2803D524216J2113m2932r1563o185K1884L2657O506p2750p1480L4724N9473k2200
2791D384463q3155L478p2622j1906J7706P5274J7567K3604J7484M2621P3870L1537
$$ y = [11612351, 11191912, 10705385, 10332548, 9888447, 9567640, 9202050, 8921334, 8591520, 8315693, 8043264, 7746181, 7587353, 7360177, 7188370, 6934470, 6647792, 6594595, 6381613, 6183839, 6080208, 5984542, 5896644, 5727817, 5541930, 5439149, 5410487, 5295291, 5217619, 5065799, 5093754, 4980032, 4852830, 4755230, 4687236, 4662168, 4562806, 4558867, 4550847, 4464801, 4443882, 4416412, 4395862, 4362037, 4413737, 4313812, 4365470, 4393010, 4340361, 4310980, 4352794, 4374155, 4372574, 4442316, 4517778, 4543873, 4510466, 4527831, 4577061, 4545939, 4520189, 4491537, 4480356, 4524216, 4536329, 4493397, 4401834, 4395649, 4417533, 4450190, 4456696, 4383946, 4312466, 4347190, 4406663, 4384463, 4301308, 4304786, 4232164, 4220258, 4237964, 4313238, 4330805, 4354409, 4371893, 4414514, 4488384, 4519921]
2779D519921J5362J6546Q3408P9263J5272Q3947O9179Q6720N2790N7426Q4533
2768E164367J03825P5472P9552J17953J19558Q7255N5343k2860J74503L6911O3236
2757F055115J58174P7562J22437J58014R7595J80063J18155J58588J11849K27560
2747G465112J85358J63966J59404J96852K09414K89003K06435K67474L33137L80926
2737I857081K62198K83551L88499L88419L10762M75773M00182L27714N27142N27499
2727A3748820O77607O33009O99492P76943Q53238Q91864J102282J112111J242838
2718B1738204J353405J636453J845711K111319K504125K805901L128459L555823
2710D0679400L695419L795488L674122L299427L082955K732429K228107J837286
$$ y = [4519921, 4535283, 4551829, 4635237, 4714500, 4729772, 4813719, 4882898, 4969618, 5022408, 5079834, 5164367, 5268192, 5343664, 5423216, 5541169, 5660727, 5747982, 5803325, 5780465, 5954968, 5991879, 6055115, 6213289, 6290851, 6413288, 6571302, 6668897, 6848960, 6967115, 7125703, 7237552, 7465112, 7650470, 7814436, 7973840, 8170692, 8380106, 8669109, 8875544, 9143018, 9476155, 9857081, 10119279, 10402830, 10791329, 11179748, 11490510, 11966283, 12366465, 12694179, 13221321, 13748820, 14426427, 15059436, 15758928, 16535871, 17389109, 18280973, 19383255, 20495366, 21738204, 23091609, 24728062, 26573773, 28685092, 31189217, 33995118, 37123577, 40679400, 44374819, 48170307, 51844429, 55143856, 58226811, 60959240, 63187347, 65024633]
2702F5024633J484346J046797O58810L34007k85234p32027r91871j245122j608360
2693F3685979j963850k288266k683789k927113l265995l601289l748823l777740
2685C9429114l686600l427538l054631k614429k234953j881753j483724j327684
2677A9717802j212348j008011q07519p47043o20927n04015m17562l81474m30544
2668A3588359k25779j90672k79757k05075j37090m2989j70857j5835L7823n4347
2658A2303781K4225P9871J7083J03163J51589J45909J58770K33793K30983K90079
2648A3739246L33921K63968L23614K60358L88048M25504M81767M67730N00811
2639A7184967N72718M74202N40769N69247M85632N72449N50915O85895O85560
$$ y = [65024633, 66508979, 67555776, 68214586, 68548593, 68263359, 67531332, 66539461, 65294339, 63685979, 61722129, 59433863, 56750074, 53822961, 50556966, 46955677, 43206854, 39429114, 35742514, 32314976, 29260345, 26645916, 24410963, 22529210, 21045486, 19717802, 18505454, 17497443, 16689924, 15942881, 15321954, 14817939, 14400377, 14018903, 13588359, 13362580, 13171908, 12892151, 12687076, 12549986, 12506997, 12336140, 12320305, 12358128, 12303781, 12328006, 12407877, 12424960, 12528123, 12679712, 12825621, 12984391, 13218184, 13449167, 13739246, 14073167, 14337135, 14660749, 14921107, 15309155, 15734659, 16216426, 16684156, 17184967, 17757685, 18231887, 18772656, 19341903, 19827535, 20399984, 20950899, 21636794, 22322354]
2630B2322354O51716P24003Q31554Q74007Q36394J022638J098764J065840J227535
2621C0654805J317299J444887J615505J793012J994468K292284K549374K781739
2613D6443373L135089L377386L618994L917707M264347M664693N202917N690714
2605H0315220O362051O956742P530215P793854P908071P565269O995001O149442
2597A37575865M996976M037334L105738K375934J966077J231183P14300K69763
2589A56273170r7874q24068j599192k478227l381190m075469m704433n285327
2581A33827390n659891n564647n281046m517776l633781k509204j270648M444
2573A05394841J122615K112373K678546L278074L718786L870453L618365L101850
$$ y = [22322354, 22974070, 23698073, 24529627, 25403634, 26240028, 27262666, 28361430, 29427270, 30654805, 31972104, 33416991, 35032496, 36825508, 38819976, 41112260, 43661634, 46443373, 49578462, 52955848, 56574842, 60492549, 64756896, 69421589, 74624506, 80315220, 86677271, 93634013, 101164228, 108958082, 116866153, 124431422, 131426423, 137575865, 142572841, 146610175, 149715913, 152091847, 154057924, 155289107, 156003407, 156273170, 156175296, 155351228, 153752036, 151273809, 147892619, 143817150, 139112717, 133827390, 128167499, 122602852, 117321806, 112804030, 109170249, 106661045, 105390397, 105394841, 106517456, 108629829, 111308375, 114586449, 118305235, 122175688, 125794053, 128895903]
2565A28895903K353386J577944R31389L72142k63617q83910j446963k080504k550699
2556A26905071k844874l214125l394101l561394l497825l333421l053821l357435
2548A00648075m517428m817556n054482m889209m522390m670565m908024m808905
2540F2459516m728278m316050l796764l396420k917739k424402k033179j614671
2532C7232013j286980r28275n15542R2661k22332r48537r02507q48048m91266
2523C1181187k94966R0749K59223M85142M65593K62511K75616P2113q1269j74579
2513C2541320k82079k40118l01272p9208l23695o08917p63842q24573o67254o01115
2503B7849247o68498q08876q42664q05829o77380o38321m94292k05207j78646
$$ y = [128895903, 131249289, 132827233, 133758622, 134130764, 133867147, 132983237, 131536274, 129455770, 126905071, 124060197, 120846072, 117451971, 113890577, 110392752, 107059331, 104005510, 100648075, 96130647, 91313091, 86258609, 81369400, 76847010, 72176445, 67268421, 62459516, 57731238, 53415188, 49618424, 46222004, 43304265, 40879863, 38846684, 37232013, 35945033, 35016758, 34501216, 34593877, 34371545, 33423008, 32520501, 31672453, 31181187, 30886221, 30976970, 31236193, 31721335, 32186928, 32449439, 32725055, 32797168, 32715899, 32541320, 32259241, 32019123, 31717851, 31638643, 31314948, 30706031, 29942189, 29117616, 28450362, 27849247, 27180749, 26371873, 25529209, 24723380, 24046000, 23407679, 22913387, 22708180, 22529534]
2494B2529534l0423J69555L73671N14466O09343R99294Q95612P26031J016264
2485B7803347J162385J373526J690148K153344K339475K593542K736109K852718
2477D4704594K957129L231228L426233L414384L393380L029219K585588K269697
2469F9011452K123620J913175J373803N92465m92157j567367k364583l377144
2461F7213264m183701m738576n010198n061697m803632m438649m024061l598508
2453C1354242l058227k613106k182187j909208j650178j351417j143953r44177
2445A6501789q92235o66080o02795n81965m27397m74129l65871l53047l53542
2436A1784728k59255k73969j36652k14355j78005l8160l5555Q5094N0946k0164
$$ y = [22529534, 22499111, 22668666, 23042337, 23556803, 24166146, 25165440, 26061052, 26787083, 27803347, 28965732, 30339258, 32029406, 34182750, 36522225, 39115767, 41851876, 44704594, 47661723, 50892951, 54319184, 57733568, 61126948, 64156167, 66741755, 69011452, 71135072, 73048247, 74422050, 75014515, 74522358, 72954991, 70590408, 67213264, 63029563, 58290987, 53280789, 48219092, 43415460, 38976811, 34952750, 31354242, 28296015, 25682909, 23500722, 21591514, 19941336, 18589919, 17445966, 16501789, 15609554, 14943474, 14340679, 13758714, 13331317, 12857188, 12491317, 12138270, 11784728, 11525473, 11251504, 11114852, 10900497, 10722492, 10684332, 10648777, 10733871, 10784817, 10764653]
2426A0764653R8530J74434J8205m9706j8681j08612k03452k08966k79186l32647
2416I854572l09405m01962l37031k46163j89793k17952j37659j46660j25445o1782
2406G680720j42303r2053m1212l6261p8216n9950j87862o2184q5980r2134p0997
2395F731568p3007n8204l085n297J12436l9871j5095K6675j0474M2593K9819M3055
2383F781113Q2534O2089K6574J16010M2194J1894N1937L446J03355P8220N8379
2372G417745J22753K06611P9175J81746K56137J69324K56508J67345J73413J84708
2362I215465K04125J80993J13332K26647L17521J76730K33218J03619J62457K37672
2352A1171779J59155K08506K87188L75455K81141L89912L96393O68303O43001
$$ y = [10764653, 10863183, 11037617, 11055822, 11006116, 10987435, 10878823, 10675371, 10466405, 10187219, 9854572, 9545167, 9143205, 8806174, 8560011, 8370218, 8152266, 8014607, 7867947, 7742502, 7680720, 7538417, 7446364, 7405152, 7368891, 7290675, 7230725, 7042863, 6980679, 6894699, 6802565, 6731568, 6658561, 6600357, 6597272, 6591975, 6704411, 6664540, 6649445, 6676120, 6665646, 6708239, 6738058, 6781113, 6863647, 6925736, 6952310, 7068320, 7110514, 7122408, 7174345, 7177791, 7281146, 7359366, 7417745, 7540498, 7747109, 7826284, 8008030, 8264167, 8433491, 8689999, 8857344, 9030757, 9215465, 9419590, 9600583, 9713915, 9940562, 10258083, 10434813, 10668031, 10771650, 10934107, 11171779, 11330934, 11539440, 11826628, 12202083, 12483224, 12873136, 13269529, 13937832, 14580833]
2343A4580833O01056O41420N38857O01624N65844N57356P11091O96242R16294
2334B0410617J052044J144758R98101Q38982P49545O28825N84271N41945P03074
2325B7652162P07350O67984Q08617R36579J120381J306810J532796J704451J819977
2316C8257107K167434K377810K561113K857425L077118L427154L809164M225588
2308F2759913M782872N388298O145607O762455P761185R262026J0759773J2438631
2300A26060760J4311471J6801875K0766627K6487635L5383723M6188906M8408333
2293C34409330K9893672J061768k4928013l9287928m1833889l8481634l2687397
2286A88145909k6967958k2269285j8396707j5335472j2747948j0560762q759042
$$ y = [14580833, 15181889, 15823309, 16362166, 16963790, 17529634, 18086990, 18798081, 19494323, 20410617, 21462661, 22607419, 23605520, 24444502, 25194047, 25822872, 26407143, 26949088, 27652162, 28359512, 29027496, 29836113, 30772692, 31893073, 33199883, 34732679, 36437130, 38257107, 40424541, 42802351, 45363464, 48220889, 51298007, 54725161, 58534325, 62759913, 67542785, 72931083, 79076690, 85839145, 93600330, 102862356, 113622129, 126060760, 140372231, 157174106, 177940733, 204428368, 239812091, 286000997, 334409330, 364303002, 365364770, 340436757, 301148829, 259314940, 220833306, 188145909, 161177951, 138908666, 120511959, 105176487, 92428539, 81867777, 73108735]
2279G3108735p235566o040758n120631m439923l789762l207696k804692k605384
2271C7864323k158017k021828j833702j592734j415639j312184j187962j160115
2263B5182142j029932r74830r06481q36892p10525o03345n31613m26835l12069
2254A8849620j99115J09854L17286M11723K52307l66923j023264j279772j407871
2245A5663845j157085j111446r67645q63401o81940o07129n32353n13060m81292
2236H748494l46159l74792l06424k95205k38814k26601l59162j85624k03512k38924
2226E973277k12018j12415j62750j09226j47557j47338j84227j45684j18138j54860
2216D479064o0888q9642j72778j86848n2247j13924j78444K7218p8075j48905
$$ y = [73108735, 65873169, 59832411, 54711780, 50271857, 46482095, 43274399, 40469707, 37864323, 35706306, 33684478, 31850776, 30258042, 28842403, 27530219, 26342257, 25182142, 24152210, 23177380, 22270899, 21434007, 20723482, 20120137, 19588524, 19161689, 18849620, 18650505, 18760359, 19077645, 19489368, 19741675, 19374752, 18351488, 17071716, 15663845, 14506760, 13395314, 12427669, 11564268, 10882328, 10275199, 9742846, 9229786, 8748494, 8402335, 8027543, 7721119, 7425914, 7187100, 6960499, 6601337, 6415713, 6212201, 5973277, 5761259, 5648844, 5486094, 5376868, 5229311, 5081973, 4897746, 4752062, 4633924, 4479064, 4418176, 4328534, 4155756, 3968908, 3916661, 3802737, 3624293, 3651511, 3573436, 3424531]
2206C424531j17589l2620n7979q5195l1013r9607q4262q7482m9975j175r054j47621
2194B620959k1685n8862K2803m8586j72349m6153k5885m7093q9072j9785L5002
2183B149294j14149m3398o6591o9815l1630m6199j04818o7583m999o8248J0476
2172A542340k0964j03526O5343N1858m5956Q001j00929O2048j540M688p9228j9343
2160A362792Q158M3102m3434j11478J14241L5220m8172o9509J2990M4264o7646
2149A280528j7811o6649M7441j7475p4429j7923l1279M6826J4179J7599r1005
2138A090002j01463P536O5291j7670K274j0958o898N4383J0874n2032K8384j3112
2126A056611l4334m4415K5519k7299Q0350O530l6020m2618L2316n6987q4215J42818
$$ y = [3424531, 3306942, 3274322, 3216343, 3131148, 3100135, 3000528, 2916266, 2828784, 2778809, 2777634, 2768580, 2620959, 2599274, 2540412, 2563215, 2514629, 2342280, 2296127, 2270242, 2223149, 2134077, 2114292, 2149294, 2035145, 1991747, 1925156, 1855341, 1823711, 1777512, 1672694, 1605111, 1600112, 1531864, 1542340, 1521376, 1417850, 1483193, 1535051, 1489095, 1497096, 1396167, 1458215, 1456675, 1461363, 1382135, 1362792, 1370950, 1414052, 1370618, 1259140, 1373381, 1408601, 1360429, 1290920, 1303910, 1348174, 1280528, 1262717, 1196068, 1243509, 1226034, 1151605, 1133682, 1102403, 1149229, 1163408, 1181007, 1090002, 988539, 996075, 1061366, 1043696, 1045970, 1035012, 1028114, 1082497, 1093371, 1041339, 1069723, 1056611, 1022277, 977862, 1003381, 976082, 1056432, 1062962, 1026942, 984324, 1016640, 959653, 875438, 1018256]
2114A018256o5141R667M3256j04294p1128P8209m9399M4804L8619l7040J05327
2103A011136o2128p725N5724p4067L0029N4354K3436k7249O539N0932J4766O989
2091A082736L618N5579P0635j2644J08678J56943R9043J73300K00470K25613J90091
2080B354062J00451j72252j69491k17967j68962j41262j32174j89159o8956p5310
2070A118980p0988m2497j03297m9139o7343o8041K5322m4814K5216l3630j39720
2059E50049P8849L0445p8071L9466r4479L8381J8521r0969m0644L9901n383L5293
2047E21359n8292k5756P4141m0999l4911o0007L5780K8913J8154N652n4062n8986
2035C50986K8250M5177J8032L2755j1307o1161j3199n1113M649N349l2857N2455
$$ y = [1018256, 953115, 962782, 1006038, 901744, 830616, 908825, 859426, 904230, 942849, 905809, 1011136, 949008, 941283, 997007, 922940, 952969, 1007323, 1030759, 1003510, 1010049, 1060981, 1075747, 1082736, 1086354, 1141933, 1212568, 1199924, 1308602, 1465545, 1564588, 1737888, 1938358, 2163971, 2354062, 2454513, 2282261, 2112770, 1894803, 1725841, 1584579, 1452405, 1263246, 1194290, 1118980, 1047992, 1005495, 902198, 853059, 785716, 717675, 742997, 698183, 723399, 689769, 550049, 628898, 659343, 581272, 620738, 526259, 564640, 583161, 492192, 451548, 491449, 486066, 521359, 463067, 437311, 511452, 470453, 435542, 375535, 411315, 440228, 458382, 464034, 409972, 350986, 379236, 424413, 442445, 475200, 463893, 402732, 389533, 338420, 343069, 348418, 315561, 368016]
2023C68016n24q771J3888J9172n7765q8532J3757j9878R1117N4844n5774o9784
2011B59766M2426N4391q6650k1854n1636L7943L4936m8011J8246N3558K9998m7203
1999B75910J7061k8280Q51l3631J062q546L4246J374O283k4524j6115J7568J8336
1986B61595p7492K730p005N3753q0472N3286m981L9883l1137N8557o6304Q005
1974B10418L0113o7016O1853m3061k3239k5798K5117L4270o225q4504K9407O2313
1962B03648o6522k2177L7963L3493M094k6623M4122J2640l124j5430r925m1781
1950A50378l0467Q0835J4737p4397j0185L4207L7201j04351K8580P4610q1950
1939A19198J7106Q1447l7862j2598j1838l1682J626P1255j4095M7708n2762K6792
$$ y = [368016, 367492, 358721, 372609, 391781, 334016, 245484, 259241, 239363, 330480, 385324, 329550, 259766, 302192, 356583, 269933, 248079, 196443, 234386, 269322, 221311, 239557, 293115, 323113, 275910, 292971, 264691, 265542, 231911, 232973, 224427, 258673, 260047, 266330, 241806, 225691, 243259, 261595, 184103, 186833, 179828, 233581, 153109, 206395, 201414, 241297, 210160, 268717, 202413, 210418, 240531, 173515, 235368, 192307, 169068, 143270, 168387, 202657, 196432, 111928, 141335, 203648, 137126, 114949, 152912, 186405, 190499, 163876, 207998, 220638, 217514, 202084, 192159, 150378, 119911, 200746, 215483, 141086, 130901, 165108, 202309, 97958, 126538, 201148, 119198, 136304, 217751, 179889, 167291, 155453, 123771, 125397, 196652, 182557, 230265, 177503, 204295]
1927B04295J6518o9624K6639k2041l5296p661N4177j9305Q668J1865m4184J7827
1915A41878l5057M6990j534j28n6754M1017o5760n3237Q5297P1984j9825J907
1903A56778k2523o4058L7435Q881K8475o3943R8661J6133n6208q6301K422J28590
1891A84342J813m3045j5144k8067P1262L4613o1228j8205r083k0377m0089N1966
1879A08758N0283j1166n909P5967p7262j7701n3153O3227N4276l5675R460k4388
1867A36717N2679l7751K718m9311o2377J2122K4444N3495K206J4390R508r5506
1855F3334l0643J63398m0308p048p0457O576L0360N8256k741l9994P389Q5530
1843B23652l8470r6687P7649L773m8263j5058J6694P0189N6505l4564q9562Q440
$$ y = [204295, 220813, 151189, 177828, 155787, 120491, 112830, 167007, 147702, 156370, 168235, 124051, 141878, 106821, 153811, 152277, 152149, 95395, 136412, 70652, 17415, 102712, 174696, 154871, 156778, 134255, 70197, 107632, 116513, 144988, 81045, 179706, 195839, 139631, 53330, 55752, 184342, 186155, 143110, 127966, 99899, 171161, 205774, 144546, 126341, 117258, 96881, 56792, 108758, 159041, 147875, 141966, 217933, 140671, 122970, 69817, 133044, 187320, 151645, 161105, 136717, 189396, 151645, 154363, 105052, 42675, 54797, 79241, 132736, 134942, 149332, 158840, 63334, 32691, 196089, 155781, 148733, 78276, 84852, 115212, 173468, 170727, 130733, 138122, 223652, 185182, 88495, 166144, 169917, 121654, 106596, 123290, 193479, 249984, 215420, 125858, 134298]
1831A34298j9633l150N0478k1573O2044q2333P454L952m4279O5084m1541j7307
1819I3494P9405J1229m0408L5201M7516q6427m3081k4867P0872q953L5528l7096
1807A32413l7344O240P4721J2866j4978M532J2406K6492j7368q1783m1824M8033
1795A24406Q1640O197L8233n4464R4051M9114n9429P00m0332K7082O1477Q0090
1783D08765k6029P492P8627L0387m9994J028N9670J0193K4156m84L7203N7104
1771F38118k583Q0222o9556J13373J8351n6609K8798P5005J10328n3346Q7050
1760I69151J2383M5729J9542O2198J8275R5437J32466K4062l5231J66349J53974
1749A664335P9628J91444J34208Q5246K71203K08966K41656K69104L66940L04733
$$ y = [134298, 114665, 111515, 161993, 140420, 202464, 120131, 127585, 131537, 87258, 152342, 110801, 93494, 172899, 184128, 143720, 178921, 226437, 140010, 96929, 72062, 142934, 133981, 169509, 132413, 95069, 101309, 176030, 188896, 173918, 178450, 190856, 217348, 199980, 118197, 76373, 124406, 206046, 212243, 250476, 196012, 290063, 339177, 279748, 280448, 240116, 267198, 328675, 408765, 382736, 390228, 468855, 499242, 449248, 450276, 509946, 520139, 544295, 543811, 581014, 638118, 635535, 715757, 646201, 759574, 777925, 721316, 750114, 825119, 935447, 882101, 969151, 981534, 1027263, 1046805, 1109003, 1127278, 1222715, 1355181, 1379243, 1344012, 1510361, 1664335, 1743963, 1935407, 2069615, 2154861, 2426064, 2635030, 2876686, 3145790, 3512730, 3817463]
1739C817463K99372L04132N52637N94715Q58866R92231J448505J942181L411185
1730A4221287L186872r15856k092812k620835k205399j659461j400765j042681
1722E470350r05697n82967l72167m11995l23848k91502k47351k23958j72259j94610
1712A743996k16964q8540j05310k6526j63065j02268r1180l3238l4527l5036r3653
1701G53689k0478l9233j7990l6384J294j05541K1671k1276R829K201J2877n5775
1689E04884l5951k3668o0785J9172l2739J4596j49951N6030N5299p0421L7845
1678C14311k0766j5497q6993K7208j15006K902J25950J3565m3022p8148L457J5774
1666A43735Q9520n3705J8393j8884m5273k3130j2177k7605K4219N547K1164L4159
$$ y = [3817463, 4116835, 4420967, 4973604, 5568319, 6427185, 7419416, 8867921, 10810102, 14221287, 17408159, 16492303, 14399491, 11778656, 9573257, 7913796, 6513031, 5470350, 4564653, 3981686, 3609519, 3197524, 2873676, 2582174, 2334823, 2110865, 1938606, 1743996, 1527032, 1438492, 1333182, 1306656, 1143591, 1041323, 950143, 916905, 882378, 847342, 753689, 733211, 693978, 675988, 639604, 640898, 535357, 557028, 535752, 545581, 547782, 560659, 504884, 468933, 445265, 384480, 403652, 370913, 385509, 235558, 291588, 346887, 276466, 314311, 293545, 278048, 191055, 218263, 103257, 106159, 232109, 245674, 202652, 124504, 127961, 143735, 233255, 179550, 197943, 179059, 133786, 110656, 98479, 70874, 95093, 100640, 121804, 155963]
1654A55963K2383n3731l2346P3631k9334M3425n344r50n1972n7426k0701P6025
1642A19623l5348k1812O3160m7225N8709O4J9216J1750n0822p3858j0013m985
1630B8459J562M8416L9984r4771J7035L2654N6521m9114l3468M0433q9246J3606
1618A2071K3842j1581O5679l5329R1402l2566k7150q6247j909K4171K2385j115
1606D3653O6845m1850n0251L2649K156J582K1210K2469k8519k1139j11798M1686
1594b1307M8051L4339j29896L004j5563N3787M7172K3608k1688k627K2584M3068
1582H4532o5356m8066p847O7424m9214j9600N4191L57M7375o4832K6540K5818
1570E1322J0591m3080q4898O7616P8169q4538k7434K1558P6692p7795o2737L508
$$ y = [155963, 178346, 124615, 92269, 165900, 136566, 179991, 174647, 173697, 121725, 64299, 43598, 119623, 84275, 62463, 125623, 78398, 137107, 137171, 156387, 168137, 117315, 43457, 33444, 28459, 30021, 78437, 118421, 23650, 40685, 73339, 129860, 80746, 47278, 87711, -1535, 12071, 35913, 24332, 90011, 54682, 146084, 113518, 86368, 121, -1788, 22383, 44768, 43653, 110498, 68648, 18397, 51046, 53202, 54784, 75994, 98463, 69944, 48805, -62993, -21307, 26744, 61083, -68813, -65809, -81372, -27585, 19587, 43195, 21507, 18880, 41464, 84532, 19176, -28890, -36737, 30687, -18527, -38127, 16064, 16421, 63796, -1036, 25504, 51322, 61913, 18833, -66065, 1551, 79720, -4818, -32252, -10694, 65998, -11797, -74534, -71026]
1558g1026L6989N9141K8151O3181m1839R690r6795L4747q552J0128P6274o0534
1546C9555q3260l1130N4204N1298J4788L9708j01195m0068R4805K2695q2691J4010
1534g281R7220j1697k7746q909n6177P1592M5807k1256j8680N2953j08159n0717
1522d3050r938M6764K578K5601k1235j4384L5934k1694j2589k011j0008M9905
1510B5873Q618l2679R399n7382J15855l8114O676N656m8865K0052K0077n6883
1498b1717J4514J1580Q380n48J3815m1098N6834M3013r2408j7161N6808k8015
1486C997k9710K2852n8470M2493L2201p2136M0121K5580m80K0774q1252L1042
1474b2988N9510K3115o0468l2303M5759m0642L8353M8512m813o2940j754K1081
$$ y = [-71026, -34037, 25104, 53255, 116436, 74597, 84287, -12508, 22239, 13687, 23815, 100089, 39555, -43705, -74835, -20631, 30667, 45455, 85163, -16032, -56100, 38705, 61400, -21291, -7281, 89939, 78242, 50496, 41587, -14590, 57002, 102809, 81553, 62873, 115826, 7667, -43050, -52988, -6224, -3646, 21955, 720, -13664, 22270, 576, -12013, -14024, -24032, 25873, 34491, 1812, 11211, -46171, 69684, 31570, 38246, 43902, -4963, 15089, 35166, -21717, -7203, 4377, 12757, 12209, 26024, -15074, 41760, 84773, -7635, -24796, 32012, 3997, -25713, -2861, -61331, -18838, 13363, -58773, -18652, 6928, 6448, 27222, -54030, -22988, 36522, 59637, -831, -33134, 12625, -28017, 10336, 58848, 54035, -8905, -10659, 10422]
1462A0422l6732J5986P9599j1807m2928k7392n0288J5514J02729l1484M835n1568
1450b3114L1579M9345R906k0038j0495N806n3139P012j1732M0480k8746m4744
1438d7880K3932j1055K7622n9579L9937O1351o593l6517R352K1323P6254m504
1426I3643p6959o073l3910L5942m6011k3437J24802m7806j7493k968J3217K2951
1414C5898k2821N998m6755k1737O4379k8062J859L9863L01k1884q2533M7364j0120
1401c8250p311k936L3442N5049k3466m6856P2621p0058K4500N566l38J252O931
1388A0146J0651J5917l4233l8362O7320k8947j5751o2523Q4133O67k2154P598
1376e538K2469Q6385o5443o1053L3999m0475l0558K3746N7034l2400m2160M6111
$$ y = [10422, -26310, -10324, 69275, 57468, 14540, -12852, -63140, -47626, 55103, 23619, 28454, -23114, 8465, 57810, 67716, 47678, 37183, 42989, -10150, -3138, -14870, 25610, -3136, -47880, -23948, -35003, -7381, -66960, -27023, 34328, 27735, -8782, 570, 21893, 98147, 93643, 16684, 10611, -23299, 12643, -33368, -56805, 67997, 20191, 2698, -270, 12947, 35898, 13077, 19075, -27680, -49417, 14962, -13100, -11241, 28622, 28923, 7039, -75494, -28130, -38250, -45561, -48497, -15055, 39994, 16528, -30328, 42293, -27765, -3265, 2301, 1963, 3215, 10146, 20797, 36714, 2481, -35881, 31439, 2492, -13259, -75782, 8351, 9018, -13136, -5538, 16931, 103316, 37873, -23180, 10819, -29656, -60214, -36468, 20566, -11834, -53994, -7883]
1364g883J2996K4375l5384K8437J1657q96p3135p708L0222k7434M2688m9074K8938
1351b2201K6235o378l1835o5841L0432L9035L0225J2632N5770k3889n3195k9308
1339c8318j8712J3774l441n5177P9010L9924q5906m315J05954n5771j0280M9598
1327A6340r9311P7489O9540k6852j6564j6349k6989J5131P845m5112O5920l9341
1315a8253M2324R961j8877k3253k4971k7893Q9084m3190k5787J9859L2486j8254
1303f764k4349K5519N341l4195L5548K8813q7148L1709k3955L5827j3697o0337
1291h7688p0073M7817k5165M1827R5230M564L1672j2434m5031n4019K7437l8004
1279h3867M5886K6238q5030P3915m5662Q215R8898j1833j500J6068l0191K6597
$$ y = [-7883, 5113, 29488, -5896, 22541, 34198, 33302, -39833, -47541, -17319, -44753, -2065, -51139, -22201, 4034, -2344, -34179, -100020, -69588, -30553, -328, 12304, 68074, 44185, -9010, -38318, -57030, -43256, -46697, -101874, -22864, 17060, -68846, -73161, 32793, -22978, -33258, 16340, -82971, -5482, 64058, 37206, 20642, 4293, -22696, -7565, 280, -44832, 21088, -18253, 24071, 34032, 15155, -8098, -33069, -60962, 28122, -15068, -40855, -20996, 11490, -6764, -31113, -5594, -253, -34448, 1100, 29913, -57235, -25526, -49481, -13654, -27351, -87688, -157761, -109944, -135109, -93282, 1948, 6512, 38184, 25750, -19281, -73300, -45863, -83867, -37981, -11743, -96773, -22858, -68520, -60305, 38593, 26760, 25260, 41328, 11137, 37734]
1267C7734K8832O90j01206J416M6505K7755m3810m2817m5199K2445P1420Q1682
1255H5447j01273o0692O7763j7541k7690R25M9186L665O2092j6734l318k3385
1243A8445m2580M262J832l363k3726R3755p4521m2998O394N345r640N1361N8728
1230D3294m7083N1067o9377k1646j5610K5858l0239k185L6960k6717J6868Q923
1218b9887k2450K3299O7889n246K856p322L1159l0101k4927l1948l3792O9405
1206H935o045J7598m803J1625k2140o2247M0800j1513J8968J1275l8495P634N1346
1193B2938n29M4456j02708K5928l5957N5094k8095j714O9407n6889n8017L5543
1181c0543R4678n8042J6272o9982m2750Q2093k3160k6000K3288J4362Q6807j36947
$$ y = [37734, 66566, 67256, -33950, -32534, 13971, 41726, -2084, -44901, -90100, -67655, 3765, 85447, -15826, -76518, -8755, -26296, -53986, -53061, -3875, -210, 61882, 45148, 41830, 18445, -24135, -19873, -18041, -21404, -45130, 48625, -25896, -68894, -62500, -57155, -66795, -15434, 43294, -3789, 47278, -22099, -43745, -59355, -33497, -63736, -65921, -28961, -55678, -38810, -29887, -52337, -29038, 38851, 33605, 36461, 29139, 60298, 30197, 5270, -26678, -60470, 8935, 2890, 20488, 15685, 27310, 5170, -57077, -16277, -27790, -8822, 2453, -36042, -28408, 22938, 22409, 66865, -35843, -9915, -45872, 9222, -18873, -20587, 48820, -8069, -66086, -30543, 64135, 6093, 22365, -47617, -90367, -8274, -31434, -57434, -34146, -19784, 67023, -69924]
1169f9924j2106N9812N0506J1774k1855j4872M1210m5808n8900K7293J0206j8561
1157d1225J5660K1077l9316l1417j3116k2211J02822p744n9486R0049L1625q5960
1145c9242k3035K5144M774N7387n8311J024m4054M1931K607j9282J680L35q239
1132e7281r745M9429k7237K9888k0360O881m190K8598R499L5833o4l72o3563n4128
1118g6812R1847K5033j5380J1269M0278n2703k4041O7410l1389n6163P8254m5992
1106A1611j7824M988l2032l77J68M0920j3766O1750k6729l3447m9581J6920L5852
1093a547n4109m0853O9935Q4964l5569j9395P1697O75q5786p2171J2587J05625
1081C6053m3461q589O4531j14179k1807r665O0074P5766q6418J2288J0728P8058
$$ y = [-69924, -82030, -22218, 28288, 40062, 18207, 3335, 44545, -1263, -60163, -32870, -22664, -41225, -25565, -4488, -43804, -75221, -88337, -110548, -7726, -15470, -74956, 15093, 46718, -39242, -62277, -37133, -32359, 25028, -33283, -32259, -76313, -34382, -31775, -51057, -49377, -49042, -57281, -67026, -17597, -44834, -14946, -35306, -28425, -32615, -4017, 5482, 41315, 41251, 40879, -22684, -76812, 15035, 40068, 24688, 35957, 76235, 23532, -509, 66901, 35512, -20651, 57603, 11611, -6213, -1225, -33257, -33634, -33466, 7454, -6312, 55438, 28709, -4738, -54319, -37399, -1547, -55656, -96509, -26574, 58390, 22821, 3426, 75123, 75798, -9988, -82159, -69572, 36053, -7408, -15997, 48534, -65645, -87452, -97117, -37043, 38723, -47695, -35407, -24679, 53379]
1069E3379n755p1343Q4046J8619o188m3030L4555j9834l2459J0702k2101K0147
1057B0738l7497J282n0621j3069M5966q784q864l5704N9779l9026P7284q7399
1045g5915P3665O2959p1150q989p7801J4746N7720J0959M218p961k0380M3158
1033E229p9180k548M0534M2265l9446j8780O7194L532l8656j8680n7861N9513
1021c6884K3179M8997l1563Q73k122L4012o277n9250m648L0434J5933j463L4894
1008D6115j1506m24J5171p8740K7824J5917p1665k9853j2568k2091O504R5295
996b0021O6182o1299j7740n438J5537k2040k4721L6444r569K54J05410o7829l5488
983d0318J0863O4545p6542R936j5744j0667N5117k8134M4802j2997n2633Q607
$$ y = [53379, 47624, -23719, 60327, 78946, 72758, 29728, 64283, 44449, 11990, 22692, 591, 20738, -16759, -15477, -66098, -79167, -33201, -41985, -50849, -86553, -26774, -65800, 11484, -75915, -2250, 60709, -10441, -19430, -97231, -82485, -24765, -13806, -9588, -17549, -37929, 5229, -73951, -76499, -35965, 6300, -33146, -51926, 15268, 18800, -19856, -38536, -96397, -36884, -13705, 35292, 3729, 4602, 2480, 36492, 30215, -29035, -33683, -3249, 12684, 11221, 46115, 34609, 34185, 49356, -29384, -1560, 14357, -57308, -87161, -99729, -121820, -115316, -20021, 46161, -15138, -32878, -38316, -22779, -44819, -69540, -33096, -42665, -42411, 62999, -4830, -40318, -29455, 35090, -41452, -31516, -47260, -57927, -2810, -30944, 13858, 861, -51772, -43165]
971d3165j7380N0957k6012j9045l900J7409N3713k3476j0210J4818O4478j6170
959D2017p7844o6932J7863K9508J9838k060M6466o765o2843P007L6316o226R156
946a4499j366k2620o6393N0634K1138M2052m8470l0415O5007k8192k6980n670
934f5774M3009O9062l5863o4279R331L3598j1733P0394j0922n0455k8888j3322
922e5842n655O5586j31810L2755K6731P5205M774m1262K8229l2185J0291J342
910b1841O5437m7399j8788o61O0349J6769k4736j6477L1473J0983l3235k3257
898a383N83k9079n2840M9120n996m7359M4617M5061m7074N4590n5j2360m4371
885d6546O8843P6005j20703l2522Q5805l2676o87k5920L8071k552N3599J3703
$$ y = [-43165, -60545, -9588, -35600, -54645, -58545, -41136, 12577, -10899, -21109, -6291, 58187, 42017, -35827, -102759, -84896, -55388, -35550, -37610, 8856, 2091, -60752, -53745, -17429, -23655, -14499, -15865, -38485, -104878, -54244, -33106, 8946, -39524, -69939, -4932, -33124, -60104, -65774, -22765, 46297, 10434, -53845, -44514, -10916, -22649, 47745, 36823, -13632, -42520, -55842, -61497, 4089, -127721, -94966, -68235, 6970, 11744, -29518, -1289, -33474, -23183, -21841, 43596, -3803, -22591, -23252, 37097, 53866, 29130, 12653, 44126, 55109, 21874, -1383, -800, -29879, -82719, -33599, -39595, -86954, -42337, 2724, -44350, 10240, 10185, -2175, -46546, 22297, 98302, -22401, -54923, 30882, -1794, -2481, -28401, 9670, 7118, 60717, 74420]
873G4420m3271m6620K657J4478l4671O83N8399o0827L2006J03446p7954R885m6099
860a3468N902o2440J03941n550n7167K1885R812l163J4207J8433r8495k0459K5134
847f1428K2782j5831O500L7254k9469O1566k7276k1064n6706L7543N4728m8572
835c9973K0230R813M4116j1173k2878O229k7601J8219L0526l4956l4908N9915
823A7559k1210j3584j348O0011J9244q6142O7057q294K1961q058k6742O0913j03754
810b2387n0826J23585k747o6528L5190o0718j418L5200M6898m3394j4785P7952
798E6022m8781n444k9405j864O7523j2869p209l5394M7013o4122K1709O684l0421
785c6558l6445K2957R138O3891K2461n0680o2147N6472J1397n2973Q3149k4564
$$ y = [74420, 31149, -15471, -12814, 1664, -33007, -32324, 26075, -34752, -2746, 100700, 22746, 32631, -13468, -7566, -70006, 33935, 28385, -28782, -6897, 2915, -248, 13959, 32392, -66103, -86562, -61428, -38646, -54477, -47977, -10723, -40192, 21374, -5902, -26966, -83672, -46129, 8599, -39973, -19743, -9930, 34186, 23013, 135, 6364, -21237, -3018, 27508, -7448, -42356, 17559, -3651, -17235, -18583, 41428, 60672, -25470, 41587, 33293, 55254, 47196, 20454, 81367, -22387, -73213, 50372, 47625, -18903, 16287, -44431, -45849, -10649, 36249, -7145, -21930, 56022, 7241, 1797, -27608, -29472, 38051, 25182, 17973, -17421, 29592, -34530, -12821, -6137, -36558, -73003, -50046, -40908, 22983, 45444, -5236, -67383, -10911, 486, -52487, 30662, 6098]
773F098j1383J1083k7110k7753O3922p0489O9J3140q405r038K8857J7501k900
760a6408j7303J7802J03907l7373o916n9804J8414K4370j3997P6697o7315j10685
748h8611K6402R8985j5596m9962M5437j9220j3808M6550o4733j8526L0378L6816
736A4112K5645M403N0800k9035n2951q2425O2244L2125j9636n4397L6284M6210
724C3379q0200N6007l1683M2916k849l1100J4199O1451l0297m4392K2092Q8647
712I8170o6100q519L649j6389M6162j4545j1791K2278k2245l2460J9870l2336
700a4256L5666j4691K2231j593m4154k524J584j097k0057L0414R626O6392m3721
687B3820l250R03J189l6562L3468K6975K7956k1890q0325m9759Q0244m4324k0387
$$ y = [6098, -5285, 5798, -21312, -49065, 14857, -55632, -55563, -42423, -50828, -59866, -31009, -13508, -16408, -33711, -15909, 87998, 50625, 43709, -16095, 2319, 26689, 12692, 89389, 22074, -88611, -62209, 36776, 21180, -28782, 16655, -2565, -16373, 30177, -34556, -53082, -22704, 14112, 39757, 44160, 94960, 65925, 12974, -69451, -7207, 24918, 5282, -49115, -12831, 33379, -46821, 9186, -22497, 20419, 17570, -13530, 669, 62120, 31823, -12569, 9523, 98170, 32070, 23551, 27200, 10811, 56973, 42428, 30637, 52915, 30670, -1790, 18080, -14256, 21410, 6719, 28950, 27357, -16797, -19321, -17737, -18834, -38891, -8477, 1149, 67541, 23820, 20570, 21473, 22662, -13900, 19568, 46543, 74499, 52609, -27716, -77475, 2769, -41555, -61942]
674f1942O1027n7109R6204l407o5451J9499L4507M6336p7775l9931N5755j5451
662g738K1851O705j5351o802m2229L2767l4012k5442M0774m077Q3175J8746k5650
649D2717o385j8930n5805j5616j1681M3512o9877M6342M1572l3003K192M7746
637A2784M9701p6379m9583M7197J6575L0134k6064o0687O0590O3326k7682l5057
625D855j0111L6725m364K3958j4391m120m3641o3468P2518l0488P621P4554p2425
612b2777N7048K3826J5641q8460J5611J0254l6475N6120J9536J8485p0321N319
600C807n5918r962P756k2177O1790J7909R018K412p481J0320o74p3118j302N5519
586b101n343l080P4832O8436j00291r643o819l9234l209Q586L9404n8283q83p683
$$ y = [-61942, -915, -58024, 38180, 34773, -30678, -11179, 23328, 69664, -8111, -48042, 7713, -7738, 14113, 20818, 5467, -1335, -43564, -10797, -44809, -70251, -29477, -33554, 49621, 68367, 42717, 36332, 17402, -38403, -54019, -65700, -22188, -92065, -45723, -4151, -37154, -34962, 12784, 62485, -13894, -63477, -16280, 295, 30429, 4365, -56322, 4268, 67594, 39912, 4855, -5256, 31469, 27105, 51063, 36672, 32552, -11089, -74557, -2039, -32527, -24906, 49648, -22777, 34271, 58097, 73738, -14722, 889, 11143, -25332, 30788, 50324, 68809, -1512, 3807, -52111, -62073, -54317, -76494, -14704, 3205, 12223, 14635, 7154, 17474, 16800, -56318, -57620, -2101, -7444, -10524, 64308, 132744, 32453, 22810, 15991, -23243, -26452, -17866, 21538, -36745, -37628, -45311]
572d5311M4782Q6550j19604L0544l4391m8432l1395O2740K4707L1826l0919k0725
560d9628O1587l6708k0909M3218j413l167j2377M5716m3222L9447j3888l3186
548b4530J07701l3740M2842p8625M0560N362o8617L0198j972o0703K4229L9021
536B1726L6741K5265o5171L0757M4322j24421J5814J833L8601K3661J1323O840
524F7291j09946Q4800n1176j6120P4121n6048L1430l8394n4489K9651o0453O3818
512c5515O6011N613r647N1060m2969o2720K9203O6691O941j05309L8933J632N1832
499F1756P2423l0511o3953k8404L7649L7875o0630K828m7132k3280J5367L0272
487D260K7974J8795Q061j4797n1021Q714l258q148j8839M2178R1607q7202r854
$$ y = [-45311, -529, 86021, -33583, -3039, -37430, -85862, -117257, -54517, -29810, 2016, -28903, -49628, 11959, -24749, -45658, -2440, -3853, -7020, -19397, 26319, -16903, 22544, 8656, -24530, 83171, 49431, 92273, 13648, 54208, 59570, -9047, 21151, 19179, -41524, -17295, 21726, 58467, 83732, 18561, 49318, 93640, -30781, -14967, -13134, 25467, 49128, 60451, 67291, -42655, 42145, -9031, -25151, 48970, -7078, 24352, -14042, -68531, -38880, -99333, -35515, 30496, 36109, 26462, 77522, 34553, -28167, 1036, 67727, 74668, -30641, 8292, 9924, 61756, 134179, 103668, 39715, 11311, 48960, 86835, 26205, 29033, -18099, -41379, -26012, 4260, 32234, 51029, 59090, 44293, -6728, 1986, -1272, -9420, -28259, 13919, 105526, 18324, 8470]
474H470L3255m8994m0568N1891O326J0385l8524N9957l0414j7944k0054K0109
462f105M9253j7465P9320n1887q4818N8470k2560j9739N3507L0791j2947O9594
450A25414p1383q2102L1076j7505M5461n3453m3379N3505j7479M698l7024n6662
438a18833O9406K3678l4141N9762m596K6502r687L3145K3207o6052J1358p8849
426f5100J09087q1667J6924M8333J886p249q0553R800L217l15R4791J1848k3563
413C7439j8528M0992k3826l9279J6449j4997K6144K2367p4844K9402k4625j4583
401c7889J076J5054k373j9204N0257J6326N983j5941k3857k4084l3878K3274P6432
388C1176r7357O6478L2661n567m545J8953l2033l3888K6918l6959J1212N63M0641
$$ y = [8470, 41725, -7269, -47837, 4054, 10380, 20765, -17759, 42198, 11784, -6160, -26214, -6105, 43148, 25683, 105003, 53116, -31702, 26768, 4208, -15531, 37976, 68767, 55820, 125414, 54031, -28071, 3005, -14500, 30961, -22492, -65871, -12366, -29845, -25147, -62171, -118833, -49427, -25749, -59890, -128, -4724, 21778, 12091, 45236, 68443, 2391, 13749, -65100, 43987, -37680, -20756, 27577, 29463, 22214, -58339, -48539, -45322, -45637, 49154, 61002, 37439, 18911, 59903, 36077, -3202, 13247, -1750, 24394, 46761, -28083, 1319, -23306, -37889, -36813, -21759, -24132, -43336, 6921, 23247, 29230, 13289, -10568, -34652, -68530, -45256, 31176, -66181, 297, 32958, 27391, 22846, 41799, 9766, -24122, 2796, -34163, -22951, -22388, 18253]
375A8253k2943n4038K4353m4641L0277M1621k504k1651L0341m1686K7624J2180
363b814J7743n8236K6957N9839o9136K4556l6204k3943J40413l7383j3938R497
351C7351p1038L3595N1199k0716l2383k573J6972k6056J9589P5135k7691p1378
339a7994j0647O9629n8686L3286k2401k306N88o0633J01806K7068j9803m0889
327i82l0941K9485L9417o7971j7802M3177l7943n7284L9263K7026M9173k811M1683
314E3490J0008o1569m8064k0544j47J152P5469k9127J0111k0607j1089Q0103J0288
301D9474n6867q330K5283p91o3395J2285M8816J7704o8083p371L2107p121Q7209
288F0920l5376k2629j4593q9934P2969j7308N8239J2942m859m1398N9062j21969
$$ y = [18253, -4690, -58728, -34375, -79016, -48739, -7118, -9622, -31273, -932, -42618, -14994, -2814, 14929, -43307, -16350, 43489, -25647, -1091, -37295, -61238, 79175, 41792, 27854, 37351, -33687, -92, 51107, 30391, -1992, -4565, 12407, -13649, 5940, 81075, 53384, -17994, -28641, 40988, -17698, 15588, -6813, -9119, -8531, -69164, 32642, 59710, 39907, -982, -31923, -2438, 36979, -30992, -48794, -5617, -43560, -100844, -61581, -34555, 14618, 11807, 53490, 63498, 1929, -46135, -66679, -66826, -65674, 9795, -19332, -9221, -29828, -40917, 39186, 49474, -7393, -15723, 9560, 8769, -54626, -42341, 6475, 24179, -43904, -51275, -19168, -26289, 60920, 25544, 2915, -11678, -101612, -28643, -45951, 12288, 25230, 20371, -21027, 38035, -83934]
276h3934R9827M098n0194N4279J2123J7973l1087M8544j4379q2027j8924l2533
264g6234j0203J09438j7591m5693N608P8644p8312R195Q04L3496K2701m2145J8402
251H110N8516q0363P1154p4808o9450P1589P2916l6837L197n0026k5929J693k1086
238g1324M2348L4218j6212M927l8263J6613N6945R932J0743j9031l9618j3026
226b1748j0609M9449n2922n0258J24540o0848L225P1822o3783n196M3518o5696
214c8506M0399l8837J5500N8566j8993n2297j5018R7890M688p4173M7123J5685
202D2027L3867j12405k0984Q468N5849p9403K6060r52j8329Q6467L6455p331m8720
189A069K2376j8926N4418k8686l1753L9561k2224m717l2416N3340j366m9359j5884
$$ y = [-83934, 15893, 19991, -30203, 24076, 36199, 54172, 23085, 71629, 57250, -24777, -43701, -76234, -86437, 23001, 5410, -40283, -34675, 43969, -34343, -25148, -24344, 9152, 31853, -10292, 8110, 66626, -13737, 57417, -17391, -86841, -15252, 57664, 20827, 24024, -26002, -51931, -50238, -71324, -28976, 5242, -10970, -6043, -44306, -27693, 29252, 39184, 49927, 30896, -8722, -21748, -32357, 17092, -35830, -86088, 38452, -22396, -19171, 52651, -11132, -16328, 27190, -38506, 1893, -36944, -21444, 37122, 18129, -34168, -49186, 48704, 53392, -20781, 26342, 42027, 75894, -36511, -57495, -49027, 6822, -72581, -46521, -47473, -65802, 20665, 57120, 49789, 1069, 23445, 4519, 58937, 30251, -1502, 38059, 15835, 11118, -21298, 32042, 30676, -18683, -34567]
176c4567O494M0119K280l4245j180J6050L592j3078j867J3585k4196o2265J17168
163B7890P099k253n897j31347L7534L7804J7738k3543R866L0921m0875j8555K2166
150c1452K8911N2324q579j0939j20851K0387J2781L5283M6994M559J188k9233
138A373K9160q884K1403O603m9561K1245l3402M10J9662K2801K8428l8140m9574
125b8476n2619L0480K1015l3078N1121k8779L5395N5046m719J3602j2498p8638
113c2148l9850j0020Q7218o3770k606O6521L1132j558k0743O248k9283n262j221
100a5342M7578J0944k5836M0086l0927K390L2274J2874r3436J3867K2436K5911
88D2819k5674k8215L0331l3184l2473o2K4049n347Q389K0206l4958K436l2660
$$ y = [-34567, -28073, 12046, 14326, -19919, -21099, -5049, -1457, -14535, -16402, -2817, -27013, -89278, 27890, 34989, 32736, 26839, -104508, -66974, -29170, -11432, -34975, -25109, 5812, -35063, -53618, -31452, -2541, 49783, 41204, 30265, -90586, -70199, -57418, -22135, 24859, 29418, 30606, 1373, 30533, 21649, 43052, 49655, 94, 21339, -12063, -11653, 8009, 30810, 59238, 21098, -28476, -81095, -50615, -29600, -62678, -11557, -40336, -4941, 50105, 45386, 58988, 46490, -32148, -71998, -82018, 5200, -58570, -61176, 5345, 36477, 34919, 14176, 20424, -8859, -14121, -15342, 32236, 43180, 17344, 57430, 26503, 28893, 61167, 74041, -19395, -5528, 16908, 42819, 17145, -11070, 19261, -13923, -46396, -46458, -22409, -27756, -19367, 839, -34119, -31683, -64343]
75f4343K1409J2568j0154M2340k141K7393k720l9060o260q749j4042P5514k2435
62I320k9505J8371K9486l7894P190k8604K5173j7221L2198L5654M114m5446L2768
49C5604l7254n5146Q9835n2816J8836P9710m0294k3463p797O774J8488k6827k3357
36a7707Q456j3677K8368R640R741j7039J0466m7059l7012L9974L399j3180j802
23c7432m54O3080O237l235k3850o986k984l0480M491o679k6883o756J8973L2204
9b0754L391O3455K5225j0646K9220n8411m5698M2639n1241
0b2820
$$ y = [-64343, -42934, -30366, -40520, 1820, -321, 27072, 24352, -14708, -20968, -29717, -43759, 31755, 9320, -20185, -1814, 27672, -10222, -3032, -31636, -6463, -23684, 8514, 44168, 48282, 2836, 35604, -1650, -56796, 33039, -19777, -941, 78769, 38475, 15012, 7215, 13989, 32477, 5650, -17707, -9251, -22928, 5440, 15080, 24821, 7782, 18248, -28811, -65823, -25849, -22450, -35630, -37432, -37886, 25194, 31431, 28196, 4346, -2640, -5624, -36104, -31613, -38292, -65175, -71931, -52958, -20754, -17363, 46092, 71317, 60671, 89891, 31480, -14218, 28421, -22820]
$$ Imaginary data points
##PAGE= N=2
##DATA TABLE= (X++(I..I)), XYDATA
16383a634611k9694O0745N4516P201K4204N0470n2335N2662N4172K1352o909k352
16371a400579N7316j223l9380K9057P590M4124L2389O3168j9596M891P694l2910
16359a247459Q3712K0619K0925M9034J029n4899K7637P0543K3701j6979j5515
16348a037652P9273J8925L3771l9796L5723l83K5392P533L0497K4974R176J7116
16336g95451R685K3135j2973J4089M5771K5245j9545k499J0991M3907k1585J5734
16324f63496M9278j4658J8521R126L435L3497N3574N4765K0803l0030L6632k4613
16312d53166j1016l718J0410K4688N6685J9024o95J9112N8976Q5368k9354k3996
16300b47682J9296J3041K2934R597L5313K3547l2083Q22R6894l530l814o374m2267
$$ y = [-1634611, -1664305, -1603560, -1549044, -1541843, -1517639, -1467169, -1519504, -1466842, -1412670, -1391318, -1398227, -1400579, -1343263, -1344486, -1383866, -1354809, -1347219, -1303095, -1270706, -1207538, -1227134, -1222243, -1214549, -1247459, -1163747, -1143128, -1122203, -1073169, -1072140, -1127039, -1099402, -1028859, -1005158, -1022137, -1037652, -958379, -939454, -905683, -945479, -909756, -910139, -884747, -877214, -846717, -821743, -812567, -795451, -785766, -762631, -775604, -761515, -715744, -690499, -710044, -712543, -701552, -657645, -679230, -663496, -614218, -628876, -610355, -601229, -597794, -564297, -510723, -455958, -435155, -465185, -428553, -453166, -464182, -467900, -457490, -432802, -376117, -357093, -357788, -338676, -279700, -194332, -223686, -247682, -228386, -215345, -192411, -182814, -147501, -123954, -156037, -155215, -58321, -61851, -65665, -72039, -114306]
16287a14306N5051M3169N7989l9015m0060Q453K2614K3484K1332K9673L8606k3
16275A06967K9882m0271j0804O0434k8610N3023O705O4j281L729o42M5531L6644
16262B61371J5783n0141O236j1235P3569J12864o9425Q4733l6351o374O3717O8653
16250E13400q7631m062l9540P54P728l8457L8617P8928M7826r433m5057P1662
16238E34735l143l3941j5408N7428K0673O023L9795J2946k4815K6729n9543l2414
16226E29065J08541O2751n7252l758K5755L564O4663k0536l9945J2867O6246J046
16214G53007M158l4687R71N1962o9731o408K7146L0943M1231J6614j7433L5074
16202H32847o688P6546m6313q507M7259O524J3196O295J966k8474j4226J6830
$$ y = [-114306, -59255, -16086, 41903, 2888, -37172, -28719, -6105, 17379, 38711, 68384, 106990, 106967, 136849, 96578, 85774, 146208, 117598, 170621, 177326, 177390, 176109, 179838, 179196, 224727, 261371, 277154, 227013, 233249, 222014, 295583, 408447, 339022, 423755, 387404, 381030, 444747, 513400, 425769, 421707, 382167, 382921, 390649, 352192, 390809, 469737, 517563, 508130, 463073, 534735, 531592, 497651, 482243, 539671, 560344, 566367, 606162, 619108, 594293, 621022, 561479, 529065, 637606, 700357, 643105, 639347, 665102, 668666, 733329, 712793, 672848, 685715, 751961, 753007, 757165, 722478, 723449, 775411, 705680, 699272, 726418, 757361, 798592, 815206, 797773, 832847, 826159, 902705, 856392, 847885, 895144, 901668, 914864, 921159, 923125, 894651, 880425, 897255]
16190H97255o3477J9495L184n52L0574M9802n727L2361P6085q3064L2333j00969
16178H87300l2817O4023P6445L0411K7567k6787j39353M1256P3832l948K83M9444
16166A047656J4169k9674n251n0381J47213r9537l9142r293K7081k6433Q3886
16155A060294k9632K9991L0108K6922n5616O9272j0529L4011o9862J295O2047
16144A148301m9154P7475m3038k0676k9376r926J03064l3318K5799m1001m157
16133A123993L3551q5727k9433N2676O4348j8947n266L9472l3977R740l1905N6302
16121A174827k5511R517N3818k5467M7284P884M3003p7590L1964k9162J5868o63
16109A225772p8367K1323M4370j0182J14498j8136l025j01307M3202j471l1332
$$ y = [897255, 833778, 853273, 856457, 855905, 886479, 936281, 930554, 962915, 1039000, 955936, 988269, 887300, 854483, 918506, 994951, 1025362, 1052929, 1026142, 886789, 928045, 1001877, 997929, 998212, 1047656, 1061825, 1032151, 1026900, 976519, 1123732, 1024195, 985053, 975760, 1002841, 976408, 1060294, 1030662, 1060653, 1090761, 1117683, 1062067, 1131339, 1120810, 1154821, 1084959, 1086254, 1148301, 1099147, 1176622, 1133584, 1112908, 1083532, 1073606, 1176670, 1143352, 1169151, 1128150, 1123993, 1157544, 1071817, 1042384, 1095060, 1159408, 1140461, 1135195, 1174667, 1140690, 1150430, 1118525, 1174827, 1149316, 1158833, 1212651, 1187184, 1234468, 1242352, 1285355, 1207765, 1239729, 1210567, 1226435, 1225772, 1147405, 1168728, 1213098, 1202916, 1317414, 1299278, 1296253, 1194946, 1238148, 1236677, 1205345]
16098A205345P7915m1928N5645j8427o8301M0820n0208k0592k0596J00579p6881
16087A183371K9760p415L6515j2725k062o3345L7450N7153J2856m2110o7785M9085
16075A210748K6080O74k1884K5095r606j6411p445J9269r1078m129Q0619k644
16063A209288N9194j1248m7579M6913M1445o108J6242k0562l3229j6843r116M3621
16051A272018l8642J6294L329R4917l1108n8167K0375l8775Q5025q2289n386N8121
16039A295712K7503k1767j3785o437o5913K9385N4040k4720J5013n918J9233M2674
16027A345020k4458j631K524J4228j3150K837m81k8149k9122M3611O619k3909
16015A293939J5674j2581m14L043k7376K6049m264m7359J1864K3861n7008O9263
$$ y = [1205345, 1283260, 1241332, 1296977, 1278550, 1210249, 1251069, 1200861, 1180269, 1159673, 1260252, 1183371, 1213131, 1205716, 1242231, 1229506, 1227444, 1164099, 1201549, 1258702, 1271558, 1229448, 1161663, 1210748, 1236828, 1237502, 1215618, 1240713, 1231107, 1214696, 1207251, 1226520, 1135442, 1131313, 1211932, 1209288, 1268482, 1257234, 1209655, 1256568, 1298013, 1291905, 1308147, 1287585, 1254356, 1237513, 1228397, 1272018, 1233376, 1249670, 1252999, 1347916, 1316808, 1258641, 1279016, 1240241, 1325266, 1242977, 1237591, 1295712, 1323215, 1301448, 1287663, 1281226, 1215313, 1244698, 1298738, 1274018, 1289031, 1283113, 1302346, 1345020, 1320562, 1318931, 1321455, 1335683, 1322533, 1325370, 1324889, 1296740, 1267618, 1311229, 1317848, 1293939, 1309613, 1297032, 1296618, 1299661, 1272285, 1298334, 1294070, 1246711, 1258575, 1282436, 1225428, 1294691]
16003A294691J0045M356l1048J5032K4323L3175o5798L1304l0792l2595o962M5406
15991A291137N1534q1555n7113N6988K8163o5448K4321M3411L2260J3723l8899
15980A298522J0850J7147j9242K2194L70l2140j9440N11O8713k9253K8894n1813
15968A295313K2944O2517n1507k577L1970k1517J0697J8566m7536l7851L5390
15957A316409J3361j4324M2098j7575L2776o589j0847k1183n2374m6031N4318
15946A290039N5626N476p387l3113n453K458q5770n361P363J7726q337K0655L4587
15933A288509J4471K2715R838j0313N450K0520K2746p9098m8904M5963L7230L9240
15921A368367r3374q955J1982J522J2491O8504m5659o6359N4849N4414k9585p9130
$$ y = [1294691, 1304736, 1309092, 1278044, 1293076, 1317399, 1350574, 1284776, 1316080, 1285288, 1252693, 1245731, 1291137, 1342671, 1261116, 1204003, 1260991, 1289154, 1223706, 1248027, 1291438, 1323698, 1337421, 1298522, 1309372, 1326519, 1307277, 1329471, 1329841, 1297701, 1278261, 1278772, 1347485, 1318232, 1347126, 1295313, 1318257, 1380774, 1329267, 1326690, 1358660, 1337143, 1347840, 1366406, 1318870, 1281019, 1316409, 1329770, 1315446, 1357544, 1339969, 1372745, 1366156, 1355309, 1334126, 1281752, 1235721, 1290039, 1345665, 1351141, 1343754, 1310641, 1305188, 1307646, 1221876, 1216515, 1223878, 1241604, 1233267, 1253922, 1288509, 1302980, 1325695, 1335533, 1325220, 1330670, 1351190, 1373936, 1294838, 1245934, 1291897, 1329127, 1368367, 1274993, 1266038, 1278020, 1279542, 1292033, 1360537, 1314878, 1248519, 1303368, 1357782, 1328197, 1249067]
15909A249067K1250J7819L3783j9722R57p433K3442j1428K344P556N5065o3669
15897A309031k8845O6055n0509j2000m1154M2123K4560P8105m7207k6668j1612
15886A301879O086l2359Q553L5355L1001o0634j9181P960L1997J6411r420J5083
15874A332731o7010Q0646K7502N7318m2868J7236n3409o2555J279L0843r9759
15863A221954K9892J3059K5005N5089m7557l4452m157N3759L2049l9709J6515
15852A321447m8917N2054k7539J450J824L8081q149o8K8356l6293K8890J4587
15840A365723l3277k9738Q372r068l3477l7999J11111L5202P702k1019k674k6995
15828A333863m2083M9072K5157p0286K6917K1614n589o7653m7637j7748J1411
$$ y = [1249067, 1270317, 1288136, 1321919, 1302197, 1303154, 1295721, 1319163, 1307735, 1310079, 1317635, 1372700, 1309031, 1280186, 1346241, 1295732, 1283732, 1242578, 1284701, 1309261, 1387366, 1340159, 1313491, 1301879, 1307965, 1275606, 1284159, 1319514, 1350515, 1289881, 1270700, 1278660, 1310657, 1327068, 1317648, 1332731, 1265721, 1346367, 1373869, 1431187, 1388319, 1405555, 1352146, 1289591, 1290870, 1321713, 1221954, 1251846, 1264905, 1289910, 1344999, 1297442, 1262990, 1258833, 1312592, 1344641, 1304932, 1321447, 1272530, 1324584, 1297045, 1298495, 1300319, 1338400, 1330251, 1330183, 1358539, 1322246, 1351136, 1365723, 1332446, 1302708, 1311080, 1302012, 1268535, 1230536, 1341647, 1376849, 1384551, 1363532, 1360858, 1333863, 1291780, 1340852, 1366009, 1295723, 1322640, 1344254, 1338665, 1271012, 1223375, 1205627, 1217038]
15817A217038O0289J22217O1739o2820l4545L9736J5647p1621M7648m3766p3194
15806A278368M3184M8073n2325l2059M8952j3165l8695M820j3908L6419l7314
15795A272350L7054M0921l77K0571j6123m3570n0804P1706r0030o6717L0803J7187
15783A222971O5418J3805L2382o5694P109K5562L8522K4984j43234L0461L8362
15772A290648L2561J5660R562o2819L0176J1889J5070n8474M6302J36035m5332
15761A421278j00556O0808j7423o8105M2366o6973N4100Q3542l9064K199M4889
15750A417061P904l3398l5717o6817Q6645K8846n1849k2711L1812q1440R140K8103
15738A317579l2400M8101k2746m0254K8359Q6033l978o1535L0691p008M0019n0843
$$ y = [1217038, 1277327, 1399544, 1461283, 1398463, 1363918, 1403654, 1419301, 1347680, 1395328, 1351562, 1278368, 1321552, 1369625, 1317300, 1285241, 1334193, 1321028, 1282333, 1287153, 1273245, 1309664, 1272350, 1309404, 1350325, 1349948, 1370519, 1354396, 1310826, 1260022, 1331728, 1241698, 1174981, 1205784, 1222971, 1288389, 1302194, 1334576, 1268882, 1275991, 1301553, 1340075, 1365059, 1221825, 1252286, 1290648, 1323209, 1338869, 1348431, 1285612, 1315788, 1327677, 1342747, 1284273, 1330575, 1466610, 1421278, 1320722, 1381530, 1364107, 1296002, 1338368, 1271395, 1325495, 1409037, 1369973, 1372172, 1417061, 1424965, 1391567, 1355850, 1289033, 1375678, 1404524, 1352675, 1329964, 1361776, 1280336, 1289476, 1317579, 1285179, 1333280, 1310534, 1270280, 1298639, 1384672, 1380694, 1319159, 1349850, 1342842, 1382861, 1332018]
15726A332018k882M8392K0363m0678O740o1993J1441m7660O4611J0074m9720K5243
15714A315949K8149N800o7258Q0325k3849K7549q3779j1939P2425q370k9108K5906
15702A331800N7346k3060K692O0147o2191q680k5432J3408l2503K9759J6877k0485
15690A339678k2921p9874j712k3598P2907O1526j0443J5170n9364K0866j6480
15679A295755K0399k86P9728o2932n5302J0351P8033l3767o726r081l3215L9805
15667A322762J6079O4770l5796J890K4142M831o2776N3266J4858o0170n4483M836
15655A294209l8608P5137j221L595P7702p2158m859L352M921J01118p5752j24335
15643A243101Q897K1933K3039k3947P5350k866L3772q5962P9170K4712k9932O9567
$$ y = [1332018, 1329136, 1377528, 1397891, 1357213, 1363953, 1301960, 1313401, 1265741, 1330352, 1340426, 1290706, 1315949, 1344098, 1349898, 1282640, 1362965, 1339116, 1366665, 1282886, 1270947, 1343372, 1335002, 1305894, 1331800, 1389146, 1366086, 1368778, 1428925, 1366734, 1358054, 1332622, 1346030, 1313527, 1343286, 1360163, 1339678, 1316757, 1236883, 1235171, 1211573, 1284480, 1346006, 1335563, 1350733, 1291369, 1312235, 1295755, 1316154, 1315868, 1395596, 1332664, 1277362, 1287713, 1365746, 1331979, 1325253, 1316172, 1282957, 1322762, 1338841, 1403611, 1367815, 1369705, 1393847, 1398678, 1335902, 1389168, 1404026, 1343856, 1289373, 1294209, 1255601, 1330738, 1329517, 1333112, 1410814, 1338656, 1333797, 1337149, 1342070, 1443188, 1367436, 1243101, 1251998, 1273931, 1296970, 1273023, 1348373, 1345507, 1379279, 1293317, 1372487, 1397199, 1367267, 1436834]
15631A436834j0486o0952J4819J5521o6304m0861L9470K1042n6603k7215Q4963
15620A350228p185m2031K681J9987P3076l8199J5617m4083j9658K1460M3995O3423
15608A439311o9645J846o810O0624j2072j5843l8510l272K4934l4186P368l2908
15596A320837M3652k673J5128j4652K1741k2536j6715K2521k131j6893o460J0209
15584A352028L3518M750K8670p3372M1410l2502L6145n997k3147K6162m5295K2264
15572A364634P638q262o8465N8371j666J862o3244O7915N7805m6705j9197j0627
15560A340059j8241l7895L5272m556L0077N85j4076L4113L7447j1469m4523K5270
15548A372063L5425l20k0002L9121j9056j10010P2955m5203k0518J6415J8723
$$ y = [1436834, 1426348, 1365396, 1380215, 1395736, 1329432, 1288571, 1328041, 1349083, 1292480, 1265265, 1350228, 1343043, 1301012, 1303693, 1323680, 1396756, 1358557, 1374174, 1330091, 1310433, 1331893, 1375888, 1439311, 1369666, 1371512, 1364702, 1425326, 1413254, 1397411, 1358901, 1355629, 1380563, 1346377, 1353745, 1320837, 1364489, 1361816, 1376944, 1362292, 1384033, 1361497, 1344782, 1367303, 1365172, 1348279, 1341819, 1352028, 1385546, 1390296, 1418966, 1345594, 1387004, 1354502, 1390647, 1384650, 1361503, 1387665, 1342370, 1364634, 1372272, 1364010, 1295545, 1353916, 1352250, 1354112, 1290868, 1358783, 1416588, 1369883, 1350686, 1340059, 1321818, 1283923, 1319195, 1314639, 1344716, 1345301, 1331225, 1365338, 1402785, 1391316, 1346793, 1372063, 1407488, 1407168, 1387166, 1426287, 1407231, 1297221, 1370176, 1324973, 1304455, 1320870, 1339593]
15537A339593N729k2073m189r879O716K5963j21760M8697Q2111j1442O6454p2258
15525A333662J2401r442R372n036n301m4155R942k6908L1987M2794K1651p894
15513A363073n6629r947o51L711K1718K0586J3534n4394K1378J8791k8929N0325
15501A362566L2313n6021j624Q297j3243O2543n5350o7L8605M7976o2756k9751
15489A333488N898j909O6958P0259j47531r247L9082L1461m2281j9976k4861J14755
15477A416096l6785k2383Q812k560N5124j1130n3590j7894Q3256q815r116n4673
15465A346342j609l4799O5853k7107P466N4373n7445Q0123L148r8415L9648j6688
15453A360890l5824J6520P373N7253j01664l8868J3474L1272L8129k7719J3589
$$ y = [1339593, 1345322, 1323249, 1319060, 1309181, 1315897, 1341860, 1220100, 1268797, 1350908, 1339466, 1405920, 1333662, 1346063, 1336621, 1345993, 1340957, 1335656, 1291501, 1301443, 1274535, 1306522, 1349316, 1370967, 1363073, 1306444, 1296497, 1295846, 1299557, 1321275, 1341861, 1355395, 1301001, 1322379, 1341170, 1312241, 1362566, 1394879, 1338858, 1337234, 1345531, 1332288, 1394831, 1339481, 1339414, 1378019, 1425995, 1363239, 1333488, 1339386, 1337477, 1404435, 1474694, 1327163, 1317916, 1356998, 1388459, 1346178, 1326202, 1301341, 1416096, 1379311, 1356928, 1365740, 1363180, 1418304, 1407174, 1353584, 1335690, 1418946, 1410131, 1401015, 1346342, 1344733, 1309934, 1375787, 1348680, 1356146, 1410519, 1353074, 1433197, 1436345, 1337930, 1377578, 1360890, 1325066, 1341586, 1348959, 1406212, 1304548, 1265680, 1279154, 1310426, 1348555, 1320836, 1334425]
15442A334425p2829M7318p0475K6161Q5883R574n3425j0715J01862J8548m1432
15431A374895m2394p095m823l2361N5624J7146p9881o829Q4088r048K8223l0035
15419A347510L8418K3833j536j052n512j9281J0065o4066J0118J04494k3523j3772
15407A405696l01K0391o70p3308J1633N9167m9123k8225n5393P4318n176M8896
15395A407905j2342m5471q7767R8490M9275j02953L8335K6297J9552k5224j0018
15384A356079M0641o0722k308M8969n3548l262P8027k0150o654M1375N77J04450
15372A523474l2214r0305Q2710l1231p5298j6198p8670Q6010K9086O061l4472
15361A368953r02l839M4565L2694q4953K2445R0156j27355j036M99M7933j6923
$$ y = [1334425, 1261596, 1308914, 1238439, 1264600, 1350483, 1360057, 1306632, 1295917, 1397779, 1416327, 1374895, 1332501, 1325406, 1320583, 1288222, 1343846, 1360992, 1281111, 1274282, 1358370, 1349322, 1377545, 1347510, 1385928, 1409761, 1408225, 1407173, 1401661, 1382380, 1392445, 1328379, 1338497, 1442991, 1419468, 1405696, 1405395, 1425786, 1425116, 1351808, 1363441, 1422608, 1373485, 1345260, 1289867, 1364185, 1359009, 1407905, 1395563, 1350092, 1262325, 1360815, 1410090, 1307137, 1345472, 1371769, 1391321, 1366097, 1356079, 1396720, 1335998, 1333690, 1382659, 1329111, 1325849, 1403876, 1383726, 1377072, 1418447, 1419024, 1523474, 1491260, 1400955, 1483665, 1452434, 1377136, 1360938, 1282268, 1368278, 1397364, 1403425, 1368953, 1368051, 1364212, 1408777, 1441471, 1356518, 1378963, 1469119, 1341764, 1340728, 1341227, 1389160, 1372237]
15349A372237o850K7346k8332k7680J03937n3358n6843Q5226k3240j3757K5973
15338A404659m3387J1494N1636o0494j5633M20L7945n3303O8141p282l679P4369
15326A464886j31583M1613Q3882p2802j6499N6539o4823q9863L016P6277k0547
15315A330096L4423K3564l4659P928L5867l5339o1638K4666L8570M2566m7254
$$ y = [1372237, 1365387, 1392733, 1364401, 1336721, 1440658, 1387300, 1330457, 1415683, 1392443, 1378686, 1404659, 1361272, 1372766, 1424402, 1363908, 1348275, 1348695, 1386640, 1333337, 1401478, 1394196, 1390517, 1464886, 1333303, 1374916, 1458798, 1385996, 1369497, 1426036, 1361213, 1271350, 1274366, 1350643, 1330096, 1364519, 1388083, 1353424, 1361352, 1397219, 1361880, 1300242, 1324908, 1363478, 1406044, 1358790]
$$ [...]
##END NTUPLES=NMR SPECTRUM
##END=
