##TITLE=1H_EC-3329(II-1)
 CDCl3
 8 sc, 
 8.8.2024
##JCAMPDX= 6.0         $$ Bruker NMR JCAMP-DX V2.0
##DATA TYPE= NMR SPECTRUM
##DATA CLASS= NTUPLES
##ORIGIN= UXNMR, Bruker Analytische Messtechnik GmbH
##OWNER= root
$$ XWIN-NMR		Version 3.5
$$ Thu Aug  8 13:46:23 2024 Russian Standard Time (UT+4h)  she@DPX200
##.OBSERVE FREQUENCY= 200.1313
##.OBSERVE NUCLEUS= ^1H
##.ACQUISITION MODE= SIMULTANEOUS
##.ACQUISITION SCHEME= undefined
##.AVERAGES= 8
##.DIGITISER RES= 18
##SPECTROMETER/DATA SYSTEM= spect
##.PULSE SEQUENCE= zg30
##.SOLVENT NAME= Acetone
##.SHIFT REFERENCE= (INTERNAL, Acetone, 0, 21.5307)
##AUDIT TRAIL= $$ (NUMBER, WHEN, WHO, WHERE, WHAT)
$$ ##TITLE= Audit trail, XWIN-NMR		Version 3.5
$$ ##JCAMPDX= 5.01
$$ ##ORIGIN= Bruker BioSpin GmbH
$$ ##OWNER= she
$$ F:/spectra/data/she/nmr/H-F/1/pdata/1/auditp.txt
$$ ##AUDIT TRAIL=  $$ (NUMBER, WHEN, WHO, WHERE, WHAT)
(   1,<2024-08-08 13:44:44.64 +0400>,<she>,<DPX200>,
      <created by zg, POWCHK disabled, PULCHK disabled
       configuration hash MD5:
       00 E9 B6 7A A2 85 ED C7 34 08 36 98 17 FE 4E 26
       data hash MD5: 16K
       01 25 2B 9E 37 B7 5A DE B3 87 3C DE BF 03 7A DA>)
(   2,<2024-08-08 13:44:51.06 +0400>,<she>,<DPX200>,
      <Start of raw data processing
       efp BC_mod = 2 LB = 0.24 FT_mod = 6 PKNL = 1 PHC0 = -25630.4 PHC1 = 6.78749 SI = 16K 
       data hash MD5: 16K
       96 62 86 FE C6 0B B1 7D 4B AC A2 45 B3 46 11 0B>)
(   3,<2024-08-08 13:45:20.03 +0400>,<she>,<DPX200>,
      <pk PHC0 = -8.142449 PHC1 = 6 
       data hash MD5: 16K
       9C 65 A7 CA DF 6D C8 F8 34 AF 88 4B 92 BA 8F 8B>)
(   4,<2024-08-08 13:45:25.85 +0400>,<she>,<DPX200>,
      <abs ABSG = 5 
       data hash MD5: 16K
       A8 EF 2C 92 08 17 A3 6F 44 4E D0 9E 47 2A 5A 43>)
$$ ##END=
$$ 
$$ hash MD5
$$ BB A6 30 A0 DD 4D BF BD F4 B9 5B 95 E4 BC 30 FC
##$RELAX= 
##$RELAX= 
##$RELAX= 
##$RELAX= 
##$RELAX= 
##$RELAX= 
$$ Bruker specific parameters
$$ --------------------------
##$DU= <F:/spectra>
##$EXPNO= 1
##$NAME= <H-F>
##$PROCNO= 1
##$TYPE= <nmr>
##$USER= <she>
##$AMP= (0..31)
100 100 100 100 100 100 100 100 100 100 100 100 100 100 100 100 100 100 
100 100 100 100 100 100 100 100 100 100 100 100 100 100 
##$AQSEQ= 0
##$AQ_mod= 1
##$AUNM= <au_zg>
##$AUTOPOS= <>
##$BF1= 200.13
##$BF2= 200.13
##$BF3= 200.13
##$BF4= 200.13
##$BF5= 200.13
##$BF6= 200.13
##$BF7= 200.13
##$BF8= 200.13
##$BYTORDA= 1
##$CFDGTYP= 0
##$CFRGTYP= 5
##$CHEMSTR= <none>
##$CNST= (0..31)
1 1 145 1 1 1 1 1 1 1 1 1 1 1 1 1 1 1 1 1 1 1 1 1 1 1 1 1 1 1 1 1 
##$CPDPRG= <>
##$CPDPRG1= <>
##$CPDPRG2= <>
##$CPDPRG3= <>
##$CPDPRG4= <mlev>
##$CPDPRG5= <mlev>
##$CPDPRG6= <mlev>
##$CPDPRG7= <mlev>
##$CPDPRG8= <mlev>
##$CPDPRGB= <>
##$CPDPRGT= <>
##$D= (0..31)
0 1.2 0 0 0 0 0 0 0 0.06 0 0.03 0 0 0 0 0.0002 0 0 0 0 0 0 0 0 0 0 0 0 
0 0 0 
##$DATE= 1723110284
##$DBL= (0..7)
120 120 120 120 120 120 120 120 
##$DBP= (0..7)
150 150 150 150 150 150 150 150 
##$DBP07= 0
##$DBPNAM0= <>
##$DBPNAM1= <>
##$DBPNAM2= <>
##$DBPNAM3= <>
##$DBPNAM4= <>
$$ [...]
##$SUBNAM3= <"">
##$SUBNAM4= <"">
##$SUBNAM5= <"">
##$SUBNAM6= <"">
##$SUBNAM7= <"">
##$SUBNAM8= <"">
##$SUBNAM9= <"">
##$SW= 24.0689771365484
##$SWIBOX= (0..15)
0 0 2 0 0 0 0 0 0 0 0 0 0 0 0 0 
##$SW_h= 4816.95568400771
##$TD= 16384
##$TD0= 1
##$TE= 0
##$TE2= 300
##$TE3= 300
##$TEG= 300
##$TL= (0..7)
0 120 120 120 120 120 120 120 
##$TP= (0..7)
150 150 150 150 150 150 150 150 
##$TP07= 0
##$TPNAME0= <>
##$TPNAME1= <>
##$TPNAME2= <>
##$TPNAME3= <>
##$TPNAME4= <>
##$TPNAME5= <>
##$TPNAME6= <>
##$TPNAME7= <>
##$TPOAL= (0..7)
0.5 0.5 0.5 0.5 0.5 0.5 0.5 0.5 
##$TPOFFS= (0..7)
0 0 0 0 0 0 0 0 
##$TUNHIN= 0
##$TUNHOUT= 0
##$TUNXOUT= 0
##$USERA1= <user>
##$USERA2= <user>
##$USERA3= <user>
##$USERA4= <user>
##$USERA5= <user>
##$V9= 5
##$VALIST= <valist>
##$VCLIST= <CCCCCCCCCCCCCCC>
##$VD= 0
##$VDLIST= <DDDDDDDDDDDDDDD>
##$VPLIST= <PPPPPPPPPPPPPPP>
##$VTLIST= <TTTTTTTTTTTTTTT>
##$WBST= 1024
##$WBSW= 4
##$XGAIN= (0..3)
0 0 0 0 
##$XL= 0
##$YL= 0
##$YMAX_a= 431865
##$YMIN_a= -323639
##$ZGOPTNS= <>
##$ZL1= 120
##$ZL2= 120
##$ZL3= 120
##$ZL4= 120
##$ABSF1= 21.49393
##$ABSF2= -2.575274
##$ABSG= 5
##$ABSL= 3
##$ALPHA= 0
##$AQORDER= 0
##$ASSFAC= 0
##$ASSFACI= 0
##$ASSFACX= 0
##$ASSWID= 0
##$AUNMP= <proc_1d>
##$AZFE= 0.1
##$AZFW= 0.1
##$BCFW= 0
##$BC_mod= 2
##$BYTORDP= 0
##$COROFFS= 0
##$CY= -3
##$DATMOD= 1
##$DC= 0
##$DFILT= <>
##$DTYPP= 0
##$F1P= 0
##$F2P= 0
##$FCOR= 1
##$FTSIZE= 16384
##$FT_mod= 6
##$GAMMA= 0
##$GB= 0
##$INTBC= 1
##$INTSCL= 3.70164e-10
##$ISEN= 128
##$LB= 0.24
##$LEV0= 0
##$LPBIN= 0
##$MAXI= 10000
##$MC2= 0
##$MEAN= 0
##$ME_mod= 0
##$MI= 1.114404
##$NCOEF= 0
##$NC_proc= -6
##$NLEV= 6
##$NOISF1= 3.799351
##$NOISF2= 2.8
##$NSP= 0
##$NTH_PI= 0
##$NZP= 0
##$OFFSET= 21.53066
##$PC= 1
##$PHC0= -25638.54
##$PHC1= 12.78749
##$PH_mod= 1
##$PKNL= yes
##$PPARMOD= 0
##$PSCAL= 0
##$PSIGN= 0
##$REVERSE= no
##$SF= 200.129399561102
##$SI= 16384
##$SIGF1= 3
##$SIGF2= 2
##$SINO= 5.538805
##$SIOLD= 16384
##$SREGLST= <1H.CDCl3>
##$SSB= 0
##$STSI= 16384
##$STSR= 0
##$SW_p= 4816.95568400771
##$SYMM= 0
##$S_DEV= 0
##$TDeff= 16384
##$TDoff= 0
##$TI= <>
##$TILT= no
##$TM1= 0
##$TM2= 0
##$TOPLEV= 0
##$USERP1= <user>
##$USERP2= <user>
##$USERP3= <user>
##$USERP4= <user>
##$USERP5= <user>
##$WDW= 1
##$XDIM= 16384
##$YMAX_p= 531141750
##$YMIN_p= -967427
$$ End of Bruker specific parameters
$$ ---------------------------------
##NTUPLES= NMR SPECTRUM
##VAR_NAME=  FREQUENCY,     SPECTRUM/REAL,   SPECTRUM/IMAG
##SYMBOL=    X,             R,               I
##VAR_TYPE=  INDEPENDENT,   DEPENDENT,       DEPENDENT
##VAR_FORM=  AFFN,          ASDF,            ASDF
##VAR_DIM=   16384,         16384,           16384
##UNITS=     HZ,            ARBITRARY UNITS, ARBITRARY UNITS
##FACTOR=    0.29402158847633, 1,            1
##FIRST=     4308.91818389016, 0,            0
##LAST=      -508.037500117554, 0,           0
##MIN=       -508.037500117554, -967427,     0
##MAX=       4308.91818389016, 531141750,    0
$$ Real data points
##PAGE= N=1
##DATA TABLE= (X++(R..R)), XYDATA
$$ [...]
5117G0672j26074J11297L8916p8711J1686R538J3367l7729K6966J51920j21995
5106F9853m9127K65632k74001J31912j02787p8417K23408n4684J7504M4446L5342
5095B29081M4235k17869J65899m9989O752N546J2584j99212l2494J38733j8001
5084H5265l0634l4688K3689M1746n1084O7981K9338m6045J02851l4531J40056
5073B93944n4684j36955L9560O3572o6815M2398j5506J00545l6861j3041J30073
5062C46230k21924J4922K14254j62143n0713M8660J08529R0243q0734N331M0971
5051C53626m2269L6697J14725q1853o6964J28774m069K6450O9373j45682N1968
5040D40776M8761m5129n0930k279p8222n365M9617J2067m4430q2131K3600K1273
$$ plain form
5117 70672 -55402 55895 94811 16100 27786 37324 50691 12962 39928 191848 69853
5106 69853 20726 286358 12357 144269 41482 -36935 186473 131789 149293 193739 229081
5095 229081 273316 55447 221346 171357 178109 183655 196239 -2973 -35467 103266 85265
5084 85265 54631 19943 43632 85378 34294 102275 131613 85568 188419 153888 293944
5073 293944 239260 102305 141865 205437 138622 181020 165514 266059 229198 216157 346230
5062 346230 124306 139228 353482 191339 140626 189286 297815 388058 307324 312655 353626
5051 353626 311357 348054 462779 380926 313962 442736 438667 465117 534490 388808 440776
5040 440776 489537 444408 393478 391199 312977 307612 357229 369296 324866 242735 266335 287608
5028B87608J40214N5859k4282n6772P9810Q9068r173N5057q5178j8636J00755
5017F14330o358o1715R3660k2431j63181j9573K6661M9301J1617j49783K8908
5006D01436J16852m9250M6660q7055J01604R3914j8655k8801N6105j02531m0106
4995D90173J60724Q0851o8150j40403j54670J0173J6838O467k410J0057N2308
4984D61958J3161j10510n0856P8518Q235j0558p1962J40568K8032M0584j63006
4973C64164K8427L8302l3965R9839j5306o841k09664J83577m658L219P2798O6983
4961E86875k5165k33084J43754J57870k13495r0863J65346J788L9098n8378o018
4950D67728P9071j2219j0912Q9716l7317k5990j706N92k4573p805J09845J7457
$$ plain form
5028 287608 427822 483681 459399 402627 482437 571505 562332 617389 532211 513575 614330
5017 614330 607972 546257 639917 617486 454305 434732 461393 510694 522311 372528 401436
5006 401436 518288 469038 515698 428643 530247 624161 605506 576705 632810 530279 490173
4995 490173 650897 731748 663598 523195 368525 378698 395536 402003 399593 409650 461958
4984 461958 475119 364609 313753 392271 400506 389948 317986 458554 486586 527170 364164
4973 364164 392591 430893 396928 496767 481461 474620 264956 448533 443875 447094 519892 586875
4961 586875 561710 328626 472380 630250 416755 325892 491238 493026 532124 473746 467728
4950 467728 546799 534580 523668 613384 576067 550077 548371 548963 524390 516585 626430 643887
4938F43887j8806M2964L747N564p8727L5899P0259n426P2729o466j2637L6740
4926G89727j6596K0j0134j59432J33001Q9005L7922p0996o0615L7393N9769R6453
4914I25517R5390j20037J23073J9375q5876k4498k5182K86937K0658m6458O0304
4903A229203l2078L7794K0839L9635p0437m4438J67626n4027K066J42564j55212
4892A283535k04607p4836q2825J06931J13706j9324j67829l0122J28129J57481
4882A210239q4433J16895p405r2904P9341K2045j28048N5190m270L7244J39263
4871A343157J9220N3618L6836m2967p5651o4908K20454R5104R2433M1344j09653
4860A608987N2074N4890R9083n1930k7268K36714J50674Q352N9198K82086P3954
$$ plain form
4938 643887 625081 668045 671792 677356 598629 634528 704787 699361 772090 765624 752987 789727
4926 789727 773131 773151 763017 603585 736586 825591 863513 792517 731902 769295 829064 925517
4914 925517 1020907 900870 1023943 1043318 957442 932944 907762 1194699 1215357 1168899 1229203
4903 1229203 1197125 1234919 1255758 1295393 1224956 1180518 1348144 1294117 1296183 1438747 1283535
4892 1283535 1078928 1004092 921267 1028198 1141904 1122580 954751 924629 1052758 1210239
4882 1210239 1125806 1242701 1235296 1142392 1221733 1243778 1115730 1170920 1166650 1203894 1343157
4871 1343157 1362377 1415995 1452831 1409864 1334213 1269305 1489759 1584863 1677296 1718640 1608987
4860 1608987 1661061 1715951 1815034 1763104 1735836 1972550 2123224 2131576 2190774 2472860 2546814
4849B546814m4990K42347J00258J51555J55175K7828K15071K13016l4874R1194
4839C663394J47650K06139K29575P0303P7188L32680K36970K47223J74149M00143
4829E785414N73734L87285L67649N29764N90177N43219M65887O27474O60784O35282
4819A1166669R13300Q06615R10354R94090J191360J362068J807896K339264K730844
4810B4222460L556767L939887L342721J555397o17342j990288k229413j989871
4802B9790318j546130q99191k41729L2666L05934Q99360J339193J727674K239972
4793C3648067K548186L310583M073768N316082O537315P484831O754400K939488
4785G2612720l199845p046522p537696o690204n379377m051541k905565k193692
$$ plain form
4849 2546814 2501824 2744171 2844429 2995984 3151159 3178987 3394058 3607074 3572200 3663394
4839 3663394 3811044 4017183 4246758 4317061 4394249 4726929 4963899 5211122 5385271 5785414
4829 5785414 6359148 6746433 7114082 7643846 8234023 8777242 9243129 9870603 10531387 11166669
4819 11166669 12079969 12886584 13796938 14791028 15982388 17344456 19152352 21491616 24222460
4810 24222460 27779227 31719114 35061835 36617232 35999890 34009602 31780189 29790318
4802 29790318 28244188 27344997 27103268 27135934 27441868 28341228 29680421 31408095 33648067
4793 33648067 36196253 39506836 43580604 48896686 55434001 62918832 69673232 72612720
4785 72612720 69412875 62366353 54828657 48138453 42759076 38707535 35801970 33608278
4777C3608278j443066p04836m3683N22165R61354J386224J660646J725568J754114
4768C9426764J900152K412902J813860k96492k744192m308427m566353l856386
4760B9781828l440066k922740k160447j868565j433667j071602p16989m12762
4752A5754990l58046k76538m98419q02027q81150r73616r03343q80778r48322
4743I232751o21635l85298m15190n29505k93476n14348l73535l16863k14624j65619
4733E402658j63313k76447k07403q1754r6562p7549j55944j37646N411j8881J05980
4722D298550j57389k23390k14107m8628J2736L832j53209j81250P346r075J21022
4711C456438J8898k0714J27417j61281N7452J62398J89220J55217J60887q0356
$$ plain form
4777 33608278 32165212 31460376 31416693 31938858 32900212 34286436 35947082 37672650 39426764
4768 39426764 41326916 43739818 45553678 45257186 42512994 38204567 33638214 29781828
4760 29781828 26341762 23419022 21258575 19390010 17956343 16884741 16167752 15754990
4752 15754990 15396944 15120406 14621987 13819960 12938810 11965194 11061851 10181073 9232751
4743 9232751 8611116 8225818 7810628 7281123 6987647 6473299 6099764 5782901 5568277 5402658
4733 5402658 5239345 4962898 4755495 4673741 4577179 4499630 4343686 4206040 4211451 4192570 4298550
4722 4298550 4141161 3917771 3703664 3655036 3667772 3671604 3518395 3337145 3344491 3335416 3456438
4711 3456438 3475336 3454622 3582039 3420758 3478210 3640608 3829828 3985045 4145932 4065576
4701D065576J76021J92120J65686J45219K21041K58815J37067M40624L96700M74164
4691F673033N25205Q27004R65324J197002P71278M91673k90393o87116o45097
4682I827913m74914l08830k78223l40220j6086R9665K08312J97143L93053O19916
4672I927729Q29137J248678J546431J729941K240670K030007P32101j032240j999565
4663A7252889k116433j775568j387016j163536r96164p54721m52097m13277k01127
4654G992950k08331M2359K44530M24124O84167R73774P72700O86161J14582o86678
4644A1040338j251687j288433q66796r00378q22397n42079o21054l90080k97049
4635D060385m89210l00737j61842k99182q5142p6965k49610m8374L3651n3487
$$ plain form
4701 4065576 4241597 4433717 4599403 4744622 4965663 5224478 5361545 5802169 6198869 6673033
4691 6673033 7198238 8025242 8990566 10187568 10958846 11450519 11160126 10473010 9827913
4682 9827913 9352999 9044169 8765946 8425726 8409640 8509305 8717617 8914760 9307813 9927729
4672 9927729 10756866 12005544 13551975 15281916 17522586 19552593 20284694 19252454 17252889
4663 17252889 15136456 13360888 11973872 10810336 9814172 9059451 8607354 8194077 7992950
4654 7992950 7784619 7826978 8071508 8495632 9179799 10153573 10926273 11612434 11727016 11040338
4644 11040338 9788651 8500218 7633422 6733044 5910647 5368568 4747514 4357434 4060385
4635 4060385 3571175 3270438 3108596 2809414 2724272 2647307 2397697 2349323 2382974 2329487
4625B329487l69908o7099K1541j29777r7689J63296j41892p1816j01167o6255
4615A468721K6989l1843M3888o9523J9691k5445k0896r809j09577J05960j45285
4604A252871n3837k6518J36618R6799m2013N1019m0891j9823L6012j50928j73556
4593A065753L6279L240N3334n2429O8966m4697p7827P9541q6406j16077M1348
4582I71025L3625N4034L5352L9839r9136r807K19783K213K1501j16604p2535J4966
4570A094256l8177P2838K8046q2234K2034k2327J36880J4346p359Q4271k843r8312
4558A201419q7855p46J29999O9457j19286Q9897n0080j0379j35954L303N4499
4547A144274j42298J6708m1923J04300P709j77861L3373J10687N4642L1854o5101
$$ plain form
4625 2329487 1959579 1892480 1914021 1784244 1686555 1849851 1707959 1636143 1534976 1468721
4615 1468721 1495710 1463867 1507755 1438232 1457923 1432478 1411582 1401773 1292196 1398156 1252871
4604 1252871 1199034 1172516 1309134 1405933 1363920 1414939 1374048 1354225 1390237 1239309 1065753
4593 1065753 1102032 1105272 1158606 1106177 1175143 1130446 1052619 1132160 1045754 929677 971025
4582 971025 1004650 1058684 1094036 1133875 1034739 1024932 1244715 1246928 1268429 1151825 1079290 1094256
4570 1094256 1056079 1128917 1156963 1074729 1096763 1074436 1211316 1225662 1218303 1302574 1299731 1201419
4558 1201419 1113564 1112818 1242817 1312274 1192988 1282885 1232805 1222426 1086472 1089775 1144274
4547 1144274 1001976 1018684 976761 1081061 1088770 910909 944282 1054969 1109611 1141465 1076364
4536A076364n2262n3588K9406J97300j00777J10606J02872o3449j29793k8978
4526A087701j28369N1236L1758O1166Q5349J85987j64661J19572q2140J05728
4516A353327l9336l9390L1979j78754J93254M3221L0024J06230j32401N4616j4693
4505A408077K8254O0474Q6334k2368Q0665j83498n887J65218J69085M5534K30735
4494B062623J51505q4262K3590p8928j97984M9548M5472o3558K1361r7909J51149
4483A982607J5850M2364J8590J25776Q7775J47778K47487J76820K76797M29517
4473C551361J17726o0683k75271q7834k73511k8204j13496k40085r8937j20593
4463B370473J72832J57536J16785r829L3122J25975K13508J90407J89178N14716
$$ plain form
4536 1076364 1024102 970514 999920 1197220 1096443 1207049 1309921 1246472 1116679 1087701
4526 1087701 959332 1010568 1042326 1103492 1188841 1374828 1210167 1329739 1247599 1353327
4516 1353327 1313991 1274601 1306580 1127826 1321080 1364301 1394325 1500555 1368154 1422770 1408077
4505 1408077 1436331 1496805 1583139 1560771 1641436 1457938 1452051 1617269 1786354 1831888 2062623
4494 2062623 2214128 2129866 2153456 2074528 1876544 1926092 1971564 1908006 1929367 1831458 1982607
4483 1982607 1998457 2040821 2059411 2185187 2272962 2420740 2668227 2845047 3121844 3551361
4473 3551361 3669087 3608404 3333133 3245299 2971788 2943584 2830088 2590003 2491066 2370473
4463 2370473 2543305 2700841 2817626 2807797 2840919 2966894 3180402 3370809 3559987 4074703
4453D074703N52392L28760j55326n19734n03729j92251l11551j07133m5806o3451
4443C056874j65145Q5982j26904P7001l2915Q1684J19663J89174K12521L20378
4433C818313J81801L06602K88837j66267l18540l04571j78967j31750p9615j12762
4423C303081j03996J17204l6056J65918K280J29778K05676J59252J65188J15617
4413D223942K42758L31205L59352O1997k3286l8329J79602R5741R0454K54873
4403E778309J23084J0809R7358Q8542K02302M37028L28911K58793N51032K86383
4393H162551O28479O05385N49381O96232N44821N59594R59650Q70151Q90415J014400
4383A5481059J031264J260855J644327K001688K619028L230938M018451M565257
$$ plain form
4453 4074703 4627095 4955855 4800529 4280795 3777066 3584815 3273264 3166131 3120325 3056874
4443 3056874 2891729 2977711 2850807 2927808 2894893 2976577 3096240 3285414 3497935 3818313
4433 3818313 4000114 4306716 4595553 4429286 4110746 3806175 3627208 3495458 3415843 3303081
4423 3303081 3199085 3316289 3280233 3446151 3448431 3578209 3783885 3943137 4108325 4223942
4413 4223942 4466700 4797905 5157257 5219254 5195968 5157639 5337241 5432982 5523436 5778309
4403 5778309 5901393 5912202 6009560 6098102 6300404 6737432 7066343 7325136 7876168 8162551
4393 8162551 8791030 9396415 9945796 10642028 11186849 11746443 12706093 13576244 14466659 15481059
4383 15481059 16512323 17773178 19417505 21419193 24038221 27269159 31287610 35852867
4375C5852867M485701K263385l91219k373273l220114k904830k257964j557735
4367B9896818j028334l66006j78965L65596R39092J014671J581102K294941L023955
4358C7542870M040373N407024P177727Q901961Q608854L414676l005667p011641
4350F5076177p506321o860084n910307m673260l444622k751504k087555j492991
4342C0349533j080660o65043j72164M37554R17451J285105J989307K673970L305535
4333C9040588L379327J600279q33483k933004l749233l717394l319060l137562
4325B6330458k761475k272027k037544j661690j101212r01386r03683p28573o14629
4316A3348239n20177j54931j98258l30647m6427K42J0317j35628m08164n54964
$$ plain form
4375 35852867 40338568 42601953 42210734 39837461 36617347 33712517 31454553 29896818
4367 29896818 28868484 28502478 28323513 28689109 29628201 30642872 32223974 34518915 37542870
4358 37542870 41583243 46990267 54167994 63069955 71678809 75093485 72087818 65076177
4350 65076177 57569856 50709772 44799465 40126205 36681583 33930079 31842524 30349533
4342 30349533 29268873 28603830 28431666 28869220 29786671 31071776 33061083 35735053 39040588
4333 39040588 42419915 44020194 43186711 40253707 36504474 32787080 29468020 26330458
4325 26330458 23568983 21296956 19259412 17597722 16496510 15595124 14691441 13962868 13348239
4316 13348239 12828062 12673131 12474873 12144226 12097799 12098041 12108358 11972730 11564566 11009602
4306A1009602o27501o43986o02540m40734l97425m06228l74604o8945m37504l45435
4296F664700j35888n7642k81613J08645j28614m47588k24233Q451l1922q1095
4286E393201j1499j2173m7354n9786p5649Q3774L5756o8809L01K9632L2669M2707
4274E342770J02727L8282j03823Q1060O7635L12467K79613J47248K03670p0386
4264F401263l7090J5981M2909P8167J31378K6373M2008K88403J27976J46615R7626
4253G361609L15923K46105M35806M54091K85004L59669M19717Q06868R52665J252267
4243A2889724J100456P04015L80385P56474J211524Q42130K55987m71751j017521
4234A6651423q36173p41635o11004k61244j27596j60517m4590J27635M02149N80992
$$ plain form
4306 11009602 10382101 9738115 9135575 8694841 8297416 7891188 7516584 7447639 7010135 6664700
4296 6664700 6528812 6471170 6189557 6298202 6169588 5722000 5497767 5506218 5474296 5393201
4286 5393201 5381702 5369529 5322175 5262389 5186740 5270514 5306270 5237461 5237762 5267394 5300063 5342770
4274 5342770 5445497 5483779 5379956 5461016 5528651 5841118 6120731 6267979 6471649 6401263
4264 6401263 6364173 6380154 6423063 6501230 6632608 6658981 6700989 6989392 7117368 7263983 7361609
4253 7361609 7677532 7923637 8359443 8813534 9098538 9458207 9877924 10684792 11637457 12889724
4243 12889724 13990180 14694195 15074580 15831054 17042578 17884708 18140695 17668944 16651423
4234 16651423 15815250 15073615 14462611 14201367 14073771 13913254 13868664 13996299 14398448 14979440
4224A4979440P04387J117593J773847K036685K872990K976754K223606k24719
4216B8460583k090338k708151k497762k056303j694598j265097q67766q40812
4208A4439756o82045k71687k88259k5967J54014K53145M81641O05617J093043
4199A5759258J249547R68025L41584n89693j177971j267307j490109j124834q63084
4190A1805416p78836n78325n69532l98450k90182k22539P2102k12256j19350p2628
4180H635420K1915p3248N1554J8568r3454J66791J38346K76471j851m4694J6080
4169I111898J6120L36059M6682R5881R4208K01581J82943L25544M99238K09057
4159A1119211K67811K09885K82455K57295L42390L50798L91957L86425M66817
$$ plain form
4224 14979440 15683827 16801420 18575267 20611952 23484942 26461696 28685302 28460583
4216 28460583 26370245 23662094 21164332 19108029 17413431 16148334 15280568 14439756
4208 14439756 13757711 13486024 13197765 13171798 13325812 13578957 14060598 14666215 15759258
4199 15759258 17008805 17976830 18318414 17728721 16550750 15283443 13793334 12668500 11805416
4190 11805416 11026580 10448255 9878723 9480273 9190091 8967552 9039654 8827398 8708048 8635420
4180 8635420 8657335 8584087 8635641 8654209 8560755 8727546 8865892 9142363 9140512 9095818 9111898
4169 9111898 9128018 9464077 9510759 9606640 9700848 9902429 10085372 10410916 10910154 11119211
4159 11119211 11387022 11596907 11879362 12136657 12479047 12829845 13221802 13608227 14075044
4150A4075044M33472N90287P78998P99517R57442R67328J031783J062238J182271
4141B1878380J401379J312837J135385J077684J148940R62369J253799J350012
4133C1520785J444236J479819J584091J940247K246551K405046K491512K494757
4125D7607044K655368K480749K841052L425298L879747L554170K954454K840110
4117G2237992L636514M711758O125777P773951R010163J0275129J1670917J1991391
4109A37433592J1988650J2991457J3371372J0575247N813577J413761l617294
4102A89970362p271715q009898p601990q822279j1066801j1209021r866867p790327
4094A18331464n543830l641427l047775l119511k960955l002373k856266j700302
$$ plain form
4150 14075044 14508516 15098803 15877801 16677318 17634760 18602088 19633871 20696109 21878380
4141 21878380 23279759 24592596 25727981 26805665 27954605 28916974 30170773 31520785
4133 31520785 32965021 34444840 36028931 37969178 40215729 42620775 45112287 47607044
4125 47607044 50262412 52743161 55584213 59009511 62889258 66443428 69397882 72237992
4117 72237992 75874506 80586264 86712041 94485992 103496155 113771284 125442201 137433592
4109 137433592 149422242 162413699 175785071 186360318 192173895 193587656 189970362
4102 189970362 182698647 174688749 167086759 158264480 147197679 135988658 126121791 118331464
4094 118331464 112787634 109146207 106098432 102978921 100017966 97015593 94159327 92459025
4086I2459025o5312J733426L961492N527500N595633L438066n40268m878243q402058
4077I8829261r436183q685780p359260o133294m695742l458240k625954k281505
4069E4153303j775299j287820o02949J77262P24993J339294J245074m55543k830329
4060E0687986m419260m835637m377426l773001l318808k645844k294605k108262
4052B2915143j562529j456147j201930j053490q79182p35919o11632p79496o70503
4043A3964315o55965m27099m17355k61460m77988l33168j74764k79616j63248
4034A0773652k47358j37111j35579j43906l1426J693j90501p5279m6328L5128
4024I802985m8773M5196K37290J98422J23718J70603j01148P9105J69353K6914
$$ plain form
4086 92459025 92393713 94127139 98088631 103616131 109211764 112649830 112109562 107231319 98829261
4077 98829261 89393078 80707298 73348038 67214744 62519002 59060762 56434808 54153303
4069 54153303 52378004 51090184 50487235 50664497 51389490 52728784 53973858 53518315 50687986
4060 50687986 46268726 41433089 37055663 33282662 29963854 27318010 25023405 22915143
4052 22915143 21352614 19896467 18694537 17641047 16761865 16025946 15414314 14634818 13964315
4043 13964315 13308350 12881251 12463896 12202436 11724448 11391280 11216516 10936900 10773652
4034 10773652 10526294 10389183 10253604 10109698 10078272 10079965 9889464 9814185 9767857 9802985
4024 9802985 9754212 9799408 10036698 10235120 10358838 10529441 10428293 10507398 10676751 10703665
4014A0703665L3779M17921K14540J05019K79445N97786N84578M20537N82858O93977
4004A4634105P66086P21610J151609J286684J664996K163349L152511M164152
3996B9705102N493830N856239K426606k660327n194391n027218m241000l368909
3988B2989932k563528j981353j622806j351667r89779r72400r73243q88606o92250
3979A0954300p33617o80455o45952m30840m00574j38840k18486j88390l70216
3970G146930j38782n8084k4650P3301L21686Q9428N0872J70765J33522M09704
3960H174692N10116O21674J12774m86310o75593o80757o92642o98307m36241l58874
3950E390532l36945j74842j35791j38827k53194m9396M6389n9945P0523J65009
$$ plain form
4014 10703665 10737444 11155365 11369905 11474924 11754369 12352155 12936733 13357270 13940128 14634105
4004 14634105 15400191 16121801 17273410 18560094 20225090 22388439 25540950 29705102
3996 29705102 35198932 41055171 43481777 40821450 35627059 30599841 26358841 22989932
3988 22989932 20426404 18445051 16822245 15470578 14480799 13508399 12535156 11646550 10954300
3979 10954300 10220683 9540228 8894276 8463436 8062862 7924022 7705536 7517146 7146930
3970 7146930 7008148 6950064 6925414 6998715 7320401 7409829 7460701 7631466 7764988 8174692
3960 8174692 8684808 9306482 9419256 8932946 8257353 7576596 6883954 6185647 5749406 5390532
3950 5390532 5053587 4878745 4742954 4604127 4350933 4301537 4347926 4287981 4358504 4523513
3940D523513J33813P1009K69764L87824N84551P76009M87731r0730n54874o18290
3930E970320n64403o00579n66396m13392k83041j85476j99743j28844l752j51252
3920B873442o7519q8550M1427P2300j64285J22032J40498Q2528K09082J56665
3910C377620R7611Q671j95421j19568k25592j40760j71777j18645r1996k0484
3900B399659M6273q1179j68326J13822n3788j54034k80j8502j87234K5191l1318
3889A890284O1616J1807l3277j02442o2142O0868J15443k7493Q4529J34205J48666
3878B282064Q9819l6733M3375L8845j5545p351p904n7151k1248n8549j56056p9825
3866B013741k5463k1006J8370l20J9670j29128J28740O0396j35632L4720J65438
$$ plain form
3940 4523513 4657326 4728335 4998099 5385923 5970474 6746483 7234214 7143484 6588610 5970320
3930 5970320 5405917 4805338 4238942 3825550 3542509 3357033 3157290 3028446 3024694 2873442
3920 2873442 2805923 2717373 2758800 2831100 2666815 2788847 2929345 3011873 3220955 3377620
3910 3377620 3475231 3483902 3288481 3168913 2943321 2802561 2630784 2512139 2420143 2399659
3900 2399659 2445932 2364753 2196427 2310249 2256461 2102427 2102147 2083645 1896411 1921602 1890284
3889 1890284 1951900 1963707 1930430 1827988 1765846 1826714 1942157 1914664 1999193 2133398 2282064
3878 2282064 2371883 2335150 2378525 2417370 2401825 2394474 2386570 2329419 2308171 2249622 2093566 2013741
3866 2013741 1988278 1967272 1985642 1985322 2004992 1875864 2004604 2065000 1929368 1964088 2129526
3855B129526j48711r4624J15354j2629k730J74303R8814k06597L4224j17621j72349
3844A796960Q3938n1032L6593m4947j09232p8135k31377m9421J67133K1681k65649
3833A276512j59728P3894J47056q8541n902j01036O9173J45859p5729Q8738q7572
3822A282724r1291P8566j62742n532m0874r7837p3306R8589J5176n7516J05123
3811A051080j01400K9071r8056r1012M3495m0825K3950J33472J4395R3245J9865
3800A077280r4719L6224l5023p4619o5966j08463K07919k8549J48276n9659J7794
3789A020495l4797r2582P7346O7762M0944j24435j918m6020p481j967N8024j6873
3777I38498K8681O4483j0288o6795J8683j0825o5169R027L4785J07519m4224o5529
$$ plain form
3855 2129526 1980815 1886191 2001545 1988916 1986186 2160489 2259303 2052706 2086930 1969309 1796960
3844 1796960 1880898 1829866 1866459 1821512 1712280 1634145 1402768 1353347 1520480 1542161 1276512
3833 1276512 1116784 1190678 1337734 1249193 1243291 1142255 1211428 1357287 1281558 1370296 1282724
3822 1282724 1191433 1269999 1107257 1101725 1060851 963014 889708 988297 1003473 945957 1051080
3811 1051080 949680 978751 880695 789683 833178 792353 816303 949775 964170 1057415 1077280
3800 1077280 982561 1018785 983762 909143 843177 734714 942633 914084 1062360 1002701 1020495
3789 1020495 985698 893116 970462 1038224 1079168 954733 952815 906795 899314 897347 955371 938498
3777 938498 967179 1031662 1021374 954579 973262 962437 897268 906295 941080 1048599 1004375 938846
3765I38846K6339J2014q1134r115j37782J81675j1434k8104j0129m4230N1361
3754H88307J0160p3591j54272R6720K1802o7291l4747K34684K4124j29221J2139
3743H28814J79408L497j51487o9191j01092J23600M4599p1454J14797r844q8686
3732H02961L969k4095L5968l4080R657P0173N8556j50835O3901L4401O416o8511
3720H08481P5663R7573j25216j23494Q8676L5438p335K14811j38531j25268J25387
3709I26185J06745k8200p290J33338k05668j74992J46666j8955J42519m7173J51211
3698A124386j7547l6172L5341O2757p3009L4712Q1094J13332J60622j37341j18578
3687A229597J21030J51076K0362J83848L4503M2436K4986n4669m2532J19479J16991
$$ plain form
3765 938846 965185 977199 896065 886950 749168 930843 919409 891305 881176 836946 888307
3754 888307 898467 824876 670604 767324 789126 721835 687088 921772 945896 816675 828814
3743 828814 1008222 1011719 860232 791041 689949 813549 858148 786694 901491 891647 802961
3732 802961 806930 782835 818803 784723 794380 864553 923109 772274 836175 870576 876992 808481
3720 808481 884144 981717 856501 733007 821683 857121 849786 1064597 926066 800798 926185
3709 926185 1032930 1004730 997440 1130778 925110 750118 896784 877829 1020348 973175 1124386
3698 1124386 1106839 1070667 1106008 1168765 1095756 1130468 1211562 1324894 1485516 1348175 1229597
3687 1229597 1350627 1501703 1522065 1705913 1740416 1782852 1807838 1753169 1710637 1830116 1947107
3676A947107J34510Q498J6455Q0998J98333J00975O2498K5414P8495J15905J32128
3665B901316K04756P708R1193J17061R2003Q5551J18937N717J63809K85964J14131
3654D188146R3402J54370M7374J77428J53638K88059L33710N08442J67036L15598
3644F427203N15445K89372O42977P58894J074816J601369K250270K477927M26078
3635A6464351j044262j599321j579368j267530r23449o17569k95155r0363J36855
3626I184189M17408P08226J308672J584781K181674J861940j02035j700168j942928
3617A3501759j692245j384699j176527j008240p66795n19102l89663k40241k00610
3608F123637k30494j89911k137o2652k3125K8026j07718O2331K07726J85961J92429
$$ plain form
3676 1947107 2081617 2090115 2106570 2187568 2385901 2486876 2549374 2574788 2653283 2769188 2901316
3665 2901316 3106072 3113780 3204973 3322034 3414037 3499588 3618525 3624242 3788051 4074015 4188146
3654 4188146 4281548 4435918 4483292 4660720 4814358 5102417 5436127 5944569 6111605 6427203
3644 6427203 6942648 7232020 7874997 8633891 9708707 11310076 13560346 16038273 16464351
3635 16464351 15420089 13820768 12241400 10973870 10050421 9432852 9137697 9047334 9184189
3626 9184189 9601597 10309823 11618495 13203276 15384950 17246890 17144855 15444687 13501759
3617 13501759 11809514 10424815 9248288 8240048 7473253 6954151 6564488 6324247 6123637
3608 6123637 5893143 5703232 5701095 5638443 5615318 5643344 5535626 5597957 5805683 5991644 6184073
3597F184073J44969L5320J61733K46661J52966J14609K0976M2646R5236J77352
3587G376541J47678J39873J65479L53555K12744L59982K01553O31042K14127N86146
3577A0388720M99050M22597O33166N47603Q62309Q57271J097687R89793J162966
3568A7461162J302296J458953J836308K274144K731150L117167L751112L952497
3560C7884789K860072N10594j564422k460117k437374j936388j390584o85994
3552C0780576j18246M11435O12226R89329J347662K328444L193717M184714N314152
3543D9044009N171302L760969J881096j498059m510795n526749n310773m515178
3535C8495822l764850k488017j960282j692388j450140q27646k51875J18352R03594
$$ plain form
3597 6184073 6329042 6364362 6526095 6772756 6925722 7040331 7061307 7103953 7199189 7376541
3587 7376541 7524219 7664092 7829571 8183126 8395870 8755852 8957405 9588447 9802574 10388720
3577 10388720 10887770 11310367 11943533 12491136 13353445 14210716 15308403 16298196 17461162
3568 17461162 18763458 20222411 22058719 24332863 27064013 30181180 33932292 37884789
3560 37884789 40744861 41255455 39691033 37230916 34793542 32857154 31466570 30780576
3552 30780576 30662330 31073765 31685991 32675320 34022982 36351426 39545143 43729857 49044009
3543 49044009 54215311 57976280 59857376 58359317 53848522 48321773 43011000 38495822
3535 38495822 34730972 32242955 30282673 28590285 27140145 26312499 26060624 26178976 27082570
3526B7082570J495668K207214K043154J062205q70138k769060l515946l210539
3518B3525128k952048k512486k009653j821737j433531j117616r71711r80415
3510I725931q17251m89370n95511n61439j93229l57681l01924l49979l97703l51247
3500E310597o4946j73349l04691l4618j62305k50238k20109l0568j09333j95996
3490C764444j55003r1724k773j01414j49161k25511J11766j18169j11350J03660
3480C024765N7825r7851m4029K58j37353j06905Q7063L11275o4503p635K01135
3469C224045J248o7643J55003K06735Q8959k9234j70064p4447o3373j26773l8929
3458C105527n8407o7836Q429J214n6289J46947Q588K21872J75400J26543R060
$$ plain form
3526 27082570 28578238 30785452 32828606 33890811 33020673 30251613 26735667 23525128
3518 23525128 20573080 18060594 16050941 14229204 12795673 11678057 10706346 9725931
3510 9725931 8908680 8419310 7823799 7262360 7069131 6711450 6409526 6059547 5661844 5310597
3500 5310597 5245651 5072302 4767611 4732993 4570688 4320450 4100341 4069773 3960440 3764444
3490 3764444 3609441 3517717 3514944 3413530 3264369 3038858 3150624 3032455 2921105 3024765
3480 3024765 3082590 2984739 2940710 2940968 2803615 2696710 2783773 3095048 3030545 3022910 3224045
3469 3224045 3225293 3157650 3312653 3519388 3608347 3579113 3409049 3334602 3271229 3144456 3105527
3458 3105527 3047120 2979284 2987713 2988927 2932638 3079585 3088173 3310045 3485445 3611988 3621048
3447C621048n9757O7205l8045k14844j32887j75301j63367k31765j54195J49935
3437B668027K7159j46130p8279L8825j55951J29891J69341N3920l3887j14714
3427B558202j92535j96973k08952j05041j25692o9670j21775q2526n1512j07693
3417A295833n7550m3554N1011p8610O2418k3374J23827q782p7386K1131m2214
3406A222750j03747n6679M5380J22594J05366N456k3739j22522R8152m5025R0937
3395A338923k9927j58910q3727J532K77855l2763m4978J73307k24653j39455J37574
3384A214778n4190r5435J24533o420L1519r8687j55201J55496j2413J7517K4784
3373A146281r0910r0627J25547k502l4188J1793J2379Q2610j40739k9980L5036
$$ plain form
3447 3621048 3561291 3628496 3590451 3375607 3242720 3067419 2904052 2672287 2518092 2668027
3437 2668027 2695186 2549056 2470777 2509602 2353651 2483542 2652883 2706803 2672916 2558202
3427 2558202 2365667 2168694 1959742 1854701 1729009 1659339 1537564 1455038 1403526 1295833
3417 1295833 1238283 1194729 1245740 1167130 1229548 1206174 1330001 1321219 1243833 1264964 1222750
3406 1222750 1119003 1062324 1107704 1230298 1335664 1341120 1317381 1194859 1293011 1247986 1338923
3395 1338923 1308996 1150086 1066359 1067891 1345746 1312983 1268005 1441312 1216659 1077204 1214778
3384 1214778 1160588 1065153 1189686 1183266 1214785 1116098 960897 1116393 1103980 1121497 1146281
3373 1146281 1055371 964744 1090291 1087789 1053601 1065394 1077773 1160383 1019644 989664 1024700
3362A024700L8688j7057r3716m9643j013l4526N111J50312K5839L0013n7683j05747
3350I15278J36296P1913K3023r6423o1916M3643k2396J54107p6836O0259L9422
3339A186370M0695j79235P3109m367J11497N594J02486K5720L4305k8856k93426
3328A073892J73816J6192N3020o8683q7578K28724m6503j98089J3457J13225K50033
3317A521506m877j4125K8489j55233J04993O4885J34131R216j61700j31314N0673
3306A446644N0395q4044J16417J30228M6429j92608J0093n818R148j93109K57518
3295A591293j11101J3168N3751N1361j56470M4082l767Q0316J42039n2076K6237
3284A678833M4017q6655n9868J43106M4637N2302m8502j12670N3469J74240j69278
$$ plain form
3362 1024700 1063388 1046331 952615 902972 901959 867433 872544 1022856 1048695 1078708 1021025 915278
3350 915278 1051574 1123487 1146510 1050087 988171 1031814 1009418 1163525 1086689 1146948 1186370
3339 1186370 1227065 1047830 1120939 1116572 1228069 1233663 1336149 1361869 1396174 1367318 1073892
3328 1073892 1247708 1263900 1316920 1248237 1160659 1389383 1342880 1144791 1158248 1271473 1521506
3317 1521506 1516629 1502504 1530993 1375760 1480753 1545638 1679769 1688985 1527285 1395971 1446644
3306 1446644 1497039 1412995 1529412 1659640 1706069 1513461 1523554 1517736 1526884 1333775 1591293
3295 1591293 1480192 1493360 1547111 1598472 1442002 1486084 1482317 1562633 1704672 1652596 1678833
3284 1678833 1722850 1636195 1576327 1719433 1764070 1816372 1767870 1655200 1708669 1882909 1713631
3273A713631l6310J25946J6807j39186P7411P0173K2854N9215K21182K777p1893
3262B062607J15352p5671L4870J7980J3479n3802j5457Q6901p8802P5748M2746
3251B225951J01975j17385k6373K68307j05697N3417N9336Q5992J21856P1257
3241B738636j1151k04421J34909L37264o1339M7632l1314o1825J23291K20615
3231C232297P3670K6147j01851R1762J90524M3860K68547O6472P5242J17078K08849
3220D292597K85854K09034J85362J29971J06877J86859K18560N9013O2258K22380
3210E958765K87425K21115K37508L03821J91114L53048M61525M74771M84860N65673
3200I539625M89608N39131N88748O47811M98372N71420O87596Q40902P88554J129297
$$ plain form
3273 1713631 1677321 1803267 1820074 1680888 1758299 1828472 1851326 1910541 2131723 2134500 2062607
3262 2062607 2177959 2102288 2137158 2155138 2168617 2114815 2099358 2186259 2107457 2183205 2225951
3251 2225951 2327926 2210541 2184168 2452475 2346778 2400195 2459531 2545523 2667379 2738636
3241 2738636 2727485 2523064 2657973 2995237 2933898 2981530 2950216 2888391 3011682 3232297
3231 3232297 3305967 3332114 3230263 3322025 3512549 3556409 3824956 3891428 3966670 4083748 4292597
3220 4292597 4578451 4787485 4972847 5102818 5209695 5396554 5615114 5674127 5736385 5958765
3210 5958765 6246190 6467305 6704813 7008634 7199748 7552796 8014321 8489092 8973952 9539625
3200 9539625 10029233 10568364 11157112 11804923 12303295 12874715 13562311 14403213 15191767 16321064
3190A6321064J249230J087553J240126J168332O99449N73201P07514Q12797J076447
3181B4935713J559036J682721K041928J960965J580681R52648J32479k72947p2033
3172C4501191N3865N72269J011278J644702J808451J716658R00314k92149j115450
3163D0801129j811850j668372j213201p79132N244M57313N20861L62200k46462
3154C6427730j306638j883300k032279j890395j559501j223457p87158l77141
3146B5367861j63564m18680n19265r37611j090196j041156r26508p43967m95976
3137A9030938m85366l11091j04903k58359j29601L8366j80760N7253J14322j07144
3127A7663655K92467K46084L08068J86951L46633N96132N19245M02616O32165
$$ plain form
3190 16321064 17570294 18657847 19897973 21066305 21765754 22338955 23046469 23859266 24935713
3181 24935713 26494749 28177470 30219398 32180363 33761044 34713692 34846171 34573224 34501191
3172 34501191 34555056 35127325 36138603 37783305 39591756 41308414 42208728 41916579 40801129
3163 40801129 38989279 37320907 36107706 35328574 35333818 35791131 36311992 36674192 36427730
3154 36427730 35121092 33237792 31205513 29315118 27755617 26532160 25745002 25367861
3146 25367861 25204297 24785617 24266352 23328741 22238545 21197389 20270881 19526914 19030938
3137 19030938 18545572 18234481 18129578 17871219 17741618 17779984 17599224 17656477 17770799 17663655
3127 17663655 17956122 18202206 18510274 18697225 19043858 19639990 20159235 20561851 21194016
3118B1194016O86706M81738O84184O91664Q10601R40934J074309J008086R82297
3109B8554535J118338J183373J187050J433669J235981J455204J731514J569682
3101C9469346J484903J745138J822214J794895J681936J996314J654516J715810
3093E3365072J668882J451353J281655J124812P75618M40259M6486k17289m43767
3084E9493081r99526j087511j474569j705768j783445j884494j918000k222500
3076D6417268k007311k129278j879747j955259j864208j927434j651914j457329
3068C1544788j471910j442358j239753j306128j269367j216075j056484r39140
3060B1603573r42757j003162q34915p49136p16013o16015p60657o69720o67962
$$ plain form
3118 21194016 21880722 22362460 23046644 23738308 24548909 25489843 26564152 27572238 28554535
3109 28554535 29672873 30856246 32043296 33476965 34712946 36168150 37899664 39469346
3101 39469346 40954249 42699387 44521601 46316496 47998432 49994746 51649262 53365072
3093 53365072 55033954 56485307 57766962 58891774 59667392 60107651 60154137 59936848 59493081
3084 59493081 58493555 57406044 55931475 54225707 52442262 50557768 48639768 46417268
3076 46417268 44409957 42280679 40400932 38445673 36581465 34654031 33002117 31544788
3068 31544788 30072878 28630520 27390767 26084639 24815272 23599197 22542713 21603573
3060 21603573 20660816 19657654 18822739 18073603 17357590 16741575 15980918 15311198 14643236
3051A4643236l96593m50175n62468m09016m84397k53608l74064o11323l74249
3042A0727343m14059l73239k43488k04674l04099j50318m27072k57369k35937
3033H117088k81912k06978k79328k17236j72187o7583j71441j39671j72767k13081
3023F194904j91385O3798j89695k72972J9233k11356j65486m4028O8347j55053
3013E116307j23081j34216r0902l7712j09643j76642r6590M4987P009k18390j25092
3002D056035J1693j54828o2047o1416j54987O0518j16709O0978K4996m0319k12070
2991C411844l0430j6693k1883j0931j19362M2131J3873q2723K0685j03491j56509
2980B946511q7982J9976L9970J09928n8794O3672p7734r1329p7923l2348j38877
$$ plain form
3051 14643236 14246643 13796468 13234000 12824984 12340587 12086979 11712915 11101592 10727343
3042 10727343 10313284 9940045 9696557 9491883 9187784 9037466 8610394 8353025 8117088
3033 8117088 7835176 7628198 7348870 7131634 6959447 6891864 6720423 6580752 6407985 6194904
3023 6194904 6003519 6067317 5877622 5604650 5623883 5412527 5247041 5203013 5271360 5116307
3013 5116307 4993226 4859010 4768108 4730396 4620753 4444111 4347521 4392508 4399517 4181127 4056035
3002 4056035 4067728 3912900 3850853 3789437 3634450 3694968 3578259 3639237 3664233 3623914 3411844
2991 3411844 3381414 3364721 3342838 3331907 3212545 3254676 3268549 3185826 3206511 3103020 2946511
2980 2946511 2858529 2878505 2918475 3028403 2969609 3033281 2955547 2864218 2786295 2753947 2615070
2969B615070p7557r641P4690q4353K5792L6724r482k5847J457n9457m9096q4094
2957B354206N07K9044l2318Q1449R6296Q6992j57956K7107m6057j16475O6167
2946B388962j68619J26965J20079P1136n6466l5485J63621j09663M7291j17701
2936B430120R9500j1912q2805K2175K05158P0246o4588r0244k899J16241q0612
2925B610380Q2021L072m7449p222O9616q068O1197P0397j8109m8569m9233K8259
2913B746292q6655j0306J88414p7042j07044M9464n9792r2125o624k28261j24501
2902B191820K19480o7715N966L5896l2815L4006L2385o5970q219L6596m5066l1194
2890B305170J08026r0537J06053r5154J5370Q2433r918M9014P8102p8913r6662
$$ plain form
2969 2615070 2537513 2527872 2602562 2518209 2544001 2580725 2571243 2545396 2546853 2487396 2438300 2354206
2957 2354206 2354713 2383757 2351439 2432888 2529184 2616176 2458220 2485327 2439270 2322795 2388962
2946 2388962 2220343 2347308 2467387 2538523 2482057 2446572 2610193 2500530 2547821 2430120
2936 2430120 2529620 2517708 2434903 2457078 2662236 2732482 2667894 2577650 2574751 2690992 2610380
2925 2610380 2692401 2695473 2648024 2640802 2710418 2702350 2763547 2833944 2815835 2767266 2718033 2746292
2913 2746292 2659637 2649331 2837745 2760703 2653659 2703123 2643331 2551206 2544582 2316321 2191820
2902 2191820 2411300 2343585 2349551 2385447 2352632 2386638 2419023 2353053 2344834 2381430 2336364 2305170
2890 2305170 2413196 2322659 2428712 2333558 2348928 2431361 2421443 2470457 2548559 2469646 2372984
2879B372984R0886J15681L0673q3111p5100J19542j30575P9548j6841P6356q8255
2868B491788r120Q3249L7236P6244J53057N4297M0333m1248J0438l1955L6869
2857B901188R5527q2362m3532q1487J52231J36452J12930P0152l3321m7177n0297
2846C130304O4852M5975q6133R5478J08869l7890P2744Q4011K0666l2114J75185
2835C641947J69266r0393m5964J16558R2188L6061N4958J17507J61554J46116
2825D399798j96477K21882K3027J52127L56386j9218J44369J17378k8500R7760
2815E268532J54970P530N0596J81220J74752R248o890k4540j06158K7664L6966
2804E773890j54388K63688K9086q7656O5058j09968j31775m6509k2155Q5663l2992
$$ plain form
2879 2372984 2463870 2579551 2610224 2527113 2452013 2571555 2440980 2520528 2503687 2580043 2491788
2868 2491788 2482668 2565917 2603153 2679397 2832454 2886751 2927084 2885836 2896274 2864319 2901188
2857 2901188 2996715 2914353 2870821 2789334 2941565 3078017 3190947 3261099 3227778 3180601 3130304
2846 3130304 3195156 3241131 3154998 3250476 3359345 3321455 3394199 3478210 3498876 3466762 3641947
2835 3641947 3811213 3720820 3674856 3791414 3883602 3919663 3974621 4092128 4253682 4399798
2825 4399798 4203321 4425203 4448230 4600357 4956743 4937525 5081894 5199272 5170772 5268532
2815 5268532 5423502 5431032 5481628 5662848 5837600 5846848 5839958 5815418 5709260 5736924 5773890
2804 5773890 5619502 5883190 5912276 5824620 5889678 5779710 5647935 5601426 5579271 5664934 5631942
2793E631942N5275J5123k4907R9731j06268q5344K65332J46254J19913n8854J7891
2782F076088l3615J42343m762R3292K5198N5200R1739K12876K15378j32480J61529
2771F902786P013J01178P64J22279K19069r8612J27320N9059J56741J04307K52818
2760G954722M65688J19928J81208J79659J23788K57225K98531M52820J76703M13087
2750A0623359L60730N91070K72598N08912O00798M80800N62627N12588O12791
2741A5126273O02256N73993N18967O14214P16383O81090O29262P92286Q19160
2732B1073884Q20290J077051J286059J091352J308647J603770J463039J777054
2724C1501146K159678K458052K662102L082382L674080M307308M968923N573649
$$ plain form
2793 5631942 5687217 5702340 5677433 5777164 5670896 5585552 5850884 5997138 6117051 6058197 6076088
2782 6076088 6042473 6184816 6180054 6273346 6298544 6353744 6445483 6658359 6873737 6741257 6902786
2771 6902786 6909799 7010977 7011741 7134020 7353089 7254477 7381797 7440856 7597597 7701904 7954722
2760 7954722 8420410 8540338 8721546 8901205 9024993 9282218 9580749 10033569 10210272 10623359
2750 10623359 10984089 11575159 11847757 12356669 12957467 13438267 14000894 14513482 15126273
2741 15126273 15728529 16302522 16821489 17435703 18152086 18833176 19462438 20254724 21073884
2732 21073884 21894174 22971225 24257284 25348636 26657283 28261053 29724092 31501146
2724 31501146 33660824 36118876 38780978 41863360 45537440 49844748 54813671 60387320
2716F0387320O204356O805906O974708O477534N717823M466825K666754J372181
2708A01073407j6418q36882j046609q90784m46352l29881L605p15927j615157
2699I5179002k634737m102152n377545o301308o745736o772997o481661n791965
2691E0970901n021517m374156l749109l118432k416129k232569j864271j301982
2683B6892736j391648j098051j010101q61703n26176m63862m85025n72273m87897
2674A9996000k35432k79680k60418l65141j65427k45197k45783k20291l4912j36913
2664A7806806j21496j50257m1316J58314J33828N0052k1828J05825M19615N2223
2654A8391766K48921K646L21685M23841K81639L57050M07760L59066O04966L83968
$$ plain form
2716 60387320 66591676 73397582 80372290 86849824 92567647 97034472 99701226 101073407
2708 101073407 101056989 100220107 99173498 98282714 97836362 97506481 97510086 96794159 95179002
2699 95179002 92544265 88442113 83064568 76763260 70017524 63244527 56762866 50970901
2691 50970901 45949384 41575228 37826119 34707687 32291558 30058989 28194718 26892736
2683 26892736 25501088 24403037 23392936 22531233 22005057 21541195 21056170 20483897 19996000
2674 19996000 19760568 19480888 19220470 18855329 18689902 18444705 18198922 17978631 17943719 17806806
2664 17806806 17685310 17535053 17493737 17652051 17785879 17835931 17814103 17919928 18339543 18391766
2654 18391766 18640687 18643333 18965018 19388859 19670498 20027548 20435308 20794374 21399340 21783308
2644B1783308P29211P85771M69264Q15247Q90428Q69626R00941J108437R23698
2635B9275931J003126J215145J283387J076251J364825J285538J423960J645387
2627C9573550J527553J726281J856073J874966K220101K406259K543050K935809
2619E6663642L230360L578892L700396M172540M529276M405276M652189M553039
2611H9485610M589244M901412N394656N683752O664495P900263R368358J0835594
2603A44823384J2266321J3209217J3593624J3009726J1329515R302906O724861
2596B24259554M420086K910187J700926J574275J996638K308679K368447J735828
2588B43274620K95815j874000l626678n497316o710708o837226o614792n359783
$$ plain form
2644 21783308 22512519 23298290 23767554 24582801 25473229 26342855 27243796 28352233 29275931
2635 29275931 30279057 31494202 32777589 33853840 35218665 36504203 37928163 39573550
2627 39573550 41101103 42827384 44683457 46558423 48778524 51184783 53727833 56663642
2619 56663642 59894002 63472894 67173290 71345830 75875106 80280382 84932571 89485610
2611 89485610 94074854 98976266 104370922 110054674 116719169 124619432 133987790 144823384
2603 144823384 157089705 170298922 183892546 196902272 208231787 217534693 224259554
2596 224259554 228679640 231589827 233290753 234865028 236861666 239170345 241538792 243274620
2588 243274620 243570435 241696435 238069757 232572441 225861733 219024507 212409715 207049932
2580B07049932l751212k404285p47236J335186L078956M016866M168309L788603
2572B16535119K919493J697361J95493r25531j857669k275828l347627l872274
2564B09068537l789030l456358l129646l477162l644469m418314m869684n517732
2556A76766142o862006q678018r206599q358995p017633m175286k058871o024822
2548A24383912j0477971r990547p784256o132155m393674k807701l521128l903622
2540G5372858l539737l264277k938175k144628j404958q49923J47051J013382
2532F2391593J573688J929707L797176M385997p59741m975081m679353l303579
2524F0360407k078283j312790o13922k896o390M2113l71209j142955j775168j811432
$$ plain form
2580 207049932 203298720 200894435 200147199 201482385 204561341 208578207 212746516 216535119
2572 216535119 219454612 221151973 221347466 220421935 218564266 216288438 212940811 209068537
2564 209068537 205279507 201823149 198693503 195216341 191571872 187153558 182283874 176766142
2556 176766142 169904136 161226118 152019519 143660524 136642891 132467605 130408734 124383912
2548 124383912 113905941 103915394 96131138 89998983 85605309 82797608 79276480 75372858
2540 75372858 71833121 68568844 65630669 63486041 62081083 61231160 61378211 62391593
2532 62391593 63965281 65894988 69692164 74078161 73318420 68343339 63663986 60360407
2524 60360407 58282124 56969334 56355412 56352516 56346126 56388239 56017030 54874075 53098907 51287475
2514E1287475j797260j940895j797154j566335j165788p93877j060971j348188
2506C9817007j055061p89548n93324m82450m71007n63853n45134l84940m02766
2497C4528924l03071n2273J89224K80186M63739P69003Q34534J031284J516530
2488C9258080J797113J458595J263805J724522K170049K693981L264591L832760
2480E7463496M406431M570654M757636M867924N205964N380435N138245M580002
2472I6370787L650530L089971K652229J882504J201448K44992j104490k524801
2464A05463170l786971n386570o358262p215080p570148p425641p018211o436625
2456E4265662n684606m693640m031731l508023k951758k558547k228992j705149
$$ plain form
2514 51287475 49490215 47549320 45752166 44185831 43020043 42226166 41165195 39817007
2506 39817007 38761946 37972398 37379074 36896624 36425617 35861764 35316630 34931690 34528924
2497 34528924 34225853 34173580 34362804 34642990 35106729 35875732 36710266 37741550 39258080
2488 39258080 41055193 42513788 43777593 45502115 47672164 50366145 53630736 57463496
2480 57463496 61869927 66440581 71198217 76066141 81272105 86652540 91790785 96370787
2472 96370787 100021317 103111288 105763517 107646021 108847469 109092461 107987971 105463170
2464 105463170 101676199 96289629 89931367 82716287 75146139 67720498 60702287 54265662
2456 54265662 48581056 43887416 39855685 36347662 33395904 30837357 28608365 26903216
2448B6903216j684864j207423j183147r94481p17663r50123o93106m88262n74199
2439A8409948n49294l97799l19921n16654l01702k26246l43072M6104j08413j32109
2429A5560842J95799J68525K42393L19084J0293K30359Q6428j93645k33526k81418
2419A6105134o92734o33285n19626n92622n46054n14020l35169j28572l07572
2410A1835480j35823k48669k6249J6457j52239k597m3421j99746j95723K3756
2400A0871226j00982j69468r3779j79302j27283R476j51288Q1072l3899M5594
2390A0151367J2347j6899O1048K9695p6544Q7859J86527n5267O4051J59019L1920
2379A0635123J51419J63011o2006K58047J8088N3489J71478K41783J63025J70341
$$ plain form
2448 26903216 25218352 24010929 22827782 21833301 21115638 20165515 19472409 18984147 18409948
2439 18409948 17860654 17462855 17142934 16626280 16324578 16098332 15755260 15801364 15692951 15560842
2429 15560842 15756641 15925166 16167559 16486643 16496936 16727295 16813723 16620078 16386552 16105134
2419 16105134 15412400 14779115 14259489 13666867 13120813 12606793 12271624 12143052 11835480
2410 11835480 11699657 11450988 11424739 11441196 11288957 11286360 11242939 11043193 10847470 10871226
2400 10871226 10770244 10600776 10506997 10327695 10200412 10209888 10058600 10139672 10105773 10151367
2390 10151367 10163714 10146815 10207863 10237558 10161014 10248873 10435400 10380133 10444184 10603203 10635123
2379 10635123 10786542 10949553 10887547 11145594 11163682 11217171 11388649 11630432 11793457 11963798
2369A1963798M68851K37165L47570N15176O32250K58798K44960L27869L06054
2360A5302491K31723L58476J14604K95526L41851J46560K27550k2448J48358Q6940
2350A7231631K23807K08150K07520L73203K95647M33917M44115P34519O28129
2341B0780638Q44388R79532R23349J063323J128667J376600J658872K017420J936953
2332C2709742K241698K372876K160504K080749J826331J552479J126161J007748
2324D7078288P99590P18271R67244J441496J395944J907157K255016K484059K865041
2315F1912106L459100L717256L965428M309231M973579N499939O082552P169060
2307A01088251Q246298R277853R713763J0542365J1748366J3577262J5693650
$$ plain form
2369 11963798 12432649 12669814 13017384 13532560 14164810 14423608 14668568 14996437 15302491
2360 15302491 15534214 15892690 16007294 16302820 16644671 16791231 17018781 16996333 17144691 17231631
2350 17231631 17455438 17663588 17871108 18244311 18539958 18973875 19417990 20152509 20780638
2341 20780638 21625026 22604558 23527907 24591230 25719897 27096497 28755369 30772789 32709742
2332 32709742 34951440 37324316 39484820 41565569 43391900 44944379 46070540 47078288
2324 47078288 47877878 48596149 49563393 51004889 52400833 54307990 56563006 59047065 61912106
2315 61912106 65371206 69088462 73053890 77363121 82336700 87836639 93919191 101088251
2307 101088251 109334549 118612402 128326165 138868530 150616896 164194158 179887808
2300A79887808J8701260K2838184K9529670L8575789N0877513O3862188O5760660
2293D70033072M6971213J4137465k3641205n2710744o2988606n9164775m9975921
2286B82660499m0999912l3428852k7506823k2947790j9261093j5990589j3367865
2279A09157575j1020116r099499p665165o653738n603873m877038m261616l711642
2271E6264888l389002l049997k413378k552462k102758j700359j922420j702372
2263C7432140j548865j437416j298161j291877j221723r87371o99965m62363m51241
2254B8033158l8083K17268O09922R13436J103054O35651r83986j943447k584619
2245B5962354k458679j981394j676363j478122j320081j101162r79485p75512
$$ plain form
2300 179887808 198589068 221427252 250956922 289532711 340410224 404272412 470033072
2293 470033072 517004285 531141750 507500545 454789801 391801195 332636420 282660499
2286 282660499 241660587 208231735 180724912 157777122 138516029 122525440 109157575
2279 109157575 98137459 89037960 81372795 74719057 69115184 64238146 59976530 56264888
2271 56264888 52875886 49825889 47412511 44860049 42757291 41056932 39134512 37432140
2263 37432140 35883275 34445859 33147698 31855821 30634098 29646727 28946762 28484399 28033158
2254 28033158 27995075 28212343 28822265 29735701 30838755 31474406 30490420 28546973 25962354
2245 25962354 23503675 21522281 19845918 18367796 17047715 15946553 14967068 14191556
2237A4191556q87374o84570o29799m49320n39696l77070l74827m80802l44762
2228I423336l35621k07847k95942k63591k49269l59640k32930p4197k11571l75900
2218F816828n7451j13297l56775k73119j04856j73071k15363j23845j57426k25772
2208E015853o0147j15254J53351k26657k14180p4701l2629j36016k93724l2208
2198C983688j3661j28782q9101r473m6206k3944m4336J6759j09822k08363r6776
2187C229983j2318j27966n4468J493r404j20510o6005n4026j41323j47918P4132
2176B571670o4769r6223j99288n1742J4994j3623p8545p6450r7351n2802l022
2165A852849M4545P239p469j17397O307k9476j5535m3895O1320r5887N484Q833
$$ plain form
2237 14191556 13304182 12619612 11989813 11540493 11000797 10623727 10248900 9768098 9423336
2228 9423336 9087715 8879868 8583926 8320335 8071066 7711426 7478496 7404299 7192728 6816828
2218 6816828 6759377 6646080 6289305 6016186 5911330 5738259 5522896 5399051 5241625 5015853
2208 5015853 4955706 4840452 4993803 4767146 4552966 4478265 4445636 4309620 4015896 3983688
2198 3983688 3970027 3841245 3752144 3742671 3696465 3672521 3628185 3644944 3535122 3326759 3229983
2187 3229983 3217665 3089699 3035231 3036724 3027320 2906810 2840805 2786779 2645456 2497538 2571670
2176 2571670 2506901 2410678 2211390 2159648 2174642 2161019 2082474 2006024 1908673 1855871 1852849
2165 1852849 1897394 1904633 1897164 1779767 1786074 1756598 1741063 1697168 1758488 1662601 1668085 1676918
2153A676918k9778l9278l3641N7856j10235N7180o5522l26585J85107p437o3212
2142A301373j0976K0854j03682O2180o6691p9851P5317J5804R4893K2392r698
2131A321915j46184J42515j4745K013k6014l2985k3570r6922Q6262p2564m3384
2120A096337J61629K7048j703r7838M0798m2253N2388q4905q922P9648j2342j05199
2108A104686m4476M3071j8354n7519K21345m3920P3654p460j33505j4780J858
2097A124600q433J19824Q7038n7290P1663P7029J97810j09117M8551K08418J02427
2086A862520J18623K45957K12331J02302K28557K13685L1244J82531p0139m40041
2076B687570l14290k41227j58085j64373k74474j27130J11166l47806n1695j9338
$$ plain form
2153 1676918 1647140 1607862 1574221 1632077 1521842 1579022 1513500 1186915 1372022 1364585 1301373
2142 1301373 1290397 1311251 1207569 1269749 1203058 1123207 1198524 1214328 1309221 1331613 1321915
2131 1321915 1175731 1318246 1303501 1305514 1279500 1246515 1222945 1126023 1212285 1139721 1096337
2120 1096337 1257966 1285014 1283311 1185473 1226271 1184018 1236406 1151501 1142579 1222227 1209885 1104686
2108 1104686 1060210 1103281 1084927 1027408 1248753 1204833 1278487 1271027 1137522 1122742 1124600
2097 1124600 1116167 1235991 1323029 1265739 1337402 1414431 1612241 1503124 1551675 1760093 1862520
2086 1862520 1981143 2227100 2439431 2541733 2770290 2983975 3015219 3197750 3127611 2687570
2076 2687570 2373280 2132053 1973968 1809595 1535121 1407991 1519157 1171351 1119656 1100318
2066A100318j18050j15482M0024j08644k0465j06867J43p541K1253r728O8821
2055G43782Q9589j07970P675K4728q2957j85896J27688r1578j58060l9766P8047
2044D05282J2199M7252Q3351r0379j51883J52681q8660o1208j7656j1456J50403
2033D29926J4898q7660J4847M948J15125j40103m4243n2787K0489K9749L4778
2022C39967J25904m1853j69529l0596O898l0872j6875N2198O1140J1305j33954
2011A73733J04672P525j5793O4091r6000M3659j04918J00543j61254L6123J66061
2000C18442q0807j2417J8260P1091o0278o3188J28468K552j66496J47690P0154
1989C73471o2617P077j42832N0095n504j08641l303k3285M1119k8028P6329L7018
$$ plain form
2066 1100318 982268 866786 906810 798166 777701 670834 670977 663436 684689 674961 743782
2055 743782 833371 725401 733076 757804 674847 488951 616639 525061 367001 327235 405282
2044 405282 417481 464733 548084 457705 305822 458503 369843 308635 290979 279523 429926
2033 429926 444824 357164 372011 376959 492084 351981 307738 254951 275440 305189 339967
2022 339967 465871 424018 254489 223893 230791 199919 183044 235242 296382 307687 173733
2011 173733 278405 285930 270137 334228 238228 281887 176969 277512 116258 152381 318442
2000 318442 237635 225218 243478 314569 254291 191103 319571 322123 155627 303317 373471
1989 373471 310854 317931 175099 225194 219690 111049 107746 84461 125580 97552 173881 210899
1977B10899j31671l0828j34218K03081p9743j5571k0137N6663Q0400j0146m478
1966A24251j5273L3855J50844l7638l4830L4408j54312m7460o5741J90360l306
1955A75158K2310n2581M0768J0303m970Q4923j01431j03212r991O3480J4773n5181
1943H4349j02380m2145J09734j18159O7789L4625K9579M2124N0212m4238N4354
1932A65844P2242r6100R1855M1543K9464j10052J7005j81853J36814M5338r3782
1921A18318p0532j57006j2340J02724P921O5684J25918j53211q2575P3653K04409
1910B22963j05279j50390j208K7068J93998k07793M6347J03510L8426m0189L0950
1899A58403o8476K5755N1029j79983J13762k4453m4310j67102M6339J29191p2194
$$ plain form
1977 210899 79228 48400 -85818 117263 37520 21949 1812 58475 138875 128729 124251
1966 124251 108978 142833 293677 256039 221209 255617 101305 53845 -11896 178464 175158
1955 175158 197468 144887 185655 195958 190988 275911 174480 71268 61277 124757 139530 84349
1943 84349 -18031 -60176 49558 -68601 -812 33813 63392 105516 155728 111490 165844
1932 165844 238086 141986 233841 275384 304848 194796 211801 29948 166762 212100 118318
1921 118318 47786 -109220 -121560 -18836 -10915 54769 180687 27476 -55099 18554 222963
1910 222963 117684 -32706 -33914 -6846 187152 -20641 25706 129216 167642 127453 158403
1899 158403 89927 115682 166711 -13272 100490 76037 31727 -135375 -89036 40155 -32039
1888c2039j7004J43967l2555N4650n9943R3075n4189p2517L2315j8864P8134p3117
1876D1913n0477J07556j6432k5060P6721R531P7584N5410j40521K7787p3033m8829
1864D2150L7016k7586J4971k0524j36341k1950P3787J23682j41852J04719J3579
1853F1651j36954k3458O5937J10863o5687J10669J52750j70601k01936O7564J36198
1842A06996o5872M6125n132J3114R6803o8140K3636n6495j42016J49253o4172
1831C4100N8338L6465N5726q8122p2646J50892R1558p1449o7021N8140M2188o954
1819B21215j251r5808l5412M2587K8939J4129R8510J28365l1714r8824j10080
1808A60656P3080m4219K7216m2124J28109l3399q8185M2053l9144k6379J92294
$$ plain form
1888 -32039 -49043 94924 62369 117019 57076 150151 95962 23445 55760 36896 115030 41913
1876 41913 -8564 98992 82560 57500 134221 143752 221336 276746 136225 164012 90979 42150
1864 42150 79166 51580 66551 46027 -90314 -112264 -38477 85205 -56647 48072 61651
1853 61651 -75303 -98761 -32824 78039 12352 123021 275771 105170 -96766 -29202 106996
1842 106996 41124 87249 82117 95231 192034 123894 147530 91035 -50981 98272 34100
1831 34100 92438 128903 184629 96507 23861 174753 266311 194862 127841 185981 228169 221215
1819 221215 219964 124156 88744 131331 160270 174399 272909 401274 369560 270736 160656
1808 160656 233736 189517 216733 174609 302718 269319 181134 223187 184043 157664 349958
1797C49958j42658L9374n0858M8080l5993M2751J2485O1881k0231J61144J1594
1786D77527j2937p3595J55178r2515p4583O4217J02804o9604J66415P5800O484
1775G25191q2513L7536J85542K3438p511J25514J97400J84602M743R5274J83952
1764A673168j8026K96m0427J31522P0607J5812m0208P6223K29465p403J02367
1753B193396L01243J88842R3911K75087J72811K53308M00367J19749K35129N33528
1743D767371M00723O70192O44748N49417O45371M58849P06027Q71210J349193
1734A1063101J747902K470555L089214M552826P516345O595120k152671o496691
1726B8385701n816134m290919l597015k771082j849133j402373j095356q85992
$$ plain form
1797 349958 207300 246674 195816 243896 207903 250654 263139 325020 304789 465933 477527
1786 477527 464590 390995 546173 453658 379075 443292 546096 476492 642907 718707 725191
1775 725191 642678 680214 865756 889194 881683 1007197 1204597 1389199 1393942 1489216 1673168
1764 1673168 1655142 1655438 1615011 1746533 1817140 1832952 1792744 1868967 2098432 2091029 2193396
1753 2193396 2494639 2683481 2777392 3052479 3225290 3478598 3878965 3998714 4233843 4767371
1743 4767371 5168094 5838286 6483034 7032451 7677822 8136671 8842698 9713908 11063101
1734 11063101 12811003 15281558 18370772 22923598 30439943 37035063 34882392 28385701
1726 28385701 22569567 18278648 14681633 11910551 10061418 8659045 7563689 6677697
1718F677697o09313n21640o17484o37434l95899m00553k55297k01768k12687l75713
1708B449909j77269m3040K5660k73728k03280j43978P412k08689p2162k34698
1698A126137M0805O7641j07971j59955o4869R0841j67743L9390l6251J59371n8048
1687I29348j16764k91668M0790J23l8675Q2111p4837j6764j4754j42341J66729
1676E23298N2851q9173R2387k04029j2681L7693k874n5962q7192N5021q6398J36662
1664C59603r4442l1325n1035l8356l7074J49173P1209M7102j58229j27349j4454
1653G4823M1962N0612l909L4027j6417p5500L3804j49016M7345J56126k7281M6870
1641B13446j34843Q5350L9957j77586j39718J47668L4894O1984k0362l9254p0605
$$ plain form
1718 6677697 6068384 5546744 4929260 4291826 3895927 3495374 3240077 3038309 2825622 2449909
1708 2449909 2272640 2229600 2255260 1981532 1778252 1634274 1641686 1432997 1360835 1126137
1698 1126137 1166942 1234583 1126612 966657 901788 992629 824886 864276 828025 987396 929348
1687 929348 812584 520916 561706 561829 523154 605265 530428 513664 498910 356569 523298
1676 523298 576149 486976 579363 375334 362653 400346 397472 341510 254318 309339 222941 359603
1664 359603 265161 233836 182801 144445 107371 256544 327753 374855 216626 89277 74823
1653 74823 116785 167397 163488 197515 181098 105598 139402 -9614 37731 193857 166576 213446
1641 213446 78603 163953 203910 26324 -113394 34274 69168 131152 110790 71536 931
1630I31M5567P4384o4753R3503l8817j11201M3359N861L6350N608j43991N3938
1618G39N2716n3401J89626j52462N04J00947R4550r7358m3218J3409j17871n7498
1606f9317J16932k5798R5316q2632l6881j60854l0595J65210q1432l4954K90661
1595A45656j50224q2517L4748R8888k9083j83817J87709q2831q8558J42911n2869
1584e9987j17112J18700o0549J77543q54j78555J26181n7781L1813M9457n6827
1573b7971Q3348j62520J01403P6590j53951R3202q6276J27383j21331j03391R4819
1562g8695J2547J21300l1262l9119j0308Q5675n7869j82572K5491J30931q7783
1551a11664p3657J62911O9255o2281j07645K1644q2428P2377J43912k5605N1236
$$ plain form
1630 931 46498 120882 56129 149632 110815 -386 42973 48834 85184 90792 -53199 739
1618 739 53455 54 189680 37218 37722 138669 233219 135861 92643 106052 -11819 -69317
1606 -69317 47615 21817 117133 34501 -2380 -163234 -193829 -28619 -110051 -145005 145656
1595 145656 -4568 -87085 -52337 46551 17468 -166349 21360 -61471 -150029 -7118 -59987
1584 -59987 -177099 -58399 -118948 58595 57741 -120814 5367 -52414 -20601 28856 -27971
1573 -27971 55377 -107143 -5740 70850 -83101 10101 -76175 51208 -70123 -173514 -78695
1562 -78695 -66148 55152 23890 -15229 -25537 60138 2269 -180303 -154812 -23881 -111664
1551 -111664 -185321 -22410 46845 -15436 -123081 -101437 -183865 -111488 32424 6819 58055
1540E8055L3525q2030j50286J7516O5036L6547M2910j34224J41615l1446N7942
1529E5160N3009J4143j7301m630j27799M9444n7024M0280q476j17101K27856j07497
1517F4o3949K0454J58027r5674m6163M6400K2695Q0472K5192r9383m3110l9436
1505c4411q649k9133j55068O1704O9749r9265J62469k9897K9757q7599n3761O0765
1493a13339J17317m032m932k1008r9170R0878k1202M0311k0937j09191N0414j10894
1481b05785J99289j13639l7138O792J77669m3598k39619k0934k5039K66231Q1255
1470D5484q7812m6753k5650j50124K57839n9225j65217J24709P0098n3288N767
1459h4172J05866q3109k4521j17102n7918k3794J76378L7037j65462L9138P3523
$$ plain form
1540 58055 91580 9550 -140736 -123220 -58184 -21637 21273 -112951 28664 -2782 55160
1529 55160 108169 122312 105011 100381 -27418 22026 -34998 5282 -3194 -120295 107561 64
1517 64 -63885 -43431 114596 18922 -27241 19159 41854 122326 147518 48135 5025 -34411
1505 -34411 -43060 -72193 -227261 -165557 -95808 -195073 -32604 -62501 -32744 -120343 -174104 -113339
1493 -113339 3978 -54 -4986 -25994 -125164 -34286 -55488 -15177 -36114 -145305 -94891 -205785
1481 -205785 -6496 -120135 -157273 -150481 27188 -16410 -256029 -276963 -302002 -35771 45484
1470 45484 -42328 -89081 -114731 -264855 -7016 -66241 -231458 -106749 -36651 -89939 -84172
1459 -84172 21694 -61415 -85936 -203038 -260956 -284750 -108372 -71335 -236797 -197659 -124136
1448a24136L1055M5148q1479J3197m830j08055J4020p569J07850K17433r9858
1437B776K6706j25264P2680j9827j569j6811q3115M7282m4152j07002R5518J24573
1425b8205j11480N0446J38856J49883j48724J4309j44007k41798J55898J50644
1415a4178K5382N4688M8741j82990n5169j5344Q8831L5042j37432K5517M3472
1404h3440j3863l7096K9999q3481k1320o2920L25539p4288l7240o7878q2054J87973
1392b0069J24295j28845j54854J03575N7347K8235N4952k6954O128j77980L9377
1381i4793r3119J83727K6681n4330n5620M3432J22352r4091j02192Q2932k9232
1370f4253j00660J42627j31808J19041P0038O469r1097r8531M6562q307j7940
$$ plain form
1448 -124136 -93081 -47933 -129412 -116215 -121045 -229100 -215080 -222649 -114799 102634 2776
1437 2776 29482 -95782 -23102 -42929 -44498 -61309 -144424 -97142 -141294 -248296 -152778 -28205
1425 -28205 -139685 -89239 49617 199500 50776 65085 -78922 -320720 -164822 -14178
1415 -14178 11204 65892 114633 -68357 -123526 -138870 -50039 -14997 -152429 -126912 -83440
1404 -83440 -97303 -134399 -104400 -187881 -209201 -272121 53418 -20870 -58110 -125988 -208042 -20069
1392 -20069 104226 -24619 -179473 -75898 -18551 9684 64636 37682 43810 -134170 -94793
1381 -94793 -187912 -4185 22496 -31834 -87454 -44022 78330 -15761 -117953 -35021 -64253
1370 -64253 -164913 -22286 -154094 -35053 34985 41454 -49643 -148174 -101612 -109919 -127859
1359a27859L3740M0672N2818k7885j011r7677m3262N6126J20093k5119j17525
1348a36889K4824J02004n7910J58991m4686J7221k5949j73917j8386O4311n9081
1337a49467O2969J29448j32489Q894O5299K0517j26636p2640J22655k2663R6899
1326B786J01981j13375k25639J669P3265K6173j6596J62609o0171j23624J49670
1315b1252R3246K787o5245n7970j53105K15413p9116p6077N291m7949M80J71489
1303a2008L4180J7601p0576j9572q5094m8031J23548l1558O3775m4042M5446r4668
1291a20999l0081k2376L9224L3013O9042M0373m1103k0205O6903j05422j17068
1280b08699K02914k2006o2663O3770N267K6607K1930M0818k49245M0927J47550
$$ plain form
1359 -127859 -94119 -53447 -629 -28514 -29525 -127202 -170464 -114338 5755 -19364 -136889
1348 -136889 -112065 -10061 -67971 91020 46334 63555 37606 -136311 -154697 -90386 -149467
1337 -149467 -86498 42950 -89539 -80645 -15346 5171 -121465 -194105 -71450 -94113 2786
1326 2786 104767 -8608 -234247 -232578 -159313 -133140 -149736 12873 -47298 -170922 -21252
1315 -21252 71994 74781 9536 -48434 -201539 13874 -65242 -141319 -136028 -183977 -183497 -12008
1303 -12008 22172 39773 -30803 -50375 -135469 -183500 -59952 -91510 -27735 -71777 -26331 -120999
1291 -120999 -151080 -173456 -134232 -101219 -32177 8196 -32907 -53112 13791 -91631 -208699
1280 -208699 -5785 -27791 -90454 -26684 -21417 5190 27120 67938 -181307 -140380 7170
1269G170N513J3106j24120J98834j69231k7901l8326J23894N5102q9551N5713
1258A0203n3197q4074J8102n3472P0418Q6782l5695n6077J06590N4204j584j34503
1246g2303N734N3048O2752R2544p6770j28943O6337o0863M2426k3152j7264K2030
1234c4424Q2080Q9450k15673q8140K11926L5514n4968o0041j94956R1227n4562
1223a92567J31179n940J2464J186q0107p655p8036n8700K34155N0455N1230j7339
1211D0325o0601K3900L7736m4477j3465j38485m3765Q631Q3415o8426J67253o134
1199a4093M6085J55494k26506P7007j73051m9393K3790q2060l1113J9362L2223
1188b22255j6402J55230M5690Q851J6885j6745j1028J08366O2165k2508P184k44979
$$ plain form
1269 7170 12683 25789 -98331 100503 -68728 -96629 -134955 -11061 44041 -45510 10203
1258 10203 -42994 -127068 -108966 -162438 -92020 -5238 -40933 -97010 9580 63784 62200 -72303
1246 -72303 -66569 -13521 49231 141775 65005 -63938 2399 -58464 -16038 -39190 -56454 -34424
1234 -34424 47656 137106 -78567 -166707 45219 80733 25765 -34276 -229232 -138005 -192567
1223 -192567 -61388 -67328 -54864 -53678 -133785 -141440 -219476 -278176 -44021 6434 57664 40325
1211 40325 -20276 3624 41360 -3117 -16582 -155067 -198832 -190201 -106786 -175212 -7959 -14093
1199 -14093 31992 187486 -39020 37987 -135064 -184457 -160667 -242727 -273840 -254478 -222255
1188 -222255 -238657 -83427 -37737 -28886 -12001 -28746 -39774 68592 130757 108249 115433 -129546
1176a29546q7181M2867j1720J42614j21377j34998J20725O2091r1489K7408J77336
1165c270K4765J0814q1196r6878J12658l3924l1086j2534P3561N751O3529m5499
1153a3309P8854k78995r1596K51248R6834m7006K2208J01011n4729q0295J00667
1142H4892q0873o9608K8279j10072R8939K16373j54737j06693O0402l2645m4669
1131a10412K0191J19796r3214R9899r4086J5067j08141K693l0755Q9299J940r9564
1119a87287J31160o7793J5229J03720j1559K0769k41378J4206J80233r1546P2309
1108f1937L9426l0304J2754j53592N2114M118J80821l3355o2292l6973n1764n5045
1096a96029J3371R7920Q9879K5100k49212J12857N3302P0632N409p1562j11193
$$ plain form
1176 -129546 -216727 -173860 -185580 -42966 -164343 -299341 -178616 -116525 -208014 -180606 -3270
1165 -3270 21495 32309 -48887 -145765 -33107 -67031 -98117 -110651 -37090 -31339 32190 -13309
1153 -13309 65545 -213450 -305046 -53798 43036 -3970 18238 119249 64520 -15775 84892
1142 84892 4019 -65589 -37310 -147382 -48443 167930 13193 -93500 -33098 -65743 -110412
1131 -110412 -90221 29575 -63639 36260 -57826 -42759 -150900 -148207 -178962 -89663 -87723 -187287
1119 -187287 -56127 -123920 -108691 -4971 -16530 4239 -237139 -222933 -42700 -134246 -61937
1108 -61937 -22511 -52815 -40061 -193653 -141539 -137421 43400 10045 -52247 -89220 -140984 -196029
1096 -196029 -182658 -84738 5141 30241 -218971 -106114 -52812 17820 23229 -48333 -159526
1085a59526J26491P2151q8316m0749K2900L7721n2819K3353J3348p0745n4694
1074a70885r910k9702J05271L8712J18342m0054K0192O3074P653j51006O4374
1063A6061J2263p5547n4263Q9122J37667p2735l106p2706P8806j30540j4331r6513
1051a85822J79112J5595j62503P0670J42183J08374k205m7522k42561L4676P3860
1040a6143Q6707j02380o5373L3038L399L7756k3805k4472J0472k729J46130K7972
1028A10572m082j68487J3484R1102P5195q1171o5618N908R1947M8961m5296K4822
1016I7337n8913K4531J4764j06504k1045L2156O635L6239j02437Q4617m4048q6943
1004a23611P4643J6934O169j69112K00819r5285n7058J10088j48738k1736L8576
$$ plain form
1085 -159526 -33035 39116 -49200 -89949 -67049 -29328 -82147 -58794 -45446 -116191 -170885
1074 -170885 -180795 -210497 -105226 -66514 51828 11774 31966 95040 102693 -48313 16061
1063 16061 28324 -47223 -101486 -12364 125303 52568 49462 -23244 55562 -74978 -89309 -185822
1051 -185822 -6710 8885 -153618 -82948 59235 167609 165404 117882 -124679 -90003 -16143
1040 -16143 70564 -31816 -97189 -64151 -60752 -22996 -46801 -71273 -60801 -63530 82600 110572
1028 110572 106490 -61997 -48513 42589 117784 36613 -29005 -23097 68850 117811 72515 97337
1016 97337 38424 62955 77719 -28785 -49830 -17674 -11039 25200 -77237 7380 -36668 -123611
1004 -123611 -48968 -32034 -25865 -194977 5842 -89443 -146501 -36413 -185151 -206887 -168311
993a68311K24486j7027n3866k8736k2320J4074J13836o6198R4684j65578J25908
982E0952L0899K189j85031R7195J56764l06426J27470J9899l5769O689j7853J15222
970F2200r6455n9608O9303O5772j4802M5566k2r7943J26056N03L2668M815j47051
957h998n7293p9004r8805Q7547L0780M2811r825J02552K1360j52419J36390q2663
945f7567L5699M4528p3223K8751n9228J20446L1156p816o1181l7996n5273O3409
933c8295J66024j39494J08516R9659k2211j43138k4418j54372k0186R0299Q6854
922I238O3867r5013J84517o4615m9819J05230o2710L33j24699J09508p8318O5226
910F2745N9741j08680q4201J08264o5645j18120J54726n2473J17366r5787l2107
$$ plain form
993 -168311 56175 39148 -14718 -43454 -65774 -51700 62136 -4062 90622 -74956 50952
982 50952 81851 84040 -100991 -3796 152968 -153458 -25988 -6089 -41858 -35169 -53022 62200
970 62200 -34255 -93863 -24560 41212 26410 71976 71954 -25989 100067 100570 133238 138053 -8998
957 -8998 -66291 -145295 -244100 -156553 -125773 -82962 -92787 9765 31125 -121294 15096 -67567
945 -67567 -31868 12660 -60563 -31812 -91040 29406 60562 52746 -8435 -46431 -101704 -38295
933 -38295 127729 -11765 96751 196410 174199 31061 6643 -147729 -167915 -77616 9238
922 9238 73105 -21908 162609 97994 48175 153405 90695 91028 -33671 75837 -2481 62745
910 62745 122486 13806 -70395 37869 -27776 -145896 8830 -43643 73723 -22064 -54171
899e4171J26953K3006J943o9565O6236j7826p9102J15967q9822J527r081Q4679
887A00744o2391M057P7774k12963r0500L46586n6453m4472m3774J54166p8482
876I4292j9912K6156j10181P7030N1047j54421j19775M247K04794K3257l7018
865C9516n7279J09395M0741j92583n8266N701J15336J40436q6933q7813J7171
854a4578o9990Q6028n3287L1891j05851N7197J25032L3866L1558r2843N9656R555
842I8234j7256j8007k9943n5282N5743L4371j89215k714R0378M3746j18020J09479
830A514J25226o6950k00989J09445O134R2254q466K8583k4318j38958q4783J22708
818c8600o0961m2143J32391N8206L2163p749k1618Q6014j49356k0266K6512R2191
$$ plain form
899 -54171 72782 95788 97731 28166 94402 76576 -2526 113441 23619 25146 16065 100744
887 100744 38353 42410 120184 -92779 -183279 163307 106854 62382 18608 172774 94292
876 94292 74380 100536 -9645 67385 118432 -35989 -155764 -151517 53277 76534 39516
865 39516 -17763 91632 132373 -60210 -118476 -112775 2561 142997 56064 -31749 -14578
854 -14578 -84568 1460 -51827 -19936 -125787 -68590 56442 90308 121866 29023 88679 98234
842 98234 80978 62971 33028 -22254 33489 67860 -121355 -124069 -33691 10055 -107965 1514
830 1514 126740 59790 -141199 -31754 -25620 66634 58168 86751 62433 -76525 -161308 -38600
818 -38600 -99561 -141704 -9313 48893 81056 73307 51689 137703 -11653 -31919 -5407 86784
806H6784N6194q0992o5883r1379p1199P9378J6596l3767J5237N950K26203r5167
794D7955j09490J13782K3790N687P3103l6304O3701o9194r1855m7957N8635O8305
782A00158N9514l2038o97j25210k9044n4673R0519M3119j59623k9164J57987R063
770B9911j13660N1211N1581N0096J03409j61762M6508R0600k39359j1173Q9263
759a3375J5695J1407J30975j06258p9679J55606n8505o2771n7728n3401J74176
748E6142j26502q4823J85723m4307L3999m5628l0135J4803R3705m4796L9334M6458
736I3973O8052j48421J90425k4729j31692j6217j2269K88k7075n6909R6130J5154
724D6710k07300k7054O4491R2400k9550p2704N358J46250q2174O532j16384J36724
$$ plain form
806 86784 142978 61986 -3897 -95276 -166475 -87097 -70501 -104268 -89031 -83081 143122 47955
794 47955 -61535 52247 76037 81724 154827 118523 182224 113030 21175 -26782 31853 100158
782 100158 159672 127634 126937 1727 -27317 -81990 8529 51648 -107975 -137139 20848 29911
770 29911 -83749 -32538 19043 69139 172548 10786 57294 147894 -91465 -102638 -13375
759 -13375 2320 13727 144702 38444 -41235 114371 55866 -6905 -64633 -118034 56142
748 56142 -70360 -155183 30540 -13767 20232 -25396 -55531 -40728 52977 8181 47515 93973
736 93973 162025 13604 204029 179300 47608 31391 19122 19410 -7665 -64574 31556 46710
724 46710 -160590 -187644 -123153 -30753 -60303 -133007 -127649 18601 -63573 -57041 -173425 -36701
712c6701J38080j19139j99289J81070r95l8636J74593m1084J4346q7391o8648
701h3794n2595O107P1738P0958r7681J34610Q67j62086L1776O757k0188R9130
689E599k7639l8283O8396l8195J56223P3576R2126k59754l7042j07169K8342r93
677h4813K07080j51167p8238J03060N6364j2781P4444R346j79568j13275k310
666a71858J14676M5624J43670k5496j60784p0280R9805j2401o930J1274L088k1125
654e0737o0375M3010J15814j7557O4050j88768K00643j73728N5274m1538j17755
643a71667R3956R9373O684j036O695L0737k3469n5973j8684J3597Q0417p2103
631a1473M240o3911J86788j27677k4668J13272m1785m5418J29627L152j27253
$$ plain form
712 -36701 101379 -17760 -217049 -35979 -36974 -75610 98983 57899 72245 -15146 -83794
701 -83794 -136389 -130282 -58544 12414 -85267 49343 50210 -111876 -80100 -73343 -93531 5599
689 5599 -22040 -60323 8073 -30122 126101 199677 291803 32049 -4993 -112162 -83820 -84813
677 -84813 122267 -28900 -107138 -4078 52286 39505 113949 123295 -56273 -169548 -171858
666 -171858 -57182 -11558 132112 106616 -54168 -124448 -24643 -37044 -43974 -32700 -29612 -50737
654 -50737 -111112 -68102 47712 30155 94205 -94563 106080 -67648 -12374 -53912 -171667
643 -171667 -77711 21662 28346 27310 34005 64742 41273 -14700 -33384 -19787 60630 -11473
631 -11473 -7233 -71144 115644 -12033 -36701 76571 34786 -10632 118995 122147 -5106
620e106j13090K29549m7734r776r40M2893p341r711p044l8640k7525k6176K1053
607D12r3149K02442j4476j58542P8977k460j35334N3558M402K0945J10280K8968
595I6023Q7714j55144n9174K25425l7115r6634O2484k389q6308J51851k0841k69738
583a03846P0563l1061O3303J10546j08224p8890J5209J7337r4854J32847J21115
572A14045j40074j07850J067J77790o2067J18100O289k06332J90902n5190J75446
561B12126k9025j24395M3705r8917l8732p9449m3714M7688m537K2406j9924J28852
549A6084j4396J46432j24579o3041r5503Q1972J34994K076j05098J56319M8568
538A83828o4276m6431n3724J15321j23665k8878l8234n6905N2374J57246k6094
$$ plain form
620 -5106 -118196 111353 63619 53843 52903 95796 88455 78744 71700 33060 5535 -20641 412
607 412 -92737 109705 95229 -63313 15664 13204 -122130 -68572 -64170 -43225 67055 96023
595 96023 183737 28593 -30581 194844 157729 61095 123579 121190 34882 186733 165892 -103846
583 -103846 -33283 -64344 -1041 109505 1281 -77609 -62400 -45063 -139917 -7070 114045
572 114045 -26029 -133879 -132812 44978 -17089 101011 107300 -99032 91870 36680 212126
561 212126 183101 58706 102411 3494 -35238 -114687 -158401 -110713 -115250 -92844 -112768 16084
549 16084 1688 148120 23541 -39500 -135003 -53031 81963 84039 -21059 135260 183828
538 183828 119552 73121 19397 134718 11053 -17825 -56059 -112964 -60590 96656 70562
527G0562q3055R5963O930N879J02277j1288q4405n7620p2130J57817N0079r8305
515H2704L8209j02626J75840o1955n0849q4842O5598K5006j50503Q3036n9263
504c9645N9885J8800l1930J4367j29343l70J64647j06259J4742j1890o4565J89710
492G8149J21534j54736K7116K8770L7956l5294O4707J8111k7628J2300M784J62736
480C38505j62033j0297j6454R558q4523l1924P1700j4154j5547n2588o412p0791
468d4960j53223P9210k6737J12451l227J4289L2939L8447R2702j26412n3729R8166
456E9916o7797K0695q119M7383l3354O9340k5743j01504R3973L0815Q8143K1890
444A95638j41192j12432K681J26811r9468N7485M523j17053Q8245j2735n8302
$$ plain form
527 70562 -12493 83470 90400 96279 198556 187268 102863 45243 -26887 130930 181009 82704
515 82704 120913 18287 194127 132172 81323 -3519 62079 87085 -63418 19618 -39645
504 -39645 20240 39040 7110 21477 -107866 -108236 56411 -49848 -35106 -46996 -111561 78149
492 78149 199683 44947 72063 100833 138789 103495 168202 186313 158685 170985 175769 338505
480 338505 176472 166175 149721 159279 74756 42832 114532 100378 84831 32243 25831 -44960
468 -44960 -198183 -118973 -145710 -33259 -36486 -22197 10742 49189 141891 15479 -38250 59916
456 59916 -7881 12814 4695 52078 18724 88064 62321 -39183 54790 85605 173748 195638
444 195638 54446 -57986 -55305 71506 -27962 29523 34046 -83007 5238 -7497 -65799
433f5799K0016L7793J1542k9696J2481J36898k7933J28763o7757j69578K744J38128
421A27602q6465m3760l8757K9694m4792L5816R4903n0617M3731J2689L6720j21827
409e063j78742J54125O2518N1942j00735r460J80679J2906j07192j9105P3699
398A15572n2330k0561p3598L1323P9326K0539n2231R7795l9551j32147J40463
387A14600P4498M4678j26165j33133J5047N6070M2339o3223O1796Q1595j41405
376B6697j15909R1405m0435R6933n8121m9799J14881j56690J6968j0610n0656
365a35336K3585j7648Q4429O6102j36329J29849R6939N7535n9949j5094J5892
354A09975l9021P302O101N7424k09585J11445o823k385J05724l6934M4907P7400
$$ plain form
433 -65799 -45783 -7990 3552 -26144 -13663 123235 95302 224065 156308 -13270 -10526 127602
421 127602 41137 -2623 -41380 -11686 -56478 -20662 74241 23624 67355 80044 116764 -5063
409 -5063 -183805 -29680 32838 84780 -15955 -25415 155264 168170 60978 41873 115572
398 115572 63242 42681 -30917 406 79732 100271 48040 145835 106284 -25863 114600
387 114600 189098 233776 107611 -25522 -10475 45595 87934 24711 86507 168102 26697
376 26697 -89212 2193 -38242 58691 570 -49229 65652 -91038 -74070 -84680 -135336
365 -135336 -111751 -129399 -44970 21132 -115197 14652 111591 169126 109177 94083 109975
354 109975 70954 78256 84357 141781 -67804 43641 36818 34433 140157 103223 148130 225530
342B25530j41281N2557J15073j67119M1438O4344j69355p9822J1384J04563J2092
331F9404r376m5475K4545n1145Q523J44958j70474M8849n99q213R7270m2302n5522
318A0443N5468Q7840j13827L1441P6672K0429K9470K2400j80578j42015J49895
307D7638K1323j37437L5025Q8234J4647j01943k8220R6641o902o636K6235N439
295E4044r330j9261j20385K9355R2080J63999m5786o6840n1447J61845k6849j00299
283F1126P3524r5216K5873j37792M375L2886L3054q2330P9769j15250M7733J74102
271A01854N8848N7114l1077j44754K3522J02078K3032O225r9306m5482j14554
260f2500j480J20802R924q831J24863O041m9885k6232q0678p1647O6226M049K0651
$$ plain form
342 225530 84249 136806 251879 84760 126198 190542 21187 -58635 -47251 57312 69404
331 69404 60028 14553 39098 -12047 -3524 141434 -29040 19809 19210 10997 108267 65965 10443
318 10443 65911 153751 39924 71365 148037 168466 197936 220336 39758 -102257 47638
307 47638 68961 -68476 -33451 54783 69430 -32513 -60733 35908 29006 22370 48605 54044
295 54044 44714 25453 -94932 -65577 26503 190502 144716 77876 26429 188274 161425 61126
283 61126 134650 39434 65307 -72485 -68110 -35224 -2170 -84500 -4731 -119981 -72248 101854
271 101854 160702 217816 186739 41985 65507 167585 190617 196842 97536 52054 -62500
260 -62500 -63980 56822 66746 57915 182778 188819 138934 112702 32024 -39623 26603 30652 51303
247E1303o5325O538J11693M8215m9592n7115m465m148j26332J5607j8403J28539
235C6515K1920R7380n8736j23015m3210Q2665M2944N3094P01l435J663j54403
223d5917j798K9390o8113R6299j1073J3017J2575p1024N2677L8612k0111L1840
211E6374Q991p5525J36139l0646j01265R8660J14212K5630n1101N2668k16846
200A7291m8519j3723J05523k1676j05715O3444J56758j4909n7946M909n8993j3333
188A3111k4236J09022L6586N994n8794n5847O5968J5498j03872O4847j15903O1169
176A3543k2306o1126J61550R5980j19530l3081P3415J02668m1084j8570p2079
165G9380J03740q857j76293J06173k9999k5778P8012j13641P2506o7214J68175
$$ plain form
247 51303 -14022 -7484 104209 152424 102832 45717 41252 37104 -89228 -73621 -92024 36515
235 36515 58435 155815 97079 -25936 -69146 13519 56463 109557 110258 106823 108486 -45917
223 -45917 -47715 -18325 -86438 9861 -1212 11805 24380 -46644 6033 44645 24534 56374
211 56374 65365 -10160 125979 95333 -5932 92728 206940 232570 181469 234137 17291
200 17291 -31228 -44951 60572 38896 -66819 -3375 153383 138474 80528 85437 26444 13111
188 13111 -11125 97897 134483 140477 81683 25836 91804 107302 3430 68277 -47626 13543
176 13543 -8763 -69889 91661 187641 68111 35030 108445 211113 170029 151459 79380
165 79380 183120 174263 -2030 104143 74144 48366 126378 12737 85243 18029 186204
154A86204k7448L3289j01881l6332n8881l1546P7743K0742L1536K7868j31998
143a0704M898n377Q0369M9376m8080K2012p4902p6287J56404p0938j99512K42174
131F9433n897K9494O4328J0576r6345n92L4259o8887k7425J64451n4885q3760
119C4750O3195k047O9406j8664j29420M7040j876k0729j9350o3777O3637k0418
107A747k7939J1025O0066J9367j09113n810Q5628N4191l2892p2551J31805L7433
95A52957l8020l5785r1367J66408J0964n1065p2333Q9832l7102j2035L2921q4426
83C0949j6646J47680k24096J14262O6630j42121M097K2560m2872R9512K6808j6860
71F9903j5293j0670Q1821q4703R0056J09794j46933q9129k5431j760M2979J849
$$ plain form
154 186204 158756 192045 90164 53832 -5049 -36595 41148 61890 93426 121294 -10704
143 -10704 -5806 -11183 69186 118562 70482 92494 17592 -58695 97709 26771 -172741 69433
131 69433 63536 93030 157358 167934 71589 70997 105256 36369 8944 173395 118510 34750
119 34750 97945 95898 165304 146640 17220 64260 62384 41655 22305 -41472 22165 1747
107 1747 -26192 -15167 44899 64266 -44847 -50657 34971 89162 56270 -16281 115524 152957
95 152957 114937 79152 -12215 154193 165157 114092 41759 131591 94489 82454 115375 30949
83 30949 14303 161983 -62113 52149 118779 -23342 -19245 3315 -39557 59955 86763 69903
71 69903 54610 43940 125761 41058 131114 240908 93975 4846 -20585 -22345 20634 22483
59B2483m149O9787J6318J1065M9541M622p1691j8705K4641L2771P1437j06442
47A01678k9163o4374O8986l4746o968p4595J17180L6951k7082O9306k1688p5710
35E9775l1811P64Q0745m6053K4389L9690k2253o1848M6765q636l6242O3568j53913
22d5060J0211N5116J0745m4160l6938O8498N4025O3807M45p6648k6852n7661N5997
9C1525N4025J12651o6454J9468J2645j33636M6379m8676J19647
0A47574
$$ plain form
59 22483 18334 88121 104439 115504 165045 169667 97976 79271 103912 136683 208120 101678
47 101678 72515 8141 77127 42381 35413 -39182 77998 114949 87867 157173 135485 59775
35 59775 27964 28728 109473 63420 87809 127499 105246 43398 90163 81527 45285 108853 -45060
22 -45060 -34849 20267 31012 -13148 -50086 18412 72437 136244 136689 60041 33189 -24472 31525
9 31525 85550 198201 131747 151215 163860 30224 76603 27927 147574
0 147574
$$ Imaginary data points
##PAGE= N=2
##DATA TABLE= (X++(I..I)), XYDATA
16383b682625J14662J9109l6617M9684J314P635J65534J8498L3168R638J01826
16372b198174m9465M9976J1227n7313K8629q6621J68383q74N9638J24437N5308
16361a894849O3309M6494j2526J4365k8615J0925j162P2532K8221J4508O8102
16350a618696J15331q691Q0821r952p7833N3783p3342N7067J4857J59325P9618
16339a227712k632J1543L2140Q7289r5966m7499N4056l2920P2715R8769m3498
16328a093715J29802M8284m7514k6192q186N2159j496J00133P6656k2529o5570
16317h58168M6064J68831L8277j2836R4249n5580j341M963k3461k6579k8952J19223
16305e35310J65959J7495p1306L3442j4413k3461L7964M7646P0232N1395L9317
$$ plain form
16383 -2682625 -2567963 -2548854 -2585471 -2535787 -2534473 -2526838 -2361304 -2342806 -2309638 -2300000 -2198174
16372 -2198174 -2247639 -2197663 -2186436 -2243749 -2215120 -2301741 -2133358 -2134232 -2074594 -1950157 -1894849
16361 -1894849 -1831540 -1785046 -1797572 -1783207 -1811822 -1800897 -1802059 -1729527 -1701306 -1686798 -1618696
16350 -1618696 -1503365 -1512056 -1431235 -1441187 -1519020 -1465237 -1538579 -1481512 -1466655 -1307330 -1227712
16339 -1227712 -1230344 -1218801 -1186661 -1099372 -1195338 -1242837 -1188781 -1221701 -1148986 -1050217 -1093715
16328 -1093715 -963913 -915629 -963143 -989335 -997521 -945362 -946858 -846725 -770069 -792598 -858168
16317 -858168 -812104 -643273 -604996 -617832 -523583 -579163 -580504 -575541 -599002 -625581 -654533 -535310
16305 -535310 -369351 -351856 -423162 -389720 -404133 -427594 -389630 -341984 -271752 -220357 -181040
16294a81040J2288l234M7946O5832L342M0447L6146j35890J8599O0937R1382J0331
16282F7086k8219R7913o4776Q3941k6711P8946j9387j1680M0598m9377J54261
16271C22595P6270j26999m9663J63639J5507k7568O8812M4230p5137J16656m2067
16260D86275q8932N7059Q5178L1815N9138o6024m3524J26986M3529j3546L6426
16249G14380J7920L4903j2462P4154k4508O4079j12376O8143P8569N1042J1663
16238I65507k312n9258q721N1304j02417O1657J61572m4556n8174k2418r485Q9962
16226A022661M6730o7538P2567M5601N2465L5033j0070P4535p8969n5334Q4317
16215A221998J08958K0826j8441p175j561P7578p6197O366m629J5651J03064j38383
$$ plain form
16294 -181040 -168752 -171986 -124040 -58208 -54866 -14419 21727 -114163 -95564 -34627 56755 67086
16282 67086 38867 136780 72004 155945 129234 208180 188793 177113 217711 168334 322595
16271 322595 398865 271866 222203 385842 401349 373781 442593 486823 411686 528342 486275
16260 486275 397343 454402 539580 571395 630533 564509 520985 647971 691500 677954 714380
16249 714380 732300 767203 754741 828895 804387 868466 756090 824233 902802 953844 965507
16238 965507 963195 903937 895216 946520 844103 905760 1067332 1022776 964602 942184 932699 1022661
16226 1022661 1069391 1001853 1074420 1120021 1172486 1207519 1197449 1271984 1193015 1137681 1221998
16215 1221998 1330956 1351782 1333341 1326166 1324605 1402183 1325986 1332352 1327723 1343374 1446438 1308055
16203A308055J97858j2874l3101j4562j4897j41664J71151J0474R7273K2145j22120
16192A467738P5376P9043o4535J84039J07497j72150o8630L1807Q0628R8140p9607
16181A739346l1667J07282n6258r9295P936o3609J33844J1953j4530m8352Q3898
16170A770548Q4270j43838j9878K6058m7259j20812J2001N0762n6852J10249K15279
16159A880528n9616J12525m6607m3174P67j42147J35408K04396j94507n7846R1290
16148A881017j0435k525R0307l9686J2755j13542L2305M9320p7576J81660J8049
16137B021649K6437K3834k9349p2524J31031L8564p0442j23268O8973j56547J05193
16126A963551Q8327j37681O3299O0752n340J22456m6760o4491K04073j03674j26526
$$ plain form
16203 1308055 1505913 1493039 1459938 1445376 1430479 1288815 1459966 1470440 1567713 1589858 1467738
16192 1467738 1543114 1622157 1557622 1741661 1849158 1677008 1608378 1640185 1720813 1818953 1739346
16181 1739346 1707679 1814961 1758703 1659408 1667344 1603735 1737579 1749532 1735002 1686650 1770548
16170 1770548 1854818 1710980 1691102 1717160 1669901 1549089 1561090 1611852 1555000 1665249 1880528
16159 1880528 1820912 1933437 1886830 1843656 1844423 1702276 1837684 2042080 1847573 1789727 1881017
16148 1881017 1870582 1868057 1958364 1918678 1931433 1817891 1850196 1899516 1821940 2003600 2021649
16137 2021649 2048086 2071920 2042571 1970047 2101078 2139642 2069200 1945932 2014905 1858358 1963551
16126 1963551 2051878 1914197 1977496 2038248 2032908 2155364 2108604 2044113 2248186 2144512 2017986
16115B017986m021j8055O3797j9163p7011k791L5586K248j14204j1921J22162
16104A994613Q2624P6438p7153p2040M8434j90586N6654J53760k2916l0622J8082
16093B037288L1382O5857j20402M8433k8539k3032m8772P8602J02631R8135n2856
16082B188727Q0821j02694m389L8410P703j04715M0485L5242Q753o6747N7652
16071B179248k2620m12j6811J7805q3938K8677l2006J8219k440k7510J39572r4562
16059B103222J31414K5802n9090j00461J19615J6952q8684J41769j31368p490
16049B151681J12446n2848J26024r4042k1805m3773l3586N6422j5582r137O5697
16038B241497n5191Q556j19553J01063J66643p6798n9790J11816n1092m1442O5002
$$ plain form
16115 2017986 2013965 1995910 2059707 2040544 1963533 1960742 1996328 1998576 1884372 1872451 1994613
16104 1994613 2077237 2153675 2076522 2004482 2052916 1862330 1918984 2072744 2049828 2019206 2037288
16093 2037288 2068670 2134527 2014125 2062558 2034019 2010987 1962215 2040817 2143448 2241583 2188727
16082 2188727 2269548 2166854 2162465 2200875 2208578 2103863 2144348 2179590 2188343 2121596 2179248
16071 2179248 2156628 2156216 2139405 2157210 2073272 2101949 2069943 2088162 2085722 2058212 2197784 2103222
16059 2103222 2234636 2260438 2201348 2100887 2220502 2237454 2148770 2290539 2159171 2151681
16049 2151681 2264127 2211279 2337303 2243261 2221456 2177683 2144097 2200519 2184937 2175800 2241497
16038 2241497 2186306 2194862 2075309 2176372 2343015 2266217 2206427 2318243 2267151 2225709 2290711
16027B290711P105l5946M7638p5998k1313J551j23307n3262J61222O3915J4673
16016B276989j4198j19622O1452J40421l4696P534j55969m9200J16817R0381j43969
16005B175940l9379M6733l8370K4832R8124k5133K3918r7846O8800q2511J2180
15994B167288M6123l2939J079J3239J09582p0257l9124J7349L9361M4447R8738
15983B394886j74517N7932O2976q7790n8439N0329K6960J15070j5662m8938j4926
15972B307881n3751n4090j6875K3922p0182P2881N9151j5912m3583N0477R4216
15961B354135j13371J17211k8509l3930m2944j01493K5264J75180j23944J8236
15951B245835n7016J36772M7289n4440o6460J03705p7323Q4314K7618k3800j24240
$$ plain form
16027 2290711 2297816 2261870 2309508 2233510 2212197 2213748 2090441 2037179 2198401 2262316 2276989
16016 2276989 2262791 2143169 2204621 2345042 2310346 2317880 2161911 2112711 2229528 2319909 2175940
16005 2175940 2136561 2183294 2144924 2169756 2267880 2242747 2266665 2168819 2237619 2155108 2167288
15994 2167288 2213411 2180472 2181551 2194790 2304372 2234115 2194991 2212340 2251701 2296148 2394886
15983 2394886 2220369 2278301 2341277 2253487 2195048 2245377 2272337 2387407 2371745 2322807 2307881
15972 2307881 2254130 2200040 2183165 2207087 2136905 2209786 2268937 2253025 2209442 2259919 2354135
15961 2354135 2240764 2357975 2329466 2295536 2252592 2151099 2176363 2351543 2227599 2245835
15951 2245835 2188819 2325591 2372880 2318440 2251980 2355685 2278362 2362676 2390294 2366494 2242254
15940B242254j24285J23455j1183n6409K42442l8763p3314R713r6042K8270j62598
15929B083540J45725l4026J51386j36268J9675R6492j11666l3261o6286J55860
15919B271171k6276n4716N3457R2022j17274k06763J74179r1659L7916L4734p8853
15908B087938J59096N7886J18462j9346r5372K4510J249r9985j06975K30093o5279
15897B292277j26291k09728J44056N1700J31887j62779j9228R7467p2861r3685
15887B032815L4880Q6143J11221j12012M2107j2807o460j917N3568k7400j4783
15876B185355J23661j68595Q8095l5101Q7209K0958n3150N4747k783J9038j44469
15865B174965R0052o3676m3127J81295n9302j07957r9896P2037R1845M2151j19559
$$ plain form
15940 2242254 2117969 2241424 2230241 2173832 2416274 2377511 2304197 2313910 2217868 2246138 2083540
15929 2083540 2229265 2195239 2346625 2210357 2230032 2326524 2214858 2181597 2115311 2271171
15919 2271171 2244895 2190179 2243636 2335658 2218384 2011621 2185800 2094141 2132057 2166791 2087938
15908 2087938 2247034 2304920 2423382 2404036 2308664 2333174 2334423 2234438 2127463 2357556 2292277
15897 2292277 2165986 1956258 2100314 2152014 2283901 2121122 2101894 2199361 2126500 2032815
15887 2032815 2067695 2153838 2265059 2153047 2195154 2182347 2175887 2173970 2227538 2200138 2185355
15876 2185355 2309016 2140421 2228516 2193415 2280624 2301582 2248432 2303179 2300396 2319434 2174965
15865 2174965 2265017 2201341 2158214 2339509 2280207 2172250 2072354 2144391 2236236 2278387 2158828
15854B158828q673J98k2393J3303J88132r3649J3910J62658j61440r0538n4220
15843B106116J36273J25229L051m1805q8425q5945l3634R7625J83264o766j78193
15832B216790J0130k5978O0149L4623j3222r6871O4738K4187n9506m9693j2369
15821B152978m06Q1320r4450n9575J00120O7665o0342J7927J29019n2406m781
15810B277069q3217j1763k570R5013P0904j03959J00902j12787m1644J44251k2191
15799B310008J3658l8962Q7761k0388o4719N9872j18303N2115n5729K4287N4710
15788B304310N5199m6105j4816j13474J5358J88845j56867j4688K08738n2834
15778B373666J5941j95339J21308k9473J05621j47746M1917Q5257r9427r2386
$$ plain form
15854 2158828 2150155 2150353 2127960 2141263 2329395 2235746 2249656 2412314 2250874 2160336 2106116
15843 2106116 2242389 2367618 2370669 2328864 2240439 2154494 2120860 2218485 2401749 2394983 2216790
15832 2216790 2226920 2200942 2261091 2295714 2282492 2185621 2250359 2274546 2215040 2165347 2152978
15821 2152978 2152572 2233892 2139442 2079867 2179987 2247652 2187310 2205237 2334256 2281850 2277069
15810 2277069 2193852 2182089 2179519 2274532 2345436 2241477 2342379 2229592 2187948 2332199 2310008
15799 2310008 2323666 2284704 2372465 2352077 2287358 2347230 2228927 2281042 2225313 2249600 2304310
15788 2304310 2359509 2313404 2298588 2185114 2200472 2389317 2232450 2217762 2426500 2373666
15778 2373666 2389607 2194268 2315576 2286103 2391724 2243978 2285895 2371152 2271725 2179339
15768B179339N0377M354N6527j01408m4368R7677j0200M0503j23322J64737r1155
15757B223061O932l4919L5224q1174L0491J05349n9990j7663j856r9534J91413
15746B297334l2839j50642J47808l0520q769K03131n5913r6456Q261j16365L8484
15735B203514Q3066m7323J01916q3353k3296p720P1125Q8523j5246j00091R7300
15724B368415m3180J3118r1323R5763l6395l494k0912n6024P1347l6995P9836
15713B340156k833J13001j7881q3606p4234J3424J73611r0671K5384K9255p4569
15702B351037l1886n474q2676J08980j00799K7305o0959l5865j8466M8216N7790
15691B257203P649l0419M1844Q7199k7815j4792j78416J26341n6425n1131p01
$$ plain form
15768 2179339 2229716 2234070 2290597 2189189 2144821 2242498 2232298 2272801 2149479 2314216 2223061
15757 2223061 2229993 2195074 2230298 2149124 2179615 2284964 2224974 2207311 2205455 2105921 2297334
15746 2297334 2264495 2113853 2261661 2231141 2222372 2425503 2369590 2273134 2281395 2165030 2203514
15735 2203514 2286580 2239257 2341173 2257820 2234524 2226804 2297929 2386452 2371206 2271115 2368415
15724 2368415 2325235 2338353 2247030 2342793 2306398 2302904 2281992 2225968 2297315 2260320 2340156
15713 2340156 2337323 2450324 2432443 2348837 2274603 2288027 2461638 2370967 2396351 2425606 2351037
15702 2351037 2319151 2313677 2231001 2339981 2239182 2266487 2205528 2169663 2151197 2199413 2257203
15691 2257203 2264852 2234433 2276277 2363476 2335661 2320869 2142453 2268794 2212369 2161238 2160537
15680B160537K4598K910j5132R5475N5213l9435K2246r734P3400n1416N8718j5739
15668B361641j5451j95565o44P8471p573m4475L8987L9709Q737Q9545l4158J8206
15656B337430n3787O9869M6675M2966j91703o2325o948L1079k8932Q8326K9906
15645B302556R405l8933O9164J9957j58459O3748q3341M0048P9785J81932j60593
15634B325269m7270Q3587j09359j21080m6m6255J29122Q2812L5638m4604j50763
15623B137051J33839P7199L0667j36587J12754M2138j67958J73908r6407J117
15613B307721q3762j12394P2641l6493J02210J06353k2557q2806j9226l8478O2011
15602B255220j17934J26410N3365o6720M3637m9682K3673o998J61634j11481k30300
$$ plain form
15680 2160537 2185135 2188045 2172913 2268388 2323601 2284166 2306412 2296678 2370078 2318662 2377380 2361641
15668 2361641 2346190 2150625 2149981 2228452 2220879 2176404 2215391 2255100 2263837 2353382 2319224 2337430
15656 2337430 2283643 2353512 2400187 2443153 2251450 2189125 2182177 2213256 2184324 2272650 2302556
15645 2302556 2311961 2273028 2342192 2362149 2203690 2267438 2184097 2224145 2303930 2485862 2325269
15634 2325269 2277999 2361586 2252227 2131147 2131101 2084846 2213968 2296780 2332418 2287814 2137051
15623 2137051 2270890 2348089 2378756 2242169 2354923 2397061 2229103 2403011 2306604 2307721
15613 2307721 2223959 2111565 2184206 2147713 2249923 2356276 2333719 2250913 2231687 2193209 2255220
15602 2255220 2137286 2263696 2317061 2250341 2293978 2244296 2267969 2260971 2422605 2311124 2080824
15591B080824K47817j8221m1710J03554j27970n9308K01508Q4359j89917k7235
15581B253701J12575j48568J0410J02543K9047K5993r632K8690j42386M5174q3541
15570B224006R3228j02029O4555K2074j13379K01819L8586q8191N5236R0622j06278
15559B380249n5102j0921j59064N8354J06657l5662K4001j13204P9390J69694
15549B444392r7593r7406K9642k9855j2927Q4692j0904n037J31356N625q0124
15538B361861j08460j58824R2366J04325Q296J00038k3478l947q7278j10835O9655
15527B243719o3664o1007J17805J08915K5899q9434p569q642q1637J53116n2112
15516B285389p750P6213k7060o153M8704R715r6018l7935k5857R6352l3568M3055
$$ plain form
15591 2080824 2328641 2310420 2268710 2372264 2244294 2184986 2386494 2470853 2280936 2253701
15581 2253701 2366276 2217708 2228118 2330661 2359708 2385701 2376069 2404759 2262373 2307547 2224006
15570 2224006 2317234 2215205 2279760 2301834 2188455 2390274 2428860 2340669 2395905 2486527 2380249
15559 2380249 2325147 2314226 2155162 2213516 2320173 2284511 2308512 2195308 2274698 2444392
15549 2444392 2346799 2249393 2279035 2249180 2236253 2320945 2310041 2305004 2436360 2441985 2361861
15538 2361861 2253401 2094577 2186943 2291268 2299564 2399602 2376124 2372177 2284899 2174064 2243719
15527 2243719 2180055 2119048 2236853 2345768 2371667 2282233 2274664 2266022 2184385 2337501 2285389
15516 2285389 2277639 2353852 2326792 2320639 2369343 2379058 2283040 2245105 2219248 2315600 2282032 2325087
15504B325087J1094M598r9644M0104l9086M8847r691l8572J40670k51849J69245
15493B300803R8053o4968p7321o0734P7796L2086r2485J31600K5339N2850J8370
15482B441389k09107Q1167Q3717j61125R5637n0223j28726K411O4474l027J16404
$$ plain form
15504 2325087 2336181 2340779 2241135 2281239 2242153 2291000 2281309 2242737 2383407 2131558 2300803
15493 2300803 2398856 2333888 2256567 2195833 2273629 2305715 2213230 2344830 2370169 2423019 2441389
15482 2441389 2232282 2313449 2397166 2236041 2331678 2281455 2152729 2155140 2219614 2216587 2332991
$$ [...]
##END NTUPLES=NMR SPECTRUM
##END=
