##TITLE=1H_EC-3329(2)
 CDCl3
 8 sc, 
 24.7.2024
##JCAMPDX= 6.0         $$ Bruker NMR JCAMP-DX V2.0
##DATA TYPE= NMR SPECTRUM
##DATA CLASS= NTUPLES
##ORIGIN= UXNMR, Bruker Analytische Messtechnik GmbH
##OWNER= root
$$ XWIN-NMR		Version 3.5
$$ Wed Jul 24 14:00:43 2024 Russian Standard Time (UT+4h)  she@DPX200
##.OBSERVE FREQUENCY= 200.1313
##.OBSERVE NUCLEUS= ^1H
##.ACQUISITION MODE= SIMULTANEOUS
##.ACQUISITION SCHEME= undefined
##.AVERAGES= 8
##.DIGITISER RES= 18
##SPECTROMETER/DATA SYSTEM= spect
##.PULSE SEQUENCE= zg30
##.SOLVENT NAME= D2O
##.SHIFT REFERENCE= (INTERNAL, D2O, 0, 19.4681)
##AUDIT TRAIL= $$ (NUMBER, WHEN, WHO, WHERE, WHAT)
$$ ##TITLE= Audit trail, XWIN-NMR		Version 3.5
$$ ##JCAMPDX= 5.01
$$ ##ORIGIN= Bruker BioSpin GmbH
$$ ##OWNER= she
$$ F:/spectra/data/she/nmr/H-F/1/pdata/1/auditp.txt
$$ ##AUDIT TRAIL=  $$ (NUMBER, WHEN, WHO, WHERE, WHAT)
(   1,<2024-07-24 13:59:35.04 +0400>,<she>,<DPX200>,
      <created by zg, POWCHK disabled, PULCHK disabled
       configuration hash MD5:
       00 E9 B6 7A A2 85 ED C7 34 08 36 98 17 FE 4E 26
       data hash MD5: 16K
       93 59 C1 16 D3 12 98 6E 79 46 72 82 D9 1B 4A C1>)
(   2,<2024-07-24 13:59:38.07 +0400>,<she>,<DPX200>,
      <Start of raw data processing
       efp BC_mod = 2 LB = 0.24 FT_mod = 6 PKNL = 1 PHC0 = -25632.2 PHC1 = 7.18749 SI = 16K 
       data hash MD5: 16K
       6D 2F DC 7C B5 BC 75 13 03 67 1F E4 D9 37 42 0A>)
(   3,<2024-07-24 14:00:05.06 +0400>,<she>,<DPX200>,
      <pk PHC0 = -3.848744 PHC1 = 4.6 
       data hash MD5: 16K
       A4 C6 12 98 E8 62 20 AB D4 C6 58 51 70 D6 38 9A>)
(   4,<2024-07-24 14:00:09.06 +0400>,<she>,<DPX200>,
      <abs ABSG = 5 
       data hash MD5: 16K
       58 A3 3A BD 79 29 67 39 E1 2C B6 17 78 AB EE 78>)
$$ ##END=
$$ 
$$ hash MD5
$$ 91 C7 6B AB 1B BE 51 38 99 A1 89 F8 B8 D8 90 2B
##$RELAX= 
##$RELAX= 
##$RELAX= 
##$RELAX= 
##$RELAX= 
##$RELAX= 
$$ Bruker specific parameters
$$ --------------------------
##$DU= <F:/spectra>
##$EXPNO= 1
##$NAME= <H-F>
##$PROCNO= 1
##$TYPE= <nmr>
##$USER= <she>
##$AMP= (0..31)
100 100 100 100 100 100 100 100 100 100 100 100 100 100 100 100 100 100 
100 100 100 100 100 100 100 100 100 100 100 100 100 100 
##$AQSEQ= 0
##$AQ_mod= 1
##$AUNM= <au_zg>
##$AUTOPOS= <>
##$BF1= 200.13
##$BF2= 200.13
##$BF3= 200.13
##$BF4= 200.13
##$BF5= 200.13
##$BF6= 200.13
##$BF7= 200.13
##$BF8= 200.13
##$BYTORDA= 1
##$CFDGTYP= 0
##$CFRGTYP= 5
##$CHEMSTR= <none>
##$CNST= (0..31)
1 1 145 1 1 1 1 1 1 1 1 1 1 1 1 1 1 1 1 1 1 1 1 1 1 1 1 1 1 1 1 1 
##$CPDPRG= <>
##$CPDPRG1= <>
##$CPDPRG2= <>
##$CPDPRG3= <>
##$CPDPRG4= <mlev>
##$CPDPRG5= <mlev>
##$CPDPRG6= <mlev>
##$CPDPRG7= <mlev>
##$CPDPRG8= <mlev>
##$CPDPRGB= <>
##$CPDPRGT= <>
##$D= (0..31)
0 1.2 0 0 0 0 0 0 0 0.06 0 0.03 0 0 0 0 0.0002 0 0 0 0 0 0 0 0 0 0 0 0 
0 0 0 
##$DATE= 1721815174
##$DBL= (0..7)
120 120 120 120 120 120 120 120 
##$DBP= (0..7)
150 150 150 150 150 150 150 150 
##$DBP07= 0
##$DBPNAM0= <>
##$DBPNAM1= <>
##$DBPNAM2= <>
##$DBPNAM3= <>
##$DBPNAM4= <>
##$DBPNAM5= <>
$$ [...]
##$SUBNAM3= <"">
##$SUBNAM4= <"">
##$SUBNAM5= <"">
##$SUBNAM6= <"">
##$SUBNAM7= <"">
##$SUBNAM8= <"">
##$SUBNAM9= <"">
##$SW= 24.0689771365484
##$SWIBOX= (0..15)
0 0 2 0 0 0 0 0 0 0 0 0 0 0 0 0 
##$SW_h= 4816.95568400771
##$TD= 16384
##$TD0= 1
##$TE= 0
##$TE2= 300
##$TE3= 300
##$TEG= 300
##$TL= (0..7)
0 120 120 120 120 120 120 120 
##$TP= (0..7)
150 150 150 150 150 150 150 150 
##$TP07= 0
##$TPNAME0= <>
##$TPNAME1= <>
##$TPNAME2= <>
##$TPNAME3= <>
##$TPNAME4= <>
##$TPNAME5= <>
##$TPNAME6= <>
##$TPNAME7= <>
##$TPOAL= (0..7)
0.5 0.5 0.5 0.5 0.5 0.5 0.5 0.5 
##$TPOFFS= (0..7)
0 0 0 0 0 0 0 0 
##$TUNHIN= 0
##$TUNHOUT= 0
##$TUNXOUT= 0
##$USERA1= <user>
##$USERA2= <user>
##$USERA3= <user>
##$USERA4= <user>
##$USERA5= <user>
##$V9= 5
##$VALIST= <valist>
##$VCLIST= <CCCCCCCCCCCCCCC>
##$VD= 0
##$VDLIST= <DDDDDDDDDDDDDDD>
##$VPLIST= <PPPPPPPPPPPPPPP>
##$VTLIST= <TTTTTTTTTTTTTTT>
##$WBST= 1024
##$WBSW= 4
##$XGAIN= (0..3)
0 0 0 0 
##$XL= 0
##$YL= 0
##$YMAX_a= 601164
##$YMIN_a= -590382
##$ZGOPTNS= <>
##$ZL1= 120
##$ZL2= 120
##$ZL3= 120
##$ZL4= 120
##$ABSF1= 19.46805
##$ABSF2= -4.601107
##$ABSG= 5
##$ABSL= 3
##$ALPHA= 0
##$AQORDER= 0
##$ASSFAC= 0
##$ASSFACI= 0
##$ASSFACX= 0
##$ASSWID= 0
##$AUNMP= <proc_1d>
##$AZFE= 0.1
##$AZFW= 0.1
##$BCFW= 0
##$BC_mod= 2
##$BYTORDP= 0
##$COROFFS= 0
##$CY= -3
##$DATMOD= 1
##$DC= 0
##$DFILT= <>
##$DTYPP= 0
##$F1P= 0
##$F2P= 0
##$FCOR= 1
##$FTSIZE= 16384
##$FT_mod= 6
##$GAMMA= 0
##$GB= 0
##$INTBC= 1
##$INTSCL= 3.70164e-10
##$ISEN= 128
##$LB= 0.24
##$LEV0= 0
##$LPBIN= 0
##$MAXI= 10000
##$MC2= 0
##$MEAN= 0
##$ME_mod= 0
##$MI= 1.114404
##$NCOEF= 0
##$NC_proc= -4
##$NLEV= 6
##$NOISF1= 3.799351
##$NOISF2= 2.8
##$NSP= 0
##$NTH_PI= 0
##$NZP= 0
##$OFFSET= 19.46805
##$PC= 1
##$PHC0= -25636.05
##$PHC1= 11.78749
##$PH_mod= 1
##$PKNL= yes
##$PPARMOD= 0
##$PSCAL= 0
##$PSIGN= 0
##$REVERSE= no
##$SF= 200.129812341591
##$SI= 16384
##$SIGF1= 3
##$SIGF2= 2
##$SINO= 5.538805
##$SIOLD= 16384
##$SREGLST= <1H.CDCl3>
##$SSB= 0
##$STSI= 16384
##$STSR= 0
##$SW_p= 4816.95568400771
##$SYMM= 0
##$S_DEV= 0
##$TDeff= 16384
##$TDoff= 0
##$TI= <>
##$TILT= no
##$TM1= 0
##$TM2= 0
##$TOPLEV= 0
##$USERP1= <user>
##$USERP2= <user>
##$USERP3= <user>
##$USERP4= <user>
##$USERP5= <user>
##$WDW= 1
##$XDIM= 16384
##$YMAX_p= 285946315
##$YMIN_p= -97539
$$ End of Bruker specific parameters
$$ ---------------------------------
##NTUPLES= NMR SPECTRUM
##VAR_NAME=  FREQUENCY,     SPECTRUM/REAL,   SPECTRUM/IMAG
##SYMBOL=    X,             R,               I
##VAR_TYPE=  INDEPENDENT,   DEPENDENT,       DEPENDENT
##VAR_FORM=  AFFN,          ASDF,            ASDF
##VAR_DIM=   16384,         16384,           16384
##UNITS=     HZ,            ARBITRARY UNITS, ARBITRARY UNITS
##FACTOR=    0.29402158847633, 1,            1
##FIRST=     3896.13719376746, 0,            0
##LAST=      -920.818490240252, 0,           0
##MIN=       -920.818490240252, -97539,      0
##MAX=       3896.13719376746, 285946315,    0
$$ Real data points
##PAGE= N=1
##DATA TABLE= (X++(R..R)), XYDATA
$$ [...]
6893a875K0205J7681R535j2535j4826J3352K0071k4056l6051j2523M4827j1411
6881A2394j6749o612k0579L0091k7772P676J2512q789J4452Q719J5436j3146j5183
6868g550j8631K8997N1085l8133k9520J1775L118k2145l0355M5097J8476j5550
6856c336K0708m8574M0876O83j170L735n146J3141r911l6586J6299L9861j4867
6843A5713o375j2289m614j5826M2928J2058j2131O866o281j7874j6523K8937J0385
6830B4974j3397o106p093j3892m139K1347L1258m4176l686j4483k5576L5761K374
6817a6834L3098q910J0117l9393j646n962J9988L9422l403j4722k3337N2941k3095
6804A8264Q788P361k6007J4908k369m6803K1125L4406j9684k0355Q608p462M0591
$$ y = [-1875, 18330, 36011, 45546, 33011, 18185, 31537, 51608, 27552, -8499, -21022, 23805, 12394, -4355, -10967, -31546, -1455, -29227, -21551, -9039, -17828, -3376, 5343, 20779, 7633, -7550, -26181, 2816, 53901, 15768, -13752, -1977, 1141, -21004, -51359, -6262, 12214, -3336, 17372, -31202, 9674, 10357, 9187, 12922, 7776, 20917, 11006, -25580, -9281, 30580, 15713, 9338, -2951, -7565, -23391, 19537, 31595, 19464, 26330, 20049, 2175, -14348, 14589, 24974, 11577, 5471, -1622, -15514, -19653, 1694, 32952, -11224, -14910, -29393, -54969, -19208, -16834, 16264, 7354, 17471, -21922, -23568, -29530, -9542, 29880, 26477, 11755, -11582, 41359, 18264, 27052, 34413, 8406, 23314, 20945, -25858, -4733, 29673, 9989, -10366, -1758, -9220, 31371]
6791C1371K861m476K270K8429m3619j5132k4502l207M7621Q033j793n681r02J2202
6777C3475K9267m1854L166k5376J6440J2404J3988k2663k3016k5024O6560M3349
6765H0716k4342k9147M597K62k1885q180J26m315J9540O362P636k724k6347K3779
6751B6078J062J5188J51j3887l9339K7087P682J8779j6891J8919l3461k6535J8039
6738B872L4231l3099J644L0966j7816k0411L1174J187l2324K6003J969J9841l354
6725D2883q714j6661K890J0343p087P645j6336j5773n879p139L4329k3062N580
6712C019J3188K1464J5274k4799K0737k9944J4690J1452m8272P1359l4626j2363
6700B1179N6269l1831P51k4289j0314p618K4430j2008m020K1282j6806J0323j1302
$$ y = [31371, 34232, 29756, 32026, 60455, 16836, 1704, -22798, -26005, 21616, 29649, 27856, 22175, 21273, 33475, 62742, 20888, 24054, -1322, 15118, 27522, 41510, 18847, -4169, -29193, 37367, 80716, 56374, 27227, 31824, 32086, 10201, 2021, 2147, -2168, 17372, 23734, 31370, 28646, 2299, 26078, 27140, 42328, 42479, 28592, -10747, 16340, 24022, 42801, 25910, 44829, 11368, -15167, 2872, 37103, 4004, 5648, 36614, 18798, -1613, 29561, 30748, -1576, 24427, 26396, 46237, 42883, 34169, 17508, 20398, 30741, 23654, 31299, 14963, -810, -6689, -13828, 20501, -2561, 3019, 16207, 37671, 52945, 28146, 48883, 18939, 33629, 45081, -3191, 68168, 33542, 21179, 77448, 45617, 46368, 22079, 11765, 4147, 28577, 16569, 12549, 33831, 17025, 27348, 16046]
6687A6046J6532K4389q594j111K1372m35P915k7429j4989M070J4948N982j5053
6674D3643j8143J8603K4844j8015p815j8943j7799O982O699Q790j6447K809m332
6661A0876j5389M0877K6706L9720j1337m6770Q800j6852P109J9822k3341P319
6649D7540J9368P573m823L1556K4153L0099j5767l4499q598R204J1419l4107J7771
6636A00889m112q466k1850m2560p343L6332L344R237Q933l8085k0717k2118M1853
6623C5337L175j638K7084j4369j2742l325J9888m3871p847N9382l5837k8709O755
6610C283K1449L9907k0726j4020M1794j3049j2558J5648k7522q064J418J2225
6598C9785k3469M2916J2417l7991j6146O0820k8569J0864k8932J0799j6216j9407
$$ y = [16046, 32578, 56967, 48373, 47262, 68634, 68199, 76114, 48685, 33696, 37766, 52714, 58696, 43643, 25500, 44103, 68947, 50932, 43117, 24174, 6375, 13357, 20056, 28846, 12399, 15208, 10876, -4513, 36364, 63070, 102790, 91453, 44683, 53483, 36631, 43740, 63562, 40221, 47540, 66908, 74481, 69658, 101214, 125367, 155466, 139699, 105200, 96602, 105806, 117225, 83118, 100889, 96777, 88311, 66461, 23901, 16558, 52890, 56234, 65471, 74404, 36319, 15602, -6516, 35337, 38512, 36874, 63958, 49589, 36847, 33522, 53410, 9539, 1692, 61074, 25237, -3472, 3283, 24732, 64639, 43913, 29893, 71687, 58638, 46080, 61728, 34206, 26142, 27560, 39785, 16316, 59232, 71649, 33658, 17512, 78332, 49763, 60627, 31695, 42494, 26278, 6871]
6586F871k6830N2060L7634n3953N1405P542j7037J619O978k3621j6847l1215K6635
6573B1241M4530J3101l2546J2240q157J1078l786j6232K2896l0729k8911r590
6561d865K5740j0202K2804J9271L189k0944k5045M7322j2204M6297j6170r293
6549F5900J6038p926k7661k3958K1828l358o984N3786j5204J506m1040K5774l951
6536E4750r395K2564J1260J7605J918p84P01j8558P0j4652j4534l4823J7454j1015
6522B2561P5556k332p3130L774J4658K2917J0107j8547j3660P440J4423K8291
6510I2058o609j5914O157k7493K2219J1635k5430K7565j2134k1467m092L719Q432
6497E8646Q130j1538k555O386J7177l0541K5109R994J0816p119j1470j144K9611
$$ y = [6871, -19959, 32101, 69735, 15782, 67187, 74729, 57692, 59311, 66289, 42668, 25821, -5394, 21241, 65771, 78872, 46326, 58566, 50409, 61487, 57701, 41469, 64365, 33636, 4725, -4865, 20875, 10673, 33477, 52748, 55937, 34993, 9948, 57270, 45066, 91363, 75193, 65900, 81938, 74012, 46351, 22393, 44221, 40863, 33879, 87665, 72461, 73967, 32927, 58701, 54750, 45355, 67919, 79179, 96784, 98702, 97918, 98619, 80061, 80131, 65479, 50945, 16122, 33576, 22561, 98117, 95785, 22655, 26429, 41087, 64004, 74111, 55564, 41904, 49344, 63767, 92058, 85449, 69535, 75692, 48199, 70418, 82053, 56623, 84188, 72054, 50587, 46495, 50214, 58646, 66776, 55238, 52683, 59069, 76246, 45705, 70814, 80808, 91624, 84505, 73035, 71891, 101502]
6484A01502J7654j0939l4813J0918l215K4957m6483k9761K9992K6109k274Q564
6472I2211J5935j3595P574j0441P985j9884j8752L3988m3833J2813K669J0512
6460G7182L3622J2743j7878l7907M257O0791j0850j7878p733k9762o059M8312
6448A08840K4036n4644L9224J5655o7123o010K8490J790J0498k581P910J9436
6436A25521J1960j7027r127L4241p104j8512j859K2889L1301l5794l6309o690
6424I3490P022j5144K2609j1776K9591j563m0413L4729j0606L72L0432m2879J4995
6411A10859L4652k0042n984J8834j1029o966j4383j9395K1500j8834L0646K7405
6399A47263K8571l4543M360j9633N517j6963K3984L7552k8417o083j7412k3573
$$ y = [101502, 119156, 108217, 73404, 84322, 81107, 106064, 59581, 29820, 59812, 85921, 83647, 92211, 108146, 94551, 102125, 91684, 99669, 79785, 61033, 95021, 51188, 64001, 66670, 77182, 110804, 123547, 105669, 67762, 72019, 132810, 121960, 104082, 96349, 66587, 60528, 108840, 132876, 78232, 117456, 133111, 65988, 59978, 88468, 90258, 100756, 98175, 106085, 125521, 137481, 120454, 111327, 145568, 138464, 119952, 118093, 140982, 172283, 136489, 100180, 93490, 100512, 85368, 107977, 96201, 125792, 124229, 83816, 118545, 107939, 108311, 138743, 95864, 110859, 145511, 125469, 119485, 138319, 127290, 120324, 105941, 86546, 108046, 89212, 119858, 147263, 175834, 141291, 145651, 126018, 131535, 114572, 138556, 176108, 147691, 141608, 124196, 100623]
6387A00623j265K4735N6141k5249r472O679k9223J9593L5309j3962k7919K1438
6375A57428k2022p043M307J1960j0282j6860P116M7650k1126K850M1227K4779
6363B19984p3990M2991l3628n8020K9969J8767j979K8181K3057j3550j195j725
6351A78862L3358m0732j1638K9813m659p845J6919J9674l5066M625k2096J1885
6339A73100J4060O837J0269l320J1021L117j6112N173j3046K712K1440J9706m7914
6326A87043J6146L5410J3389M108O202j3738P285P596l136n4282O0K5600J908
6313B33591J4110k8352J8496n220l736K5150j3597J9097J5397k188K7830n217
6301B95361N738M778L0290k9119k1225k268m494j7992K7307K4282L0021k7419
$$ y = [100623, 99358, 124093, 180234, 154985, 145513, 152192, 122969, 142562, 177871, 163909, 135990, 157428, 135406, 128363, 132670, 144630, 134348, 117488, 124604, 172254, 151128, 153978, 195205, 219984, 145994, 188985, 155357, 97337, 127306, 146073, 144094, 172275, 195332, 181782, 180587, 178862, 212220, 171488, 159850, 189663, 185004, 177159, 194078, 213752, 178686, 183311, 161215, 173100, 187160, 193997, 204266, 200946, 211967, 215084, 198972, 204145, 191099, 193811, 215251, 234957, 187043, 203189, 238599, 251988, 256096, 262298, 248560, 255845, 263441, 260305, 206023, 206083, 231683, 233591, 247701, 219349, 237845, 232625, 228889, 254039, 240442, 259539, 274936, 272748, 300578, 295361, 301099, 305877, 336167, 307048, 285823, 283555, 279061, 261069, 288376, 312658, 342679, 315260]
6289C15260J0912Q615l2398k7476K4735K5762K8970l4049L793P50K9007P900K39
6276C62020K7772l9730J2018K5078k145j8733L5171L42P879q392O468K6329q926
6263D25151j4178K32M4321M8373J7975K4743J3818K2248K4096j7994K7009J1995
6251F27789O366J9775L0658M0746K3275j0855P1756N705L3858N6709P1916J0494
6239I88192N2749M3226O4729L5235R6684P9174K6734J07327J08417M4569Q7028
6228A734064J54525J15451J55590J78009K42440L05729L26996L49351K39129M8985
6218C850269j31435k11606j35443j43981j50597o7203K4583J3379L4585O4435
6208C146986J30663J42951K60868L16415M27946L99489N13631O15264O67793M92223
$$ y = [315260, 326172, 334787, 302389, 274913, 299648, 325410, 354380, 320331, 324124, 324874, 353881, 361781, 362020, 389792, 350062, 362080, 387158, 385013, 366280, 401451, 401793, 409672, 401280, 407748, 434077, 425151, 410973, 411205, 455526, 503899, 521874, 546617, 560435, 582683, 606779, 588785, 615794, 627789, 634155, 653930, 684588, 725334, 748609, 737754, 809510, 815215, 849073, 905782, 977698, 988192, 1040941, 1084167, 1148896, 1184131, 1280815, 1359989, 1386723, 1494050, 1602467, 1647036, 1734064, 1888589, 2004040, 2159630, 2337639, 2580079, 2885808, 3212804, 3562155, 3801284, 3850269, 3718834, 3507228, 3371785, 3227804, 3077207, 3010004, 3034587, 3047966, 3082551, 3146986, 3277649, 3420600, 3681468, 3997883, 4425829, 4825318, 5338949, 5954213, 6622006, 7114229]
6198G114229k1994m51029o78096o44775n58713m27180l52819k91863j66568j32861
6188C388331n7744p5964N9543N1235R9229J09320J29398K16964K58843K50379
6178D429534J13763j15365k71147m14824l82628l00236k91392k22301j69180j75444
6168B200780j39944p6253j09936m5130q1459j5584o9431p4175l1809q9579k9093
6157A438387l0786p7040Q029j1656n7992J014J7567l4648l7321k1903Q428J5274
6145A217353k3592k3464n379l1092l5617P599o731J1851L4507m5736L7163Q885
6133A145747P726J9558m994l0342R449L2160N1064J1782j1595O071p226N8334
6121A287734J538j0930M6486L0880j6520L2163L677N040M4921R982K894J5413
$$ y = [7114229, 7092235, 6641206, 5963110, 5318335, 4759622, 4332442, 3979623, 3687760, 3521192, 3388331, 3330587, 3254623, 3314166, 3365401, 3464630, 3573950, 3703348, 3920312, 4179155, 4429534, 4543297, 4427932, 4156785, 3741961, 3359333, 3059097, 2767705, 2545404, 2376224, 2200780, 2060836, 1984583, 1874647, 1829517, 1748058, 1732474, 1663043, 1588868, 1557059, 1467480, 1438387, 1407601, 1330561, 1338590, 1326934, 1268942, 1269956, 1287523, 1252875, 1215554, 1193651, 1202079, 1217353, 1193761, 1170297, 1164918, 1133826, 1098209, 1105808, 1099077, 1110928, 1145435, 1099699, 1136862, 1145747, 1153473, 1173031, 1168037, 1137695, 1147144, 1179304, 1230368, 1242150, 1230555, 1236626, 1229400, 1287734, 1289272, 1278342, 1324828, 1355708, 1339188, 1371351, 1375028, 1380068, 1424989, 1434971, 1437865, 1453278]
6109A453278J6936K5145L306N1623L0626J3917O2815M4804M9704j5676K4287K0921
6097A781686M7402J5732N653M8879J2559M7084M8873K9497K3391K4709L8602L7078
6085B161145L8220N2429N5782O1354K7613R0608O0426J4978L2073J8531N1606
6074B664765N0375K3149O7186Q0248Q6P8107Q7024L4508J34559Q5463Q7659J02822
6062C495951J39773J11481J12087R6406P2364Q9893J24903J34626J62996J62228
6052D702708J59701J67609J99853J55086J88250K13562J97189K66657K81500K96560
6042F828675K64568K98089L06701L60339M02598M26607M57187M47362M80388N05099
6032A0777613N36720N64777N97787O56201O07438O20843P10246P53514P75478
$$ y = [1453278, 1470214, 1495359, 1498665, 1550288, 1580914, 1594831, 1657646, 1702450, 1752154, 1736478, 1760765, 1781686, 1829088, 1844820, 1850473, 1899352, 1911911, 1958995, 2007868, 2037365, 2060756, 2085465, 2124067, 2161145, 2199365, 2251794, 2307576, 2368930, 2396543, 2487151, 2547577, 2562555, 2594628, 2613159, 2664765, 2715140, 2738289, 2805475, 2885723, 2885809, 2963916, 3050940, 3085448, 3220007, 3305470, 3393129, 3495951, 3635724, 3747205, 3859292, 3955698, 4028062, 4117955, 4242858, 4377484, 4540480, 4702708, 4862409, 5030018, 5229871, 5384957, 5573207, 5786769, 5983958, 6250615, 6532115, 6828675, 7093243, 7391332, 7698033, 8058372, 8460970, 8887577, 9344764, 9792126, 10272514, 10777613, 11314333, 11879110, 12476897, 13133098, 13740536, 14361379, 15071625, 15825139, 16600617]
6023A6600617P97718P91994Q85688Q95651J006697J024349J079786J215392J308072
6014B5605964J372749J419653J573591J698638J735061J861475J919662J977322
6006C9164115K051670J989729J915340J823501J642729J407880J125073P77574
5998E1897611M97674J19572k38955n63166r06197j203594j490327j750453j888860
5989D4473305k067247k145262k149541k152907k079184k079566j913041j833553
5981B8053004j664383j601495j498220j387925j289252j131779j110734r87505
5973A7381711r36284q79493p99511p12966p15816o80740n88526n71412n58877
5964A0938086m40179m56568m41274m16851l69383l85333l38588l28935l15568
$$ y = [16600617, 17398335, 18190329, 19076017, 19971668, 20978365, 22002714, 23082500, 24297892, 25605964, 26978713, 28398366, 29971957, 31670595, 33405656, 35267131, 37186793, 39164115, 41215785, 43205514, 45120854, 46944355, 48587084, 49994964, 51120037, 51897611, 52395285, 52514857, 52275902, 51712736, 50806539, 49602945, 48112618, 46362165, 44473305, 42406058, 40260796, 38111255, 35958348, 33879164, 31799598, 29886557, 28053004, 26388621, 24787126, 23288906, 21900981, 20611729, 19479950, 18369216, 17381711, 16445427, 15565934, 14766423, 14053457, 13337641, 12656901, 12068375, 11496963, 10938086, 10497907, 10041339, 9600065, 9183214, 8813831, 8428498, 8089910, 7760975, 7445407]
5955G445407l09909k63162k38341k27819k21357k20556k03210k42213j58736j84090
5945E176014j92953j55989j41873k03569j31110q3653j63418j34478r7238j33869
5935C737864j35794j11004p2862j08125r9197r0004m8938o8033j01016p0261p1324
5924B761306r4420n6683r7196q2716n8222k3109m1039n7888l7308p3374j00555
5913B038796m1817l3344k3094l4907m3008q1833k4947j2978o8560l1153j9323
5902A623832j0169m6901k4173k0267k4688j6084n844r7692k9952L3252l9279k6238
5890A315797O711n4863Q177l9482j198N400k8144l8070J0390n085m191L9408l0567
5877A184283m2954m6287k1907K2801j2850L747k0043m5096J3830k2639j8758L004
$$ y = [7445407, 7135498, 6872336, 6633995, 6406176, 6184819, 5964263, 5761053, 5518840, 5360104, 5176014, 4983061, 4827072, 4685199, 4481630, 4350520, 4266867, 4103449, 3968971, 3871733, 3737864, 3602070, 3491066, 3418204, 3310079, 3210882, 3120878, 3071940, 3003907, 2902891, 2832630, 2761306, 2666886, 2610203, 2513007, 2430291, 2372069, 2348960, 2307921, 2250033, 2212725, 2139351, 2038796, 1996979, 1963635, 1940541, 1905634, 1862626, 1780793, 1755846, 1742868, 1674308, 1643155, 1623832, 1613663, 1566762, 1542589, 1522322, 1497634, 1481550, 1475706, 1378014, 1348062, 1381314, 1342035, 1315797, 1322508, 1267645, 1275822, 1236340, 1235142, 1240542, 1212398, 1174328, 1184718, 1179633, 1175442, 1214850, 1184283, 1141329, 1095042, 1073135, 1095936, 1083086, 1086833, 1066790, 1021694, 1035524, 1012885, 994127, 997131]
5865I97131o779l0468k3368K6031k1707M0240M0703k4788L6123k7694m2061l3649
5853I29714K0780J4554o2618j6308m5729o958n503j6502J360J1047k6468K9005
5841H26374k1080J3432J0758j6352K5212K6M714m874k5388j7449J8700J1613j332
5828H24354n168j8784J4592K9706K6463l847p120P878j5389J1220L7347K4278
5816I25530J7672J944L1406J298j945P4144P824K1362M0902L6359N7459M4708
5804A258663M2478R1625N8632P3392P7904P7634N6982Q2869R6289J65094J65188
5793B246750J86942K30605K67656L17432M41585M06804K65877L1106j82120k92195
5783C920442k73433k38844j56402j28684p4712k8180K5637R6650R3052J52587
$$ y = [997131, 990352, 959884, 936516, 962547, 940840, 981080, 1021783, 996995, 1033118, 1005424, 963363, 929714, 950494, 965048, 902430, 886122, 840393, 833435, 827932, 811430, 812790, 823837, 797369, 826374, 805294, 818726, 829484, 813132, 838344, 838370, 843084, 838210, 812822, 795373, 814073, 825686, 824354, 819186, 800402, 814994, 844700, 871163, 867316, 860196, 868074, 852685, 863905, 901252, 925530, 943202, 945146, 976552, 977850, 975905, 1050049, 1057873, 1079235, 1120137, 1156496, 1213955, 1258663, 1301141, 1392766, 1451398, 1524790, 1602694, 1680328, 1737310, 1820179, 1916468, 2081562, 2246750, 2433692, 2664297, 2931953, 3249385, 3690970, 4097774, 4363651, 4394757, 4212637, 3920442, 3647009, 3408165, 3251763, 3123079, 3048367, 3020187, 3045824, 3142474, 3235526, 3388113]
5773C388113K06850K86167L29448M22184N36576P24598Q04348M41664j67012n38497
5763F434439o69024o43867n51999m69021m08596l26370k01718j76201r2128j02495
5753B793020n1846M563Q6416P4379J06867K17204K53425K95817J16814p2238k08861
5742C615560k45462l14816l38894k72182k16538k44974k22156j42224j26555q7111
5732A404648q3937q4253k850k3675n0575n9432L241J384o1571l3164J3518k7225
5720I96109k6064p9991m0323j3083l3894m2403j6567j8232l3536j1695l3527r605
5708F37189O892p057K2353J4749n3373k9806J6511K022j7745K8762l2622K7298
5696F15173M01l5994J8365p636k5428K561J1358j9599K9862K1265L823j9139k7169
$$ y = [3388113, 3594963, 3881130, 4210578, 4632762, 5169338, 5893936, 6698284, 7139948, 6972936, 6434439, 5765415, 5121548, 4569549, 4100528, 3691932, 3365562, 3163844, 2987643, 2895515, 2793020, 2741174, 2745737, 2832153, 2906532, 3013399, 3230603, 3484028, 3779845, 3896659, 3824421, 3615560, 3370098, 3055282, 2716388, 2444206, 2227668, 1982694, 1760538, 1618314, 1491759, 1404648, 1320711, 1236458, 1233608, 1209933, 1159358, 1099926, 1103167, 1104551, 1042980, 1009816, 1023334, 996109, 970045, 890054, 849731, 836648, 802754, 760351, 743784, 725552, 692016, 680321, 646794, 637189, 644081, 637024, 659377, 674126, 620753, 590947, 607458, 609480, 591735, 620497, 587875, 615173, 615574, 579580, 597945, 590309, 564881, 567442, 578800, 559201, 589063, 610328, 614151, 595012, 567843]
5683E67843J8438l5712Q745K1497J1476J2240j5940M092j1920O8182N0468J4054
5671G13463K9465O0309J9537K1471k6501k8621o0496k3921N77k8613J3588J7899
5659G08157j1892j8076L4654M8045O0549N43K9817K9568N4606L1300K0718O1436
5647A049425Q8698J06420J24533M6784j10223p7050j00532o6099o549j7634k4910
5636A012863j4282J8079J8767O5288J6989K296j7596l570K3527P671K5320J01107
5624A256459L2602O3806J45440J31925K2865l9540j32874r4839o9727p1889j3481
5613A230747n935p008o6623L6710J2083j0737j7431L619j2324r965K1034O9038
5601A243208J7792J2773J8687Q6710J04459J3887m6354O011J3057J0412p863o4715
$$ y = [567843, 586281, 550569, 559314, 580811, 592287, 604527, 588587, 592679, 580759, 648941, 699409, 713463, 742928, 803237, 822774, 844245, 817744, 789123, 728627, 704706, 705283, 676670, 690258, 708157, 696265, 678189, 712843, 760888, 821437, 821980, 851797, 881365, 935971, 967271, 987989, 1049425, 1138123, 1244543, 1369076, 1415860, 1305637, 1228587, 1128055, 1061956, 1055407, 1037773, 1012863, 998581, 1016660, 1035427, 1100715, 1117704, 1120000, 1102404, 1098834, 1122361, 1130032, 1155352, 1256459, 1289061, 1352867, 1498307, 1630232, 1653097, 1613557, 1480683, 1385844, 1316117, 1244228, 1230747, 1224812, 1217804, 1151181, 1187891, 1199974, 1189237, 1171806, 1175425, 1163101, 1153136, 1174170, 1243208, 1261000, 1273773, 1292460, 1379170, 1483629, 1497516, 1451162, 1457173, 1470230, 1480642, 1472779, 1408064]
5589A408064m2181l8552p4966m2874m6073j2135N4896l2406K276j20L7105M5277
5577A258311l256J4128m161k59k9936k8681L6866k5762K2490K8285K4776N7010
5565A349811L2206N4783M7450N5599O2642Q6337K7055O7576J19385P2679R5894
5554B071417J23587J11455J21809Q6972J02580J63155J04714J48024J49082J47505
5544C330300J39554J35881J82399K05102K25296J52181J84921K78521K86364K35476
5534E355995K93883L35992L17089K31760L25076L69579M71673N63223O83823P50397
5524I698490P57900Q51891Q89745P91238Q75714R57473P80885N52363K15179o1799
5514A6309079l18306o25276p76379o76713o50028n74536n37705m94039n21271
$$ y = [1408064, 1365883, 1327331, 1252365, 1209491, 1163418, 1151283, 1206179, 1173773, 1176049, 1175929, 1213034, 1258311, 1255055, 1269183, 1265022, 1264763, 1234827, 1206146, 1243012, 1217250, 1239740, 1268025, 1292801, 1349811, 1382017, 1436800, 1484250, 1539849, 1602491, 1688828, 1715883, 1783459, 1902844, 1975523, 2071417, 2195004, 2306459, 2428268, 2515240, 2617820, 2780975, 2885689, 3033713, 3182795, 3330300, 3469854, 3605735, 3788134, 3993236, 4218532, 4370713, 4555634, 4834155, 5120519, 5355995, 5649878, 5985870, 6302959, 6534719, 6859795, 7229374, 7701047, 8264270, 8948093, 9698490, 10456390, 11308281, 12198026, 12989264, 13864978, 14822451, 15603336, 16155699, 16370878, 16309079, 15990773, 15365497, 14589118, 13912405, 13262377, 12687841, 12150136, 11656097, 11134826]
5505A1134826o17070o12908n02502m19935l75030l55369k80242l14504k44455
5496G412811j16002o0362N332J79843K31878L51539L95521L62503J58230q2371
5486H838922k95264n36961o63890n99943n10613m99559l75821k73976k64412k49306
5476D569177j35298j00509q175L3770J20734K01261J22570J6014k25301l49799
5466D244444m18507m07478l05117k71020k46872j92628j54510j20411o7061k1181
5456B039659o1797m1384J02479L1446j21461j81064j48188r6326j06800j31288
5446A285276q2122j06084o4572k3606j1738o8000o09m9434l1185j4600n1191M1131
5434H23266q825l9043k1427R583m9117p999K9353K3374l5695j2291r222k4556
$$ y = [11134826, 10517756, 9904848, 9402346, 8982411, 8607381, 8252012, 7971770, 7657266, 7412811, 7296809, 7236447, 7241779, 7421622, 7653500, 8005039, 8400560, 8763063, 8921293, 8838922, 8543658, 8006697, 7342807, 6742864, 6232251, 5732692, 5356871, 5082895, 4818483, 4569177, 4433879, 4333370, 4325195, 4358965, 4479699, 4680960, 4803530, 4819544, 4594243, 4244444, 3825937, 3418459, 3113342, 2842322, 2595450, 2402822, 2248312, 2127901, 2060840, 2039659, 1977862, 1936478, 2038957, 2070403, 1948942, 1767878, 1619690, 1523364, 1416564, 1285276, 1203154, 1097070, 1032498, 1008892, 997154, 929154, 928545, 879111, 847926, 833326, 782135, 823266, 814441, 775398, 753971, 763554, 714437, 706438, 735791, 759165, 723470, 711179, 701957, 677401]
5422F77401J896P776n905N766L0354J1635L401K5993K4618N5798O2727R0912N3479
5409A045851m0035q6169r1568m6163n6808o1785k8873k6747q1894J0798M0495
5398E77102L845k7259m0498j7407J3376j8502L2201k3318l1067m743k154k1344
5386D40232l4300J3442P899O066k6056L9400j6267K1820j352l4504N518L360Q464
5373D33722K3146J1597r846J5775n4353R805m630n3612j0359K6702k9112j48j4033
5360C44654n2827J0923j8510L2911L0707j8946k0328l014J3704L1532N0137L5933
5348D36876K077n1934l2805q866K7586l2457j5056m3549j4625k081Q706M2841
5336C16713k9110o1433J297j1183j1436L0668k966j111J5676m4470N1327j5356
$$ y = [677401, 679297, 687073, 681168, 686934, 717288, 728923, 732324, 758317, 782935, 838733, 901460, 992372, 1045851, 1005816, 919647, 828079, 781916, 725108, 663323, 634450, 607703, 525809, 536607, 577102, 580947, 553688, 513190, 495783, 509159, 490657, 522858, 499540, 468473, 463730, 461576, 440232, 405932, 419374, 427273, 433339, 407283, 446683, 430416, 452236, 450884, 416380, 421898, 425258, 433722, 456868, 468465, 458619, 474394, 420041, 429846, 425216, 371604, 361245, 387947, 358835, 358687, 344654, 291827, 302750, 284240, 317151, 347858, 328912, 308584, 305570, 319274, 350806, 400943, 436876, 438953, 387019, 354214, 345348, 372934, 340477, 325421, 281872, 267247, 265166, 273872, 316713, 287603, 226170, 227467, 216284, 204848, 235516, 232550, 231439, 247115, 202645, 253972, 238616]
5324B38616R58M4086Q275N201k4393m249j7959j2331R087j8749m376N4467m3888
5311B34745K7656K0934l8200J7066K4136p413l460R696j071n8907K63P714Q808
5298B41967M6174K6205k4465k8982K1453q571J5530J5072j5005L8837j6059N6395
5286C68551P472n3291M6015k5118O084M333r416L185K9920N3128N9672J0770K6215
5273E27520K0568J0391J1127k5532j1752n1651L737q7588J6928L2617j5230n9056
5261C72079k3574j4372j5026L975l7982K9364K0048o285j6645M033j5083J1457
5249C11989J4449J309J0923m2417j1966K708M852j3776m837M4988o739j7855o621
5236B87007L4376k919j5716j5122J5567j1391p970o581K440L2590k6489K6862
$$ y = [238616, 239574, 283660, 291935, 297136, 272743, 268494, 250535, 238204, 247291, 228542, 224166, 278633, 234745, 262401, 283335, 245135, 262201, 286337, 278924, 275464, 285160, 284089, 225182, 225445, 233159, 241967, 288141, 314346, 289881, 260899, 282352, 273781, 289311, 304383, 289378, 328215, 312156, 368551, 376023, 322732, 368747, 343629, 349713, 354046, 344630, 347815, 377735, 430863, 490535, 501305, 527520, 548088, 558479, 569606, 544074, 532322, 480671, 484408, 396820, 413748, 446365, 431135, 372079, 348505, 334133, 319107, 323082, 285100, 314464, 334512, 328227, 311582, 315615, 300532, 311989, 326438, 327747, 338670, 296253, 284287, 286995, 291847, 278071, 273234, 318222, 311483, 293628, 287007, 321383, 318464, 302748, 287626, 303193, 291802, 283832, 277251, 279691, 312281, 285792, 312654]
5224C12654j5470k6459L615L247j1639P060j3876j3396K9702M1291q119L9099
5212C47709l8930J103P906m2841K0464K5012M995K0803j0662J2451J1670l1902
5200C27778N403J3923j6187J1281J3422l6136q934L5697K810q374R555P15m656
5187C46297k3124J4851L7401p209o432l0921L4371l2659L1857k7846j041O8485
5175D04030J9451n602l843L473L2965R283m2750L563N765M4726p7723K6822j42
5162D20018L5870k7480j6442n440M8382j792L3629N665q229J9242K5047j7143
5150E11327j2600K4491k8866k92M205n220N829L1453R751J0551M3725J9910k0238
5137E94026k9731K1313K9935o637p198j0319O728q427K7351N2510N595k5447j3467
$$ y = [312654, 297184, 270725, 274340, 277587, 265948, 273008, 259132, 245736, 275438, 316729, 308610, 347709, 308779, 309882, 317788, 274947, 295411, 320423, 325418, 346221, 335559, 348010, 359680, 327778, 333181, 347104, 330917, 342198, 355620, 319484, 310550, 346247, 349057, 340683, 350238, 350953, 346297, 323173, 338024, 375425, 368216, 361784, 330863, 365234, 332575, 364432, 336586, 335545, 404030, 423481, 417879, 414036, 417509, 450474, 459757, 417007, 420570, 426335, 471061, 393338, 420160, 420018, 455888, 428408, 411966, 406526, 454908, 453116, 486745, 492410, 484181, 503423, 528470, 511327, 498727, 523218, 494352, 494060, 498265, 493045, 498874, 530327, 540078, 550629, 594354, 614264, 594026, 564295, 585608, 615543, 608906, 601708, 591389, 598117, 589690, 617041, 669551, 675146, 649699, 636232]
5124F36232K6344K7044J1946M510M3767j9976K2389J5280k5363P338P0934M0619
5112H61064L0848M1913J4331N017j4588n170L9340N4488M7009L6462N3583J8330
5100A182627L4741P9081K2187O1219M6032O3215P9726O8658R3905P2400O5051
5089A868842J31497J31877J25646J24299J82721K24267K17048K20161L01901K65451
5079C793710K07697K00201J85116J65256R6496J26210J56666J60679J86732K84987
5069E563750K68992L05556L48577L47752L85524L88746N15589N52994N49636O92633
5059I919749O92260Q35009R24903R68149J115599J285310J526982J701998K051287
5050B1021246K632276L422848M263820N411265P101530Q828889Q358803K313510
$$ y = [636232, 662576, 689620, 701566, 706076, 749843, 729867, 752256, 767536, 742173, 749511, 820445, 861064, 891912, 933825, 948156, 953173, 938585, 933415, 972755, 1027243, 1074252, 1110714, 1164297, 1182627, 1217368, 1296449, 1318636, 1379855, 1425887, 1489102, 1568828, 1637486, 1731391, 1803791, 1868842, 2000339, 2132216, 2257862, 2382161, 2564882, 2789149, 3006197, 3226358, 3528259, 3793710, 4001407, 4201608, 4386724, 4551980, 4648476, 4774686, 4931352, 5092031, 5278763, 5563750, 5832742, 6138298, 6486875, 6834627, 7220151, 7608897, 8124486, 8677480, 9227116, 9919749, 10612009, 11447018, 12371921, 13340070, 14455669, 15740979, 17267961, 18969959, 21021246, 23653522, 27076370, 31340190, 36751455, 43852985, 52681874, 61040677, 63354187]
5042F3354187n305262q396298q032217o658288n725831m638956l636332k947191
5034A8013812k372678j936080j506450j214131j098332q87026p24357o40515n73658
5025G060585m67356m15879l76538l17137l11365l25474l01999k28852k18790j99089
5015C898106j90668j52043j59458j67698j13889j57318j14288j04313q4131j17136
5005B537164q9168n7528m5120m3329q1236q5837m7872K330l8182l2726l4545o0174
4993A923777n5115k4878K9879J7793j371k6821L8790J4665r311P0017J1431M1
4981A988897M2487R7923K4957K5618Q6970J00032J10504J58439K04502J91536
4971C031865J84394K84069L30243L84727K52863P8241j26913k10502k11348k14858
$$ y = [63354187, 58048925, 49652627, 41620410, 34962122, 29236291, 24597335, 20961003, 18013812, 15641134, 13705054, 12198604, 10984473, 9886141, 8999115, 8274758, 7634243, 7060585, 6593229, 6177350, 5800812, 5483675, 5172310, 4846836, 4544837, 4315985, 4097195, 3898106, 3707438, 3555395, 3395937, 3228239, 3114350, 2957032, 2842744, 2738431, 2654300, 2537164, 2447996, 2390468, 2345348, 2302019, 2220783, 2134946, 2087074, 2089404, 2051222, 2018496, 1983951, 1923777, 1868662, 1843784, 1873663, 1891456, 1890085, 1863264, 1902054, 1916719, 1907408, 1977425, 1988856, 1988897, 2031384, 2129307, 2154264, 2179882, 2266852, 2366884, 2477388, 2635827, 2840329, 3031865, 3216259, 3500328, 3830571, 4215298, 4468161, 4546402, 4419489, 4208987, 3997639, 3782781]
4961C782781j21346j09221n3776J8298R1508R8695J01209J85552K93483M15427
4951D702610M41160M61503L65670J70474p4775m00863n13825m94269m11324l89676
4941C856685k93254j79810j84814k10949o6074P211j8495O5258Q9930J88835J57643
4930C412166J54193o7780k21882l37897l27580k54922k75686k24377j64454j52387
4920A539394r5030j03746o4320q8805j1984n3010m4517j2310l6389m1960l7243
4909I50080l5525o1676l3663m8402o922j369o0753k0694n283k2374R663j7627
4897F45455n669n5309N87j0465k1889j8665j6749k7187K4861J1778l1967k1170
4885D73611P094J8484j9301J3772l221J510M7493l6091N1813L990k0414J414j7934
$$ y = [3782781, 3661435, 3552214, 3498438, 3516736, 3608244, 3706939, 3808148, 3993700, 4287183, 4702610, 5143770, 5605273, 5970943, 6141417, 6066642, 5665779, 5151954, 4657685, 4246361, 3856685, 3563431, 3383621, 3198807, 2987858, 2921784, 2928995, 2910500, 2975758, 3065688, 3254523, 3412166, 3566359, 3498579, 3276697, 2938800, 2611220, 2356298, 2080612, 1856235, 1691781, 1539394, 1444364, 1340618, 1276298, 1187493, 1175509, 1122499, 1077982, 1065672, 1029283, 987323, 950080, 914555, 852879, 819216, 770814, 763892, 762523, 701770, 681076, 675793, 653419, 663082, 645455, 639786, 584477, 585064, 574599, 552710, 534045, 517296, 490109, 514970, 526748, 494781, 473611, 480705, 499189, 479888, 493660, 490439, 491949, 539442, 503351, 555164, 559154, 538740, 540154, 522220]
4872E22220K5583p707j6871K113k8706K2675k3408l182j158L1579l624K036m2014
4859D79536J9067L735J5312k1910m8108J7372M405k3193n2092K2433J3089M3650
4847D73296n8801q321O3811L7821n6922j0675J6512n740N669j4881l6146J0272
4835D15895l767J9588J1601Q793r543m568l4711L1086K1112K2178J0360N261q255
4822D85030J4432o689J6356L2538L2618k4292K0305O0654M1426K1351k8344R56
4810F66341m2968o3116n39l5811k4286j9093m4792L3939k6380l7967j3865j2012
4798C79451q89O1809m1284j35j8226J8242J7461Q388m8527j083J9036m1277K2426
4785C75392m788m7731K6734k8110R097j7758K1771K1632k6267J8511J0736o074
$$ y = [522220, 547803, 540096, 523225, 525338, 496632, 519307, 495899, 492717, 491559, 523138, 519514, 521550, 479536, 498603, 502338, 517650, 495740, 447632, 465004, 469409, 446216, 394124, 416557, 429646, 473296, 414495, 406174, 469985, 507806, 450884, 440209, 456721, 450981, 456650, 441769, 405623, 415895, 412128, 431716, 443317, 452110, 442567, 437999, 403288, 434374, 455486, 477664, 488024, 493285, 485030, 499462, 492773, 509129, 541667, 574285, 549993, 570298, 630952, 672378, 693729, 665385, 666341, 623373, 560257, 559718, 523907, 499621, 480528, 435736, 469675, 443295, 405328, 391463, 379451, 378562, 440371, 399087, 398952, 380726, 398968, 416429, 424817, 376290, 375207, 394243, 352966, 375392, 370604, 322873, 349607, 321497, 330594, 312836, 334607, 356239, 329972, 348483, 359219, 353145]
4773C53145j848J32l298m0256j0456K7730o51p707j3719M707q024L8195J0265
4760C48215k4942k3377l17L1013K3261j1323L967L2236k964k3628J1949o705j9420
4747C37965K8400L1836l1185J3057J4967j7539J833J2180L15J8118q859r150J5061
4734D06999j120k5390K8296J7315k6124J5048K1014k089K2168k0072k1723K5446
4722D39768Q751P122J4576L707k2143J6859M7266k7701j1868K0699k6734j256
4710D69046J6602j122N996L631M1698j9944l2506J9268J8393J2216O131J9841
4698E59250r521l4245p173L9335M0062K2826l4936Q662k2623J3791M9176j5002
4686F09602Q182J8883k0560P627M0341L515r042M3492K3464k8703P547R809N0942
$$ y = [353145, 351297, 351429, 348131, 307875, 297419, 325149, 324498, 316791, 303072, 307779, 299755, 337950, 348215, 323273, 299896, 299579, 330592, 353853, 342530, 346497, 378733, 375769, 352141, 364090, 357385, 337965, 366365, 398201, 367016, 380073, 395040, 377501, 379334, 391514, 391829, 409947, 401088, 391938, 406999, 405879, 380489, 408785, 426100, 399976, 415024, 436038, 433949, 456117, 436045, 414322, 439768, 448519, 455641, 470217, 473924, 451781, 468640, 515906, 488205, 476337, 497036, 470302, 469046, 485648, 484526, 490522, 494153, 535851, 515907, 483401, 502669, 521062, 533278, 539409, 559250, 549729, 515484, 508311, 547646, 587708, 610534, 575598, 584260, 561637, 575428, 624604, 609602, 617784, 636667, 616107, 623734, 664075, 667590, 658548, 702040, 725504, 696801, 704348, 714157, 765099]
4673G65099J4990k1388J8080l27L6700M9886K3165K9932N151k0558L3654L1927
4661I66311J7717K2860L3585P1677L1177L6789N5797R192N8294N5103O4474J10477
4649A533453L1403O6309Q8827Q2194J11180O3762J30771J04161N1593J37584J20082
4638B521319J42084J37025J93586J60359J90804J90361K58535K00142K22281K94263
4628D510759L05647L09989L11372L04478K83443M01412M70683N04776N30723N66171
4618H499453O17669O10258N59583M93226M43041N02449N41284O43610O69222Q29375
4608A4409170Q90818Q58923P67031N86226L72761J94950J51139K10284L32310
4599A8773612M20517N71127N89136N68991L15464M0303k45422m51281n52700m60668
$$ y = [765099, 780089, 758701, 776781, 776454, 813154, 863040, 886205, 916137, 921288, 900730, 934384, 966311, 984028, 1006888, 1040473, 1112150, 1143327, 1180116, 1235913, 1245105, 1303399, 1358502, 1422976, 1533453, 1564856, 1631165, 1719992, 1802186, 1913366, 1977128, 2107899, 2212060, 2263653, 2401237, 2521319, 2663403, 2800428, 2994014, 3154373, 3345177, 3535538, 3794073, 3994215, 4216496, 4510759, 4816406, 5126395, 5437767, 5742245, 6025688, 6427100, 6897783, 7402559, 7933282, 8499453, 9117122, 9727380, 10286963, 10780189, 11223230, 11725679, 12266963, 12910573, 13579795, 14409170, 15299988, 16158911, 16925942, 17512168, 17884929, 18079879, 18231018, 18441302, 18773612, 19194129, 19765256, 20354392, 20923383, 21238847, 21279150, 21033728, 20582447, 20029747, 19569079]
4589A9569079l49117k83089j35276r1230j61163l20866n17036o92778q11962q74695
4579A5331867p78783p09312o05459n42253m41771m04286m81938n51530o31141
4570A0185394o91041o21903o47085m91353m39592m02955l42078l04835l00505
4561E944047l31492l60196l57768l31662l34350k27729k38356k04695j53762j88291
4551C215746j32674k05141j61983j52084j15363j44731q2672j35777j01852p5025
4541A908444r4615m5521j01551p0535r6915j6954o6359r2520m0671l7642m5264
4530A199897j0574l2684m0956j6640k5580m9436L793l6019k1348l351l8208j2537
4518I16357j1480j4271j5647k2777K0333k6893q2276K1031K5540n2590K4689q445
$$ y = [19569079, 19219962, 18936873, 18801597, 18710367, 18549204, 18228338, 17711302, 17018524, 16206562, 15331867, 14553084, 13843772, 13238313, 12696060, 12254289, 11850003, 11368065, 10816535, 10185394, 9494353, 8872450, 8225365, 7734012, 7294420, 6891465, 6549387, 6244552, 5944047, 5612555, 5252359, 4894591, 4562929, 4228579, 4000850, 3762494, 3557799, 3404037, 3215746, 3083072, 2877931, 2715948, 2563864, 2448501, 2303770, 2221098, 2085321, 1983469, 1908444, 1813829, 1768308, 1666757, 1596222, 1499307, 1482353, 1415994, 1323474, 1282803, 1245161, 1199897, 1189323, 1156639, 1115683, 1099043, 1073463, 1024027, 1027820, 991801, 970453, 967102, 928894, 916357, 904877, 890606, 874959, 852182, 872515, 845622, 763346, 784377, 809917, 757327, 782016, 773571]
4506G73571K554K412m9444m902M324l0209m812j5443j8955L531j5070j4811K0606
4493F53352j5101l3358O665K1314m2715j1042r93K2840O612K745n956R11L56k4473
4479E81157o334j8282q113M1995j7195j3492m3166K8941M4452r935K4023n384
4467E98667J8652p5952k2871J8652L9279M727k408R69l1664L821L4977k646k6787
4454E57416k0388M9176J2554j0554Q854m7236M327J1201P319N853j5630J1282
4442E74174L4353l7231M1057j2739J3795K5656P791L3150N698j4522m925N1058
4430G17315J9415L1864j1167L388J9243K1930K5418J4880N095J2731l3971J024
4418H27165L4081K9274l7141j5604J1579P084l0377j9067n146k2035J7092L9935
$$ y = [773571, 776125, 778537, 729093, 724191, 728515, 698306, 693494, 678051, 659096, 662627, 647557, 632746, 653352, 638251, 604893, 611558, 632872, 590157, 579115, 578122, 600962, 607574, 610319, 604363, 605274, 605630, 581157, 574823, 556541, 548428, 590423, 573228, 559736, 516570, 545511, 589963, 580028, 604051, 598667, 617319, 541367, 518496, 537148, 576427, 581154, 578746, 579715, 548051, 551872, 586849, 584203, 557416, 537028, 586204, 598758, 588204, 597058, 549822, 554149, 565350, 572669, 578522, 562892, 574174, 608527, 571296, 612353, 599614, 613409, 639065, 646856, 680006, 685704, 671182, 666257, 717315, 736730, 768594, 757427, 760815, 780058, 801988, 827406, 842286, 847381, 860112, 826141, 827165, 861246, 890520, 853379, 837775, 849354, 856438, 826061, 806994, 801848, 779813, 796905, 836840]
4406H36840n8410k0032j9897j8154K454p658K1409K0670j0852J0869k209J77k5693
4393G29514K1388o691P516j2658p978K9762J041N531j2550O583Q321N1510k146
4380H19143R33O842L9505j5097o554j244m329K9591R291K5975k8460j6490J4009
4367H73115N3610k394j0841N764j3411N0948K1315j518l9256J3169j1995M7206
4355I85712j1456l7229q96J9600J4514k0522J3829J7640M4309K1457m1484R978
4343A015452K3218K6343j3518k499J1687m72K6058M318m070P0863n862K3518K2516
4330A197552N572k7235L3533O2444L1425N807l7647m032N0730K8135M036J3666
4318A363986j8610K7839l540K1405K6123M430m069J8881K5356L5366N156l326
$$ y = [836840, 778430, 758398, 738501, 720347, 722801, 715143, 736552, 757222, 746370, 757239, 755030, 755207, 729514, 750902, 744211, 751727, 739069, 731091, 760853, 761894, 767425, 754875, 761458, 769779, 821289, 819143, 820076, 826918, 866423, 851326, 844772, 843528, 839199, 868790, 878081, 904056, 875596, 859106, 873115, 926725, 924331, 913490, 919254, 905843, 956791, 978106, 976588, 937332, 950501, 938506, 985712, 974256, 937027, 936131, 955731, 970245, 949723, 963552, 981192, 1025501, 1046958, 1005474, 1015452, 1038670, 1065013, 1051495, 1048996, 1060683, 1060211, 1086269, 1090587, 1086517, 1157380, 1151518, 1175036, 1197552, 1203124, 1175889, 1209422, 1271866, 1303291, 1309098, 1271451, 1267419, 1318149, 1346284, 1350320, 1363986, 1345376, 1373215, 1369675, 1391080, 1417203, 1421633, 1417564, 1436445, 1461801, 1497167, 1502323, 1498997]
4306A498997J5744L7006K8306L0332q992K4681p79N8474M2696N6043K4029J6505
4294A823042L9943J1932O8020M2520L0463P3226N5864M0650N7664K6309M6628
4283B316261P095J2780R0136j2213M940L9728L9928L3944O0650L3821J02873L8766
4271B768709L7235N9365O9004N3128J0959M0689N9740P2480O3810R3895L9451
4260C368465R7670R1633J32188R7010J42351J24469J49874K44211J99095J94095
4250D841061K49781K59412K70233K42371K47966L08050K61449L11539L23628K98064
4240G613554L20848L71250L93848L40649M24988M35145M62307M49337M84400N43550
4230A1839876N83102N87057P14789P13200P70301Q79463J025191J128741J307540
$$ y = [1498997, 1514741, 1551747, 1580053, 1610385, 1601393, 1626074, 1625295, 1683769, 1726465, 1782508, 1806537, 1823042, 1862985, 1874917, 1942937, 1985457, 2015920, 2089146, 2145010, 2185660, 2243324, 2269633, 2316261, 2323356, 2336136, 2426272, 2414059, 2418999, 2458727, 2498655, 2532599, 2593249, 2627070, 2729943, 2768709, 2805944, 2865309, 2934313, 2987441, 2998400, 3039089, 3098829, 3171309, 3235119, 3329014, 3368465, 3466135, 3557768, 3689956, 3786966, 3929317, 4053786, 4203660, 4447871, 4646966, 4841061, 5090842, 5350254, 5620487, 5862858, 6110824, 6418874, 6680323, 6991862, 7315490, 7613554, 7934402, 8305652, 8699500, 9040149, 9465137, 9900282, 10362589, 10811926, 11296326, 11839876, 12422978, 13010035, 13724824, 14438024, 15208325, 16087788, 17112979, 18241720, 19549260]
4221A9549260J474828J676647J926568K199893K555728K909140L246469L513231
4213C9051764L612141L367071K962559K220954J410722P01234J31004l99169m60470
4204E2597810m21247k55931j17706k02084m71561r59863j601701k268252k846337
4195D3453128l321312l550223l504425l345823l059397k679632k375771k016943
4187A9599602j715383j427889j296623j059753r33696q20931o67686o16128n08090
4178A0553423m46683m34893l75478l07479k80542k63581k32972k21291k15953
4169G774551j85398j51215j11775j29551j48016j32271o2763j03298r7454n6624
4159F596186n5459j7486r0935n9552L622k5133K131K1144k9493J3505R4554M1443
$$ y = [19549260, 21024088, 22700735, 24627303, 26827196, 29382924, 32292064, 35538533, 39051764, 42663905, 46030976, 48993535, 51214489, 52625211, 53326445, 53457449, 53058280, 52597810, 52176563, 51920632, 51802926, 51600842, 51129281, 50169418, 48567717, 46299465, 43453128, 40131816, 36581593, 33077168, 29731345, 26671948, 23992316, 21616545, 19599602, 17884219, 16456330, 15159707, 14099954, 13166258, 12345327, 11677641, 11061513, 10553423, 10106740, 9671847, 9296369, 8988890, 8708348, 8444767, 8211795, 7990504, 7774551, 7589153, 7437938, 7326163, 7196612, 7048596, 6916325, 6853562, 6750264, 6652810, 6596186, 6540727, 6523241, 6432306, 6372754, 6376376, 6351243, 6353374, 6374518, 6345025, 6358530, 6453084, 6494527]
4147F494527O2634O4633O9353O3687J02248P7970R3894Q9988J09545R5314J40195
4136G463988J89539J79105J69029K01273K54221K68591K82618L06130L67895M04929
4126A0087318M70288N09008N81083O52695P59752Q82735R83820J027905J063421
4117A7018025J082164J095133J125903J013358R67662R06549Q40977O83050M82333
4108B5215154K78132R61k27131m11998n35216n73365n89165n84757m77215l16261
4098B1779139k21798j00333O0851K05688L50211M45494N81735O88956P87296Q60677
4088B5437916J045686J144131J300905J507883J688790J910442K200038K507025
4080C8742816K879678L337196L831156M357503M909682N298607N540593N438784
$$ y = [6494527, 6557161, 6621794, 6691147, 6754834, 6857082, 6935052, 7028946, 7118934, 7228479, 7323793, 7463988, 7653527, 7832632, 8001661, 8202934, 8457155, 8725746, 9008364, 9314494, 9682389, 10087318, 10557606, 11066614, 11647697, 12300392, 13060144, 13942879, 14926699, 15954604, 17018025, 18100189, 19195322, 20321225, 21334583, 22302245, 23208794, 24049771, 24732821, 25215154, 25493286, 25494247, 25267116, 24855118, 24319902, 23746537, 23157372, 22572615, 22095400, 21779139, 21557341, 21457008, 21517859, 21723547, 22073758, 22519252, 23100987, 23789943, 24577239, 25437916, 26483602, 27627733, 28928638, 30436521, 32125311, 34035753, 36235791, 38742816, 41622494, 44959690, 48790846, 53148349, 58058031, 63356638, 68897231, 74336015]
4072G4336015M987498M242611L257337K214744J259336M26015j96311n66017p04666
4063H9256562n31964l42452q2063J34021J89617J29706k02167p16326j291160
4054H6543774j971828k493268k988081l407179l679101l788674l757775l559213
4046F0898655l324283k910192k522256j993516j504018j069144o15428k47459
4038D6712359K48080N97668J068762J458085J908401K378269K918266L505865
4030F0795755L974460M457162M727334M901867M937996M697954M357427M071640
4022I6921595L778236L597610L356441L046738K749218K164253J432807L93235
4014A17440133p14499j733079k599166l223276l684339m042382m303352m460362
$$ y = [74336015, 79323513, 83566124, 86823461, 89038205, 90297541, 90723556, 90527245, 89961228, 89256562, 88724598, 88382146, 88300083, 88434104, 88623721, 88753427, 88551260, 87834934, 86543774, 84571946, 82078678, 79090597, 75683418, 72004317, 68215643, 64457868, 60898655, 57574372, 54664180, 52141924, 50148408, 48644390, 47575246, 46959818, 46712359, 46960439, 47558107, 48626869, 50084954, 51993355, 54371624, 57289890, 60795755, 64770215, 69227377, 73954711, 78856578, 83794574, 88492528, 92849955, 96921595, 100699831, 104297441, 107653882, 110700620, 113449838, 115614091, 117046898, 117440133, 116725634, 114992555, 112393389, 109170113, 105485774, 101443392, 97140040, 92679678]
4006I2679678m626923m778234m826204m836611m795687m587640m280062l862380
3998E6085937l389125k993063k671502k402147k249622k117285k029258j906186
3990C6327749j738633j520872j297517j008837p90770o68683n46921m45507k21830
3981B8088179r6519Q4851J41791Q7377O9366K4060j13653k67569l72365m40911
3971B7204607m64965n07953n01336m73097m32008m13630m44658m38401m78172
3962B3050387n30870q44215j127342j103940r72423q18871o53841o91391q28517
3953A5478977q76027p23251o00260n14295m29673k82077k61348k18719j22484
3944A1450843l4L9830P6161J21350K18860K78344L16272K69407K64672L04659
$$ y = [92679678, 88052755, 83274521, 78448317, 73611706, 68816019, 64228379, 59948317, 56085937, 52696812, 49703749, 47032247, 44630100, 42380478, 40263193, 38233935, 36327749, 34589116, 33068244, 31770727, 30761890, 29971120, 29302437, 28755516, 28310009, 28088179, 27991660, 28076511, 28218302, 28305679, 28375045, 28399105, 28285452, 28017883, 27645518, 27204607, 26739642, 26231689, 25730353, 25257256, 24825248, 24411618, 23966960, 23528559, 23050387, 22519517, 21675302, 20547960, 19444020, 18471597, 17652726, 16998885, 16307494, 15478977, 14602950, 13879699, 13279439, 12765144, 12335471, 12053394, 11792046, 11573327, 11450843, 11450809, 11490639, 11566800, 11688150, 11907010, 12185354, 12501626, 12771033, 13035705, 13340364]
3934A3340364J49750M7134M5006J17313K08402K26615K06756K89680L18317L40551
3924A5289888L61727L91125K54903K45978K40328K75579K97091M35535N42810
3915A8334964O52691P86634R15378J000199J146430J252411J536239J754101K020154
3906B9399201K376159K712709L189733L689915M230438M707523N107556N174035
3898F0587269M902892M234717L070383J624297K068j755575l345839m488369n255309
3889E9576534n507536n329674m836002m316524l726379l174016k691320k237015
3881B7758068j854455j641052j391753j254617j163767j049801q92941q04746
3873A7704936p50884p49528p03574p24750p59200p29220p05448p06048p19592
$$ y = [13340364, 13490114, 13537248, 13582254, 13699567, 13907969, 14134584, 14341340, 14631020, 14949337, 15289888, 15651615, 16042740, 16297643, 16543621, 16783949, 17059528, 17356619, 17792154, 18334964, 18987655, 19774289, 20689667, 21689866, 22836296, 24088707, 25624946, 27379047, 29399201, 31775360, 34488069, 37677802, 41367717, 45598155, 50305678, 55413234, 60587269, 65490161, 69724878, 72795261, 74419558, 74421626, 72666051, 69320212, 64831843, 59576534, 54068998, 48739324, 43903322, 39586798, 35860419, 32686403, 29995083, 27758068, 25903613, 24262561, 22870808, 21616191, 20452424, 19402623, 18509682, 17704936, 16954052, 16204524, 15500950, 14776200, 14017000, 13287780, 12582332, 11876284, 11156692]
3864A1156692o87632n85223n01363m57256l76155l53683k98836k98481k45457
3855G352606j95187k10720j48412j96290k08798j35087j64787j51653j40108j07731
3845E693833p0415j10931r4963o4656q8954n9560q126o0910j19490l1770m7334
3834D936724k2021p3057k1476m8576n3003j4937o6491q3511q6140j8357m7352
3823D401803n7063k7961m2664j079l3710j9655k3385L9087J8460J7722k7829N0582
3811D294308j6840K7584P1507m259l0134N8419K5124n878k7885K6215L2510K2688
3799D473359J6768M691l78K236l524J5180M0507J892K3259O1881K1793K0757K5647
3786D704068K9244L5084L1249J06741O9272O6451Q0940J19838J31045J40441R2669
$$ y = [11156692, 10469060, 9883837, 9382474, 8925218, 8549063, 8195380, 7896544, 7598063, 7352606, 7157419, 6946699, 6798287, 6601997, 6393199, 6258112, 6093325, 5941672, 5801564, 5693833, 5623418, 5512487, 5417524, 5352868, 5263914, 5204354, 5196228, 5135318, 5015828, 4984058, 4936724, 4914703, 4841646, 4820170, 4771594, 4718591, 4703654, 4637163, 4553652, 4467512, 4449155, 4401803, 4344740, 4316779, 4274115, 4273036, 4239326, 4219671, 4196286, 4235373, 4253833, 4271555, 4243726, 4294308, 4277468, 4305052, 4376559, 4372300, 4342166, 4400585, 4425709, 4419831, 4391946, 4418161, 4450671, 4473359, 4490127, 4494818, 4494440, 4496676, 4493152, 4508332, 4548839, 4550731, 4573990, 4635871, 4657664, 4678421, 4704068, 4733312, 4768396, 4799645, 4906386, 4975658, 5042109, 5123049, 5242887, 5373932, 5514373, 5607042]
3775E607042J83723J80898J83804J60815J77448K24940J85802K59067K75084K60733
3765G699356K95356L24556L02277L80093L88041M53844M84433M80203N97781O37883
3755A2043823P47833Q55929R74293J173817J300195J321506J275762J035511R29060
3746B1657729R32233Q76029P42656P11782Q21331R29226J091792J216051J400610
3737C0379439J641155J815234K007585K145252K199368K377193K629445K892737
3729D8087408L236014L598105M072057M502916N042538N630244O481813P528329
3721H8179424Q762035J0368089J2316770J4892550J8289843K2692766K8239051
3714B03740528L3210800L2044634J6950353p576396k5807027l1639226k9826740
$$ y = [5607042, 5790765, 5971663, 6155467, 6316282, 6493730, 6718670, 6904472, 7163539, 7438623, 7699356, 7994712, 8319268, 8621545, 9001638, 9389679, 9843523, 10327956, 10808159, 11405940, 12043823, 12791656, 13647585, 14621878, 15795695, 17095890, 18417396, 19693158, 20728669, 21657729, 22589962, 23465991, 24208647, 24920429, 25741760, 26670986, 27762778, 28978829, 30379439, 32020594, 33835828, 35843413, 37988665, 40188033, 42565226, 45194671, 48087408, 51323422, 54921527, 58993584, 63496500, 68539038, 74169282, 80651095, 88179424, 96941459, 107309548, 119626318, 134518868, 152808711, 175501477, 203740528, 236951328, 268995962, 285946315, 278369919, 252562892, 220923666, 191096926]
3707A91096926k5662465k1203182j6965273j3651437j1033094q586734o320002
3700H7674739m179998k317121j207913k000242m420210o361490o768948o258658
3692E4160159n484085m694711l971803l394441l022269k603454k267500k069832
3684B6652064j756629j561231j402126j278485j205997j104751r56075q76935
3676A6509835q34838p72656p58203o71715o25130o07526n46171n00074m46535
3667A0746987m75248m34304m00290l82340l34260l00266k38004k67584k01771
3658G712920j64086j35963j40757j11419j75299k51022k81624l26860l47298k25919
3648E552673k13895k17945k04324j95825j60291j43850j18756j36733j58080r5458
$$ y = [191096926, 165434461, 144231279, 127266006, 113614569, 102581475, 93994741, 87674739, 83494741, 81177620, 79969707, 77969465, 73549255, 67187765, 60418817, 54160159, 48676074, 43981363, 40009560, 36615119, 33592850, 30989396, 28721896, 26652064, 24895435, 23334204, 21932078, 20653593, 19447596, 18342845, 17386770, 16509835, 15674997, 14902341, 14144138, 13472423, 12847293, 12239767, 11693596, 11193522, 10746987, 10271739, 9837435, 9437145, 9054805, 8720545, 8420279, 8182275, 7914691, 7712920, 7548834, 7412871, 7272114, 7160695, 6985396, 6734374, 6452750, 6125890, 5778592, 5552673, 5338778, 5120833, 4916509, 4720684, 4560393, 4416543, 4297787, 4161054, 4002974, 3907516]
3638C907516j42384j83581j11306p1278j28955j06939r8475r0311r2515j07601
3628B774171l3567j23811o8337l6133r2218n8523p9811j06077p3668n3008n3556
3617A995462m7650j9766o4917j02299l1974p409m0251n3590l1683k6945m7345
3606A521633k2992l7427k8966M857l3924l3784N0662n9516k7242l4950k4883k1273
3594A252195n0387n1541l1084l8873j4498k5019l7519j6263L5636j1562Q198n812
3582A013471k4065L9020l7332J040L3281K9469J9669L793k1907Q347m5773j1731
3570A007282k5009m7141n6576j9669j650k9505K766p0557n3717J2714q866k7014
3558F83058j8306j2125l391o137k7947L237k871j7017k854l9235K5518j997m763
$$ y = [3907516, 3765132, 3581551, 3470245, 3398967, 3270012, 3163073, 3064598, 2974287, 2881772, 2774171, 2740604, 2616793, 2548456, 2512323, 2420105, 2361582, 2281771, 2175694, 2102026, 2049018, 1995462, 1947812, 1928046, 1863129, 1760830, 1728856, 1721447, 1681196, 1627606, 1595923, 1568978, 1521633, 1498641, 1461214, 1432248, 1437105, 1403181, 1369397, 1420059, 1360543, 1333301, 1298351, 1273468, 1252195, 1201808, 1150267, 1119183, 1080310, 1065812, 1040793, 1003274, 987011, 1022647, 1011085, 1019283, 1013471, 989406, 1028426, 991094, 992134, 1025415, 1054884, 1074553, 1078346, 1056439, 1064786, 1019013, 1007282, 982273, 935132, 878556, 858887, 857237, 827732, 830498, 759941, 706224, 718938, 710072, 683058, 664752, 652627, 649236, 643099, 615152, 618389, 615518, 598501, 595647, 556412, 581930, 579933, 575170]
3545E75170K8459k2523k9655Q823M0354q360n8084k7256m406J1874o479j939q811
3532D97167J9498R190L848j754P989k0612p191Q936Q412K071m215q326j53K3468
3518E38328K5957P350k5245Q475N7559J0093J2680O5392P4826m855L0648R6471
3506H97679L4347Q8316Q9291J03298J33620J53002J67946J6469r7779j20009j43715
3495A322465j12008r2918j49917j26843n7815p4548L340n9521l2405j3873j7304
3484E88653K3574o8264q7061m795n3982k3107l1573l069k2498j3435j1411N5629
3472C48661n1505m7208j6004j6407O514j1317L388k6898L6270j6242q644K6573
3460B27181L5869k9611j7875J1917l4789l5131M3016m779k2291m5938K2146L3986
$$ y = [575170, 603629, 581106, 551451, 560274, 600628, 592268, 534184, 506928, 502522, 514396, 507917, 505978, 497167, 516665, 525855, 529703, 527949, 535938, 515326, 508135, 517071, 525483, 527554, 523339, 515013, 514860, 538328, 564285, 571635, 546390, 554865, 612424, 622517, 635197, 700589, 775415, 770560, 801208, 897679, 932026, 1020342, 1109633, 1212931, 1346551, 1499553, 1667499, 1683968, 1586189, 1466180, 1322465, 1210457, 1117539, 967622, 840779, 782964, 708416, 711756, 652235, 619830, 605957, 588653, 612227, 543963, 456902, 452107, 398125, 375018, 343445, 340376, 317878, 304443, 293032, 348661, 297156, 249948, 233944, 217537, 224051, 212734, 216122, 189224, 225494, 209252, 200608, 227181, 263050, 233439, 215564, 227481, 192692, 157561, 200577, 195798, 173507, 127569, 149715, 183701]
3448A83701k3310k7875l9146p45J9944Q243K9537j6528j7657j5088k1539M042
3436H3579m830N3399j9560j2971k2540k5363K8039K1741j2211j1233J5308m6508
3424D6850R567j7504J8249o297m523p862l262J2167P396J7902N162k6669m1021
3411A0155K7401k1922K7278L6143k997l1950J5519k253M79J9791o044j8625J2280
3398F5255o72n2791J0044j7620j1661O9401J436k5264k3868n781J2421m1229N865
3385a4464L2214l1631J8541J6202o143j3441k918N765J6382q319r610L364M6630
3372E2572J9525j3216k8263n4999K0360j008l80K3721K1840j8661k5098j6937
3360b0544M7956J524j4371N81o522J6533J7470j3097m1737m0366O182N3960R353
$$ y = [183701, 160391, 132516, 93370, 92625, 112569, 120812, 150349, 133821, 116164, 101076, 79537, 83579, 78749, 132148, 112588, 99617, 77077, 51714, 79753, 101494, 89283, 78050, 93358, 46850, 56417, 38913, 57162, 50865, 46342, 38480, 35218, 47385, 54781, 72683, 77845, 51176, 10155, 37556, 15634, 42912, 79055, 76058, 44108, 59627, 57374, 57853, 77644, 71600, 52975, 65255, 64583, 11792, 21836, 4216, -7445, 61956, 63392, 38128, 14260, 8479, 20900, -20329, -14464, 17750, -13881, 4660, 20862, 14719, 1278, -1640, 4125, 20507, 12188, 2578, 5942, 52572, 72097, 58881, 30618, -24381, -4021, -5029, -5409, 18312, 40152, 21491, -3607, -20544, 27412, 28936, 14565, 15146, 8624, 25157, 42627, 29530, -12207, -52573, -46391, 7569, 16922]
3347A6922j0132L1217l8086J5888l5734J2501K5706J879j8402O928L71j3746K4331
3334A9643n474Q360n4366L750n646M1161O00o854m155J4099j2634M1640m4364
3321d240l2173K7819L804Q100o805j7071J104L782J640k9702p72O6436k7848n0147
3307e6073K8110L508l567j391K370M3355j9423j6672l968K1314l0k2643J3334
3294a1776K8373m4046J6477K320j3880m767m22j6776L5504L471j8861r555l3431
3281f7369j0344M8382J8674k0214l6237K9727M939j2092L1379l433K4932l2039
3269b3695j3329o854J0351k6854K1410N826l977m752K003L7834l1711J14N4083
3256B0449k2731j967J1605R619m0478p317K6895l1139K124K1249q832J745N882
$$ y = [16922, 6790, 38007, -79, 15809, -19925, -7424, 18282, 20161, 1759, 8687, 9058, -4688, 19643, 14169, 22529, -31837, -28087, -33733, 7428, 8028, 1174, -2981, 11118, -1516, 40124, -4240, -36413, -8594, -4790, 3310, -3495, -20566, -19462, -15680, -14040, -43742, -44514, 21922, -5926, -56073, -27963, -24455, -28022, -29413, -27043, 16312, -3111, -19783, -23751, -2437, -2467, -25110, -11776, 16597, -27449, -10972, -8652, -22532, -27299, -27721, -44497, -8993, -5522, -24383, -33938, -67369, -77713, -29331, -10657, -30871, -67108, -37381, -32442, -44534, -13155, -16588, 8344, -23695, -37024, -43878, -33527, -60381, -38971, -33145, -37122, -41874, -39871, -2037, -33748, -33634, 20449, -2282, -4249, 7356, 16975, -23503, -30820, -3925, -35064, -32940, -11691, -20523, -18778, -12896]
3243a2896n490R350K079j8523j843k4035K2104J2511j6563O343l8264K0041p175
3230e2361j0388L6002J2105l4215N7113l2677L417n650J8528P552k4814M6131
3218B0743K698p535m429k35k5070m1332J5725p184M2338L0862n5230O547K1860
3205b42k5440Q206N6619N769m6935m631J5522K4977p274j4416j0018m784M480
3192A833j5815K5279p861J1933j2992j990k1523K0699L5353k6804k86K9198k605
3179C4419L1115N556n350N1355J760j2941L4165K6318J1691K2842K4516q361Q554
3166B25639J6442r411R805N4475K2041L425m29K1328K9902j0502M8733O463K1524
3153D39435O7801L9158L1096M3605M4978N5466N9951N9584N3176R5941J05822
$$ y = [-12896, -18386, -9036, -6957, -25480, -27323, -51358, -29254, -16743, -33306, -26963, -65227, -45186, -52361, -62749, -26747, -14642, -48857, 8256, -24421, -21004, -26654, -8126, -574, -25388, 20743, 23441, 15906, 11477, 11242, -13828, -55160, -39435, -46619, -4281, 26581, -28649, -22102, -242, -25682, -17476, 39143, 44912, -2023, -6654, 8868, 33845, 26571, 12155, 2137, -2647, 1833, -13982, 11297, 3436, 15369, 2377, 387, -21136, -437, 34916, 8112, 7826, 37024, 34419, 65534, 71090, 65740, 117095, 118855, 105914, 140079, 166397, 178088, 200930, 225446, 217085, 225639, 242081, 232670, 242475, 296950, 318991, 322416, 321987, 343315, 373217, 362715, 411448, 417911, 439435, 507236, 546394, 577490, 621095, 666073, 721539, 781490, 841074, 894250, 990191, 1096013]
3142A096013J04015J09416R2899J77209J92025K51548L49589N10214P07209J055669
3132D645806R89204j83507r30442q70614o90539n61564m53807k84198k46433j86685
3122A227221j35258o0857j51730q9209q2625q2563n5533p2716l0525m9987l3838
3111C82380l6502m0546l1584N970m367J0974l1477o9644j0545m527j5361o968
3099A47803N696l3128m050J853K6305j8920l1500o920k0266j3307J9595j6592
3087E6569P236k9423J536j1127Q116K3847l3554L21J5461j5863J2702q802l0875
3074c856J3979J104j0702J3945j7490O354q856j100K1499m6183K0062M742Q248
3061A746o4204K4808L7802Q721L185j6882k2806J2884k6498J3962k6686L006K4056
$$ y = [1096013, 1200028, 1309444, 1402343, 1579552, 1771577, 2023125, 2372714, 2882928, 3590137, 4645806, 5635010, 5451503, 4521061, 3650447, 2959908, 2398344, 1944537, 1660339, 1413906, 1227221, 1091963, 1031106, 879376, 790167, 707542, 624979, 569446, 496730, 466205, 416218, 382380, 345878, 305332, 273748, 279718, 275351, 286325, 254848, 185204, 174659, 170132, 154771, 147803, 153499, 120371, 116321, 118174, 144479, 125559, 94059, 87139, 66873, 53566, 73161, 56569, 63805, 34382, 35918, 24791, 32907, 56754, 23200, 23521, 38982, 23119, 35821, 27019, -3856, 10123, 11227, 525, 14470, -3020, 3334, -5522, -6622, 14877, -31306, -11244, -6502, 1746, -62458, -37650, 152, 8873, 12058, -4824, -27630, -14746, -41244, -27282, -53968, -50962, -26906]
3048b6906J4828m2163j669K0670p908K3711j34j2985o931k8769j595K8686q412
3035d9577k1681j5652Q546J7115P346J600J3423O326k4490K3111L7746m948n7691
3022e8826K6932k972m6616L022P594J8386r660J1676j914J1239J3406K4121k8298
3009c1910J0359k5878o445p028q943r94K8944L369J976K8978l2153l1949J8267
2996e3407N698Q559o171J5385J3791K983l1558j1811Q475k4664n928O0311K367
2983a5970k4178J619J8773j8273k777J5379J2788j0769l4777K8236N414N632p821
2970b6724k5131k3846K6416L5470K0497k4457j7996k1928n540M448M747k4866
2958g8910M675M4303j4378m1950K2307O680L156O6K9583k4201q564K8795j7505
$$ y = [-26906, -12078, -54241, -55910, -35240, -43148, -19437, -19571, -32556, -39487, -68256, -69851, -41165, -49577, -71258, -86910, -78364, -61249, -53903, -52303, -38880, -32554, -57044, -33933, 3813, -1135, -58826, -31894, -34866, -81482, -78460, -70866, -52480, -62140, -50464, -52378, -41139, -27733, -3612, -31910, -21551, -47429, -53874, -60902, -69845, -70839, -41895, -38526, -36550, -7572, -39725, -71674, -53407, -47709, -39150, -45321, -29936, -16145, -13162, -44720, -56531, -48056, -72720, -78648, -18337, -15970, -40148, -38529, -19756, -38029, -40806, -25427, -12639, -23408, -58185, -29949, -24535, -18903, -26724, -51855, -75701, -49285, -13815, 6682, -17775, -35771, -57699, -63239, -58791, -54044, -78910, -74235, -29932, -44310, -86260, -63953, -57273, -54117, -54051, -24468, -48669, -57233, -28438, -45943]
2945d5943J896J6002l1579K6508j2566J7805j7694J7982r648K0205l4818j856
2933e3706M5072l1185j1287K2868K2020k0390l7786J1606j003L0545O780k7599
2921d4065j9566j3591M6866J1843p147j3165L5593p1599K0680J1012l4986M741
2909g3384j2700N4342J2329j9555k2032K0464K5043J3464R016n523n5849m94J8107
2896c6772k9070J1159n730K6579J0303k5102l8683M1404m511K2887K2380r676
2884a4832k7843J4917k7588J1069J0473J3359N180K022m0358J539o124J9628N601
2871c2957l826j4145J6405K9022l3221N892k3872j021l5689K614K8394K2099J2559
2858b7746j6827p049q176J1285k951L9840l0105R645j7983L7425k7552r046J4309
$$ y = [-45943, -44047, -28045, -59624, -33116, -45682, -27877, -45571, -27589, -37237, -17032, -51850, -53706, -8634, -39819, -51106, -28238, -6218, -26608, -64394, -52788, -53791, -23246, -16466, -44065, -63631, -77222, -30356, -18513, -25660, -38825, -3232, -74831, -54151, -43139, -78125, -73384, -86084, -31742, -19413, -38968, -61000, -40536, -15493, -2029, 6987, 1464, -54385, -54879, -36772, -65842, -54683, -60413, -33834, -23531, -48633, -87316, -45912, -50423, -27536, -5156, -14832, -42675, -27758, -55346, -44277, -33804, -20445, -15265, -13243, -53601, -52062, -58186, -38558, -32957, -36783, -50928, -34523, -5501, -38722, -32830, -56702, -57723, -93412, -90798, -62404, -40305, -27746, -44573, -51622, -59798, -48513, -51464, -11624, -41729, -32084, -50067, -12642, -40194, -49240, -34931]
2845c4931j5252l354K6631l2533j9973J5079k777J5760j2407p101K4237L4999
2833a1622M892j6322r492l0473J0146J769J5529j0125k5465L3951Q41j100Q965
2820b8506j9742K368J4410J0730J9542j6200m030J1537P420l7072K1148k1539
2808c9934p992J721K7219j0331k8490j4814J4164r021J7912M5753k7340m6795
2796g7948Q300K6974Q863k8896J7320j0889N2038l2687J6679o618j4914K0136
2784b1642n690k1983j0978N056j2982K0264J128k1377m741L606l251K4961L4370
2771a3259m0664K7416j7032m294j0590K6573J915l2738K0365K4196J6131k8308
2759c0289j1603K8250l8764K5913J327L667L1397k5079j733k8027k4402O0094
$$ y = [-34931, -50183, -53537, -26906, -59439, -79412, -64333, -67110, -51350, -63757, -70858, -46621, -11622, -6730, -23052, -32544, -63017, -52871, -51102, -35573, -45698, -71163, -37212, -36371, -37471, -28506, -48248, -45880, -31470, -20740, -1198, -17398, -21428, -9891, -2471, -39543, -18395, -39934, -47926, -46205, -18986, -29317, -57807, -72621, -58457, -67478, -49566, -3813, -31153, -77948, -69648, -42674, -33811, -62707, -45387, -56276, -4238, -36925, -20246, -26864, -41778, -21642, -27332, -49315, -60293, -55237, -68219, -47955, -46827, -68204, -72945, -69339, -72590, -47629, -13259, -53923, -26507, -43539, -47833, -58423, -31850, -29935, -62673, -42308, -18112, -1981, -30289, -41892, -13642, -52406, -26493, -25166, -21499, 9898, -15181, -16914, -44941, -69343, -9249]
2747i249Q061l2264K533K461l4813K499J9336J626O802j4159j3018J9507r622
2734e0300K2305J1628o200k8675K880K7811k7322K9008n690k3173R942N285k155
2721c4656K5142k1102k5624K3969p051L452K8425m4078L1993n505J3384j8254
2709b9905q687K725j2855r02J831r081M1862j2898j2740J0802j0903J1590L0472
2696A311k5365k3220j2272R826L1653K1207J4454n4929q155J5093k8010K1060
2684c7347L9171K651j1785j1730K7878n3162P768J119j9772L3683R351j2382k6131
2671e0688J5028L735j3185j0443L7591j4056l4501n936K8199Q234K3580n3362
2659f5804J4240K6320M646l1338M6017J640j1190j5552o515j4716J4751J8436
$$ y = [-9249, -1188, -33452, -30919, -28458, -63271, -60772, -41436, -39810, -33008, -47167, -60185, -40678, -50300, -27995, -16367, -22567, -51242, -48362, -20551, -47873, -18865, -24555, -47728, -37786, -32501, -34656, -9514, -30616, -56240, -32271, -39322, -35870, -7445, -51523, -19530, -25035, -11651, -29905, -38592, -35867, -48722, -49624, -47793, -56874, -15012, -27910, -40650, -29848, -40751, -29161, 1311, -24054, -47274, -59546, -49720, -18067, 3140, 17594, -37335, -45490, -30397, -58407, -37347, 1824, 4475, -7310, -19040, 8838, -44324, -36556, -35437, -55209, -21526, -12175, -24557, -50688, -35660, -31925, -45110, -55553, -17962, -32018, -66519, -72455, -44256, -36022, -12442, -65804, -51564, -25244, -20598, -51936, -5919, -4279, -15469, -31021, -37536, -52252, -37501, -19065]
2647a9065J9573k0608j3214K6026j4501j2935l4289O855L7969K7468j1881n5535
2635f4137M9218j4256r215L5614j9978o483P527J1815l3168M330k0369k516L6259
2622b5359J7959M787j0263k7320K892j4080j109L3495L2737j7866J2930q271q001
2609g469J020j2794L714J5783k5445l18k8349L8531j5269j4523N143N213J5306
2596a9457r842K955m505Q453j5572l687N2939j3064p940k3252O270j2046K0038
2583a8710K1478l161j8883L31O718k2039Q91R60L421j5559N683K4955j4406M355
2569b3966K9904l5390j5964L241J2766O126j5394N993R301J4966M605j2879R950
2556f741l7385M052j2426J4371K0452l2105J1226K8163j3290k9883k9958K6511
$$ y = [-19065, 508, -20100, -33314, -7288, -21789, -34724, -69013, -62158, -24189, 3279, -8602, -64137, -14919, -29175, -38390, -2776, -22754, -29237, -21710, -9895, -43063, -38733, -59102, -61618, -25359, -7400, -2613, -12876, -40196, -37304, -51384, -52493, -18998, 13739, -4127, 8803, 532, -7469, -6449, -19243, -15529, 254, -25191, -25509, -53858, -15327, -30596, -45119, -39976, -34763, -19457, -29299, -26344, -30849, -22396, -37968, -41655, 11284, -1780, -9720, -32972, -26702, -38748, -18710, 2768, -393, -19276, -18945, -12227, -34266, -33375, -32415, -28994, -44553, -38870, -13915, -28321, -23966, 5938, -29452, -45416, -42175, -29409, -23283, -38677, -32684, -23383, -8417, -3812, -16691, -6741, -44126, -40074, -52500, -38129, -17677, -49782, -38556, -10393, -23683, -53566, -83524, -57013]
2544e7013J9574K4880M3263k3510k4146K096P39l6431J9971J1258j4682L6548
2532B547k5369l0966N905L4431L1323k2023p527r134j6762j0860j7224l1880M0949
2519e6590J2133K900l293L7484k3090K531J4075o0009P810J5526k7244m905K0581
2506f2091j352J0528L293J1562J0920P256L948r374l237p368J2538n6J3780o757
2492a6410j2061J3166k7743K8608N088j9494J7642L312K0520j8647k4160o665
2480c6844j6182Q294L3581J6105j5329J0909j9706J8097K64n3591R066j0692O860
2467d9168J2159K8960P724j9709M139k9522m9372M8076M3517j3660L1617m405
2455A0356k5458J8318K1267k3827j3099j621l4238K7816L6444J210k1924O50j4620
$$ y = [-57013, -37439, -12559, 30704, 7194, -16952, -14856, -14117, -50548, -30577, -19319, -34001, 2547, -22822, -53788, -47883, -13452, 17871, -4152, -11679, -20813, -37575, -48435, -65659, -97539, -56590, -44457, -41557, -44850, -7366, -30456, -27925, -13850, -73859, -66049, -50523, -77767, -82672, -62091, -63443, -52915, -49622, -38060, -27140, -19884, -15936, -25310, -28547, -35915, -23377, -23433, -9653, -16410, -28471, -15305, -43048, -14440, -9352, -28846, -11204, -7892, 12628, -6019, -30179, -36844, -53026, -44732, -11151, 4954, -10375, 534, -19172, -1075, -811, -54402, -45336, -56028, -49168, -37009, -8049, -325, -20034, -15895, -45417, -94789, -46713, -3196, -16856, 14761, 10356, -15102, 3216, 24483, 656, -12443, -14064, -48302, -20486, 15958, 17168, -4756, -4106, -18726]
2442a8726j6752K0853j4918L7553J0036N459k572j1003j9500o300j6613J9567
2430a2916j5423k8550K2633J1911j0235J914J2748K1900m2397J1435j6098K9931
2418a3147Q586j0713L0170k5149K2532p597p443j427k0012k2646K2088J3366q952
2405b0344J4876L909J2407j9512r149k2996J6199K0918R248j0635j4882r481J6809
2392a2633j808q07L582Q029M44k3062L4802J4047q668J6499l9764k0643K1382
2379h600J0883K2675O034j8564k6744j5049m718j2694q060N3793j1649n335J3741
2366d287J8823k9952J1684p244k5853O312N2402j4520l6586p391K6625K5166j5653
2353d74j3442J4241j4360j7460P113J1287J0534j4067M012K0423j2331l0037Q648
$$ y = [-18726, -35478, -14625, -29543, 8010, 18046, 23505, 20933, 9930, -9570, -15870, -32483, -12916, -28339, -56889, -34256, -22345, -32580, -30666, -17918, 3982, -38415, -26980, -43078, -13147, -4561, -15274, 14896, -10253, 12279, 4682, -2761, -4188, -24200, -46846, -24758, -11392, -20344, -5468, -1559, 10848, -8664, -17813, -40809, -24610, -3692, 5556, -5079, -19961, -29442, -12633, -14441, -15248, -11666, -3637, -3193, -26255, 8547, 22594, 13926, 30425, -9339, -29982, -8600, 2283, 24958, 30992, 12428, -14316, -29365, -34083, -46777, -54837, -1044, -12693, -18028, -4287, 14536, -15416, -3732, -10976, -36829, -30517, 21885, 7365, -29221, -36612, -9987, 15179, -474, -13916, 325, -14035, -31495, -24382, -13095, -2561, -16628, -12616, 7807, -4524, -34561, -25913]
2340b5913r853J7300L704l3421M025K393r374K8192q068n853L7661j2348k7045
2327c8600K5754n502j3163l7370L2154L3446P955n083K2522l3748j1974m458J7609
2314a0458M0380n7846j528J3112j2776J7148o842q162K287J3820r561K0031J6121
2301A5726o3121o585L1488J7145q338l0925J6116J3656R439J9681j9470K6978
2289B1790j4274k4762r959L481k866J8904j7826K869m318M1098O849j2761o858
2276A367P360m1079Q200K8980L488r845M038o1307q196O6333J6117j8265k0284
2263b3093L3844J0829k4063k660N147K8073j0837m1011J3784O209j3494N867N182
2250f223K4684r274m5345J1095j4460n998L1499k0250J1008J4434l6262L5097
$$ y = [-25913, -35766, -18466, -14762, -48183, -44158, -41765, -51139, -22947, -31015, -36868, 793, -11555, -38600, -12846, -18348, -31511, -68881, -36727, -3281, 4674, -409, 22113, -11635, -23609, -28067, -10458, 29922, -27924, -29452, -16340, -29116, -11968, -18810, -26972, -24685, -10865, -20426, -395, 15726, -47395, -53980, -22492, -5347, -13685, -44610, -28494, -14838, -5399, 14282, -5188, 21790, 7516, -17246, -27205, -23724, -26590, -7686, -25512, -22643, -26961, 14137, 20986, 8225, 1367, 8727, -32352, -24152, 4828, 8316, -1529, 2509, -58798, -66994, -661, 15456, -2809, -23093, 10751, 21580, -2483, -5143, 4, 28077, 17240, -23771, -9987, -3778, -17272, -11405, -6223, 18461, 9187, -36158, -25063, -39523, -45521, -14022, -34272, -23264, -8830, -45092, -9995]
2238i995j6005k396Q67R285P506P803j415l351M250O214J3919j5126j7077M4085
2224B8564j7853j359J707m0582j0681M1808J1832k4270m715q215J7800o901p199
2211b0064J451K2306n302j9128K7209l9951k1306L3898K3913j0272j2078K1577
2199B253N875M988J2892o2852K5810K5818o489j0670K8004o044q573j4636j4291
2186a7915J9144J6453m8396r511o165J1524K0063M471L049O864j2958P754J0616
2173D993L40j501l2717J494k488K7247j3475J4692R431J8716j2199O178l264j7110
2159C37J7993k5049P972j5117K8083J0890m6914K5354j9673K7343j3339p375l8994
2146d8489L9257l6660K7283K2097n166P659q690j7931J4935k2029J8999K8452
$$ y = [-9995, -26000, -28396, -27529, -18244, -10738, -2935, -4350, -7701, -3451, 2763, 16682, 1556, -15521, 28564, 10711, 9352, 11059, -29523, -40204, 1604, 13436, -10834, -15549, -23764, -5964, -12865, -20064, -18613, 3693, -1609, -20737, 6472, -33479, -54785, -20887, 3026, -7246, -19324, 2253, 8128, 13116, 26008, -36844, -11034, 14784, 8295, -2375, 25629, 19585, 11012, -3624, -17915, 1229, 17682, -30714, -40225, -46390, -34866, -14803, -10332, -7283, -419, -13377, -5623, 4993, 5333, 3832, -28885, -27391, -29879, -2632, -16107, -1415, 8016, 26732, 14533, 20711, 17447, 337, 18330, -6719, 1253, -13864, 14219, 25109, -21805, 3549, -16124, 11219, -2120, -9495, -48489, -9232, -45892, -18609, 3488, -1678, 5981, -2709, -20640, -5705, -27734, -8735, 19717]
2134A9717k1215M876k4639J9683L921j6189l5741j416M1947j91K1557J4309k1648
2121D971M392Q163l9052N770K6261r83k929j6955k1670J1384J2203r508K8059
2108A0106k2575K5959K249j036o08J7849n035n51j6660j3586N73p562q963j1880
2094c1720J6729k755J3746M3964r097n480k6090k0018N868k3630j6944K093K1473
2081c1861M7149k9774r982q36J1542k4466O747L6432k652M95K580M6924j3503
2068C8795j9940k9296j5091K0504j1127L7453j2023O2372m1444j5099M386j2206
2056G284K0334k6304l5841O476p345K066J1155J6706J9966M122r446p653K3184
2043B4704o888q123J8892j3025k1650j3630l914J3795J6675R933J1142k4778j008
$$ y = [19717, -1498, 3378, -21261, -1578, 2343, -13846, -49587, -51003, -9056, -9247, 12310, 26619, 4971, 9363, 17526, -21526, -15756, 10505, 9522, 6593, -10362, -32032, -20648, -8445, -17953, 10106, -12469, 13490, 15739, 14703, 14095, 31944, 26909, 26358, 9698, -3888, -3315, -10877, -19840, -31720, -14991, -17746, -4000, 39964, 30867, 25387, -703, -20721, -14853, -38483, -55427, -53334, -31861, 15288, -14486, -24468, -25304, -13762, -38228, -31481, 4951, 2299, 2794, 5374, 52298, 38795, 18855, -10441, -25532, -5028, -16155, 21298, 9275, 71647, 30203, 15104, 19490, 7284, 27618, 1314, -34527, -28051, -35396, -33330, -22175, -5469, 14497, 18619, 9173, 1520, 24704, 17816, 9693, 28585, 15560, -6090, -19720, -23634, -9839, 6836, 16769, 27911, 3133, 2125]
2030B125J2245J3921O255k6798Q227m1273M2084L939L040j0102o986l0361L0528
2017F844K1749l1365K5048j0447K528j320k066l669j5399K8299k5453J2554l2050
2004b4747K2022Q387k5740O327P103N381J508n005j7260R435J5062j213K0175
1991B1435j6938j9217k484l256j8735M1337K3314p285j0534m574p347n021O160
1978c145j5402L6726m961k8528K3282r535m7473J5078M6336M009l4888K1450J6171
1965A9120k7176L4539L257q341l2692K3673l7471L8477L4581n4893P654K6913
1953B7641K0749j3778k3132l3851K7321q010k5019N4864j4372o2010K7466m683
1941b6814L2764o684K6340m6914j2367M8637p0051K9456Q5J7614L135m892J3495
$$ y = [2125, 14370, 28291, 34546, 7748, 15975, -25298, 16786, 20725, 23765, 13663, 6677, -23684, 6844, 28593, -2772, 22276, 11829, 14357, 13037, 10971, 7302, -8097, 20202, -5251, 7303, -24747, -2725, 5662, -20078, -13751, -6648, -1267, 241, -4764, -22024, -12589, 2473, 1260, 21435, 4497, -14720, -17204, -20460, -39195, 2142, 25456, 18171, 7637, 3063, -4284, -9305, -3145, -18547, 18179, 13218, -15310, 7972, -1563, -49036, -33958, 12378, 16387, -18501, 2949, 19120, -8056, 26483, 29740, 21399, -11293, 12380, -25091, 13386, 47967, -6926, 728, 27641, 48390, 34612, 11480, -22371, 4950, -3060, -28079, 26785, 12413, -49597, -22131, -26814, 5950, -734, 25606, -21308, -33675, 14962, -55089, -25633, -25548, -7934, -4799, -9691, 3804]
1928C804L1934K807l559m6730J657K0857l410k1661q54J8330j3285n074M479K3525
1914A2820k0999K405K9835K903n4890M1508N07j6066J627K3975L923n609j1394
1901A0545j8394j0403j140o438J3142n692k814J7125N718K1020q740j8813n1151
1888e6035n302M2290j352j3995K2520J2547l7787J905L1210K3042k3472J5891
1876A1462r744j6176J6061L7070m5488Q831j3444K9777j3802n5N323k7274L9910
1863B2451p506R797j430k6893n773p933M2161m4656K4418n232Q597k6399J2927
1850e471k686K8581J5844k198j0123k9409J3159j7603r575L7733J4588k0395L7728
1837E0173j5954l4623K1339l2199J4611O4437m7366q440k396K6420j9418R031
$$ y = [3804, 35738, 38545, 34986, -11744, -10087, 10770, 7360, -14301, -15155, 3175, -10110, -15184, -10705, 12820, -8179, -5774, 24061, 26964, -27926, 13582, 14089, -1977, -350, 23625, 27548, 21939, 10545, -7849, -18252, -19392, -25830, -12688, -18380, -21194, -4069, 1649, 22669, 13929, -4884, -56035, -61337, -19047, -20399, -34394, -11874, 673, -37114, -35209, -3999, 19043, -4429, 11462, 1718, -14458, 1603, 38673, -6815, 2016, -11428, 18349, 4547, 4492, 9815, -17459, 22451, 14945, 24742, 23312, -3581, -9354, -17287, 24874, -19782, 4636, -596, 8001, -18398, -5471, -8157, 20424, 36268, 34070, 23947, -5462, 7697, -9906, -19481, 18252, 32840, 12445, 50173, 34219, -404, 20935, -11264, 3347, 67784, 20418, 11978, 9582, 36002, 16584, 25615]
1825B5615l1688K6992l83k9040p043J2248P632Q656o03K9775m1032R97j8843k1997
1811c8714K9262j1662L604K1855Q555j0626l1148L1155j6480K7567k1998j323
1799i953P743j2664R934K2506l3605j4162L9267L776M906M231J3155K440j9832
1786A7742J8904m2361J0186M541j6088L5153m1430J8824l554J8375p368L4531
1774D7455Q025l6294j4652j2147J5457p403k926J129L3263k3836n751L3781J269
1761C7370m0182J8250N9966m2276l1249k0745j5698L8520K9028L3525j9809l6097
1749A0603J4535K0715m1359N116N478O534K8718j0599l7116k6259K7523J7865
1737B1754k2028L1005l6417N572J1475J1617o306K8962J6766k6463j3023l4638
$$ y = [25615, -6073, 20919, 20536, -8504, -15547, -3299, 4333, 12989, 12386, 42161, 1129, 2126, -16717, -38714, -9452, -21114, -17510, 4345, 12900, 2274, -28874, 2281, -14199, 13368, -8630, -9953, -2210, -14874, -4940, 17566, -16039, -30201, 9066, 12842, 17748, 21979, 35134, 37574, 17742, 36646, -5715, 4471, 9012, -7076, 28077, -13353, 5471, 1917, 20292, 12924, 47455, 55480, 19186, 4534, -7613, 7844, 441, -2485, -1356, 31907, 8071, 2320, 36101, 37370, -2812, 15438, 75404, 33128, 1879, -18866, -34564, 3956, 32984, 66509, 46700, 10603, 25138, 45853, 4494, 9610, 15088, 21622, 50340, 39741, 2625, -23634, 3889, 21754, -274, 30731, -5686, -114, 11361, 22978, 16672, 45634, 62400, 35937, 22914, -11724]
1725a1724l098K028p32Q550K133j0836M1425l1894L7301j6128k7050P449O511
1712C935J1117k2452q930J4262j3100O0007j0616l8107k2938L7216J3390L731
1700B7515j0438k806j4894J8642J6584m5063O87K8644k8548P950K9929J87l814
1687B4575j6531K3804n225Q251J3793q277M1532r846k3914L249k0342j5051m439
1674A1579k9126K5315J6892l0514P73L078O172j2966k158j399L0050K370l4801
1661a4735k5157L2899J6239K2166Q046p996q295J1295P349l6837L2374j9920p459
1648I969K366J1234r491l0113l6131K9414l1137L3347N3243m4794N96J2861k5274
1635b3910P169N0737k3674L364j8966J2563L677j7166r201J2240Q071L0954k9245
$$ y = [-11724, -14822, -12794, -13526, -4976, -2843, -13679, 27746, -4148, 33153, 17025, -10025, -2576, 3935, 15052, -7400, -16330, -2068, -15168, 44839, 34223, -3884, -26822, 10394, 23784, 27515, 17077, 14271, -623, 18019, 34603, -10460, -9773, 18871, -9677, -1727, 28202, 28389, 24575, 8044, 31848, 26623, 34874, 48667, 40390, 81922, 72076, 48162, 51411, 31069, 16018, 11579, -17547, 7768, 24660, -5854, -5081, -2003, 4169, -8797, -10955, -12354, 17696, 20066, -14735, -39892, -6993, 9246, 31412, 39458, 31462, 23167, 34462, 41811, 4974, 37348, 17428, 9969, 12335, 23569, 14078, -16035, -52166, -22752, -53889, -20542, 32701, -12093, -11497, 1364, -23910, -16741, 33996, 10322, 13686, -5280, 7283, 10960, -6206, -15407, -3167, 4904, 35858, 6613]
1622F613j2636J7697L2057l3807k398K7380k213l130N665M0048n6949k1160m0800
1609d3633L9207K2700K850p058N35j894j8423o733m7M3809p38J588j8205J8214
1595C2172k408L832l2768N775J5310O764r426N420j6083R123q840k7663L3582
1582A4790K8656k2710j069l949K1726l5576j6966K6073k2490O7465k6568m3634
1570a4252J4898J1163n748K1508J0999k717M537k090m9214j211K4902k1593J3257
1557D439J4327o704J2183j249k1806J054q939n441L1181J272k8114L25O515o737
1543g694M5774k545k0957L3235J2653n2652L0044j0779m781L1985n3522p223J7535
1530A1073j1271p682j121K1525J883r307R2K2994K2620l4215j6130j8620K1076
$$ y = [6613, -6023, 11674, 43731, 9924, 7526, 34906, 32693, 29563, 35228, 75276, 18327, -2833, -43633, -4426, 18274, 21124, 14066, 14601, 12707, -5716, -12449, -12496, 31313, 30575, 32163, 13958, 32172, 29764, 33596, 828, 6603, 21913, 28677, 19251, 24671, 8588, 17711, 8871, -18792, 14790, 43446, 20736, 19667, 15718, 37444, 1868, -15098, 10975, -11515, 55950, 29382, -14252, 646, 11809, 6061, 27569, 38568, 35851, 40388, 38298, -10916, -12127, 12775, -8818, 4439, 18766, 12062, 24245, 22996, 1190, 2244, -6695, -12136, 19045, 20317, -7797, -7472, -957, -7694, 38080, 35535, 14578, 47813, 60466, 7814, 37858, 27079, 22298, 54283, 761, -6462, 11073, -198, -7880, -9001, 12524, 14407, 5100, 5192, 28186, 50806, 16591, 461, -18159, 2917]
1517B917q295K0080J9752l4557j9087M8625Q433J641j8387L869l0863R145K2082
1504B5355p754R844k5729J7556J2267k4139q857J7037J7600k1290K2078J88j2127
1491B2029K0796k97J8371k4122p353J3769o834k3716l37J1257m502J9221j9706
1478A8576k97j00p019O310k1992L8183j524j6439J4668j6825K019q947m3913K3091
1464a4209L6950j642j419l175k672J30j9630r314L2685j8934J3956J7023k1020
1451H729o68J6872j7153p043K0946n28r423K1224K3113l9860K7833j081R269m4516
1437G714j791j3884N547N0380K9213J235m998j0803l1906j4108O649R835M754
1424C7837k7293j2930J2065L2829j1940J7090k3032L397j1798l0698J8624J1924
$$ y = [2917, -5378, 14702, 34454, -103, -19190, 29435, 37868, 39509, 21122, 24991, -5872, 3273, 25355, 17601, 27445, 1716, 19272, 31539, 7400, -1457, 15580, 33180, 11890, 33968, 34156, 22029, 42825, 42528, 60899, 36777, 29424, 43193, 36359, 12643, 12306, 23563, 19061, 38282, 18576, 18279, 18179, 11160, 17470, -4522, 33661, 32137, 15698, 30366, 13541, 15560, 6613, -37300, -14209, 22741, 21099, 19680, 16505, 13833, 13963, -5667, -14981, 17704, -1230, 12726, 29749, 8729, 8061, 24933, 7780, 737, 21683, 21155, 11732, 32956, 56069, 16209, 44042, 42961, 52230, 7714, 5923, -7961, -2414, 47966, 77179, 78414, 73416, 62613, 30707, 16599, 23248, 33083, 37837, 10544, -2386, 9679, 42508, 30568, 47658, 24626, 28023, 16225, -14473, 4151, 16075]
1412A6075L5806j7210r469Q134p158k6256J8510j922l6311K0325K7957j2220k119
1399A4142M165L0375l6887j0522J9748j1751j1921R888J0174K8711j6337O975
1387C6760j2235k3056J6896J5802k6795J3901Q133j2739l2144M3371J937n7870
1375b8039J8216p963J1048n359K4813K1174J1747k0760n405m8716J9079K8193
1363A8028j8980O030Q230j4460N49N820J1052K1428L906k1030k5355k496o044
1350a3322J1632n32k668J7470J0539l093p688k9055O6617j5191L089k0265j1754
1337E779K535p678J8495K1864k4676P257j3973l4292k831J7711J2134K0170J3234
1324C5729m7300J1818L5464l8873m43R487K562q014k9412L9008K8194j3971j7931
$$ y = [16075, 51881, 34671, 25202, 33336, 26178, -78, 18432, 16510, -19801, 524, 28481, 16261, 14142, 18307, 48682, 11795, 1273, 21021, 9270, -2651, 7237, 17411, 46122, 29785, 36760, 24525, 1469, 18365, 34167, 7372, 21273, 29406, 16667, -15477, 27894, 29831, -28039, -9823, -17786, -6738, -12097, 12716, 33890, 45637, 24877, 19472, -29244, -10165, 18028, -952, 5078, 13308, -1152, -603, 5217, 16269, 37697, 41603, 20573, -4782, -7278, -13322, -1690, -2222, -4890, 12580, 23119, 20026, 12338, -16717, 49900, 34709, 37798, 17533, 5779, 8314, 636, 19131, 40995, 16319, 23576, 9603, -24689, -27520, -9809, 2325, 22495, 35729, -11571, 247, 35711, -3162, -3605, 5882, 8444, 430, -28982, 10026, 38220, 24249, 6318]
1311F318K4929p376k4195L4977L4243o0700p441k1742J4625J3729K3320n060k169
1298B3458m120J8898m0074K9614k7402k1436O3143J7332j0465m2723l5740M280
1286b5235J9045J7061j5531k232R6K3798K905K972q453k8083K2489m099r769j51
1272e187J3222L2787J1118j4283k8044J8353J9386l4571j5090O254L6358l1776
1260H527K0914k7775L576j6163M594L3930m30r252m040J1782J2199k9362K1117
1247B9617j6519q82K1083j3395j0125J8189J7555k732k2028p155J1992m678O069
1234B6991m037k8451K8388n307j2112J6376j7549k7488L5444p335j9892K5612
1222A0640k3794L235K2875M1982j7422l4252L763M4413j3366j9052m124j0487
$$ y = [6318, 31247, 23871, -324, 34653, 68896, 8196, 755, -20987, -6362, 7367, 30687, 25627, 23458, 19338, 38236, -1838, 27776, 374, -21062, 42081, 59413, 48948, 6225, -29515, -25235, -6190, 10871, -4660, -6892, -6796, 17002, 19907, 22879, 14426, -13657, 8832, 4733, -5036, -5187, 8035, 40822, 51940, 37657, 9613, 27966, 47352, 12781, -2309, 3945, 40303, 8527, 29441, 1666, 5242, -10921, -6327, 27603, 27173, 17921, 13881, 25663, 37862, 8500, 29617, 13098, 12216, 33299, 19904, 9779, 27968, 45523, 42791, 20763, 13608, 25600, 20922, 26991, 22954, -5497, 22891, 17584, 5472, 21848, 4299, -23189, 12255, 4920, -14972, 10640, -13154, -9919, 12956, 54938, 37516, 3264, 7027, 51440, 38074, 19022, 14898, 4411]
1210D411O358j4200k4749O2232l5408r91K7017k9142K26J4974J0162l7285Q658
1197g737L9845J2739m9448R018k8293L6862J7599J7520m0700o769k008J589K1168
1184B1385J709j5313o832M825n287k3080q931N8096l0800j527j3493M2843J1419
1171C5014K6062o3284m376K1199M5842j1018k1940j6018M37k317k2052J3725J5344
1158A6618j6971L1129J4488j1084k2676J7807o600m2549M8209k852j2191m146
1146I182j9569L016L9232J259l1283L2067j4972O144k3430K0837K0736j6209j0126
1133A6884l5033L3643j9679L6484p558M003m6949P907P324j8640k005J0891j9275
1120c2003K9567J3382l2701L0752q988k2472K0305J2537p482N625K3227J0594
$$ y = [4411, 10769, -3431, -28180, 34052, -1356, -2347, 24670, -4472, -4246, 10728, 20890, -16395, -7737, 32108, 44847, -4601, 4417, -23876, 12986, 30585, 48105, 7405, 636, -1372, 217, 21385, 23094, 7781, 949, 5774, 487, -22593, -31524, 26572, -4228, -5755, -19248, 23595, 35014, 61076, -2208, -6584, 14615, 60457, 49439, 27499, 11481, 11918, 9601, -12451, 1274, 16618, -353, 30776, 45264, 34180, 11504, 29311, 22711, -19838, 28371, 25519, 13328, 9182, -10387, -7371, 31861, 33120, 1837, 33904, 18932, 25076, 1646, 22483, 43219, 27010, 16884, -18149, 15494, -4185, 32299, 24741, 28744, -18205, -10298, -2974, -21614, -23619, -12728, -32003, -2436, 10946, -21755, 8997, 9, -22463, -2158, 10379, 2897, 8522, 31749, 42343]
1108D2343l5933P078K2614j6130J7377k1261o734K2860l4020k6281L3965J4423
1096B0301k123P853N665j9968o214R639J4856j5208R534l271j5444k1024j6721
1083c2125L2276k257M209K9500m4932J6146L3374k6983J2342j6273j0075K8246
1071B3448j045n5209J1905L7477P020L8748m7782j3801J6386M494j5752R979J7961
1058C3829k6057M848L191m201j0143K3501m1576k57k7649M5502J9609K01n4190
1045c3392R813K9973J853L4382l0043Q418j3306n0520N4288K0953n7196J4128
1033a0649L8141l7820M766l169R750j3925q647J4382n091J7887l1930K8366m505
1020b444J460l6407K5332j6282L0415P49k6040K3801K918o955J2629j7079m5194
$$ y = [42343, 6410, 13488, 36102, 19972, 37349, 16088, 9354, 32214, -1806, -28087, 5878, 20301, 18178, 26031, 31696, 11728, 5514, 15153, 30009, 14801, 24335, 21064, 5620, -15404, -32125, 151, -2106, 2103, 31603, -13329, 2817, 36191, 9208, 21550, 5277, -4798, 23448, 22403, -32806, -20901, 16576, 23596, 62344, 14562, 761, 17147, 21641, 5889, 15868, 33829, 7772, 12620, 15811, 11610, 1467, 24968, -16608, -16865, -44514, 988, 20597, 20798, -33392, -23579, 6394, 8247, 42629, 12586, 21004, 7698, -42822, 11466, 32419, -24777, -10649, 27492, -10328, -5562, -8731, 1019, -12906, -21553, -7171, -12262, 5625, -26305, 2061, -2444, -984, -37391, -12059, -28341, 2074, 2823, -23217, 584, 3502, -3453, 9176, -7903, -53097]
1007e3097N0769J3560J7806J5043k1259l7677k606o202N098M2494K30J1807k62
994C5704n1955J0041K0486o466J5966j7689Q876K9009k6128K384O251j7123j0585
981a229m6484K5191P0719m6359n784J6717J1581m0686J9456n360j655J0818k4421
968a7496j2973K3530J1646J9746K0907m4459R466J8289j1722m2592L1864J276
956G482J5065k4416q161Q114l8050R465N044J3556J5326m005p306p864J9508k7205
942b3447j5495L1671K5252j937k0020j2121K8211j4795j1866l122p802K0745L963
929g63K0577p615o258J7317j1993l225J1283l7301O3804j551j5718K69l635l4391
915i200r632j080n075J1491k7658Q1035k8652k0421J3944L773r93k3659l3793
$$ y = [-53097, -2328, 11232, 29038, 44081, 22822, -14855, -17461, -23663, -18565, 23929, 24159, 35966, 35704, -16251, -6210, 14276, 7810, 23776, 6087, 14963, 43972, 17844, 20228, 26479, 9356, -1229, -47713, -22522, 48197, 1838, -3946, 12771, 24352, -16334, 3122, -2238, -3893, 6925, -17496, -30469, -6939, 4707, 24453, 45360, 901, 10367, 28656, 16934, -25658, 6206, 7482, 22547, -1869, -10030, -1916, -39966, -30501, -25457, -11901, 3425, -580, -7886, -15750, 3758, -23447, -38942, -7271, 17981, 16044, -3976, -16097, 12114, -2681, -14547, -17669, -25471, -4726, -763, 19814, 12199, 5941, 23258, 11265, 8040, 19323, -17978, 45826, 44275, 28557, 28826, 25191, -9200, -18832, -19912, -24987, -13496, -41154, 39881, 11229, -9192, 4752, 8525, 7532, -16127, -49920]
902d9920J4041N3859k2623n993J7710j1036L0463j780j2675k242N997j3314M1873
889D4360k4299o470m743k9538R167K4868J0122l2136j8387K7933L4636l7411k7333
876b9231J9299k43J7099k3705n353m523K5647J1294j2470J7834k5928J1577k4852
863b3555l234K0315J3187r826Q822K3153m206j5922O07m937O540r283j7711J699
849a4351R922M425J3562J6953r92k5647O502j1306o335N7959j7925n0694L772
836a4155K2984j9846K4965j592k5273L7330m2286O4183k5607o637j3520J9721
824B0267O831m252j4367q201K6997l8412K76j0770K3581K8059j209N715k2148
811A2367l543q702Q7J4537p050K6367K008m8891K8398J2217j6442M78L360J9068
$$ y = [-49920, -35879, 17980, -4643, -10636, 7074, -3962, 26501, 24721, 12046, 9804, 15801, 2487, 44360, 20061, 13591, 8848, -20690, -11523, 13345, 23467, -8669, -27056, 877, 35513, -1898, -29231, -9932, -10175, 6924, -16781, -22134, -26657, -1010, 10284, -2186, 15648, -10280, 1297, -23555, -26789, -6474, 6713, -3113, 5709, 28862, 24656, 8734, 9341, 4404, 10944, 1661, -16050, -14351, -4429, -4, 13558, 30511, 29519, 3872, 10374, -932, -7267, 50692, 32767, -17927, -14155, 8829, -11017, 13948, 12356, -12917, 24413, -17873, 46310, 20703, 14066, 546, 20267, 27098, 22846, 8479, 278, 27275, -11137, -10861, -21631, 1950, 30009, 28800, 34515, 12367, 8824, 122, 209, 14746, 7696, 34063, 36071, -12820, 15578, 27795, 11353, 11831, 15191, 34259]
797C4259m329k5485Q213J9442m0914p686R942J5429k5541o317N04k1171J0245
784c3409L3735M632j9751R800J0105j898k6349J1163K5866r088J3519q663K289
771A1951q692k5924J8951l4761M6722J0949k1521N3568o189j1795k6924J257K6143
758C3735r16l1875j4335r543r558q179O986K1302j1396j2963J9099j5289L0659
745b273J8501J0329j8067J5440j0661k6272L135j0864J0458j5736N3854l055j2004
732A2785k3882J2076J6985p485M811j2545M1986m7156L499l1787L9845j9576k29
719a0673K4348l3368K8652m495l6227Q416L7145q80k7784p051K3341J366k5706
706b2916N697l128L004J8420J9039j6444r210R423k9454J1909k2571j4090m457
$$ y = [34259, 29930, 4445, 12658, 32100, -8814, -16500, -6558, 8871, -16670, -22987, -22483, -43654, -33409, 326, 4958, -14793, -4993, 5112, 3214, -23135, -11972, 13894, 4806, 18325, 9662, 11951, 3259, -22665, -3714, -38475, 8247, 19196, -2325, 51243, 45054, 33259, 6335, 7592, 33735, 32819, 944, -13391, -22934, -32492, -40671, -33685, -12383, -23779, -36742, -17643, -32932, -2273, 16228, 26557, 8490, 23930, 13269, -13003, -9868, -20732, -10274, -26010, 27844, 24789, 12785, -11097, 979, 17964, 10479, 15290, 2745, 44731, -2425, 1074, -30713, 9132, -10444, -10673, 13675, -19693, 8959, 4464, -31763, -23347, 13798, 12918, -14866, -21917, 1424, 2790, -22916, -17219, -20347, -17343, 1077, 20116, 3672, -5538, 3885, -25569, -13660, -36231, -50321, -54778]
693e4778L3998J3967r96J5042k4377k0007K0402R18k285N898k8141L2376M895
680c088o25J257o208J742K7070k624m8047K8826j337P036L8502k7256J2245p375
666B0118j0592r887q54j7006O455K8719k5009K4356k3742J8077K7943j6270j1870
653A0438m676j3294q236J3070m1757L0212J9650m450J7724l6995n748K4376K1013
640B1327j5963l942k1222K5959k8337N2606j1979n9759L0500J086k176p458J3069
627f289J9896j8137j34p505m197J5368K5697l9504L8199l2327j3712K1948q584
614i281j827o570k594L632P537j6287L2994l653R628k5277j5568J1493o201Q159
600a3815Q503n269j3429M026j6283K7995j0948L263J8867L4647j4465r604J2071
$$ y = [-54778, -20780, -6813, -7809, 7233, -17144, -37151, -16749, -15831, -18116, -12218, -40359, -7983, -3088, -3713, -2456, -8664, -6922, 20148, 17524, -30523, -1697, -3034, 4002, 42504, 15248, 27493, 20118, 9526, -361, -1215, -18221, -11766, 16953, -8056, 16300, -7442, 10635, 38578, 22308, 10438, 5762, -7532, -15768, -2698, -44455, -14243, 5407, 957, 18681, -18314, -24062, 314, 21327, 5364, 1422, -19800, 6159, -22178, 30428, 18449, -41310, -10810, -9724, -11900, -19358, -6289, 13607, -4530, -4664, -12169, -16366, -998, 24699, -14805, 23394, -8933, -22645, -697, -9281, -11108, -17678, -20272, -16640, -9103, -25390, 7604, 3951, 13579, -11698, -27266, -15773, -21974, -13815, -5312, -10581, -24010, -19984, -36267, -8272, -19220, -15957, 2910, 37557, 23092, 13488, 25559]
587B5559l4997L5717k6187J629j9498K6220m694j6490Q969J3523k118j2231K2604
574A8006k4772K5742K765n4887J3986K6846J4870o628r329J5751l2815k7973q544
561d6982o269L2492l3568j1224M2141N5833m4622k0685N8916k775k5104K3586
549B1739j1489J2807m0578J5067L8663m7167J0632j1269j718K8403p737J6142
537B3495l9251j6545k804K0779m423j1907k607j603L6336k1054K1999j029k7871
524b6485J7975J7581L246j6484k533K2566k9327R957N912q664J7986k6257r876
511b4403R352j9517K6894N6J3592k4412l424O934N630J2847m6452o694K0403J559
497b7635r46J0810p73j3959n33L5252J4568n370J8936k941j5678m1225k5781M6194
$$ y = [25559, -9438, 26279, 92, 1721, -17777, 8443, 3749, -12741, -3772, 9751, 7633, -4598, 18006, -6766, 18976, 21741, -33146, -19160, 7686, 22556, 15928, 6599, 22350, -10465, -38438, -46982, -53251, -20759, -54327, -65551, -23410, 32423, -12199, -32884, 26032, 23257, -1847, 21739, 10250, 23057, -17521, -2454, 36209, -10958, -326, -11595, -13313, 15090, 7353, 23495, -15756, -32301, -35105, -14326, -18749, -30656, -33263, -34866, 1470, -19584, 2415, 1386, -26485, -8510, 9071, 12317, -4167, -6700, 15866, -13461, -3504, 2408, -6256, 11730, -14527, -24403, -15051, -34568, -7674, -7618, 5974, -18438, -21862, -14928, -9298, 3549, -42903, -49597, -29194, -27635, -28581, -17771, -18544, -32503, -33036, 2216, 16784, 11414, 30350, 27409, 11731, -29494, -55275, -9081]
483i081n226P42j2041K1134k5345k6046N978J1911J4577k7322J9831L5408J1038
470A5558n0301K6803j8967q931p639j684j4633l908j2469Q211j0735J6051P5122
457A2478m927k1911j1938K059l3475N7579K5269k9843N6283j8472o6528k5737
445e9163K4763J7636J7073n4980J7250q246N849L3899k2447L7545n7647J9069
433b9399L4429j6956J8554j5722k2939J4736j7021j4178J2255K3041k2441N9658
421B4017l7353K545L128P604j0683k5871M1055k5243M277M371J1654l7183J7671
408b0011k5659j6490M4941K7217k9171l2235J1216L537K9423K295r179R37k8248
395d1427j9173J3368r1K8182j4212R710n421m0629J1929M297L7132k3840j9285
$$ y = [-9081, -14307, -13565, -25606, -4472, -29817, -55863, -49885, -37974, -23397, -50719, -30888, 4520, 15558, -34743, -7940, -26907, -35838, -43477, -45161, -59794, -63702, -76171, -67960, -78695, -62644, 12478, 7551, -14360, -26298, -24239, -57714, -135, 25134, -4709, 51574, 33102, -33426, -59163, -34400, -16764, 309, -54671, -37421, -45667, -39818, -5919, -28366, 9179, -48468, -29399, 5030, -11926, 6628, -9094, -32033, -17297, -34318, -48496, -36241, -13200, -35641, 24017, -13336, -10791, -7663, -59, -10742, -36613, 4442, -20801, -16524, -12153, -499, -37682, -20011, -45670, -62160, -17219, 9998, -19173, -51408, -40192, -36655, -7232, -4937, -14116, -13179, -41427, -60600, -47232, -47323, -19141, -33353, -23643, -29064, -69693, -57764, -53467, -16335, -40175, -59460]
382e9460J5158j7319L7126k1961K0788k914K8410R987n8691M78J6112J2297L468
369a6521l146o732L5668k9673j8495R093r627R784J1256k2474m153K4070j8671
356c9621K221q567n714Q371m00k2133J0928K4687p480J2119l4706J7108K4288
343a8899l2898j1096P242R162J7658j7798J7481k558j695p773k751M5690k3400
330b1635j9815O67J7131J8064k755q672l134o795j3325N2420m7963J8214p232
317b4830J3080k5565K9149j0328n6914K2727K6978J983m3230N5907J4025K41k6717
304b3494r417L498l6800P507J9670l1028K0448r686L158J2948K1714n104l9808
291f6394J7900j9165J698K6152k7290K0953K0637l2551O516J8515j3836j5838
$$ y = [-59460, -44302, -61621, -24495, -46456, -25668, -28582, -172, 9815, -48876, -48398, -32286, -19989, -16521, -19667, -26399, 9269, -20404, -38899, -29806, -39433, -29649, -18393, -40867, -45020, -20950, -39621, -37400, -45967, -51681, -43310, -43710, -65843, -54915, -30228, -37708, -25589, -60295, -43187, -18899, -51797, -62893, -55651, -46489, -28831, -46629, -29148, -31706, -33401, -41174, -43925, 1765, -21635, -41450, -40783, -23652, -5588, -8343, -17015, -20149, -26944, -40269, 12151, -35812, -17598, -24830, -11750, -37315, -8166, -18494, -75408, -52681, -25703, -23720, -66950, -11043, 2982, 3223, -23494, -32911, -29413, -66213, -58706, -39036, -70064, -49616, -59302, -56144, -43196, -21482, -26586, -66394, -48494, -67659, -65961, -39809, -67099, -46146, -25509, -58060, -51544, -33029, -46865, -62703]
279f2703L8307k9268j4525L9427K0242m2745j0517n2m683J7311n142K6728L3111
266E491k0110o8066N7568k2298j8275L0893l4155j3279L9084J4606k5223k9330
254h3094K84J8323M0961k721k2576R928R568J8807k4170J3312L528k0274k4997
241f3121J6859N6072j5675j134l579m8716j4997K8911k307j1644m236J8743L029
228d1795j2635K5304K647k2758l718N771J2782q862L3507Q47m962q438o740n807
214c4857k2537k219J6214J7273K301k3034j4072L149K0754j4356k6273L8828K4244
201a4585k0359K9158L1952l8785m3502J4602k415j6579K4673l9396J6617M3617
189a5002j1792o389L815N789j9998j2226n125j6439K1887J1360M625N812J1741
$$ y = [-62703, -24396, -53664, -68189, -28762, -8520, -51265, -61782, -61834, -66517, -49206, -54348, -27620, 5491, -14619, -82685, -25117, -47415, -65690, -34797, -68952, -82231, -43147, -28541, -53764, -83094, -82810, -64487, -23526, -26247, -48823, -38895, -29327, -10520, -34690, -21378, -17850, -38124, -63121, -46262, 9810, -5865, -6999, -10578, -59294, -74291, -45380, -47687, -59331, -63567, -44824, -41795, -54430, -29126, -26479, -49237, -52955, -47184, -34402, -43264, -9757, -8910, -13872, -22310, -29050, -34857, -57394, -59613, -43399, -26126, -23825, -46859, -60931, -57782, -37028, -51384, -77657, -38829, -14585, -34944, -5786, 26166, -12619, -56121, -41519, -43934, -60513, -35840, -75236, -58619, -15002, -26794, -33183, -29368, -23579, -43577, -55803, -60928, -77367, -55480, -44120, -39495, -33683, -21942]
176b1942K756j9625J3616k5660k2639L2446J6011k144k5656M424J915l2960K6210
163e3248k88O130J0608j32j9606K7784M846k1411O986J4752K1647l9523l7651
150g9106N432K7500J9685j5054k5300J4217q827m727L9094j5507k9517J6451J346
137e4313J5755k09j0050K657K4126l1847l3557O761k864l88L2721k0437j6976
124h8621L8368K8253l9486p286J4674J4696j6331N395k6322J1041q277J6811Q282
111d8803M748O398J3564j096k0847o972J1139K16k0015K1805j3600L691k9814
98g9586m904K4757J3300p331j9252J6080L090j0805j3712L2055m706j9811J4104
$$ y = [-21942, -19186, -38811, -25195, -50855, -73494, -41048, -25037, -27181, -52837, -48413, -46498, -79458, -53248, -53536, -47406, -36798, -36930, -56536, -28752, -23906, -45317, -38331, -23579, -1932, -41455, -79106, -73674, -46174, -26489, -41543, -66843, -52626, -61453, -66180, -27086, -42593, -72110, -55659, -54313, -38558, -38767, -48817, -46160, -22034, -53881, -87438, -80677, -83541, -83929, -51208, -71645, -88621, -50253, -22000, -61486, -68772, -54098, -39402, -55733, -50338, -76660, -65619, -73896, -57085, -48803, -44055, -37657, -24093, -25189, -46036, -53008, -41869, -41653, -61668, -39863, -53463, -49772, -79586, -84490, -59733, -46433, -53764, -73016, -56936, -53846, -64651, -78363, -46308, -51014, -70825, -56721]
$$ [...]
##END NTUPLES=NMR SPECTRUM
##END=
