##TITLE=1H_EC-3329(11)
 CDCl3
 8 sc, 
 25.7.2024
##JCAMPDX= 6.0         $$ Bruker NMR JCAMP-DX V2.0
##DATA TYPE= NMR SPECTRUM
##DATA CLASS= NTUPLES
##ORIGIN= UXNMR, Bruker Analytische Messtechnik GmbH
##OWNER= root
$$ XWIN-NMR		Version 3.5
$$ Thu Jul 25 14:03:49 2024 Russian Standard Time (UT+4h)  she@DPX200
##.OBSERVE FREQUENCY= 200.1315
##.OBSERVE NUCLEUS= ^1H
##.ACQUISITION MODE= SIMULTANEOUS
##.ACQUISITION SCHEME= undefined
##.AVERAGES= 8
##.DIGITISER RES= 18
##SPECTROMETER/DATA SYSTEM= spect
##.PULSE SEQUENCE= zg30
##.SOLVENT NAME= D2O
##.SHIFT REFERENCE= (INTERNAL, D2O, 0, 20.4861)
##AUDIT TRAIL= $$ (NUMBER, WHEN, WHO, WHERE, WHAT)
$$ ##TITLE= Audit trail, XWIN-NMR		Version 3.5
$$ ##JCAMPDX= 5.01
$$ ##ORIGIN= Bruker BioSpin GmbH
$$ ##OWNER= she
$$ F:/spectra/data/she/nmr/H-F/1/pdata/1/auditp.txt
$$ ##AUDIT TRAIL=  $$ (NUMBER, WHEN, WHO, WHERE, WHAT)
(   1,<2024-07-25 14:02:23.25 +0400>,<she>,<DPX200>,
      <created by zg, POWCHK disabled, PULCHK disabled
       configuration hash MD5:
       00 E9 B6 7A A2 85 ED C7 34 08 36 98 17 FE 4E 26
       data hash MD5: 16K
       A8 1C DD 65 1B 38 D6 0B A4 BB E9 2E 81 5E A0 59>)
(   2,<2024-07-25 14:02:26.70 +0400>,<she>,<DPX200>,
      <Start of raw data processing
       efp BC_mod = 2 LB = 0.24 FT_mod = 6 PKNL = 1 PHC0 = -25796.5 PHC1 = 15.78749 SI = 16K 
       data hash MD5: 16K
       32 24 24 42 94 17 ED 43 D1 F5 06 9D A6 C6 AD 62>)
(   3,<2024-07-25 14:02:46.39 +0400>,<she>,<DPX200>,
      <pk PHC0 = 2.243089 PHC1 = -1.2 
       data hash MD5: 16K
       57 3F 4D BF 00 CE 91 21 4F 95 39 1D 8B EB A8 42>)
(   4,<2024-07-25 14:02:50.20 +0400>,<she>,<DPX200>,
      <abs ABSG = 5 
       data hash MD5: 16K
       45 FB 61 82 39 DD 5F E7 76 E8 7B 63 B5 48 64 4E>)
$$ ##END=
$$ 
$$ hash MD5
$$ DF 1A BE 3A 65 EB 00 13 9C BC 4C E5 83 08 2F 8E
##$RELAX= 
##$RELAX= 
##$RELAX= 
##$RELAX= 
##$RELAX= 
##$RELAX= 
$$ Bruker specific parameters
$$ --------------------------
##$DU= <F:/spectra>
##$EXPNO= 1
##$NAME= <H-F>
##$PROCNO= 1
##$TYPE= <nmr>
##$USER= <she>
##$AMP= (0..31)
100 100 100 100 100 100 100 100 100 100 100 100 100 100 100 100 100 100 
100 100 100 100 100 100 100 100 100 100 100 100 100 100 
##$AQSEQ= 0
##$AQ_mod= 1
##$AUNM= <au_zg>
##$AUTOPOS= <>
##$BF1= 200.13
##$BF2= 200.13
##$BF3= 200.13
##$BF4= 200.13
##$BF5= 200.13
##$BF6= 200.13
##$BF7= 200.13
##$BF8= 200.13
##$BYTORDA= 1
##$CFDGTYP= 0
##$CFRGTYP= 5
##$CHEMSTR= <none>
##$CNST= (0..31)
1 1 145 1 1 1 1 1 1 1 1 1 1 1 1 1 1 1 1 1 1 1 1 1 1 1 1 1 1 1 1 1 
##$CPDPRG= <>
##$CPDPRG1= <>
##$CPDPRG2= <>
##$CPDPRG3= <>
##$CPDPRG4= <mlev>
##$CPDPRG5= <mlev>
##$CPDPRG6= <mlev>
##$CPDPRG7= <mlev>
##$CPDPRG8= <mlev>
##$CPDPRGB= <>
##$CPDPRGT= <>
##$D= (0..31)
0 1.2 0 0 0 0 0 0 0 0.06 0 0.03 0 0 0 0 0.0002 0 0 0 0 0 0 0 0 0 0 0 0 
0 0 0 
##$DATE= 1721901742
##$DBL= (0..7)
120 120 120 120 120 120 120 120 
##$DBP= (0..7)
150 150 150 150 150 150 150 150 
##$DBP07= 0
##$DBPNAM0= <>
##$DBPNAM1= <>
##$DBPNAM2= <>
##$DBPNAM3= <>
##$DBPNAM4= <>
##$DBPNAM5= <>
$$ [...]
##$SUBNAM3= <"">
##$SUBNAM4= <"">
##$SUBNAM5= <"">
##$SUBNAM6= <"">
##$SUBNAM7= <"">
##$SUBNAM8= <"">
##$SUBNAM9= <"">
##$SW= 24.0689530833862
##$SWIBOX= (0..15)
0 0 2 0 0 0 0 0 0 0 0 0 0 0 0 0 
##$SW_h= 4816.95568400771
##$TD= 16384
##$TD0= 1
##$TE= 0
##$TE2= 300
##$TE3= 300
##$TEG= 300
##$TL= (0..7)
0 120 120 120 120 120 120 120 
##$TP= (0..7)
150 150 150 150 150 150 150 150 
##$TP07= 0
##$TPNAME0= <>
##$TPNAME1= <>
##$TPNAME2= <>
##$TPNAME3= <>
##$TPNAME4= <>
##$TPNAME5= <>
##$TPNAME6= <>
##$TPNAME7= <>
##$TPOAL= (0..7)
0.5 0.5 0.5 0.5 0.5 0.5 0.5 0.5 
##$TPOFFS= (0..7)
0 0 0 0 0 0 0 0 
##$TUNHIN= 0
##$TUNHOUT= 0
##$TUNXOUT= 0
##$USERA1= <user>
##$USERA2= <user>
##$USERA3= <user>
##$USERA4= <user>
##$USERA5= <user>
##$V9= 5
##$VALIST= <valist>
##$VCLIST= <CCCCCCCCCCCCCCC>
##$VD= 0
##$VDLIST= <DDDDDDDDDDDDDDD>
##$VPLIST= <PPPPPPPPPPPPPPP>
##$VTLIST= <TTTTTTTTTTTTTTT>
##$WBST= 1024
##$WBSW= 4
##$XGAIN= (0..3)
0 0 0 0 
##$XL= 0
##$YL= 0
##$YMAX_a= 106335
##$YMIN_a= -232497
##$ZGOPTNS= <>
##$ZL1= 120
##$ZL2= 120
##$ZL3= 120
##$ZL4= 120
##$ABSF1= 20.50521
##$ABSF2= -3.563946
##$ABSG= 5
##$ABSL= 3
##$ALPHA= 0
##$AQORDER= 0
##$ASSFAC= 0
##$ASSFACI= 0
##$ASSFACX= 0
##$ASSWID= 0
##$AUNMP= <proc_1d>
##$AZFE= 0.1
##$AZFW= 0.1
##$BCFW= 0
##$BC_mod= 2
##$BYTORDP= 0
##$COROFFS= 0
##$CY= -3
##$DATMOD= 1
##$DC= 0
##$DFILT= <>
##$DTYPP= 0
##$F1P= 0
##$F2P= 0
##$FCOR= 1
##$FTSIZE= 16384
##$FT_mod= 6
##$GAMMA= 0
##$GB= 0
##$INTBC= 1
##$INTSCL= 3.70164e-10
##$ISEN= 128
##$LB= 0.24
##$LEV0= 0
##$LPBIN= 0
##$MAXI= 10000
##$MC2= 0
##$MEAN= 0
##$ME_mod= 0
##$MI= 1.114404
##$NCOEF= 0
##$NC_proc= -8
##$NLEV= 6
##$NOISF1= 3.799351
##$NOISF2= 2.8
##$NSP= 0
##$NTH_PI= 0
##$NZP= 0
##$OFFSET= 20.48611
##$PC= 1
##$PHC0= -25794.26
##$PHC1= 14.58749
##$PH_mod= 1
##$PKNL= yes
##$PPARMOD= 0
##$PSCAL= 0
##$PSIGN= 0
##$REVERSE= no
##$SF= 200.129808598241
##$SI= 16384
##$SIGF1= 3
##$SIGF2= 2
##$SINO= 5.538805
##$SIOLD= 16384
##$SREGLST= <1H.CDCl3>
##$SSB= 0
##$STSI= 16384
##$STSR= 0
##$SW_p= 4816.95568400771
##$SYMM= 0
##$S_DEV= 0
##$TDeff= 16384
##$TDoff= 0
##$TI= <>
##$TILT= no
##$TM1= 0
##$TM2= 0
##$TOPLEV= 0
##$USERP1= <user>
##$USERP2= <user>
##$USERP3= <user>
##$USERP4= <user>
##$USERP5= <user>
##$WDW= 1
##$XDIM= 16384
##$YMAX_p= 397153463
##$YMIN_p= -1036161
$$ End of Bruker specific parameters
$$ ---------------------------------
##NTUPLES= NMR SPECTRUM
##VAR_NAME=  FREQUENCY,     SPECTRUM/REAL,   SPECTRUM/IMAG
##SYMBOL=    X,             R,               I
##VAR_TYPE=  INDEPENDENT,   DEPENDENT,       DEPENDENT
##VAR_FORM=  AFFN,          ASDF,            ASDF
##VAR_DIM=   16384,         16384,           16384
##UNITS=     HZ,            ARBITRARY UNITS, ARBITRARY UNITS
##FACTOR=    0.29402158847633, 1,            1
##FIRST=     4099.88141076289, 0,            0
##LAST=      -717.074273244816, 0,           0
##MIN=       -717.074273244816, -1036161,    0
##MAX=       4099.88141076289, 397153463,    0
$$ Real data points
##PAGE= N=1
##DATA TABLE= (X++(R..R)), XYDATA
$$ [...]
10317A48885n11583L98304M22344l64696m3929p480J70893q9227J46008j07709
$$ 148885 -362698 35606 457950 93254 49325 41845 212738 123511 269519 161810
10307A61810p7381M7878J48031l25155J15376K58117k80406L29063j23331m17226
$$ 161810 84429 132307 280338 -44817 70559 328676 48270 377333 254002 -163224
10297a63224j8536M06956J54130j96224J02727l31021J28544q4842K33564J28436
$$ -163224 -181760 225196 379326 183102 285829 -45192 83352 -1490 232074 360510
10287C60510l66558L7426j19043l8553R0469k14193K28983r2310m9149M55492
$$ 360510 -6048 31378 -87665 -126218 -35749 -249942 -20959 -113269 -162418 293074
10277B93074k66322N6194K9675J42429J42112j91548l14179j33669K11389n6636
$$ 293074 26752 82946 112621 255050 397162 205614 -108565 -242234 -30845 -87481
10267h7481K74462j37572k32698K02054K2467k48136j77679M63183J8851J02884
$$ -87481 186981 49409 -183289 18765 41232 -206904 -384583 78600 97451 200335
10257B00335j73562j87136K28306m70868K57002M34407J685J67971k98432m0054
$$ 200335 26773 -160363 67943 -402925 -145923 288484 290169 458140 159708 119654
10247A19654j60314J34939k10738k7660O08191j66690J6826l8687r9125L924J94987
$$ 119654 -40660 94279 -116459 -144119 464072 297382 314208 275521 176396 180320 375307
10236C75307p7373j07109J3122J02764j74280m2359J14990J79563j32476p0368
$$ 375307 297934 190825 203947 306711 132431 90072 205062 384625 252149 181781
10226A81781J4278L07869J7444k50912m22171J48902N57800k8291m46229m494
$$ 181781 196059 503928 521372 270460 -151711 -2809 554991 526700 80471 75977
10216G5977J17873R6754p6386l90366J63984P2862J74124k07395Q563l31256L68271
$$ 75977 193850 290604 214218 -176148 -12164 60698 234822 27427 35990 -295266 73005
10205G3005k08796J70067j56464N2940K9001m05142j52143O10025J61868j41377
$$ 73005 -135791 34276 -122188 -69248 -40247 -445389 -597532 12493 174361 32984
10195C2984j74467L00130l13795k70466r8784M32365j67065j56518k16143J20419
$$ 32984 -141483 158647 -155148 -425614 -524398 -92033 -259098 -415616 -631759 -511340
10185e11340N83004k6024M3953n91744R9797K23221J64861K58992j15264j63129
$$ -511340 71664 45640 89593 -502151 -402354 -179133 -14272 244720 129456 -33673
10175c3673J67546k36777p502J84088l0335l7394j31363K19069k71138j98989
$$ -33673 133873 -102904 -110406 73682 43347 5953 -125410 93659 -177479 -376468
10165c76468j8236J04218K9180k55936P48117M04042o45507j67691L22605K7876
$$ -376468 -394704 -290486 -261306 -517242 230875 634917 -10590 -178281 144324 172200
10155A72200K27581m93967K70335k24502J63431m55197J95967l6496J30679J25391
$$ 172200 399781 -94186 176149 -48353 115078 -340119 -144152 -180648 -49969 75422
10145G5422j15502K82963o5734K7404J7933l22749L50657o765j29816l1289k28133
$$ 75422 -40080 242883 177149 204553 222486 -100263 250394 243629 113813 82524 -145609
10134a45609N6844M3013j0477r81N59753k7364k61159j69262M4049l61428N29435
$$ -145609 -88765 -45752 -56229 -57210 502543 475179 214020 44758 88807 -272621 256814
10123B56814R9293j37456j6718j56009l16808p9986K22604J1574l0695N2197O3922
$$ 256814 356107 218651 201933 45924 -270884 -350870 -128266 -116692 -147387 -95190 -31268
10112c1268o0552L42323j00514P7597k82159l37039K07055m2900J81389J6069
$$ -31268 -91820 250503 149989 227586 -54573 -391612 -184557 -227457 -46068 -29999
10102b9999j96713K48977K01767j97615O9262L09320R9555j80779n08238M7324
$$ -29999 -226712 22265 224032 26417 95679 404999 504554 323775 -184463 -137139
10092a37139K14695m63540J47084r1533L16570K41666m02921K43871q6614K51058
$$ -137139 77556 -385984 -238900 -330433 -13863 227803 -175118 68753 -17861 233197
10082B33197l02021M25818k14322n16845K12111j09920K24326M4913K75873k53713
$$ 233197 -68824 356994 142672 -374173 -162062 -271982 -47656 -2743 273130 19417
10072A9417j05299J51598k59967R8158o2338j92043J55916K29331M0078J74817
$$ 19417 -85882 65716 -194251 -96093 -158431 -350474 -194558 34773 74851 249668
10062B49668j84324r1679k2035m8159M2034o8506j41898J2207N65078J70221o01732
$$ 249668 65344 -26335 -48370 -96529 -54495 -123001 -264899 -252692 312386 482607 -119125
10051a19125K42303J9647j3206M99812l36493m02781j84202K6669j77365J26099
$$ -119125 123178 142825 129619 629431 292938 -109843 -294045 -267376 -444741 -318642
10041c18642M13768j10211J71259k43496k25511J52170o9148J78665j714J927
$$ -318642 95126 -15085 156174 -87322 -312833 -160663 -229811 -51146 -52860 -50933
10031e0933j18622J41814J97211l0653r1613J67533P4500k55086j44023n3151
$$ -50933 -169555 -27741 169470 138817 47204 214737 289237 34151 -109872 -163023
10021a63023j9625l1849l00612N74714J61376J41409l50076j76697j36076m67628
$$ -163023 -182648 -214497 -515109 59605 220981 362390 12314 -164383 -300459 -768087
10011g68087L82929O3635L21489r5090k31873K02791O2455k55146K877L11581
$$ -768087 -385158 -321523 -34 -95124 -326997 -124206 -61751 -316897 -314020 -2439
10001b439J05410j80983K22087Q9804j10184p9110Q02K59454l59327n946o4151
$$ -2439 102971 -78012 144075 233879 123695 44585 45387 304841 -54486 -60432 -124583
9990a24583k91543o3713N25406K73341j86814j48521j20299l37797O30776k14198
$$ -124583 -416126 -479839 45567 318908 132094 -16427 -136726 -474523 156253 -57945
9980e7945m12323J19086L09207K63028l2459j38399J61298j64644J53909j72804
$$ -57945 -470268 -351182 -41975 221053 188594 50195 211493 46849 200758 27954
9970B7954k93629J05104J26254L8187P4763J76194l57327j96036J44083l96908
$$ 27954 -265675 -160571 -34317 3870 78633 254827 -102500 -298536 -154453 -551361
9960e51361M91785j8210m63759M04010M03585j29646l40390m4554L42582n7K95550
$$ -551361 -59576 -77786 -541545 -137535 266050 136404 -203986 -248540 94042 93985 389535
9949C89535p3247k91454j46485k61841M45661K7431K13978l73607m529k6360j56229
$$ 389535 316288 24834 -121651 -383492 62169 89600 303578 -70029 -74558 -100918 -257147
9938b57147r4654j29258R8866J02524K83748j13822n92514K56558n4720M56207
$$ -257147 -351801 -481059 -382193 -279669 4079 -109743 -702257 -445699 -500419 -44212
9928d4212l2718Q3467o3711k41632K2301N94534j01047j18202j73576J03387l15777
$$ -44212 -76930 6537 -57174 -298806 -276505 318029 216982 98780 -74796 28591 -287186
9917b87186n2334J50299k1390n9260r9186J408J22679L96584M9288j42162J3494
$$ -287186 -339520 -189221 -210611 -269871 -369057 -367649 -244970 151614 200902 58740 72234
9906G2234k77284P5738j56435l56302L13572L36314k42627K25497j34185l31199
$$ 72234 -205050 -129312 -285747 -642049 -328477 7837 -234790 -9293 -143478 -474677
9896d74677N7368K05007K14480J13388j52977J5698N35523k18547j89116p0622
$$ -474677 -417309 -212302 2178 115566 -37411 -21713 513810 295263 106147 35525
9886C5525k2415o4654l52357M6098L43455k45052K30662j66383L36707K38570
$$ 35525 13110 -51544 -403901 -357803 -14348 -259400 -28738 -195121 141586 380156
9876C80156k25068J42608j7409J09121J50534j56301j36202j02442k4703P6791
$$ 380156 155088 297696 280287 389408 539942 383641 247439 144997 120294 197085
9866A97085j56264l5917J01844j10548k0837P211p9021O4528j15697l5555L79041
$$ 197085 40821 4904 106748 -3800 -24637 -17426 -96447 -31919 -147616 -183171 195870
9855A95870l59229N9733O1394k03943O0455M4265l7161N5286J51720J50518Q0635
$$ 195870 -163359 -103626 -42232 -246175 -185720 -141455 -178616 -123330 28390 178908 259543
9844B59543m36362K33435J11293j58790O4113j98712j87747J74509P6379k90323
$$ 259543 -176819 56616 167909 9119 73232 -125480 -313227 -138718 -62339 -352662
9834c52662J52103J73145j15467J41571l860P6074K20485N7416l6555l9834P2659
$$ -352662 -200559 -27414 -142881 -1310 -5170 70904 291389 348805 312250 272416 345075
9823C45075k83102L4157n2234P4143k09200m8067J68P4378J04402j75807L1188
$$ 345075 61973 96130 43896 118039 -91161 -139228 -139060 -64682 39720 -136087 -104899
9812a04899K51465l06807J0728l30857K35218L58563l00427J14775K92767n8449
$$ -104899 146566 -160241 -149513 -480370 -245152 113411 -187016 -72241 220526 162077
9802A62077k07503j06882K37804m28391J91928K63547m51624J51754K54540j34409
$$ 162077 -45426 -152308 85496 -342895 -150967 112580 -339044 -187290 67250 -67159
9792f7159k53943P6475j21731K94016J39564j43348j82880R7304j20742K48330
$$ -67159 -321102 -244627 -366358 -72342 67222 -76126 -259006 -161702 -282444 -34114
9782c4114o9174j72885M77930j57569j83655k2841k61674k05477M49859L29590
$$ -34114 -103288 -276173 201757 44188 -139467 -162308 -423982 -629459 -179600 149990
9772A49990l15215j8393m0013L54096J43634m4141j00985m37683k11084L30880
$$ 149990 -165225 -183618 -223631 130465 274099 229958 128973 -308710 -519794 -188914
9762a88914J47535K3448l09378l34209N90358j95056j15773N93552j67681N15211
$$ -188914 -41379 -17931 -327309 -661518 -71160 -266216 -381989 211563 43882 559093
9752E59093j79336k25050j3449k04936j49611K62345J50852j43806k30693K8446
$$ 559093 379757 154707 141258 -63678 -213289 49056 199908 56102 -174591 -146145
9742a46145j91701J98280J82319k74681K15834l28931k74074P16204q9116q3771
$$ -146145 -337846 -139566 42753 -231928 -16094 -345025 -619099 97105 7989 -75782
9732g5782J55346k5501j7843R3796J94437j53382k6808l24586l4112q693m4264
$$ -75782 79564 54063 36220 130016 324453 171071 144263 -180323 -214435 -223128 -267392
9721b67392J73388L65703j27119o829j19303M25978l97290o0235j43450j71013
$$ -267392 -94004 271699 144580 137751 18448 444426 47136 -13099 -156549 -327562
9711c27562J36970L92673m14145J16330K38694p8594O17207j23482l36734l9173
$$ -327562 -190592 202081 -212064 -95734 142960 64366 681573 558091 221357 182184
9701A82184m6222L3513j38315M3919Q1255j75762J06421l00693K9894L57911L0472
$$ 182184 135962 169475 31160 75079 156334 -19428 86993 -213700 -183806 174105 204577
9690B04577K2310j69477k14644K22297j0079k3954J93036n21740j52203K64353
$$ 204577 226887 57410 -157234 65063 54984 31030 224066 -297674 -449877 -185524
9680a85524M2699j37020K97240K77830r2706M7435k74007K45635L4823j13490
$$ -185524 -142825 -279845 17395 295225 202519 249954 -24053 221582 256405 142915
9670A42915k05542J02802M1620l8875l57524j79862N30892N496k16442k27068
$$ 142915 -62627 40175 81795 42920 -314604 -494466 36426 41922 -174520 -401588
9660d01588P5056M06062n5854l15939k79417M20373K35468j08707J29989n225
$$ -401588 -326532 79530 23676 -292263 -571680 -151307 84161 -24546 105443 100218
9650A00218j40621q1545l04085J14108K57387L81613j28346K73078l91302K12819
$$ 100218 -40403 -121948 -426033 -311925 -54538 327075 198729 471807 80505 293324
9640B93324L65687l14836k81434k35922J42200K34956k65384k3834J41276Q5416
$$ 293324 659011 344175 62741 -173181 -30981 203975 -61409 -85243 56033 141449
9630A41449j93973l41260J54011Q8637J3625j1183K12482q6412L3423j39570k77869
$$ 141449 -52524 -393784 -239773 -151136 -137511 -148694 63788 -22624 10799 -128771 -406640
9619d06640k88729M23282J34305r3462j9778j44396L67702q0267l1352J95382
$$ -406640 -695369 -272087 -137782 -231244 -251022 -395418 -27716 -107983 -139335 56047
9609E6047M84076o25890k21257j31755O060O40325l84759n8181k0385l3106j49449
$$ 56047 540123 -85767 -307024 -438779 -432719 207606 -177153 -235334 -255719 -288825 -438274
9598d38274L11193j92112M23498l91681L44132j49k59489N9121J53895J78616
$$ -438274 -127081 -319193 104305 -287376 56756 56607 -202882 -143761 10134 188750
9588A88750o6118O993l27489j95588J82691k57026J93011K29546K02221l1185
$$ 188750 122632 129625 -197864 -393452 -210761 -467787 -274776 -45230 156991 125806
9578A25806J3229K07576k59877k02510l6173J36198k60884j29560j26430K12617
$$ 125806 139035 346611 86734 -115776 -151949 -15751 -276635 -406195 -532625 -320008
9568c20008L86995r9079k8624J99179k01608l74094J15240N08960r2823L08629
$$ -320008 66987 -32092 -60716 138463 -63145 -437239 -321999 186961 94138 402767
9558D02767J951n64140l2936N03594k53923J00001j93901J9485M5871K40973j29453
$$ 402767 404718 -159422 -192358 311236 57313 157314 -36587 -17102 28769 269742 140289
9547A40289k7549K15928Q5076k88230J02816R0761l4493l65122O6867J79240l00388
$$ 140289 112740 328668 413744 125514 228330 319091 284598 -80524 -13657 165583 -134805
9536a34805j37075K97177M857J24875p1595l39232M28452L03367J0943l42011
$$ -134805 -271880 25297 30154 155029 83434 -255798 172654 476021 486964 144953
9526A44953k05937k9393L08149j57094m30480R1436J26250Q3770j92642m1815
$$ 144953 -60984 -90377 217772 60678 -369802 -278366 -152116 -68346 -260988 -302803
9516c02803K1612L19138k1742j56192K06362R5222r9864m426P9627K23860J07014
$$ -302803 -281191 37947 16205 -139987 66375 161597 61733 57307 136934 360794 467808
9505D67808n81944k07799L49184j96834N3631o9396r9225K50739l69369M03685
$$ 467808 -114136 -321935 27249 -169585 -115954 -185350 -284575 -33836 -403205 480
9495D80K40878R6106k72767k70013n6456N27668k50597m0586j5322K48641k75966
$$ 480 241358 337464 64697 -205316 -261772 265896 15299 -25287 -40609 208032 -67934
9484f7934k61296j89290j1086K06470J42898K2012N8115j2631j73563n1589K35993
$$ -67934 -329230 -518520 -529606 -323136 -180238 -158226 -100111 -112742 -286305 -337894 -101901
9473a01901L08445J20616k37008n10070O0645N27887J05751J58876J39088m86076
$$ -101901 206544 327160 90152 -419918 -359273 168614 274365 433241 572329 86253
9463H6253k85982K2596Q5167j67539M0220J04353k17074k2979L59009o791m21150
$$ 86253 -199729 -177133 -91966 -259505 -219285 -114932 -332006 -354985 4024 -2767 -423917
9452d23917M19741j32266n4645k29234J90390L4708k3800K45319k58401J69334
$$ -423917 -4176 -136442 -191087 -420321 -229931 -195223 -219023 26296 -232105 -62771
9442f2771M48043P7966l35589m65645K14075J18380R8376K62077l95754r3737
$$ -62771 385272 463238 127649 -337996 -123921 -5541 92835 354912 -40842 -134579
9432a34579j02384J46951k16532o2275L40285l4411M06117j16602n3160O5756
$$ -134579 -236963 -90012 -306544 -368819 -28534 -62945 343172 226570 173410 239166
9422B39166o7421j06273K20555K0580m37670K40342J18710M5131n62589K1342
$$ 239166 171745 65472 286027 306607 -131063 109279 227989 273120 -289469 -268127
9412b68127K50758r4626k3079O1402k13999K45242J12734K21548j41487n15556
$$ -268127 -17369 -111995 -135074 -73672 -287671 -42429 70305 291853 150366 -365190
9402c65190K61728k45753K99813n4530q9955L70661k8978j48716L7812m9782j68643
$$ -365190 -103462 -349215 -49402 -103932 -193887 176774 147796 -920 36892 -12890 -181533
9391a81533K9564m6720m5395j62358M25835O9383J20280k11899L21019p29691
$$ -181533 -151969 -198689 -244084 -406442 19393 88776 209056 -2843 318176 -411515
9381d11515K00589q1866M96739j61843k71424k09350K69622J32101N3653l6607
$$ -411515 -210926 -292792 203947 42104 -229320 -438670 -169048 -36947 16706 -19901
9371a9901j0446J67717j08834L8005r2520k58801k81926K46088L71533J380j135
$$ -19901 -30347 137370 28536 66541 -25979 -284780 -566706 -320618 50915 52295 51160
9360E1160L2273k48837L06172K76458O6457K4358j65193m82019K44556o6433K4624
$$ 51160 83433 -165404 140768 417226 483683 508041 342848 -139171 105385 38952 63576
9349F3576J3593K01740l37884j5344L42480k45482N9157J40328M3734j66848l51960
$$ 63576 77169 278909 -58975 -74319 268161 22679 81836 222164 265898 99050 -252910
9338b52910J14939l23054L87308l18996o709J81905j1365K70723K19474k87910
$$ -252910 -137971 -461025 -73717 -392713 -399422 -217517 -228882 41841 261315 -26595
9328b6595n58786P08543L30049n66952Q5662P4947k61359j53912P8445K24988
$$ -26595 -585381 123162 453211 -113741 -28079 46868 -214491 -368403 -289958 -64970
9318f4970K16152L16022l25096m1007M5634J40422m97148L39058q4239O4351n8341
$$ -64970 151182 467204 142108 101101 146735 287157 -209991 129067 44828 109179 50838
9307E0838m1080J13658l31116R3838J46337P0794K58460k15015o5252O3038j22157
$$ 50838 9758 123416 -207700 -113862 32475 103269 361729 146714 81462 144500 22343
9296B2343q9841k45662K71260l4173j28218k17821j02010J11930O43811n9217
$$ 22343 -67498 -313160 -41900 -76073 -204291 -422112 -524122 -412192 231619 172402
9286A72402L8137m972n2791m4464r1576k44918L44880p0437P3760p4340l05098
$$ 172402 210539 205567 152776 108312 16736 -228182 116698 46261 120021 45681 -259417
9275b59417r6832J91311O7788J86613J22340p7443n65145M07711k06308K98039
$$ -259417 -356249 -164938 -97150 89463 211803 134360 -430785 -23074 -229382 68657
9265F8657J12651q7742M13183p8604j96336k33197j34222M1601k8666j27193L05947
$$ 68657 181308 93566 506749 428145 231809 -1388 -135610 -94009 -122675 -249868 56079
9254E6079k34917J03334O26689k58116o9049j45058J9404m8822j1675L6460p9374
$$ 56079 -178838 -75504 551185 293069 224020 78962 98366 49544 37869 74329 -5045
9243e045M32934m75102J14326K3708k38323J45813L13131J13801J68157l43356
$$ -5045 427889 -47213 67113 90821 -147502 -1689 311442 425243 593400 250044
9233B50044l85420L37746j04646m6587J36459R9207K33691k55591o85674J09327
$$ 250044 -135376 202370 97724 51137 187596 286803 520494 264903 -420771 -311444
9223c11444J23112j73466j16088K91486Q0136j28177J75652p3134J23202k38534
$$ -311444 -188332 -361798 -477886 -186400 -106264 -234441 -58789 -131923 -8721 -247255
9213b47255L96492o0851K94959k11586j4740R0056k46313K65218k76081k36176
$$ -247255 149237 88386 383345 171759 157019 247075 762 265980 -10101 -246277
9203b46277j92255K75367J18894j156L8567M42131o6842J20314j00672n48853
$$ -246277 -438532 -163165 -44271 -45427 -6860 435271 368429 488743 388071 -160782
9193a60782J93650K55141k01676j42871K39228m8866L20352o07263K17999L92868
$$ -160782 32868 288009 86333 -56538 182690 133824 454176 -153087 64912 457780
9183D57780o8304j91816l26614M6591k29041L9644l9939P288J54515R4826n4772
$$ 457780 389476 197660 -128954 -82363 -311404 -271760 -311699 -304411 -149896 -55070 -109842
9172a09842k48417K45818J55038J36915l12094K95319J39715n6649j34477k12648
$$ -109842 -358259 -112441 42597 179512 -132582 162737 302452 245803 111326 -101322
9162a01322P1496r8794L2800O2360l21283j06045K69609J02546Q5487J19344j83783
$$ -101322 -29826 -128620 -95820 -33460 -354743 -460788 -191179 -88633 -3146 116198 -67585
9151f7585p2331j71558M5242K25678O9247N7496J42601j42281k8821r9874L63207
$$ -67585 -139916 -311474 -266232 -40554 28693 86189 228790 86509 57688 -42186 321021
9140C21021m66733j50797J56347M88797l97487n6785L44849m04707O06207k84047
$$ 321021 -145712 -296509 -140162 348635 -48852 -105637 239212 -165495 440712 156665
9130A56665k44938L93251j86371j51241P3683J2593K41581m58360M17327m87292
$$ 156665 -88273 304978 118607 -32634 41049 53642 295223 -163137 254190 -233102
9120b33102l7408n28580M46436N16095p1708j93393q1391L31824k43712m05055
$$ -233102 -270510 -799090 -352654 163441 91733 -101660 -183051 148773 -94939 -499994
9110d99994j32800M69368L00561j8308R4627n3859j95283J04447l87235J92855
$$ -499994 -632794 -163426 137135 118827 213454 159595 -35688 68759 -318476 -125621
9100a25621M36243m97145l17477L57462q4241R4592M38937k74828j77470J18106
$$ -125621 310622 -186523 -504000 -146538 -230779 -136187 302750 27922 -149548 -31442
9090c1442k48865L2943K72806m2087j79540K30724L18906n9137k5694l01113K54853
$$ -31442 -280307 -247364 25442 -16645 -196185 34539 353445 294308 268614 -32499 222354
9079B22354p170r1179q5163k18800L73984j49776M5487l86915M38113L1062n3437
$$ 222354 215184 124005 38842 -179958 194026 44250 89737 -297178 140935 171997 118560
9068A18560o14l60096j30676K39931N81993l26616k59101j21388k39352K50628
$$ 118560 117946 -242150 -372826 -132895 449098 122482 -136619 -258007 -497359 -246731
9058b46731M11237m5460j01179J26441P0031j61870n97717p4369N14583J38989
$$ -246731 164506 119046 17867 144308 214339 52469 -545248 -619617 -105034 33955
9048C3955L33099k39401j90199K29759L0325j69854J16356L378m05707J14733
$$ 33955 367054 127653 -62546 167213 197538 27684 144040 147418 -258289 -143556
9038a43556M3134o6096J13680L1854j41677k7808K54647j09149j92038m0145K0221
$$ -143556 -100422 -166518 -52838 -20984 -162661 -190469 64178 -44971 -237009 -277154 -256933
9027b56933L0653K36144k46551k04850M90476j05134J8066J69311K86964k71020
$$ -256933 -226280 9864 -236687 -441537 48939 -56195 -38129 131182 418146 147126
9017A47126j91604O40976j37496k12460l45893K02153k8739j50303k24292L33348
$$ 147126 -44478 596498 459002 246542 -99351 102802 74063 -76240 -300532 32816
9007C2816j17031r7058N69725M1235J66391n62184l02673K60674J55698k22777
$$ 32816 -84215 -181273 388452 429687 596078 33894 -268779 -8105 147593 -75184
8997g5184j08964j86048K69750N49333n63389N89770o2705j39643l56413k398
$$ -75184 -184148 -370196 -100446 448887 -114502 475268 412563 272920 -83493 -85891
8987h5891J48165r0082k20147J98497J3303k80065J02692J50938J26259l65005
$$ -85891 62274 -27808 -247955 -49458 -36155 -316220 -213528 -62590 63669 -301336
8977c01336L55726k83418R1200K7221L24095k15235J60539l46807K10393J40857
$$ -301336 54390 -229028 -137828 -110607 213488 -1747 158792 -188015 22378 163235
8967A63235k08311k28727M2027M22438L58929k77376k91645L99328n39096l49475
$$ 163235 -45076 -273803 -231776 190662 549591 272215 -19430 379898 -159198 -508673
8957e08673L88171K95013p036l6820P2989m71739k9939N58473J00309k2293l04064
$$ -508673 -120502 174511 167475 130655 203644 -268095 -298034 260439 360748 338455 34391
8946C4391K6112k78483L88602j39605j8207j23389J76192J44086l04987L2739
$$ 34391 60503 -217980 170622 31017 12810 -110579 65613 209699 -95288 -62549
8936f2549K76715j93033N4254P9465j14351J14888J00816l11719k28254K59514
$$ -62549 214166 21133 75387 154852 40501 155389 256205 -55514 -283768 -24254
8926b4254j39608K18994M5358r9795M1846j7348k99598o9494k1222P6157O3344
$$ -24254 -163862 55132 100490 695 42541 25193 -274405 -343899 -365121 -288964 -225620
8915b25620M6576J19713N07764J7819O5481j64375j35551k79389j27508N03620
$$ -225620 -179044 -59331 448433 466252 531733 367358 231807 -47582 -175090 328530
8905C28530l0448k63951l31448P4619J32444j81977j46334o5373M46238J48167
$$ 328530 298082 34131 -297317 -222698 -90254 -272231 -418565 -483938 -37700 110467
8895A10467l32754L15074J13589j36112m01587j83293P84783J50047j56662j46299
$$ 110467 -222287 92787 206376 70264 -331323 -514616 270167 420214 263552 117253
8885A17253J10531m51900q8332K77395M1951j52919K88311k81071L33454M27412
$$ 117253 227784 -224116 -312448 -35053 6898 -146021 142290 -138781 194673 622085
8875F22085n09738j16952J67269j45122p2095Q0777j36849m3980l6817L05434
$$ 622085 112347 -4605 162664 17542 -54553 26224 -110625 -154605 -191422 114012
8865A14012k94296L42344J15732l60652J22935L25635q2951J41471l1151j43237
$$ 114012 -180284 162060 277792 -82860 40075 365710 282759 424230 393079 249842
8855B49842K81L9310K98454m55903k93676J96534N5188j82300j3274L82080R8599
$$ 249842 250123 289433 587887 131984 -161692 34842 90030 -92270 -105544 276536 375135
8844C75135l5916o0206l79462j19600M32491M3081J961j22409j42436J81131j15094
$$ 375135 339219 279013 -100449 -220049 212442 255523 257484 135075 -7361 173770 58676
8833E8676J36721q0044j58189k9351L28337k11068r2471l76388J86183K37396
$$ 58676 195397 115353 -42836 -72187 256150 45082 -47389 -423777 -237594 -198
8823a98n18741L16317M24980j70746K9401J39850o07666J36361K81744j22184
$$ -198 -518939 -202622 222358 51612 81013 220863 -386803 -250442 31302 -90882
8813i0882l60244L2285L23795N04510k04517l35921J00235K34800m62795j14733
$$ -90882 -451126 -418841 -95046 409464 204947 -130974 -30739 204061 -258734 -373467
8803c73467q1726N51718J3237K18510j98548R5776J68048o8868m97495J76944
$$ -373467 -455193 96525 109762 328272 129724 225500 393548 324680 -172815 4129
8793D129P9392k59406l34780K25588p8854j59412K53273j9439L05249k41160J82500
$$ 4129 83521 -175885 -510665 -285077 -363931 -523343 -270070 -289509 15740 -225420 -42920
8782d2920j47063K9653J5924m68117J29915O90370j08118k13899J61736J55972
$$ -42920 -189983 -160330 -144406 -612523 -482608 207762 99644 -114255 47481 203453
8772B03453k22207j77266J61468J86736q4164L4268L1763K37764k58096m11908
$$ 203453 -18754 -196020 -34552 152184 68020 102288 134051 371815 113719 -298189
8762b98189L24171K70151k56521M66686j19677j49325j61551O0928q106K2203
$$ -298189 25982 296133 39612 506298 386621 237296 75745 136673 128567 150770
8752A50770k85383K12024N9775k04099k61448M57680L82019m82755K9127l67565
$$ 150770 -134613 77411 137186 -66913 -328361 129319 511338 28583 57710 -309855
8742c09855k33946J70370O2789L52147k88622K28493J22500j65069j15631K51836
$$ -309855 -543801 -373431 -310642 41505 -247117 -18624 103876 -61193 -176824 75012
8732G5012k67075K72619K53837k85805j75206P0270k27332K7417n2313M88512
$$ 75012 -192063 80556 334393 48588 -126618 -56348 -283680 -256263 -308576 179936
8722A79936j55288L71171j55953j56292K70958k39406J90891m0106l808m10827
$$ 179936 24648 395819 239866 83574 354532 115126 306017 265911 262103 -148724
8712a48724Q7281L6108l41331o3643M96769j76268n3544k70282K20594K00158
$$ -148724 -61443 -25335 -366666 -430309 66460 -109808 -163352 -433634 -213040 -12882
8702a2882M22956j5754q2578k18700j62357K64634M0029k08645M53829k32437
$$ -12882 410074 394320 311742 93042 -69315 195319 235348 26703 480532 248095
8692B48095J1424k16290J61623K45244j2077k21485Q9160k1431j98556J19657
$$ 248095 259519 43229 204852 450096 438019 216534 305694 284263 85707 205364
8682B05364J10484k73902j0705m40878Q0813K69103K93973l71481l08618L73856
$$ 205364 315848 41946 31241 -409637 -328824 -59721 234252 -137229 -445847 -71991
8672g1991j9989J92817o5181j72630K58066l5753J17293K55384K9657k35991r7906
$$ -71991 -91980 100837 35656 -136974 121092 85339 202632 458016 487673 251682 153776
8661A53776j30598j32005K64329l5362j18579K29671n38228J88896J66460n7087
$$ 153776 23178 -108827 155502 120140 1561 231232 -306996 -118100 48360 -8727
8651h727J80490j38939q6382k05590K78240n7302j36745k3287J78432K22715J79868
$$ -8727 171763 32824 -53558 -259148 19092 -38210 -174955 -198242 -19810 202905 382773
8640C82773m74379j71741N9181J96069K70745q3389J20742q4439k91191j22689
$$ 382773 -91606 -263347 -204166 -8097 262648 179259 300001 215562 -75629 -198318
8630a98318n4750M59633q2263q4561j85940k8644K62190l2365Q010L58745k39659
$$ -198318 -253068 206565 124302 39741 -146199 -174843 87347 54982 62992 421737 182078
8619A82078l8256l1433J72317J09756j5198j85617J33403k14681J63551j6663
$$ 182078 143822 112389 284706 394462 379264 193647 327050 112369 275920 259257
8609B59257N5972l08166k75304o0123N10200J21152k96177L2311P1608q4263l5273
$$ 259257 315229 7063 -268241 -328364 181836 302988 6811 39122 110730 26467 -8806
8598h806J98101N898M24469n13981k44324J93774N42825m23466M4743J0592n8748
$$ -8806 189295 195193 619662 105681 -138643 55131 597956 174490 219233 229825 171077
8587A71077J7309J34416j70163N2279l97708K96635K90457k41345j12341l38144
$$ 171077 188386 322802 152639 204918 -192790 103845 394302 152957 40616 -297528
8577b97528L22303J29689j56866n35703L92481M94939k20746K868k97115J88601
$$ -297528 24775 154464 -2402 -538105 -145624 349315 128569 131437 -165678 22923
8567B2923P7327k30740l2466K44858j72275o6646M51110l02301K05714l56575
$$ 22923 100250 -130490 -162956 81902 -90373 -157019 294091 -8210 197504 -159071
8557a59071k6979n6831P5093j00412L48065j800k54407j06943L41477K8803j66099
$$ -159071 -186050 -242881 -167788 -268200 79865 78065 -176342 -283285 58192 86995 -79104
8546g9104J09968J47358k19283l2111O0889J53600j73901j10759K64810j524k97568
$$ -79104 30864 178222 -41061 -73172 -12283 141317 -32584 -143343 121467 119943 -177625
8535a77625K20913L25425m7514j88189l06254N1889L97581j64926l97102J23092
$$ -177625 43288 368713 321199 133010 -173244 -121355 276226 111300 -285802 -162710
8525a62710N4681k5240O7956J97523j26217l74484K24931K26571M9423k52972
$$ -162710 -108029 -133269 -65313 132210 5993 -368491 -143560 83011 132434 -120538
8515a20538j13255N93692k00080n5179J67183q2646m15817q6074O07268J09110
$$ -120538 -233793 359899 159819 104640 271823 189177 -226640 -312714 294554 403664
8505D03664l23804j11294K87867r1442j72922O4081j80977k9945N4226k11022
$$ 403664 79860 -31434 256433 164991 -7931 56150 -124827 -154772 -100546 -311568
8495c11568K93189j75429n8079J8188L34028j20108P9937K44256k89678J35174
$$ -311568 -18379 -193808 -251887 -233699 100329 -19779 60158 304414 14736 149910
8485A49910p1080K15389l01266r2621j32714J531766l27993o72522k05591J76926
$$ 149910 78830 294219 -7047 -99668 -232382 1299384 971391 298869 93278 270204
8475B70204K4824n1886J2732j46883j55427J48569j25830L40099L7662l4495k07856
$$ 270204 295028 243142 255874 108991 -46436 102133 -23697 316402 354064 319569 111713
8464A11713l415K07692R303J46791m06879l8983M8665k77527M24373M14625m10567
$$ 111713 108298 315990 325293 472084 65205 26222 74887 -202640 221733 636358 225791
8453B25791m51924K33486q3854k0230K80298K21616l42710J07136J73540M32735
$$ 225791 -226133 7353 -76501 -96731 183567 405183 62473 169609 343149 775884
8443G75884M20397p10164l53819R1241p6070j50761J33007O5169J35735n1234
$$ 775884 1196281 486117 132298 223539 147469 -3292 129715 194884 330619 279385
8433B79385j75937k32682J17578K17586K59159m08369k11j73994N3156J29547
$$ 279385 103448 -129234 -11656 205930 465089 56720 56509 -117485 -64329 65218
8423F5218j94302J03968J62407o48082J41973M18065j31972L03156q8Q3520j02704
$$ 65218 -129084 -25116 137291 -510791 -368818 49247 -82725 220431 220343 303863 201159
8412B01159p9504j00865q3477O8327J55921j00109L36345J62361m67775J80109
$$ 201159 121655 20790 -62687 5640 161561 61452 397797 560158 92383 272492
8402B72492k73658m7982K53921j43033p417N87001j42668k60335j05715N6546
$$ 272492 -1166 -49148 204773 61740 54323 641324 498656 238321 132606 189152
8392A89152J01741M10267r2306m38492j50511k5496P0554K54376Q5688R5561o21187
$$ 189152 290893 701160 608854 170362 19851 -5645 64909 319285 404973 500534 -120653
8381a20653R3783J35980m6242J40341K3547J07391n4265J10124l37826k07643
$$ -120653 -26870 109110 62868 203209 226756 334147 279882 390006 52180 -155463
8371a55463N5442K06400j83229N26026p1223n01493M40578J17668L51279M7404
$$ -155463 -100021 106379 -76850 449176 377953 -123540 317038 434706 785985 833389
8361H33389k63163k52295n4666M48341j68167k04306j26909J07472J54283j46830
$$ 833389 570226 317931 263265 711606 543439 339133 212224 319696 473979 327149
8351C27149R6940n3826K00878k23423p4216k09425j41141N34572J01076N938j70817
$$ 327149 424089 370263 571141 347718 273502 64077 -77064 457508 558584 564522 393705
8340C93705j87809K14580k31426M7595q2974N09652m0045k29331q6369M34193
$$ 393705 205896 420476 189050 236645 153671 663323 623278 393947 307578 741771
8330G41771m17158j56735K79609J09102k69601m35717J13074J31327J98097n3782
$$ 741771 324613 167878 447487 556589 286988 -148729 -35655 95672 293769 239987
8320B39987K73849P7728N85k97245K48751k84917l04433J33211M16698J15776
$$ 239987 513836 591564 592149 294904 543655 258738 -45695 87516 504214 619990
8310F19990l23959j28719M38986k87394K02243r5031K53377l75338k5317Q0160
$$ 619990 296031 167312 606298 318904 521147 426116 679493 304155 278838 358998
8300C58998p7467m33230J67037M62516m2990q6586j25350L74320l25887K82999
$$ 358998 281531 -151699 15338 477854 434864 348278 222928 597248 271361 554360
8290E54360p3145m52882M68182K05833k61550k59880K31924J88690j27950L54554
$$ 554360 481215 28333 496515 702348 440798 180918 412842 601532 473582 828136
8280H28136m4798k19564j74489j51053J31161q719k50009N2283J18487M14656
$$ 828136 783338 563774 389285 238232 369393 360674 110665 162948 281435 696091
8270F96091n57008k28356K07183k23971K56565K0069L7843J19218J90013l80046
$$ 696091 139083 -89273 117910 -106061 150504 170573 208416 327634 517647 137601
8260A37601M09356k02717J7014k8569r9354M88043j96923J76282j78182k67540
$$ 137601 546957 344240 361254 332685 233331 721374 524451 700733 522551 255011
8250B55011K2432L41455J21687J22900n65521N07382J11949l04683K35455j35451
$$ 255011 277443 618898 740585 863485 297964 805346 917295 612612 848067 712616
8240G12616o577K12168m98587k75108p66L97717L0356O6604K82695p2606P6438
$$ 712616 706039 918207 419620 144512 143746 541463 571819 638423 921118 848512 924950
8229I24950k80770j46870N3789K7880L25893j16379O74969l20995J43743Q17l90871
$$ 924950 644180 497310 551099 578979 904872 788493 1463462 1142467 1286210 1287027 896156
8218H96156J53331J63612K08527k71336K6011p4566k42850K01637J25468m07553
$$ 896156 1049487 1213099 1421626 1150290 1176301 1101735 858885 1060522 1185990 778437
8208G78437K22688K40952k19010K16502J61769m42826l1806R2433k82249k82749
$$ 778437 1001125 1242077 1023067 1239569 1401338 958512 926706 1019139 736890 454141
8198D54141K2240L44438N42854j71194l48417n74885Q009718j788788l293288
$$ 454141 476381 820819 1363673 1192479 844062 269177 8278895 6490107 3196819
8189C196819K83950j347677L81854m58538K57198p00720L24775K36851q4975k39261
$$ 3196819 3480769 2133092 2514946 2056408 2313606 1612886 1937661 2174512 2089537 1850276
8179A850276K48044j48582k17536j89657L92677n9802J82445l02775J76605j41715
$$ 1850276 2098320 1949738 1732202 1542545 1935222 1875420 2057865 1755090 1931695 1789980
8169A789980O1743K33981N45498k11507K84439J86482Q7512l36425K10901n1307
$$ 1789980 1851723 2085704 2631202 2419695 2704134 2890616 2978128 2641703 2852604 2801297
8159B801297j09320l08749l29356k14005m5624M2398J10308q6136p9409k89193
$$ 2801297 2691977 2383228 2053872 1839867 1794243 1836641 1946949 1860813 1781404 1492211
8149A492211o4911p5190l85024J05073L77557m04645J66505L97496l01353L40671
$$ 1492211 1427300 1352110 967086 1072159 1449716 1045071 1211576 1609072 1307719 1648390
8139A648390n4303l14106j48421J96972o8556L50829Q7366j50383j93292K11892
$$ 1648390 1594087 1279981 1131560 1328532 1259976 1610805 1698171 1547788 1354496 1566388
8129A566388J61866l685K93411q3100l2415P2552j42698J74714L92746J04830
$$ 1566388 1728254 1724569 2017980 1934880 1902465 1975017 1832319 2007033 2399779 2504609
8119B504609j38200k12460J63140K15254p9153J70230J3482Q3545Q0579Q5936
$$ 2504609 2366409 2153949 2317089 2532343 2453190 2623420 2636902 2720447 2801026 2886962
8109B886962J22046k74812K16327P04089k88988J82852M13295O5582p2446M9966
$$ 2886962 3009008 2734196 2950523 3654612 3365624 3548476 3961771 4027353 3954907 4004873
8099D004873j62093k24081K18890L49331K3483p4278l39150O32658M37893o96762
$$ 4004873 3842780 3618699 3837589 4186920 4210403 4136125 3796975 4429633 4867526 4170764
8089D170764M9634k9341k28837r3077n5975M02997K08770p4511k46763k55682
$$ 4170764 4220398 4191057 3962220 3869143 3813168 4216165 4424935 4350424 4103661 3847979
8079C847979L82224L9443m83882l62042J51703J02197L229K80410P5026k36857
$$ 3847979 4230203 4269646 3785764 3423722 3575425 3677622 3680851 3961261 4036287 3799430
8069C799430k48167q2760j59561k04473j62751P8531j0669j68250q4015K27317
$$ 3799430 3551263 3468503 3308942 3104469 2941718 3020249 3009580 2841330 2757315 2984632
8059B984632J69230k94956L65091k10756N8482K29317j434k46260L52631l34054
$$ 2984632 3153862 2858906 3223997 3013241 3071723 3301040 3299606 3053346 3405977 3071923
8049C071923n8305J58099n2361O4655J24415J27563J30694k97011j0071P1654
$$ 3071923 3013618 3171717 3119356 3184011 3308426 3435989 3566683 3269672 3259601 3331255
8039C331255R5054J91971Q2644j84431N215J49755j88149k8617J06856k3782k8806
$$ 3331255 3426309 3618280 3700924 3516493 3521708 3671463 3483314 3454697 3561553 3537771 3508965
8028C508965q767K25160P6099K87244J29294o815k04378j62150k88690L46129
$$ 3508965 3500198 3725358 3801457 4088701 4217995 4211180 4006802 3844652 3555962 3902091
8018C902091M89897k20502J48415o1403L24260j59276L26669L75911J48135m4394
$$ 3902091 4391988 4171486 4319901 4258498 4582758 4423482 4750151 5126062 5274197 5229803
8008E229803k62183L24747L93312J42026R0755j26253O50993J62154Q6909K26261
$$ 5229803 4967620 5292367 5685679 5827705 5918460 5792207 6443200 6605354 6692263 6918524
7998F918524L01806J03619M60327L51966j94011O18921O34880K32604J167790
$$ 6918524 7220330 7323949 7784276 8136242 7942231 8561152 9196032 9428636 10596426
7989A0596426L58115K12807Q12368P41162N14160O70391J071420R46640Q71410
$$ 10596426 10954541 11167348 11979716 12720878 13235038 13905429 14976849 15923489 16794899
7980A6794899J099383R17604O31196J096736J126631J384763J444435J760831
$$ 16794899 17894282 18811886 19443082 20539818 21666449 23051212 24495647 26256478
7972B6256478J217915K047376J557064J414763K186297K218139K178259L076891
$$ 26256478 27474393 29521769 31078833 32493596 34679893 36898032 39076291 42153182
7964D2153182L549786L400991M004376M783181N569103O182019P981723Q821114
$$ 42153182 45702968 49103959 53108335 57891516 63460619 69642638 77624361 86445475
7956H6445475J0028839Q610500R001801Q523513N873187K264521J581815Q03287
$$ 86445475 96474314 105084814 114086615 122610128 128483315 130747836 132329651 133132938
7948A33132938J000433Q42286K988380N948622P403802N858229L498460K368455
$$ 133132938 134133371 134975657 137964037 143912659 151316461 157174690 160673150 163041605
7940A63041605q10680k981995o376401o479801o938871q164517n893696k576081
$$ 163041605 162230925 159248930 152872529 146392728 139453857 131289340 125395644 122819563
7932A22819563k46004K222329M784717N419952N101116N617555L580488N6747
$$ 122819563 122573559 124795888 129580605 135000557 140101673 145719228 149299716 149356463
7924A49356463j861466j002188j833179j749344n16923K401943M714081M307356
$$ 149356463 147494997 146492809 144659630 142910286 142393363 144795306 149509387 153816743
7916A53816743K442968N36520k545693o547971r795601j1453000j1093623j3521746
$$ 153816743 156259711 156796231 154250538 147702567 137906966 126453966 115360343 101838597
7908A01838597j2966557j0192237q618769p698916n996133n627439n229562l811623
$$ 101838597 88872040 78679803 70061034 62362118 56365985 50738546 45508984 41697361
7900D1697361k938436l148530k583306j725553j614074j475293j973989j650826
$$ 41697361 38758925 35610395 33027089 31301536 29687462 28212169 26238180 24587354
7892B4587354j291257j255215j248938p09585p30158o12948q61991n64450j095840
$$ 24587354 23296097 22040882 20791944 20082359 19352201 18739253 17877262 17312812 16216972
7883A6216972o96933m34977p51215p54002l44005l72998k92963o72041k86401
$$ 16216972 15520039 15085062 14333847 13579845 13235840 12862842 12569879 11897838 11611437
7874A1611437k65327k43889n17079n79071m31686l12966k10242m37970r7730j31363
$$ 11611437 11346110 11102221 10585142 10006071 9574385 9261419 9051177 8613207 8515477 8384114
7864H384114P2034k57324J00571k7740J0902o14789l53924M9702l93136m72171
$$ 8384114 8456148 8198824 8299395 8271655 8282557 7667768 7313844 7363546 6970410 6498239
7854F498239j01007m59154J68992m89492k60250j87137k48383J70531j40672j64733
$$ 6498239 6397232 5938078 6107070 5617578 5357328 5170191 4921808 5092339 4951667 4786934
7844D786934k14655K18457l35511K49486l69500j74399N9467l89278J25972P3994
$$ 4786934 4572279 4790736 4455225 4704711 4335211 4160812 4220279 3831001 3956973 4030967
7834D030967l8731O6026J39281l39650k58088N81689l87180J93975l86095J41887
$$ 4030967 3992236 4058262 4197543 3857893 3599805 4181494 3794314 3988289 3602194 3744081
7824C744081J0176N0192J67630p41263n41995P24075J27855j53039O5495k34785
$$ 3744081 3754257 3804449 3972079 3230816 2688821 3412896 3540751 3387712 3453207 3218422
7814C218422n0845l3632j07882J5386K12961j82581J04790l69080P68K53484J67378
$$ 3218422 3167577 3133945 3026063 3041449 3254410 3071829 3176619 2807539 2808307 3061791 3229169
7803C229169l55143K35813P0998J85040Q7934k69392J26836R0188M7991o8066
$$ 3229169 2874026 3109839 3180837 3365877 3453811 3184419 3311255 3401443 3449434 3381368
7793C381368J01160R9404j98845L21772o8715N00661l08854n66767K45524m4466
$$ 3381368 3482528 3581932 3383087 3704859 3636144 4136805 3827951 3261184 3506708 3462242
7783C462242R9334L91510j88505j79731R5811j36834J21922j7219j05297K52027
$$ 3462242 3561576 3953086 3764581 3584850 3680661 3543827 3665749 3648530 3543233 3795260
7773C795260j4503Q9110P7281j71019M5334o3597K0426j92551j73395j12911M16192
$$ 3795260 3780757 3869867 3947148 3776129 3821463 3757866 3778292 3585741 3412346 3299435 3715627
7762C715627k88076J11009M01444j8623j75144J75049m3736K07240j10226J67046
$$ 3715627 3427551 3538560 3940004 3921381 3746237 3921286 3877550 4084790 3974564 4141610
7752D141610j29430j48326J52883j05346J97373L26928K67348m4694k47722l96388
$$ 4141610 4012180 3863854 4016737 3911391 4108764 4435692 4703040 4658346 4410624 4014236
7742D014236j618K14852j35132Q2816j92154L42212L02333n14549K02014N7238
$$ 4014236 4012618 4227470 4092338 4175154 3983000 4325212 4627545 4112996 4315010 4372248
7732D372248j7665R3165j16428j96509R9812J54330M58823k98576j09476K61889
$$ 4372248 4354583 4447748 4331320 4134811 4234623 4388953 4847776 4549200 4439724 4701613
7722D701613j21454j57031L65450J32721j93064J29839k24240j27424k57607n70680
$$ 4701613 4580159 4423128 4788578 4921299 4728235 4858074 4633834 4506410 4248803 3678123
7712C678123K33393q7139K09937k17376l37872K71483j96335m0499l5491J12188
$$ 3678123 3911516 3824377 4034314 3816938 3479066 3750549 3554214 3513715 3478224 3590412
7702C590412M5467J79930O58628j87344k52494j06623l88697j10936L11086k68076
$$ 3590412 3635879 3815809 4474437 4287093 4034599 3927976 3539279 3428343 3739429 3471353
7692C471353k78332Q7733J02289o6761J41694P9556M10887j16623p9056L35921
$$ 3471353 3193021 3280754 3383043 3316282 3457976 3537532 3948419 3831796 3752740 4088661
7682D088661p7702J63160j08864n01807J86178Q7139k94569K43750J63812r881
$$ 4088661 4010959 4174119 4065255 3563448 3749626 3836765 3542196 3785946 3949758 3939877
7672C939877K55840l6073J98037j07886m08931J32236l0062l2267K03610K70765
$$ 3939877 4195717 4159644 4357681 4249795 3840864 3973100 3943038 3910771 4114381 4385146
7662D385146L59996j65001J41511N3453m20942L16874K40226Q3424N16059j9783
$$ 4385146 4745142 4580141 4721652 4775105 4354163 4671037 4911263 4994687 5510746 5490963
7652E490963j29287p3930L98093J08705k22262N55274o3648q9906j03038R7925
$$ 5490963 5361676 5287746 5685839 5794544 5572282 6127556 6063908 5974002 5870964 5968889
7642E968889J51579k67937K42857K43552j67289k18751K7919r3038K35849n438
$$ 5968889 6120468 5852531 6095388 6338940 6171651 5952900 5980819 5887781 6123630 6118192
7632F118192j15245J52268J67376J96208J29308k70650j26661q8858M6475J40209
$$ 6118192 6002947 6155215 6322591 6518799 6648107 6377457 6250796 6161938 6208413 6348622
7622F348622j00674M32552j37520l9249o7059K52223L39163k03248j92399K86826
$$ 6348622 6247948 6680500 6542980 6503731 6436672 6688895 7028058 6824810 6632411 6919237
7612F919237j5031K08731j0364K09715k57179k73485L34374L31113n1314k80310
$$ 6919237 6904206 7112937 7102573 7312288 7055109 6781624 7115998 7447111 7395797 7115487
7602G115487J45299M03145p023l00444K22733J57549R5922R3053j91351J1347
$$ 7115487 7260786 7663931 7656908 7356464 7579197 7736746 7832668 7925721 7734370 7745717
7592G745717M45441p0814o0464L29352J78215K7832k9814K69127R4591j0397L8256
$$ 7745717 8191158 8120344 8059880 8389232 8567447 8595279 8565465 8834592 8929183 8918786 8957042
7581H957042K81040N98737m151M00544M21868m3737K01600M12135M52133j00231
$$ 8957042 9238082 9836819 9832668 10233212 10655080 10611343 10812943 11225078 11677211 11576980
7571A1576980J58106L29802P15258K90269K66378N03692M49139O07126M13416
$$ 11576980 11735086 12064888 12780146 13070415 13336793 13840485 14289624 14896750 15310166
7562A5310166N58405R39611N00722Q95468R33983N83263J335547J731022Q64286
$$ 15310166 15868571 16808182 17308904 18204372 19138355 19721618 21057165 22788187 23652473
7553B3652473J561195J951496J672575J478936J786668J630359J936925J657434
$$ 23652473 25213668 27165164 28837739 30316675 32103343 33733702 35670627 37328061
7545C7328061J521735K124050K621701K435898L030820L478022L276461L964201
$$ 37328061 38849796 40973846 43595547 46031445 49062265 52540287 55816748 59780949
7537E9780949L939310L841847L434460M310521M335873M162579N071832N829919
$$ 59780949 63720259 67562106 70996566 75307087 79642960 83805539 88877371 94707290
7529I4707290O612403P196480Q590010R760005J1169238J4185573J7440627K1404877
$$ 94707290 101319693 108516173 117106183 126866188 138035426 152220999 169661626 191066503
7521A91066503K2059616J8425148J3690180J0990340N986285k60514l272292k922640
$$ 191066503 213126119 231551267 245241447 256231787 262218072 261957558 258685266 255762626
7513B55762626L434662J0184031J5449094J8974440K0318240J8651032J2110913
$$ 255762626 259197288 269381319 284830413 303804853 324123093 342774125 354885038
7506C54885038P482658n60703j3847943j8368974j5927610j4731438j3620109
$$ 354885038 362367696 361806993 347959050 329590076 313662466 298931028 285310919
7499B85310919r267598n878380o28517K199269p73487l153492n097422j1064372
$$ 285310919 276043321 270164941 269536424 271735693 270962206 267808714 262711292 251646920
7491B51646920j3921699j2233732j2798660j1154564r798146j0660328j1201819
$$ 251646920 237725221 225491489 212692829 201538265 191740119 181079791 169877972
7484A69877972q463994o467938p853958r231653p741124o877041m854214m203543
$$ 169877972 161413978 154946040 147092082 137860429 130119305 123242264 118388050 114184507
7476A14184507l680488k865698k371895j873061j651724n14037O47761J970006
$$ 114184507 110504019 107638321 105266426 103393365 101741641 101227604 101875365 103845371
7468A03845371L745207N804919P599664Q821954M350685J747200N019896P393533
$$ 103845371 107590578 113395497 120995161 129817115 134167800 135915000 140934896 148328429
7460A48328429M412808j623935l546932k483861m174751m551395k968434l638181
$$ 148328429 152741237 151117302 147570370 145086509 140911758 136360363 133391929 129753748
7452A29753748n693807o736769j0085098j2325392j1599843r464732p153002n743967
$$ 129753748 124059941 117323172 107238074 94912682 83312839 73848107 66695105 60951138
7444F0951138m024028l637434k566713k605696j798594j916971j356422p31432
$$ 60951138 56927110 53289676 50722963 48117267 46318673 44401702 43045280 42313848
7436D2313848j30085n60809Q35002J390279J612510J982506N05234l19002j030037
$$ 42313848 42183763 41622954 42457956 43848235 45460745 47443251 47948485 47629483 46599446
7427D6599446j784843j557043j399425j730146j704481j321714j785904j186291
$$ 46599446 44814603 43257560 41858135 40127989 38423508 37101794 35315890 34129599
7419C4129599j488420j167779k43209K3055k94065l79331m39883Q7464K40191
$$ 34129599 32641179 31473400 31230191 31253246 30959181 30579850 30139967 30227431 30467622
7410C0467622J12472J64214Q89994O41366J000208J227202R45580J878996K307659
$$ 30467622 30580094 30744308 31634302 32275668 33275876 34503078 35448658 37327654 39635313
7401C9635313J999938K553726K351187K014849J897513K175263K135756K038119
$$ 39635313 41635251 44188977 46540164 48555013 50452526 52627789 54763545 56801664
7393E6801664J460037K173759K464343L801799L871995M257023M239510M995036
$$ 56801664 58261701 60435460 62899803 66701602 70573597 74830620 79070130 84065166
7385H4065166O032064P194721O133079L312574L019170K833859L129458M518614
$$ 84065166 90097230 97291951 103425030 106737604 109756774 112590633 115720091 120238705
7377A20238705O986643R263843J0313218J0698631J1112575J2163307J5256196
$$ 120238705 127225348 136489191 146802409 157501040 168613615 180776922 196033118
7370A96033118K0206031K2741645K4257326K8569439M7908307M6688950j7413281
$$ 196033118 216239149 238980794 263238120 291807559 339715866 386404816 368991535
7363C68991535m8656807l8801079k9279137k1747981j5578702j2328293q653946
$$ 368991535 320334728 281533649 252254512 230506531 214927829 202599536 193945590
7356A93945590p834136q579806q734926q305850o228591m262430K29443L268699
$$ 193945590 186111454 177531648 168796722 160490872 154262281 149999851 150229294 153497993
7348A53497993N572603N553317K220379L45741K50005O00964k289139o482953
$$ 153497993 159070596 164623913 166844292 167190033 167440038 168041002 165751863 159268910
7340A59268910q433917p329534o097996m261284l830497m732218m564792n379807
$$ 159268910 150834993 143505459 137407463 133146179 129315682 124583464 120018672 114638865
7332A14638865n242760n611055m231375l226885n053922n526075m663874m322833
$$ 114638865 109396105 103785050 99553675 96326790 91272868 85746793 81082919 76760086
7324G6760086k828390j090167O97367K221916n81994l833433m550249m352257
$$ 76760086 73931696 72841529 73538896 75760812 75178818 71345385 66795136 62442879
7316F2442879k505234j428828l482443n341406m687393m174518l455454l276138
$$ 62442879 59937645 58508817 55026374 49684968 44997575 40823057 37367603 34091465
7308C4091465k373410k298642j607882j243833j543422j560761q88156j110272
$$ 34091465 31718055 29419413 27811531 26567698 25024276 23463515 22575359 21465087
7300B1465087q13949j307268j272466r22967q46018m62311m23529j254692p58736
$$ 21465087 20651138 19343870 18071404 17148437 16302419 15840108 15416579 14161887 13403151
7291A3403151K78208r88409q88924j28032O0878n03633p6940m07374m59353j76953
$$ 13403151 13681359 12692950 11804026 11675994 11736872 11233239 11156299 10748925 10289572 10112619
7281A0112619l19835m69800K2802J16285m65034l29085k30236K8681m06332l75636
$$ 10112619 9792784 9322984 9345786 9462071 8997037 8667952 8437716 8466397 8060065 7684429
7271G684429m66590K81349O8338j99289n19931p2434m4815j105l11640J0081j93048
$$ 7684429 7217839 7499188 7567526 7368237 6848306 6775872 6731057 6729952 6418312 6428393 6235345
7260F235345K12793J06849r4650k72730k18104j61470k21655J21423L23227l47447
$$ 6235345 6448138 6554987 6460337 6187607 5969503 5808033 5586378 5707801 6031028 5683581
7250E683581l65564J52475k25417j81745K4321j14101J87913Q1539r1896M8412
$$ 5683581 5318017 5470492 5245075 5063330 5087651 4973550 5161463 5243002 5151106 5199518
7240E199518o311j26343k10289J19876j27125j38414m38924K47724J06587n08008
$$ 5199518 5193207 5066864 4856575 4976451 4849326 4710912 4271988 4519712 4626299 4118291
7230D118291K28166m02841J40212k6198J12009l48742j50432k60759R5978j7622
$$ 4118291 4346457 3943616 4083828 4057630 4169639 3820897 3670465 3409706 3505684 3488062
7220C488062J70382j27701k03078j56218j59441K65134J87962k03j13880k04369
$$ 3488062 3658444 3530743 3327665 3171447 3012006 3277140 3465102 3464899 3351019 3146650
7210C146650o9292j05557P8243J46492N7882j7050m60345J30040J69993j47634
$$ 3146650 3077358 2971801 3050044 3196536 3254418 3237368 2777023 2907063 3077056 2929422
7200B929422o24653J51544K21345J24736k03157l09335M1704o7815q4755o0180
$$ 2929422 2304769 2456313 2677658 2802394 2599237 2289902 2331606 2263791 2179036 2118856
7190B118856j43211J57061L32485J51932j44886n37782m11572K93131K2198N4580
$$ 2118856 1975645 2132706 2465191 2617123 2472237 1934455 1522883 1816014 1838212 1892792
7180A892792k67490L05247K11193j56788k55238k40249l05073o0521P04912q2835
$$ 1892792 1625302 1930549 2141742 1984954 1729716 1489467 1184394 1123873 1828785 1745950
7170A745950l46036M6825m8766m4454N0593J74059k14178P9549j0798m2157P7408
$$ 1745950 1399914 1446739 1397973 1353519 1404112 1578171 1363993 1443542 1432744 1390587 1467995
7159A467995N3666l3211j82694K32684K83177m19295l01113j22585q9965N68965
$$ 1467995 1521661 1488450 1305756 1538440 1821617 1402322 1101209 978624 888659 1457624
7149A457624k49828n0506j76890K16729M4857l26533J53848j57363J61478J83731
$$ 1457624 1207796 1157290 980400 1197129 1241986 915453 1069301 911938 1073416 1257147
7139A257147J90623o7655k16182k86118O06588k70945m41131J70653j85589k74159
$$ 1257147 1447770 1380115 1163933 877815 1484403 1213458 772327 942980 757391 483232
7129D83232N17478m46529r9397n1680m8684P55048k30546P6989J6063j01503p6987
$$ 483232 1000710 554181 454784 403104 354420 1109468 878922 955911 971974 870471 793484
7118G93484l58846M95576L18758j01410k17313L76114l39309n1938l4140O1895
$$ 793484 434638 930214 1248972 1147562 930249 1306363 967054 915116 880976 942871
7108I42871J68573j63385k72132o4712Q3490L75341J79180j21025j527J37821
$$ 942871 1111444 948059 675927 611215 694705 1070046 1249226 1128201 1126674 1264495
7098A264495K51953J72403n8453m81178j85663M75073n5384n05013K82705j85294
$$ 1264495 1516448 1688851 1630398 1149220 963557 1438630 1383246 878233 1160938 975644
7088I75644j73029K91713J68936o3811P3497l6626k19437l9436p3763O3247k41305
$$ 975644 802615 1094328 1263264 1199453 1272950 1236324 1016887 977451 903688 966935 725630
7077G25630K383J75096M6337k06517O23602K90545j57553J02393m68345J7639
$$ 725630 728013 903109 949446 742929 1366531 1657076 1499523 1601916 1133571 1151210
7067A151210R344K38642m96491L35987K8759m7433n73349M2410J8147M15034m2613
$$ 1151210 1160554 1399196 902705 1238692 1267451 1220018 646669 689079 707226 1122260 1079647
7056A079647R1125m54382J273M78721k25522j39258m1690n806J8618J20064j3107
$$ 1079647 1170772 716390 717663 1196384 970862 831604 789914 784108 802726 922790 909683
7045I09683m03386N2079J24626o02151L04041L05107N5820j6302m27926P676K78459
$$ 909683 506297 558376 683002 80851 384892 689999 745819 729517 301591 309267 587726
7034E87726j47651j37621k42161L00945k79891o8004J59958M49128p5395j74394
$$ 587726 440075 302454 60293 361238 81347 13343 173301 622429 547034 372640
7024C72640K50868M22087l78240l88532m82366L40472J19627N1437K81689q3799
$$ 372640 623508 1045595 667355 278823 -203543 136929 256556 307993 589682 505883
7014E05883k07549P3888O6616j93161J65607K23036R9794O81490k59527k59869
$$ 505883 298334 372222 438838 245677 411284 634320 734114 1415604 1156077 896208
7004H96208l74786r6440K53813r0921j89006k05191J86549q5242K13796l13234
$$ 896208 521422 424982 678795 587874 398868 193677 380226 294984 508780 195546
6994A95546j36806J46323K47479k63145k5464L71566l29080m16881M7173K71791
$$ 195546 58740 205063 452542 189397 163933 535499 206419 -210462 -163289 108502
6984A08502J62682n38399M59572k6535j51817J35557n3246J2314P5097K31453
$$ 108502 271184 -267215 192357 165822 14005 149562 96316 108630 183727 415180
6974D15180J32808m59420J6889N7800o2259k13627r3220j72522Q4104K31285J25961
$$ 415180 547988 88568 105457 163257 100998 -112629 -205849 -378371 -294267 -62982 62979
6963F2979Q1526L45311j70877j41134n7484Q1683j82962R6225j55311j66391J9018
$$ 62979 144505 489816 318939 177805 120321 202004 19042 115267 -40044 -206435 -187417
6952a87417N49854n1339K5035J47461k20265j14667K7470k3441l33985J92611
$$ -187417 362437 311098 336133 483594 263329 148662 176132 152691 -181294 11317
6942A1317j35655n5214N16955K0092k90004j22997k28408P53557k41918j61940
$$ 11317 -124338 -179552 337403 357495 67491 -55506 -283914 469643 227725 65785
6932F5785J32972k8893K20804l46340k79275M4523r301P5446L52151J85185k70192
$$ 65785 198757 169864 390668 44328 -234947 -190424 -199725 -124279 227872 413057 142865
6921A42865N07542m77539j62293L28142J52002k00195R9427l40479l06868J55925
$$ 142865 650407 172868 10575 338717 490719 290524 389951 49472 -257396 -101471
6911a01471q4313j34308J49959L60169m8269O724j28964J34280k51092q6905J00167
$$ -101471 -185784 -320092 -170133 190036 141767 148491 19527 153807 -97285 -184190 -84023
6900h4023o313j55166N40741J84728k64645l41874j26469J82507J5993J42421
$$ -84023 -90336 -245502 295239 479967 215322 -126552 -253021 -70514 -54521 87900
6890H7900j43265j33904K23405j97392k7229M34052k04621k27806k1539J64030
$$ 87900 -55365 -189269 34136 -163256 -190485 243567 38946 -188860 -210399 -46369
6880d6369k64218p753J57864m48058K59767K03259j31458K41552J03245j43954
$$ -46369 -310587 -318340 -160476 -608534 -348767 -145508 -276966 -35414 67831 -76123
6870g6123M6982K80108m158Q6423j54107k30204J841N66791l60493P2051J53038
$$ -76123 -29141 250967 246809 333232 179125 -51079 -49238 517553 157060 229111 382149
6859C82149l26846k19038J91664j65972k8773p492Q4991L06875k51806J9605r8993
$$ 382149 55303 -163735 27929 -138043 -166816 -174308 -89317 217558 -34248 -14643 -113636
6848a13636o2887K87531p3013j00537P7785j7525r6832j84517N65590j82741k38722
$$ -113636 -176523 111008 37995 -62542 15243 -2282 -99114 -283631 281959 99218 -139504
6837a39504L66703J37261n55634j55715M13178O9659Q5952K35485k33970k97656
$$ -139504 227199 364460 -191174 -346889 66289 135948 221900 457385 223415 -74241
6827g4241K06495m8871m1450j67317L70222m55804j32716M56230N5626l57687
$$ -74241 132254 83383 41933 -125384 244838 -210966 -343682 112548 168174 -189513
6817a89513j09723p7015L43885j70566J65894Q4185m31020J26442J23320j47677
$$ -189513 -299236 -376251 -32366 -202932 -37038 47147 -383873 -257431 -134111 -281788
6807b81788K19349j1184J38104k3960R8114k19870j08990j36814J32743K96166
$$ -281788 -62439 -73623 64481 40521 138635 -81235 -190225 -327039 -194296 101870
6797A01870L8569k3413j2587J48835j10818j42410n1472J17306l31210L1962L21757
$$ 101870 140439 117026 104439 253274 142456 46 -51426 65880 -265330 -233368 88389
6786H8389J51779n90559j16261K83127P7867j02902r719K80674r8657j33549K12413
$$ 88389 240168 -350391 -466652 -183525 -105658 -208560 -218279 62395 -36262 -169811 42602
6775D2602K52640k57375r6123J66291m27163j04063J53795L18622k29892L24116
$$ 42602 295242 37867 -58256 108035 -319128 -423191 -269396 49226 -180666 143450
6765A43450m93322M5769M23059n5955m59636N15543o0573J82205r8217R2390k85131
$$ 143450 -349872 -304103 118956 63001 -396635 118908 58335 240540 142323 234713 -50418
6754e0418k72846J59901N0005j60667J56635K40980r5068L42982O3627m62227
$$ -50418 -323264 -163363 -113358 -274025 -117390 123590 28522 371504 435131 -27096
6744b7096l65847O4126K26190J09153k06744O5441J56151j24551L45948k24019
$$ -27096 -392943 -328817 -102627 6526 -200218 -134777 21374 -103177 242771 18752
6734A8752j61805j06627J04349n47892j04792N16482J09239m49652R5387J82126
$$ 18752 -143053 -249680 -145331 -693223 -798015 -281533 -172294 -621946 -526559 -344433
6724c44433r3283K78251k10817Q7743L77256J57531K02033k41216r1854k40079
$$ -344433 -437716 -159465 -370282 -282539 94717 252248 454281 213065 121211 -118868
6714a18868k45834J73116r0584R422J77074K1197j8076J91373J31170O6521m23763
$$ -118868 -364702 -191586 -282170 -272748 -95674 -74477 -92553 98820 229990 296511 -127252
6703a27252j60198j25222J21274M9227K79037j20462k63868k4416P22606l46696
$$ -127252 -287450 -412672 -291398 -242171 36866 -83596 -347464 -371880 350726 4030
6693D030r5727L46982j80442m4387j44458J30257P7485l37558o9002K20313k95976
$$ 4030 -91697 255285 74843 30456 -114002 16255 93740 -243818 -312820 -92507 -388483
6682c88483J24623K66648j01427O8401n29092K97720o860M4047k19232P5522J66222
$$ -388483 -263860 2788 -98639 -30238 -559330 -261610 -268470 -224423 -443655 -368133 -201911
6671b01911K1517j10432R7874J2495J44529r2807L27625l39247j95618M2775k8102
$$ -201911 -180394 -290826 -192952 -180457 -35928 -128735 198890 -140357 -335975 -293200 -321302
6660c21302P5207j3786j81381J85911L43909J62620O1057L3695k38489l68699
$$ -321302 -246095 -259881 -441262 -255351 88558 251178 312235 345930 107441 -261258
6650b61258M0574K85128M7480K41404k95879j26406l2232j90768K52268n1473
$$ -261258 -220684 64444 111924 353328 57449 -68957 -101189 -291957 -39689 -91162
6640i1162j5024m8790K86590r1088k4803J6110R555O5557J82730n08161o8089
$$ -91162 -106186 -154976 131614 40526 15723 31833 41388 106945 289675 -218486 -286575
6629b86575J67047L73526j94023j15751J59548k99684l59506M1943j04624L85293
$$ -286575 -119528 253998 59975 -55776 103772 -195912 -555418 -513475 -618099 -232806
6619b32806j12533M8612L75280j2989j59721j87486J57921J599j6943k2428L0257
$$ -232806 -345339 -296727 78553 65564 -94157 -281643 -123722 -122123 -139066 -161494 -131237
6608a31237K33224L2574o7596K648j4992J1546j63260K03602j51698r2735K05020
$$ -131237 101987 134561 66965 69613 54621 66167 -97093 106509 -45189 -137924 67096
6597F7096L6264J0745k2029K75758j82071k1268j70722r8284J28122o8564J3345
$$ 67096 103360 114105 92076 367834 185763 164495 -6227 -104511 23611 -44953 -31608
6586c1608m945m14041M38891k59409l22602J88195j36426K15219k22806J31540
$$ -31608 -36553 -450594 -11703 -271112 -593714 -405519 -541945 -326726 -549532 -417992
6576d17992q1916p923J03513m6058k29k49090N74468J03163r4733L57559l68262
$$ -417992 -499908 -507831 -404318 -450376 -450605 -699695 -125227 -22064 -116797 240762 -127500
6565a27500J24147k6059J3654k3553j61304K37553l01523J91471k1167K4113k2459
$$ -127500 -3353 -29412 -15758 -39311 -200615 36938 -264585 -73114 -94281 -70168 -92627
6554i2627k4822K38062l38037J8197n8869j68622p289R6529p5955J60584P3997
$$ -92627 -117449 120613 -217424 -199227 -258096 -426718 -434007 -337478 -413433 -252849 -178852
6543a78852L01063j35126k28684j87844M4582J58302j2444k22544N07489l07928
$$ -178852 122211 -12915 -241599 -429443 -384861 -226559 -239003 -461547 45942 -261986
6533b61986O4504K15298l7692l86771o29514N02417M36240J69528q6829O6665
$$ -261986 -197482 17816 -19876 -406647 -1036161 -533744 -97504 72024 -14805 51860
6523E1860m2335j10738K3542j57820N2515J79309J49116j28916m13317M32320
$$ 51860 9525 -101213 -77671 -235491 -182976 -3667 145449 16533 -396784 35536
6513C5536J25117j90410K0711K87405k22132Q2357m75520k65214J36946O33008
$$ 35536 160653 -29757 -9046 278359 56227 138584 -336936 -602150 -465204 167804
6503A67804k1240l09790J92369J19000k4678k42635J2701K52074q2356m6837l58222
$$ 167804 146564 -163226 29143 148143 123465 -119170 -106469 145605 63249 16412 -341810
6492c41810k2330J86710J64348j48930J08866l02980J83703M91158n40257J7591
$$ -341810 -364140 -177430 -13082 -162012 -53146 -356126 -172423 318735 -221522 -203931
6482b03931j02537N46570N6633j31699p1717j47595J7689l3622l24509J30396
$$ -203931 -306468 240102 296735 165036 93319 -54276 -36587 -70209 -394718 -264322
6472b64322K58479j3342M9348K04990j35817j89886j97823j1522L17512k45481
$$ -264322 -5843 -19185 30163 235153 99336 -90550 -288373 -299895 17617 -227864
6462b27864r6603K85409j91907J44646N2311J69470O3375j95034K76368k23923
$$ -227864 -324467 -39058 -230965 -86319 -34008 135462 198837 3803 280171 56248
6452E6248O1106k09023K37339J75422l61804k17623J51705j88022l03543L74018
$$ 56248 117354 -91669 145670 321092 -40712 -258335 -106630 -294652 -598195 -224177
6442b24177L26511l13072J08983N31301k21684l775l52775K12717J20230l4661
$$ -224177 102334 -210738 -101755 429546 207862 204087 -148688 64029 184259 149598
6432A49598L00958Q29j95777m95045r1594K83153L6026P3923l75117j71152K26852
$$ 149598 450556 451385 255608 -239437 -331031 -47878 -11852 62071 -313046 -484198 -257346
6421b57346J39053m6279J56958J52482r7032j3922j14091L3182K03358L62241
$$ -257346 -118293 -164572 -7614 144868 47836 33914 -80177 -46995 156363 518604
6411E18604o59154j03987J80710K40340l2856k62632O2672M8866p7584J91306
$$ 518604 -140550 -244537 -63827 176513 143657 -118975 -56303 -7437 -85021 106285
6401A06285j23281j58947j83657L52281N4498l42864J62380n2307P0527M84780
$$ 106285 -16996 -175943 -359600 -7319 47179 -295685 -133305 -185612 -115085 369695
6391C69695j56189J590J92880k27856J31560J46118L09947n93983J5417J17013
$$ 369695 213506 215096 407976 180120 311680 457798 767745 173762 189179 306192
6381C06192k53589j06640M27578J84645k72708j55056J60815m13153k58075J60742
$$ 306192 52603 -54037 373541 558186 285478 130422 291237 -121916 -379991 -219249
6371b19249K69906K05606K44563o0097j96005k96629j35103L50877q3174k24534
$$ -219249 50657 256263 500826 440729 244724 -51905 -187008 163869 80695 -143839
6361a43839j69950O58964o55980m18336P29818j59587m58893K68073M79594j07653
$$ -143839 -313789 345175 -310805 -729141 677 -158910 -617803 -349730 129864 22211
6351B2211P8360j79426M17243o1608j36099j54261L02623j29742k52028L68088
$$ 22211 100571 -78855 338388 276780 140681 -13580 289043 159301 -92727 275361
6341B75361l76195o10219L41445K14104j10005N523k93611J79767L81800K3784
$$ 275361 -100834 -711053 -369608 -155504 -265509 -259986 -553597 -373830 7970 31754
6331C1754J35261n14463K63530J5254P3030J6209K8793K38542k09032n0402j73123
$$ 31754 167015 -347448 -83918 -68664 4366 20575 49368 287910 78878 28476 -144647
6320a44647J82581j96304P7303J66433L25878k41999L07956k35526l20740J95986
$$ -144647 37934 -158370 -81067 85366 411244 169245 477201 241675 -79065 116921
6310A16921K08994j85436j44428L8440J97274L4127q724J26645j51334J14811
$$ 116921 325915 140479 -3949 34491 231765 265892 257168 383813 232479 347290
6300C47290m26508P7279K52019k05040q6855J5180l01818L76053L06001k18130
$$ 347290 -79218 -1939 250080 45040 -41815 -26635 -328453 47600 353601 135471
6290A35471J41171m75315K73111J08649j65981J14810o4382K70728k65474J72582
$$ 135471 276642 -198673 74438 183087 17106 131916 67534 338262 72788 245370
6280B45370j14775J80886M4201j85311m0817j00074N3207k16121N9151J79992
$$ 245370 130595 311481 355682 170371 129554 29480 82687 -133434 -74283 105709
6270A05709L33757r132l31731l70618L80254o1498L82979k59453J3412j57249
$$ 105709 439466 430334 98603 -272015 108239 46741 429720 170267 183679 26430
6260B6430L49399o7347l48304J85609n0299j79112m4420j11621j12636k50844
$$ 26430 375829 308482 -39822 145787 95488 -83624 -128044 -239665 -352301 -603145
6250f03145M25893L92858l17305J97236m09687J16756N8595r2968M16221K48187
$$ -603145 -177252 215606 -101699 95537 -314150 -197394 -138799 -231767 184454 432641
6240D32641o69108m5267L191K06298m9852k04822K55069Q3472j41951M7679K2456
$$ 432641 -236467 -281734 -278543 -72245 -122097 -326919 -71850 11622 -130329 -82650 -60194
6229f0194J09680L63182l71458k07145K29978q1609L12622k96685K4439N10142
$$ -60194 49486 412668 41210 -165935 64043 -17566 295056 -1629 22810 532952
6219E32952o43880M34441P8363K02969k99219m6172m09172K0606K93834k26837
$$ 532952 -110928 323513 401876 604845 305626 259454 -149718 -129112 164722 -62115
6209f2115K16851l17778j18580m3084K68042M24656P0901l69280K62038k11503
$$ -62115 154736 -163042 -281622 -324706 -56664 367992 438893 69613 331651 120148
6199A20148j93944J16545k36944L6763K27356j74822J20960K45774J08213J59718
$$ 120148 -73796 42749 -194195 -157432 69924 -104898 16062 261836 370049 529767
6189E29767l88629k4599l06398j64443M77056O3874p7398l55217m2981L49149
$$ 529767 141138 116539 -189859 -354302 122754 186628 109230 -245987 -288968 60181
6179F0181K44310n3792k74652L69080L65472k19361J4534l02064o57747K72586
$$ 60181 304491 250699 -23953 345127 710599 491238 505772 203708 -454039 -181453
6169a81453K03859j89741j9796L85978L83747J9072j25831j14493N8750j75184
$$ -181453 22406 -167335 -187131 198847 582594 601666 475835 361342 420092 244908
6159B44908r7748m09937K8518J45695r6858q660J37729L30225k1211j97296N2425
$$ 244908 147160 -262777 -234259 -88564 -185422 -194082 -56353 273872 252661 55365 107790
6148A07790j5440j12924n9833m6392L51164q0829n5184Q7688m9722J37448J12526
$$ 107790 92350 -20574 -80407 -126799 224365 143536 88352 176040 126318 263766 376292
6137C76292m65959Q877N0459j55417K74979r5477J52231k31017o7293l80129O65761
$$ 376292 -89667 -80790 -30331 -185748 89231 -6246 145985 -85032 -152325 -532454 133307
6126A33307J61271l6703o57676L70493J76684K94273l61227J07380n17053m7065
$$ 133307 294578 257875 -399801 -29308 147376 441649 80422 187802 -329251 -376316
6116c76316N05839J07801k50421K13909J27330n48197J62389L21914o1744k99760
$$ -376316 129523 237324 -13097 200812 328142 -220055 -57666 264248 202504 -97256
6106i7256J35316J4799K01832k08382k56057K25608J59300j98366K91085k71595
$$ -97256 38060 52859 254691 46309 -209748 15860 175160 -23206 267879 -3716
6096c716O58291J3550j40018j62621j26158n2635J96919l02506M0516l1358l6267
$$ -3716 654575 668125 528107 365486 239328 186693 383612 81106 121622 90264 53997
6085E3997l14732k28782M18226K32286k8648L4995q1853l24483p9517J67832J58917
$$ 53997 -260735 -489517 -71291 160995 132347 167342 85489 -238994 -318511 -150679 8238
6074H238j54612L68797J95249m41367J86027J19055J53520J52886o95660K07188
$$ 8238 -146374 222423 417672 -23695 162332 281387 434907 587793 -107867 99321
6064I9321O8040j98439K16910L05980J2160l62199O9498j35290o6405K63951J01121
$$ 99321 167361 -31078 185832 491812 503972 141773 211271 75981 9576 273527 374648
6053C74648P7284J02386m62794n2059J97478J95217j03269K72683J77091l95894
$$ 374648 451932 554318 91524 39465 236943 432160 328891 601574 778665 382771
6043C82771k69468K56037l85669n5467p7759J72361J30536L38912J25798l26691
$$ 382771 113303 369340 -16329 -71796 -149555 22806 153342 492254 618052 291361
6033B91361n46049J80223n8893j52606q6926M27186J52961q8903R0014j47721
$$ 291361 -254688 -74465 -133358 -285964 -372890 54296 207257 118354 208368 60647
6023F0647R7759Q2276j3969k62489K30180J57408k37178Q0942p3988K62749j33424
$$ 60647 158406 240682 226713 -35776 194404 351812 114634 195576 121588 384337 250913
6012B50913Q4511j83657j57210L3187J35272L7007k35612J29842L8772R5970m22571
$$ 250913 335424 151767 -5443 27744 163016 200023 -35589 94253 133025 228995 -193576
6001a93576K60909j60958L74125j19715j14231L75035r9896K40744N22013m16020
$$ -193576 67333 -93625 280500 160785 46554 421589 321693 562437 1084450 668430
5991F68430l60792L66412j02628j84507k6191j22923k36789M29422J04662n18687
$$ 668430 307638 674050 571422 386915 360724 237801 1012 430434 535096 16409
5981A6409K63847j28349J03224p2832k2855M3160Q374L66414j67465k47894j74004
$$ 16409 280256 151907 255131 182299 159444 202604 210978 577392 409927 162033 -11971
5970a1971R2343L42490j34664L4252J4689j55824L27890L33874k81713K55295
$$ -11971 80372 422862 288198 322450 337139 181315 509205 843079 561366 816661
5960H16661p949j5873j78137j41542p3880M9698l39029N00735M8307J20261J02794
$$ 816661 808712 792839 614702 473160 399280 448978 109949 610684 658991 779252 882046
5949H82046k14636l49981J63197P8541J20155Q243k03960J85381j57320R3672
$$ 882046 667410 317429 480626 559167 679322 687565 483605 668986 511666 605338
5939F05338J52403J42144m81064J28772L43035j12284O85226j58026p23293J66684
$$ 605338 757741 899885 418821 547593 890628 778344 1463570 1305544 582251 748935
5929G48935M7202k05597o212L38174l88747r9711J49319m81600l1767N08806K36246
$$ 748935 796137 590540 584328 922502 533755 434044 583363 101763 69996 578802 815048
5918H15048l85266P2169j66429P7038M5218k56098O72657l7566L8828n73241Q4309
$$ 815048 429782 501951 335522 412560 457778 201680 874337 836771 875599 302358 386667
5907C86667p8736j85788J71609K64748R4857l4102l1710j8848j06745k0695L69326
$$ 386667 307931 122143 293752 558500 653357 619255 587545 568697 461952 441257 810583
5896H10583J35869r9446j94402l675k57292j86306k48153K68495p4331M5709K01397
$$ 810583 946452 847006 652604 648929 391637 205331 -42822 225673 151342 197051 398448
5885C98448j75969j19623M85339K07571M04676k96026l29654p9993k72762M49842
$$ 398448 222479 102856 588195 795766 1200442 904416 574762 494769 222007 671849
5875F71849j91449K13353n9269l70096M4850L10529j26008J26499P7791j72695
$$ 671849 480400 693753 634484 264388 309238 619767 493759 620258 698049 525354
5865E25354J15289l91982k5520K50343J80475K6517j34836L7061L24991k45101
$$ 525354 640643 248661 223141 473484 653959 680476 545640 582701 907692 662591
5855F62591m43446R5078J38508K02624m45551K06489J12049j80089K17249m33994
$$ 662591 219145 314223 452731 655355 209804 416293 528342 348253 565502 131508
5845A31508p7268L88098r2371l37083Q8775M47829J46573k91913p19225M86919
$$ 131508 54240 442338 349967 12884 101659 549488 696061 404148 -315077 171842
5835A71842N02601k61192k50639R8558j05065j33908K90961p8429k6653j24885
$$ 171842 674443 413251 162612 261170 156105 22197 313158 234729 208076 83191
5825H3191J01376L56487j55090k26467J97142K94983J21920m33223M1559q0589
$$ 83191 184567 541054 385964 159497 356639 651622 773542 340319 381878 301289
5815C01289o8126M98271n06683K69922K64347k02106M42901k61949j10503J24612
$$ 301289 233163 731434 224751 494673 759020 556914 999815 737866 627363 751975
5805G51975m39076n7483p8255l6798m1977K95027k32157L73371J24203j1697j17240
$$ 751975 312899 255416 177161 140363 98386 393413 161256 534627 658830 647133 529893
5794E29893o7797N1163j51919K23422j16017l10694K4313K73976j43415O8166
$$ 529893 462096 513259 361340 584762 468745 158051 182364 456340 312925 381091
5784C81091J38895j9362l21700k7622Q2332r0447J23397L45390R0147q2851l5322
$$ 381091 519986 500624 178924 151302 233634 143187 266584 611974 702121 619270 583948
5773E83948k34700J00274K45134n32555L059K2344M41711K44359o78778j22375
$$ 583948 349248 449522 694656 162101 165160 187504 629215 873574 194796 72421
5763G2421P58681m31736j45539M85308K0311l90413K74610L7924m29811O4385
$$ 72421 831102 399366 253827 739135 759446 369033 643643 681567 251756 316141
5753C16141M65030M0428L22788o4836m37936M62160k54397K2892k31729j48574
$$ 316141 781171 821599 1144387 1079551 641615 1103775 849378 872270 640541 491967
5743D91967K33503L76701o22753N38217J16961j33528O4038m88178J86389J1135
$$ 491967 725470 1102171 479418 1017635 1134596 1001068 1065106 576928 763317 774452
5733G74452j53548k29590L53812K09030j66018K91726J29963L6148O3268k36693
$$ 774452 620904 391314 745126 954156 788138 1079864 1209827 1245975 1309243 1072550
5723A072550r748k79258k17j32804L41141m60775j07187L94120L12215p3789L22508
$$ 1072550 1062802 783544 783327 650523 991664 530889 423702 817822 1130037 1056248 1378756
5712A378756j07434K04127L54846n54016j83684J27278O273J19108m64365p3346
$$ 1378756 1271322 1475449 1830295 1276279 1092595 1219873 1226146 1345254 880889 807543
5702H07543L69063l86780n4539J70094M4364R100J90567k37555j45485L9133K97652
$$ 807543 1176606 789826 735287 905381 949745 958845 1149412 911857 766372 805505 1103157
5691A103157J51795M83512k27761l04340p0605p482k20427L61641l93457J39948
$$ 1103157 1254952 1738464 1510703 1206363 1135758 1128276 907849 1269490 876033 1015981
5681A015981K8714M2614j23924J40210p295q7495m8752k94162K18389r5237L47507
$$ 1015981 1044695 1087309 963385 1103595 1096300 1008805 960053 665891 884280 789043 1136550
5670A136550j54064l7111K59089k21204K45166J16970n75055k27082K68148K16162
$$ 1136550 982486 945375 1204464 983260 1228426 1345396 770341 543259 811407 1027569
5660A027569k16737p6344K19312K67104J34011j10592m42797M4150j25129O25383
$$ 1027569 810832 734488 953800 1220904 1354915 1244323 801526 845676 720547 1345930
5650A345930j21815J22252j25084j11681K89478j75459J75434J39321l00421L45356
$$ 1345930 1224115 1346367 1221283 1109602 1399080 1223621 1399055 1538376 1237955 1583311
5640A583311k19940J56051K33899l51982L41623k02774K71865p8705J15047L62744
$$ 1583311 1363371 1519422 1753321 1401339 1742962 1540188 1812053 1733348 1848395 2211139
5630B211139j52411k8688K52120M11453j33238r0183J77302R2123j58429K99208
$$ 2211139 2058728 2030040 2282160 2693613 2560375 2470192 2647494 2739617 2581188 2880396
5620B880396n17422M84097R4745k93254O09218M42672J47087K22119m2028L44093
$$ 2880396 2362974 2847071 2941816 2648562 3257780 3700452 3847539 4069658 4027630 4371723
5610D371723N99536r6982K68048O13780J95382l57211n67560j81779o22238n30110
$$ 4371723 4971259 4874277 5142325 5756105 5951487 5594276 5026716 4844937 4222699 3692589
5600C692589j03798q5960j14075j93685j41343l25996K73024j00329J03102j79178
$$ 3692589 3588791 3502831 3388756 3195071 3053728 2727732 3000756 2900427 3003529 2824351
5590B824351J12911J34052j01943J8138j02839J1826L29140P0366k27302n6465
$$ 2824351 2937262 3071314 2969371 2987509 2884670 2896496 3225636 3296002 3068700 3012235
5580C012235L21613R5372o6585k61614M90860J92911l13110K2037N83559k35757
$$ 3012235 3333848 3429220 3362635 3101021 3591881 3784792 3471682 3493719 4077278 3841521
5570C841521p027L22142K68493j26398O845L91349k7918p3058K92062k27867j37053
$$ 3841521 3834494 4156636 4425129 4298731 4305576 4696925 4669007 4595949 4888011 4660144 4523091
5559D523091N78659L32286L11712J54222M38563l53267P58334L29304L87162j20857
$$ 4523091 5101750 5434036 5745748 5899970 6338533 5985266 6743600 7072904 7460066 7339209
5549G339209J01278O26517M05851O25966J24899L30655N58771N77744M45218P45543
$$ 7339209 7440487 8067004 8472855 9098821 9223720 9554375 10113146 10690890 11136108 11881651
5539A1881651M25387Q53469N60338O39774Q98622R81518J498055J023743Q45906
$$ 11881651 12307038 13160507 13720845 14360619 15259241 16240759 17738814 18762557 19608463
5530A9608463R96452J894809J990713J721807J665601J170596K346126K281437
$$ 19608463 20604915 22499724 24490437 26212244 27877845 29048441 31394567 33676004
5522C3676004L143499L955525M750440N519768O301099M610290J434354j875195
$$ 33676004 36819503 40775028 45525468 51045236 57346335 61956625 63390979 61515784
5514F1515784k787052k030713j369422n93348P85057J478390J898885K755644
$$ 61515784 58728732 56698019 55328597 54735249 55520306 56998696 58897581 61653225
5506F1653225M203190M373065M949285M937416N614145N896448O370788P624824
$$ 61653225 65856415 70229480 75178765 80116181 85730326 91626774 97997562 105622386
5498A05622386R453314R960725O894034j137001q481129j0663055r137495p382218
$$ 105622386 115075700 125036425 131930459 130793458 122312329 111649274 102511779 95129561
5490I5129561n085478k821033j877191M90000K205354M714079N522864N597825
$$ 95129561 90044083 87223050 85345859 85835859 88041213 92755292 98278156 103875981
5482A03875981N117090L663711L496626J138980j554554j897860k374235k944858
$$ 103875981 108993071 112656782 116153408 117292388 115737834 113839974 111465739 108520881
5474A08520881n409961o903507p249138p213781o360469m918325m679957k804674
$$ 108520881 103110920 96207413 88958275 81744494 75384025 70465700 65785743 62981069
5466F2981069j740091n38810K30913P92201J209165R97644Q393j510218l493123
$$ 62981069 61240978 60702168 60933081 61725282 62934447 63932091 63940484 62430266 58937143
5457E8937143m530097m582556l937654l083529k518932j930941j204486k176315
$$ 58937143 54407046 49824490 45886836 42803307 40284375 38353434 37148948 34972633
5449C4972633k322475k540454j953175j940090j602091j147984j266445j176825
$$ 34972633 32650158 30109704 28156529 26216439 24614348 23466364 22199919 21023094
5441B1023094r69903r55764l50719o16367l50916k57666k76236k83575m3639j4645
$$ 21023094 20053191 19097427 18746708 18130341 17779425 17521759 17245523 16961948 16918309 16903664
5431A6903664L16566n90908N5427J71873K53820l8284p75956k61767n13013n53447
$$ 16903664 17220230 16629322 16684749 16856622 17110442 17072158 16296202 16034435 15521422 14967975
5421A4967975n56890k99426m9457Q8252m30100J03763L81577L98721M07756K87986
$$ 14967975 14411085 14111659 14062202 14150454 13720354 13824117 14205694 14604415 15012171 15300157
5411A5300157P70945R61670P54494P21730R67641J143263J231602J145435J756083
$$ 15300157 16071102 17032772 17787266 18508996 19476637 20619900 21851502 22996937 24753020
5402B4753020J987402K222934K854055L578951L697376K226916K76658j819868
$$ 24753020 26740422 28963356 31817411 35396362 39093738 41320654 41597312 39777444
5394C9777444k111521k523044k047759j181571p79650m13496r0557K40515J407145
$$ 39777444 37665923 35142879 33095120 31913549 31133899 30720403 30629846 30870361 32277506
5385C2277506J629096J337024K277295L319887M818130O232401P405853Q143231
$$ 32277506 33906602 35243626 37520921 40840808 45658938 51891339 59297192 67440423
5377F7440423O125649l89982o169397p548363p880587o163871m844530k994630
$$ 67440423 73566072 73176090 67006693 59458330 51577743 45413872 40569342 37574712
5369C7574712k652628k017615k291969j165453m75526j70738L57146R02134J928890
$$ 37574712 34922084 32904469 30612500 29447047 28971521 28800783 29157929 30060063 31988953
5360C1988953K288219L366292L667084J904848j252275l657406m443070m555596
$$ 31988953 34277172 37643464 41310548 43215396 41963121 38305715 33862645 29307049
5352B9307049l355942l246608k523375j686502j519359j835713j735847r09438
$$ 29307049 25951107 22704499 20181124 18494622 16975263 15139550 13403703 12494265
5344A2494265j006724o25710j243849m58672k41309m57680o11614l10001k52674
$$ 12494265 11487541 10861831 9617982 9159310 8918001 8460321 7848707 7538706 7286032
5335G286032k64400J87809o73572J42651n17055l97081k98340k03070k73865R1961
$$ 7286032 7021632 7209441 6535869 6678520 6161465 5764384 5466044 5262974 4989109 5081070
5325E081070P4284k21379k73898M49245N1198m69930O8849o8144j85013k97329
$$ 5081070 5155354 4933975 4660077 5109322 5160520 4690590 4759439 4691295 4506282 4208953
5315D208953o1934n0825j27607k3604j50557m226k41574j60161K60616n7143J41452
$$ 4208953 4147019 4096194 3968587 3944983 3794426 3790200 3548626 3388465 3649081 3591938 3733390
5304C733390l96304J65849Q1484j37070o6441J10621k45028m39762L5010k01259
$$ 3733390 3337086 3502935 3584419 3447349 3380908 3491529 3246501 2806739 2841749 2640490
5294B640490m7007N26953O5375j363O246m24394K48526o1563N2568M61157Q7929
$$ 2640490 2593483 3120436 3185811 3184448 3190694 2766300 3014826 2953263 3005831 3466988 3554917
5283C554917j69283j52234q1170p4521R4646k44662Q8622m23777K12243N9009
$$ 3554917 3385634 3233400 3152230 3077709 3172355 2927693 3016315 2592538 2804781 2863790
5273B863790k3525J7592l27211N4381L85958L20109m04418j2177j4709p4491j58689
$$ 2863790 2840265 2857857 2530646 2585027 2970985 3291094 2886676 2874499 2859790 2785299 2626610
5262B626610N27178r4986J10777m28087j11508P21556k32398k9317J85992m27432
$$ 2626610 3153788 3058802 3169579 2741492 2629984 3351540 3119142 3089825 3275817 2848385
5252B848385l38648J22647k91090J47984J76380l6503K18674N3761k93375L60195
$$ 2848385 2509737 2632384 2341294 2489278 2665658 2629155 2847829 2901590 2608215 2968410
5242B968410j04342J30740m65669q649K10267J50801j898K2451j89891K98502
$$ 2968410 2864068 2994808 2529139 2520490 2730757 2881558 2879660 2902111 2712220 3010722
5232C010722J03129n9678l3122j89067j02759j05802K65387M7246k25631L82675
$$ 3010722 3113851 3054173 3021051 2831984 2729225 2623423 2888810 2936056 2710425 3093100
5222C093100J29067J89229J50872k75449l89471L50595j83796m26944r9280M3952
$$ 3093100 3222167 3411396 3562268 3286819 2897348 3247943 3064147 2637203 2537923 2581875
5212B581875K30323J48287J06863k43949l46620K22174M3793L39823J5537j26777
$$ 2581875 2812198 2960485 3067348 2823399 2476779 2698953 2742746 3082569 3098106 2971329
5202B971329K58427O8052M2909P9140L53435K50236j19403K89126j44196k42815
$$ 2971329 3229756 3297808 3340717 3419857 3773292 4023528 3904125 4193251 4049055 3806240
5192C806240M22032m42732J30104j85631J16030K12010J23123n8446J83731l56568
$$ 3806240 4228272 3785540 3915644 3730013 3846043 4058053 4181176 4122730 4306461 3949893
5182C949893J20440N1893K05080J92588l46784J82203k1535K4886K75709J60751
$$ 3949893 4070333 4122226 4327306 4519894 4173110 4355313 4333778 4358664 4634373 4795124
5172D795124m1934L5896R6142M30194o4367j21017J31344k62393J15481k33559
$$ 4795124 4753190 4789086 4885228 5315422 5251055 5130038 5261382 4998989 5114470 4880911
5162D880911k48879o0468o407N10567o5737L6768k46022K78669n7297l5423R2299
$$ 4880911 4632032 4571564 4565157 5075724 5009987 5046755 4800733 5079402 5022105 4986682 5078981
5151E078981J18051L44864j41472j25429k20156K7616r1807K35481n5169K30908
$$ 5078981 5197032 5541896 5400424 5274995 5054839 5082455 4990648 5226129 5170960 5401868
5141E401868J50931J25878n2829l48612P4564k05725N7578M58326q458R6616M57106
$$ 5401868 5552799 5678677 5625848 5277236 5351800 5146075 5203653 5661979 5653521 5750137 6207243
5130F207243n03964K6173M44772L23037k03436j62K74972m080O55212J9334L97038
$$ 6207243 5703279 5729452 6174224 6497261 6293825 6293663 6568635 6564555 7219767 7239101 7636139
5119G636139L8722L20984P36889M95074L89468J89612K77358L58518L33540O18702
$$ 7636139 7674861 7995845 8732734 9227808 9617276 9806888 10084246 10442764 10776304 11395006
5109A1395006J64378r8902K59794P75858O33347M32744K82384R74264O07888O90297
$$ 11395006 11559384 11460482 11720276 12496134 13129481 13562225 13844609 14818873 15426761 16117058
5099A6117058P81833J355064J238126J585141J421256J861923K285675J722704
$$ 16117058 16898891 18253955 19492081 21077222 22498478 24360401 26646076 28368780
5091B8368780K046062K153588K852156L310445L537037N086197N922415O266103
$$ 28368780 30414842 32568430 35420586 38731031 42268068 47354265 53276680 59542783
5083E9542783N835691K613535r42274l562099l823392k923744k250613j145606
$$ 59542783 65378474 67992009 67049735 63487636 59664244 56740500 54489887 53344281
5075E3344281j52449O20661J586365K200846K614519L240747M228296N701916
$$ 53344281 53191832 53812493 55398858 57599704 60214223 63454970 67683266 73385182
5067G3385182O818694Q235687J0242481J2027574J3199793J1755526M116556n162611
$$ 73385182 80203876 88439563 98682044 110709618 123909411 135664937 139781493 134618882
5059A34618882j0651684j2464391j0585429q999248o211295m459956k488776j295356
$$ 134618882 123967198 111502807 100917378 91918130 85706835 81246879 78758103 77462747
5051G7462747r37507M63948J129790J583862K681341M098633N751110O608067
$$ 77462747 76525240 76989188 78118978 79702840 82384181 86482814 92233924 98841991
5043I8841991P768479P256854N328753K904057j993493q003851j0775304j0620979
$$ 98841991 106610470 113867324 119196077 122100134 120106641 112102790 101327486 90706507
5035I0706507q568947o337084n271867l899813l824118l390399k460768j493781
$$ 90706507 82137560 75800476 70528609 66628796 62804678 59414279 56953511 55459730
5027E5459730n16832K77995O81336K71320M3142k29129j0386L3228o42121j547275
$$ 55459730 54942898 55220893 55902229 56173549 56216691 55987562 55977176 56010404 55368283 53821008
5017E3821008k198003l197126m103112l153522l286942l049052j609423k108039
$$ 53821008 51623005 48425879 44322767 41169245 37882303 34833251 33223828 31115789
5009C1115789j455168j175801m13663J91941l3230k70592j115235j478674j368265
$$ 31115789 29660621 28484820 28071157 28263098 28229868 27959276 26844041 25365367 23997102
5000B3997102j573327j101255n79355o71535q62497o88188k37422m49532q10872
$$ 23997102 22423775 21322520 20743165 20071630 19209133 18520945 18283523 17833991 17023119
4991A7023119n68637q295m57803J90767n2167J25044j74710k0803K29591j52441
$$ 17023119 16454482 16446187 15988384 16179151 16126984 16252028 16077318 16056515 16286106 16133665
4981A6133665j28846k86472J86602k35614N24720l2540k09191M84928L0903J84668
$$ 16133665 16004819 15718347 15904949 15669335 16194055 16161515 15952324 16437252 16468155 16652823
4971A6652823K9618K77920j60846M06785L21253O06178Q72670N70180O69906L71690
$$ 16652823 16682441 16960361 16799515 17206300 17527553 18133731 19006401 19576581 20246487 20618177
4961B0618177R08451J100418Q81950J032002O15226O67482J862030K242236K104846
$$ 20618177 21526628 22627046 23508996 24540998 25156224 25823706 27685736 29927972 32032818
4952C2032818K567343L695658M610549N056200M425656J328516j268192l163396
$$ 32032818 34600161 38295819 42906368 47962568 52388224 53716740 52448548 49285152
4944D9285152l967590k415805j513522q57674m58722Q3444J93038Q03345R49727
$$ 49285152 45317562 42901757 41388235 40530561 40071839 40155283 40348321 41151666 42101393
4935D2101393J825537L034342K833489L923953N876360P448082R234932P411717
$$ 42101393 43926930 46961272 49794761 53718714 59595074 67043156 76278088 83689805
4927H3689805J177094o308583q262233p682991o802648n166104l959886l455330
$$ 83689805 84866899 78558316 70296083 62613092 55810444 50644340 46684454 43229124
4919D3229124j984859j914810j518560j182699m47005M10844J009988J846553
$$ 43229124 41244265 39329455 37810895 36628196 36181191 36592035 37602023 39448576
4911C9448576J641574K787796K947000K678411J20665l292955l534251m242496
$$ 39448576 41090150 43877946 46824946 49503357 49624022 46331067 42796816 38554320
4903C8554320l474022k615444j960508j467948j172388p76834j063381l49888
$$ 38554320 35080298 32464854 30504346 29036398 27864010 27087176 26023795 25673907
4895B5673907n48555k65647k08987m28730l99138p28213k39846K05009j62475
$$ 25673907 25125352 24859705 24650718 24221988 23822850 23094637 22854791 23059800 22897325
4886B2897325L393J08432M68048J79728J18398O07329O00241Q20926M60530M04715
$$ 22897325 22900718 23009150 23477198 23656926 23775324 24382653 24982894 25803820 26264350 26669065
4876B6669065Q67945P07911J380337J238206J512031J76700K65151m07103P20745
$$ 26669065 27537010 28244921 29625258 30863464 32375495 32552195 32817346 32410243 33130988
4867C3130988J153396O82933Q37283R38319J407692R43001O85413J259246J457271
$$ 33130988 34284384 34967317 35804600 36742919 38150611 39093612 39779025 41038271 42495542
4858D2495542J387819J827556J766341K440126L181078L636252L310707K870520
$$ 42495542 43883361 45710917 47477258 49917384 53098462 56734714 60045421 62915941
4850F2915941K363138K630921L230754L630268L951744L325563L870999L563142
$$ 62915941 65279079 67910000 71140754 74771022 78722766 82048329 85919328 89482470
4842H9482470M281925N697311O828791R226563J3164950J6190410J9054681J2025825
$$ 89482470 93764395 99461706 106290497 115517060 128682010 144872420 163927101 175952926
4834A75952926j732187p071350n232277k212896j774192k532016j809103p28541
$$ 175952926 174220739 167149389 161917112 159704216 157930024 155398008 153588905 152860364
4826A52860364J186803L388580N357646Q036651R869534J0903029J2913955J4049726
$$ 152860364 154047167 157435747 162793393 170830044 180699578 191602607 204516562 218566288
4818B18566288J3506919J3697973J5728228J4024684Q875944N372593L976294
$$ 218566288 232073207 245771180 261499408 275524092 284400036 289772629 293748923
4811B93748923J456792m5160J014217L968680P185926J1915636J8256142K2018404
$$ 293748923 295205715 295160555 296174772 300143452 307329378 319245014 337501156 359519560
4803C59519560J7528447J493126j4322850k0563689j9491860j4038944o571408
$$ 359519560 377048007 378541133 364218283 343654594 324162734 310123790 303552382
4796C03552382j444603L828143Q474764J3286117J4234617M353163j3848555k4300997
$$ 303552382 302107779 305935922 314410686 327696803 341931420 346284583 332436028 308135031
4788C08135031k4230530k2151091k0491572j8521099j6466022j5496955j3785772
$$ 308135031 283904501 261753410 241261838 222740739 206274717 190777762 176991990
4781A76991990j1572263r141975o511231m932664m377753m716897m663911n353902
$$ 176991990 165419727 156277752 149766521 144833857 140456104 135739207 131075296 125721394
4773A25721394n471440m754323l626787k809203k583186k830271l232707n662752
$$ 125721394 120249954 115495631 111868844 109059641 106476455 103646184 100413477 94750725
4765I4750725o894242o643722n337505m640305l697475l478520l122796l251794
$$ 94750725 87856483 81212761 75875256 71234951 67537476 64058956 60936160 57684366
4757E7684366k387796k087992j418705j706600k154720j445002j508004j576080
$$ 57684366 55296570 53208578 51789873 50083273 47928553 46483551 44975547 43399467
4749D3399467r45425j179187j387371l16054j94373k70106l92070M28612l8256
$$ 43399467 42454042 41274855 39887484 39571430 39377057 39106951 38714881 39143493 39105237
4740C9105237M35768P45857M63455J090223J383236K093802K196827K555109L024520
$$ 39105237 39541005 40286862 40750317 41840540 43223776 45317578 47514405 50069514 53094034
4731E3094034K077112j227678j916287j219687n22657l27029L76830J151598R07687
$$ 53094034 55171146 53943468 52027181 50807494 50284837 49957808 50334638 51486236 52393923
4722E2393923N37535P18688P98469J202559J312146J253136J703172K363645K721246
$$ 52393923 52931458 53650146 54448615 55651174 56963320 58216456 59919628 62283273 65004519
4713F5004519K426559L056351M398541N902879P746806J0903414J4783288J9083044
$$ 65004519 67431078 70487429 74885970 80788849 88535655 99439069 114222357 133305401
4705A33305401K2964005J8405388k966086j7680228j8943089j5990029j2571323
$$ 133305401 156269406 174674794 171708708 154028480 135085391 119095362 106524039
4698A06524039r392487p550185n839613m554615l742319l275874m017508m823821
$$ 106524039 97131552 89581367 83741754 79187139 75444820 72168946 68151438 63327617
4690F3327617m911988m230786l512502l057677k320041j499890j187408j014067
$$ 63327617 58415629 54184843 50672341 47614664 45294623 43794733 42607325 41593258
4682D1593258l98224q57689j9384O75397O83572J557032J870302J125761J704828
$$ 41593258 41195034 40337345 40317961 40993358 41676930 43233962 45104264 46230025 47934853
4673D7934853K220434K863226M090966N318008L702749L50987m202050o107585
$$ 47934853 50155287 53018513 57109479 62427487 66130236 66481223 62279173 56171588
4665E6171588n890168n438773m742254l597633k057084k136642j542563q69985
$$ 56171588 50281420 44842647 40100393 36502760 34445676 32309034 30766471 29896486
4657B9896486r81288m95739j49918O9594L97873r3472J197959J561930J876309
$$ 29896486 28915198 28419459 28269541 28339135 28737008 28643536 29841495 31403425 33279734
4648C3279734K951942M478666N847713N826272K664232k277402n086617n512577
$$ 33279734 36231676 40710342 46558055 52384327 55048559 52771157 47684540 42171963
4640D2171963n285474m853616k807647k614916k470682r81298j610808j050263
$$ 42171963 36886489 32032873 29225226 26610310 24139628 23158330 21547522 20497259
4632B0497259o81085n68946m67494n51313O0341p555J77523P01504K61614J049099
$$ 20497259 19816174 19247228 18779734 18228421 18288762 18281207 18458730 19160234 19421848 20470947
4622B0470947K128645J918125J061928l88146j237382j447176j612668j854093
$$ 20470947 22599592 24517717 25579645 25191499 23954117 22506941 20894273 19040180
4614A9040180j081902m26057l69247m84587n88874j34166o09968j230667r32257
$$ 19040180 17958278 17532221 17162974 16678387 16089513 15955347 15345379 14114712 13182455
4605A3182455o38503k79351l49181m46553J89039J00209n59420l15865M04734
$$ 13182455 12543952 12264601 11915420 11468867 11657906 11758115 11198695 10882830 11287564
4596A1287564k47622k35258J61996L44270K23636N62027M39809P13292O01087
$$ 11287564 11039942 10804684 10966680 11310950 11534586 12096613 12536422 13249714 13850801
4587A3850801o7542N52029o3767n37771L4050p93740r2768l83219o95293l59224
$$ 13850801 13783259 14335288 14271521 13733750 13767800 12974060 12881292 12498073 11802780 11443556
4577A1443556L7283p93744k25011M8457m26775l61960n15329o1882k6876J07480
$$ 11443556 11480839 10687095 10462084 10510541 10083766 9721806 9206477 9144595 9117719 9225199
4567I225199J43829L13284L50164K76050j13434P03568J99888N57040J40408m50225
$$ 9225199 9369028 9682312 10032476 10308526 10195092 10898660 11098548 11655588 11795996 11345771
4557A1345771m72497l62772r24979l72229n50791m47935M6837o05696k98694k59581
$$ 11345771 10873274 10510502 9585523 9213294 8662503 8214568 8261405 7655709 7357015 7097434
4547G097434k51597m47059J74506L32711m32548n51511j02794K96478J66484L5535
$$ 7097434 6845837 6398778 6573284 6905995 6473447 5921936 5819142 6115620 6282104 6317639
4537F317639L26376K455L89380L36167j66428j79104j92742n87100M2988m62264
$$ 6317639 6644015 6646470 7035850 7372017 7205589 7026485 6833743 6246643 6289631 5827367
4527E827367l59481p0771J57531l54344j01394K48360m70734J16195l11167J32780
$$ 5827367 5467886 5397115 5554646 5200302 5098908 5347268 4876534 4992729 4681562 4814342
4517D814342J38101L0835L54509l12867q6917L95772l58673N05635J99683M0318
$$ 4814342 4952443 4983278 5337787 5024920 4938003 5333775 4975102 5480737 5680420 5720738
4507E720738k23128j31061l6739o36099K24304l08875l36180O742j22118J7573
$$ 5720738 5497610 5366549 5329810 4693711 4918015 4609140 4272960 4279702 4157584 4175157
4497D175157k12443l89178R1268o926M500n3071L03924j51536L92660N5955J15195
$$ 4175157 3962714 3573536 3664804 3657878 3662378 3609307 3913231 3761695 4154355 4210310 4325505
4486D325505L5809j65604l6431k41556m0445k68551L14156k7802k21564k15990
$$ 4325505 4361314 4195710 4159279 3917723 3877278 3608727 3922883 3895081 3673517 3457527
4476C457527K01481k07284m06607J0131J66031j9962j17659j17607l47526M76083
$$ 3457527 3659008 3451724 3045117 3055248 3221279 3201317 3083658 2966051 2618525 3094608
$$ [...]
##END NTUPLES=NMR SPECTRUM
##END=
