##TITLE=1H_EC-3329(1)
 CDCl3
 8 sc, 
 24.7.2024
##JCAMPDX= 6.0         $$ Bruker NMR JCAMP-DX V2.0
##DATA TYPE= NMR SPECTRUM
##DATA CLASS= NTUPLES
##ORIGIN= UXNMR, Bruker Analytische Messtechnik GmbH
##OWNER= root
$$ XWIN-NMR		Version 3.5
$$ Wed Jul 24 13:49:56 2024 Russian Standard Time (UT+4h)  she@DPX200
##.OBSERVE FREQUENCY= 200.1308
##.OBSERVE NUCLEUS= ^1H
##.ACQUISITION MODE= SIMULTANEOUS
##.ACQUISITION SCHEME= undefined
##.AVERAGES= 8
##.DIGITISER RES= 18
##SPECTROMETER/DATA SYSTEM= spect
##.PULSE SEQUENCE= zg30
##.SOLVENT NAME= D2O
##.SHIFT REFERENCE= (INTERNAL, D2O, 0, 16.9765)
##AUDIT TRAIL= $$ (NUMBER, WHEN, WHO, WHERE, WHAT)
$$ ##TITLE= Audit trail, XWIN-NMR		Version 3.5
$$ ##JCAMPDX= 5.01
$$ ##ORIGIN= Bruker BioSpin GmbH
$$ ##OWNER= she
$$ F:/spectra/data/she/nmr/H-F/1/pdata/1/auditp.txt
$$ ##AUDIT TRAIL=  $$ (NUMBER, WHEN, WHO, WHERE, WHAT)
(   1,<2024-07-24 13:48:32.09 +0400>,<she>,<DPX200>,
      <created by zg, POWCHK disabled, PULCHK disabled
       configuration hash MD5:
       00 E9 B6 7A A2 85 ED C7 34 08 36 98 17 FE 4E 26
       data hash MD5: 16K
       F4 B4 08 39 7D 21 8B 79 0E 00 6F 2C A6 9B BF 44>)
(   2,<2024-07-24 13:48:36.93 +0400>,<she>,<DPX200>,
      <Start of raw data processing
       efp BC_mod = 2 LB = 0.24 FT_mod = 6 PKNL = 1 PHC0 = -25640.91 PHC1 = 11.58749 SI = 16K 
       data hash MD5: 16K
       F7 AB D9 CD 77 73 85 FD 96 B0 4D EC C1 0A 48 FF>)
(   3,<2024-07-24 13:49:01.43 +0400>,<she>,<DPX200>,
      <pk PHC0 = 3.905754 PHC1 = 2.8 
       data hash MD5: 16K
       58 3E 64 4A 75 D2 B7 C4 87 54 60 89 54 D7 16 9D>)
(   4,<2024-07-24 13:49:04.93 +0400>,<she>,<DPX200>,
      <abs ABSG = 5 
       data hash MD5: 16K
       E1 21 1E 60 D0 A5 AA F5 E7 6F 6B 0A FD D7 BF BE>)
$$ ##END=
$$ 
$$ hash MD5
$$ C3 EA 57 08 E0 16 AA 77 C0 BC F2 01 2C C8 A9 32
##$RELAX= 
##$RELAX= 
##$RELAX= 
##$RELAX= 
##$RELAX= 
##$RELAX= 
$$ Bruker specific parameters
$$ --------------------------
##$DU= <F:/spectra>
##$EXPNO= 1
##$NAME= <H-F>
##$PROCNO= 1
##$TYPE= <nmr>
##$USER= <she>
##$AMP= (0..31)
100 100 100 100 100 100 100 100 100 100 100 100 100 100 100 100 100 100 
100 100 100 100 100 100 100 100 100 100 100 100 100 100 
##$AQSEQ= 0
##$AQ_mod= 1
##$AUNM= <au_zg>
##$AUTOPOS= <>
##$BF1= 200.13
##$BF2= 200.13
##$BF3= 200.13
##$BF4= 200.13
##$BF5= 200.13
##$BF6= 200.13
##$BF7= 200.13
##$BF8= 200.13
##$BYTORDA= 1
##$CFDGTYP= 0
##$CFRGTYP= 5
##$CHEMSTR= <none>
##$CNST= (0..31)
1 1 145 1 1 1 1 1 1 1 1 1 1 1 1 1 1 1 1 1 1 1 1 1 1 1 1 1 1 1 1 1 
##$CPDPRG= <>
##$CPDPRG1= <>
##$CPDPRG2= <>
##$CPDPRG3= <>
##$CPDPRG4= <mlev>
##$CPDPRG5= <mlev>
##$CPDPRG6= <mlev>
##$CPDPRG7= <mlev>
##$CPDPRG8= <mlev>
##$CPDPRGB= <>
##$CPDPRGT= <>
##$D= (0..31)
0 1.2 0 0 0 0 0 0 0 0.06 0 0.03 0 0 0 0 0.0002 0 0 0 0 0 0 0 0 0 0 0 0 
0 0 0 
##$DATE= 1721814511
##$DBL= (0..7)
120 120 120 120 120 120 120 120 
##$DBP= (0..7)
150 150 150 150 150 150 150 150 
##$DBP07= 0
##$DBPNAM0= <>
##$DBPNAM1= <>
##$DBPNAM2= <>
##$DBPNAM3= <>
##$DBPNAM4= <>
##$DBPNAM5= <>
$$ [...]
##$SUBNAM3= <"">
##$SUBNAM4= <"">
##$SUBNAM5= <"">
##$SUBNAM6= <"">
##$SUBNAM7= <"">
##$SUBNAM8= <"">
##$SUBNAM9= <"">
##$SW= 24.0690372696642
##$SWIBOX= (0..15)
0 0 2 0 0 0 0 0 0 0 0 0 0 0 0 0 
##$SW_h= 4816.95568400771
##$TD= 16384
##$TD0= 1
##$TE= 0
##$TE2= 300
##$TE3= 300
##$TEG= 300
##$TL= (0..7)
0 120 120 120 120 120 120 120 
##$TP= (0..7)
150 150 150 150 150 150 150 150 
##$TP07= 0
##$TPNAME0= <>
##$TPNAME1= <>
##$TPNAME2= <>
##$TPNAME3= <>
##$TPNAME4= <>
##$TPNAME5= <>
##$TPNAME6= <>
##$TPNAME7= <>
##$TPOAL= (0..7)
0.5 0.5 0.5 0.5 0.5 0.5 0.5 0.5 
##$TPOFFS= (0..7)
0 0 0 0 0 0 0 0 
##$TUNHIN= 0
##$TUNHOUT= 0
##$TUNXOUT= 0
##$USERA1= <user>
##$USERA2= <user>
##$USERA3= <user>
##$USERA4= <user>
##$USERA5= <user>
##$V9= 5
##$VALIST= <valist>
##$VCLIST= <CCCCCCCCCCCCCCC>
##$VD= 0
##$VDLIST= <DDDDDDDDDDDDDDD>
##$VPLIST= <PPPPPPPPPPPPPPP>
##$VTLIST= <TTTTTTTTTTTTTTT>
##$WBST= 1024
##$WBSW= 4
##$XGAIN= (0..3)
0 0 0 0 
##$XL= 0
##$YL= 0
##$YMAX_a= 862659
##$YMIN_a= -504410
##$ZGOPTNS= <>
##$ZL1= 120
##$ZL2= 120
##$ZL3= 120
##$ZL4= 120
##$ABSF1= 21.47102
##$ABSF2= -2.598244
##$ABSG= 5
##$ABSL= 3
##$ALPHA= 0
##$AQORDER= 0
##$ASSFAC= 0
##$ASSFACI= 0
##$ASSFACX= 0
##$ASSWID= 0
##$AUNMP= <proc_1d>
##$AZFE= 0.1
##$AZFW= 0.1
##$BCFW= 0
##$BC_mod= 2
##$BYTORDP= 0
##$COROFFS= 0
##$CY= -3
##$DATMOD= 1
##$DC= 0
##$DFILT= <>
##$DTYPP= 0
##$F1P= 0
##$F2P= 0
##$FCOR= 1
##$FTSIZE= 16384
##$FT_mod= 6
##$GAMMA= 0
##$GB= 0
##$INTBC= 1
##$INTSCL= 3.70164e-10
##$ISEN= 128
##$LB= 0.24
##$LEV0= 0
##$LPBIN= 0
##$MAXI= 10000
##$MC2= 0
##$MEAN= 0
##$ME_mod= 0
##$MI= 1.114404
##$NCOEF= 0
##$NC_proc= -5
##$NLEV= 6
##$NOISF1= 3.799351
##$NOISF2= 2.8
##$NSP= 0
##$NTH_PI= 0
##$NZP= 0
##$OFFSET= 16.97651
##$PC= 1
##$PHC0= -25637
##$PHC1= 14.38749
##$PH_mod= 1
##$PKNL= yes
##$PPARMOD= 0
##$PSCAL= 0
##$PSIGN= 0
##$REVERSE= no
##$SF= 200.129810971202
##$SI= 16384
##$SIGF1= 3
##$SIGF2= 2
##$SINO= 5.538805
##$SIOLD= 16384
##$SREGLST= <1H.CDCl3>
##$SSB= 0
##$STSI= 16384
##$STSR= 0
##$SW_p= 4816.95568400771
##$SYMM= 0
##$S_DEV= 0
##$TDeff= 16384
##$TDoff= 0
##$TI= <>
##$TILT= no
##$TM1= 0
##$TM2= 0
##$TOPLEV= 0
##$USERP1= <user>
##$USERP2= <user>
##$USERP3= <user>
##$USERP4= <user>
##$USERP5= <user>
##$WDW= 1
##$XDIM= 16384
##$YMAX_p= 328806909
##$YMIN_p= -524092
$$ End of Bruker specific parameters
$$ ---------------------------------
##NTUPLES= NMR SPECTRUM
##VAR_NAME=  FREQUENCY,     SPECTRUM/REAL,   SPECTRUM/IMAG
##SYMBOL=    X,             R,               I
##VAR_TYPE=  INDEPENDENT,   DEPENDENT,       DEPENDENT
##VAR_FORM=  AFFN,          ASDF,            ASDF
##VAR_DIM=   16384,         16384,           16384
##UNITS=     HZ,            ARBITRARY UNITS, ARBITRARY UNITS
##FACTOR=    0.29402158847633, 1,            1
##FIRST=     3397.5055559808, 0,             0
##LAST=      -1419.45012802691, 0,           0
##MIN=       -1419.45012802691, -524092,     0
##MAX=       3397.5055559808, 328806909,     0
$$ Real data points
##PAGE= N=1
##DATA TABLE= (X++(R..R)), XYDATA
$$ [...]
8309A57712q2915j8106K0577N8795K0670m8157m0034k7894n663J02242p8933M9739
8297A08033q785K6875q5231K1392l600r516J587M5843M211L4098k6888m7046M9321
8284A10294J10328L0009j40962j6362p3148L6554N2001L6018J2549N678j3748
8273A49211q1774O7033m2733k8306L2896N2709n6037q3221N4031K9150P7373n5079
8261A15253R7950q589r4761N3116k7401j7373M4153m3907p150n0880J14071L0548
8249B05030j45839n1566P9754M8653j03296p5375J50959R2547j31021K9L1143
8238A01018j6509l2798Q6730j20906P5357R5696L3945R529l2845J06075m9835
8227B55457o3033j0616l5618L3822m5553O998Q2383o2950j54658O4347Q8990j8843
$$ y = [157712, 74797, 56691, 77268, 136063, 156733, 108576, 68542, 40648, 34985, 137227, 58294, 108033, 99248, 126123, 40892, 62284, 58684, 49168, 50755, 96598, 100809, 134907, 108019, 60973, 110294, 220622, 250631, 109669, 93307, 20159, 56713, 108714, 144732, 157281, 162959, 149211, 67437, 134470, 91737, 63431, 96327, 149036, 92999, 9778, 63809, 92959, 170332, 115253, 213203, 204614, 109853, 162969, 135568, 118195, 162348, 118441, 111291, 60411, 174482, 205030, 59191, 7625, 87379, 136032, 32736, -42639, 108320, 200867, 69846, 69875, 101018, 84509, 51711, 138441, 17535, 92892, 188588, 222533, 232062, 199217, 305292, 255457, 192424, 181808, 146190, 180012, 134459, 141457, 223840, 160890, 6232, 70579, 159569, 140726]
8215A40726M2144p0399j37785K20M3866J98254r6718K6996q9954L7112O6087J09707
8203B70256m4397R965m159l7063R514L1559J40497r3053k220j12974P1567p63584
8191e24092K14363M34652q3452O3020j7535J59841j31683J180p5227M6234j0792
8180G6509P5681K6011o5926k3586O2340J12759p641l900N5193l9791q7495m8586
8168A31568L8993Q953Q4586l5845m3653Q5700o7947O3361l7805N1195p6916k2862
8156A79328o5939L846m4322J07076J38002j8957j2184m0489L3259K3625l4640
8145B68605l2645J8332J10833o5644r293O8677j33534J1154K2081N6996Q074L750
8133C27386P0940k9200L9334l5614j06154j4707K2071M6475L9530k4533J25643
$$ y = [140726, 182870, 112471, -25314, -25094, 18772, 217026, 120308, 147304, 57350, 94462, 160549, 270256, 225859, 235824, 231665, 194602, 204116, 235675, 376172, 283119, 280899, 167925, 239492, -524092, -309729, 124923, 41471, 104491, 86956, 246797, 115114, 116294, 41067, 87301, 76509, 152190, 178201, 112275, 88689, 151029, 263788, 256147, 252247, 307440, 267649, 180154, 131568, 170561, 179514, 264100, 228255, 184602, 270302, 202355, 265716, 227911, 279106, 202190, 179328, 113389, 117235, 72913, 179989, 317991, 299034, 286850, 246361, 279620, 303245, 268605, 235960, 254292, 365125, 299481, 290188, 358865, 225331, 236485, 258566, 315562, 323636, 327386, 398326, 369126, 408460, 372846, 266692, 251985, 274056, 320531, 360061, 335528, 461171]
8122D61171m720m198J38281l4503O1104j21615j9725N8549M8884m7307J581N5561
8110E93063k08212M2772N3672j9023j06523q1122J20599R958Q2730J2625n0723
8099D49816J1052Q3546k1606n0316j50787O3228J85826k760k7721p6480K1863
8088D85661m062l687M8122J29887q9502j09966P201R2792j36708P1078L936P6034
8076E70786q2817L536k2491m1229j4053J33677J19945r8521J3135M9646K5864
8065F57478r2558j6861n1648Q3128R3141k7210K6339m2463J09286j00879p1346
8054E66407k2291J11346M0467j24170J03568Q6373l3497q8915N5424J08702p5427
8043G27987P0927l7042K2085o403L2835J00460j3335j0021o6723Q9898j5424L8247
$$ y = [461171, 456451, 452253, 590534, 556031, 617135, 495520, 475795, 534344, 583228, 535921, 537502, 593063, 384851, 427623, 481295, 462272, 355749, 274627, 395226, 405184, 487914, 500539, 449816, 460868, 544414, 522808, 472492, 321705, 384933, 570759, 567999, 540278, 463798, 485661, 481599, 477912, 526034, 655921, 566419, 456453, 463654, 556446, 419738, 490816, 494752, 570786, 487969, 491505, 469014, 427785, 413732, 547409, 667354, 568833, 581968, 631614, 657478, 564920, 548059, 496411, 579539, 672680, 645470, 671809, 629346, 738632, 637753, 566407, 544116, 655462, 695929, 571759, 675327, 761700, 728203, 639288, 694712, 803414, 727987, 798914, 761872, 783957, 777554, 810389, 910849, 897514, 887493, 820770, 910668, 895244, 933491]
8031I33491R462M1763P8320j209o2298J9574P5242p5463k932J64131j17388J11027
8019A173720J4676M4567J58387p514L7538M3468o8383N3563k9141J45302k2930
8008A543253Q5418O5881p20J40599J91497j8420j9244J30301J00038j3545R733
7997B214791N0988P0916K0469J42208k992N4179o6671o2179L8849J49402K0300
7986B630260l2007K8053R9099N6397n1471Q7258J80873N9090O0130K14560L42
7975C332584R3092J11704k5465K17263J19200K91768L9521J1599Q6529J54414
7965D432209J13360J34310J90862J64141J60435R5203M4421J43802K30690J45032
7955E854465J82257k5253K36753N6197K04418K03881Q6014O1039J68486J75178
$$ y = [933491, 942953, 984716, 1063036, 1061827, 999529, 1019103, 1094345, 1018882, 1015950, 1180081, 1062693, 1173720, 1188396, 1232963, 1391350, 1383836, 1421374, 1464842, 1396459, 1450022, 1420881, 1566183, 1543253, 1628671, 1694552, 1693832, 1834431, 2025928, 2007508, 1988264, 2118565, 2218603, 2205058, 2214791, 2265779, 2336695, 2357164, 2499372, 2496380, 2550559, 2483888, 2421709, 2460558, 2609960, 2630260, 2598253, 2626306, 2725405, 2781802, 2730331, 2817589, 2998462, 3057552, 3117682, 3332242, 3332584, 3425676, 3537380, 3511915, 3729178, 3848378, 4140146, 4179667, 4191266, 4277795, 4432209, 4545569, 4679879, 4870741, 5034882, 5195317, 5290520, 5334941, 5478743, 5709433, 5854465, 6036722, 6011469, 6248222, 6304419, 6508837, 6712718, 6798732, 6859771, 7028257, 7203435]
7945G203435K14376M2780J09496J68963L2576Q5042J82699p7156J02688P1763
7935H136662M7857Q8279R2761j00161N0371K61830n5575R7307J26457J52467J21468
7924I019723K16638L02253L31582K83511K69825N28264M99540N65848O59204P26354
7914A3402742P91249R40670J183759J383928J437025J633313K110491K355899
7906B5239076K058092J044441n14362j763697k106884j508387j294198o51276
7898B0502805j62200K38164P37830J131825J498371J950992K351519K458249K711768
7889C3419323L137708L771591M154135M754741M701688K336701k155346n430671
7881D8689870o069287n177908m113368l078431k149303j407986q43384k78152
$$ y = [7203435, 7417811, 7460591, 7570087, 7739050, 7771626, 7856668, 8039367, 7962211, 8064899, 8136662, 8184519, 8272798, 8365559, 8265398, 8315769, 8577599, 8522024, 8619331, 8745788, 8898255, 9019723, 9236361, 9538614, 9870196, 10153707, 10423532, 10951796, 11451336, 12017184, 12676388, 13402742, 14193991, 15134661, 16318420, 17702348, 19139373, 20772686, 22883177, 25239076, 27297168, 28341609, 27827247, 26063550, 23956666, 22448279, 21154081, 20502805, 20340605, 20578769, 21316599, 22448424, 23946795, 25897787, 28249306, 30707555, 33419323, 36557031, 40328622, 44482757, 49237498, 53939186, 56275887, 54120541, 48689870, 42620583, 37442675, 33329307, 30250876, 28101573, 26693587, 25850203, 25572051]
7873B5572051M09757O84799J097993J277311J097802J205634J299082J340778
7865C3985207J475833J132616r3199j989338l348707l571532l174115k674383
7857B1742382k157392j882298j323224j073085q05379n02422m59988k84108m45273
7848A2809213m48746o13242o75498p23464q17850p69041n11737m00913l80642
7839G468080l38359l36957m44763k36830k68600k11027k27916j55658l50085k03395
7829D694490J5966j48503j13193j75642l7227j1354r31k05770n7919K5156M1815
7818D026888k29630m5253j73834j42734j468j91828p028J2825k16208j33640L6128
7807B934218M2286k8585j38214n3427J00162J05306o1528k1380k2662J21687L9183
$$ y = [25572051, 25981808, 26666607, 27764600, 29041911, 30139713, 31345347, 32644429, 33985207, 35461040, 36593656, 36500457, 34511119, 31162412, 27590880, 24416765, 21742382, 19584990, 17702692, 16379468, 15306383, 14501004, 13998582, 13538594, 13254486, 12809213, 12360467, 11747225, 11071727, 10348263, 9530413, 8761372, 8249635, 7848722, 7468080, 7129721, 6792764, 6348001, 6111171, 5842571, 5631544, 5403628, 5247970, 4897885, 4694490, 4710456, 4561953, 4448760, 4273118, 4235891, 4224537, 4223606, 4017836, 3959917, 3985073, 4026888, 3797258, 3752005, 3578171, 3435437, 3433969, 3242141, 3235113, 3247938, 3031730, 2898090, 2934218, 2976504, 2947919, 2809705, 2756278, 2856440, 2961746, 2900218, 2878838, 2856176, 2977863, 3017046]
7796C017046j5796j0303J89795K49397K583J91924J99679K91098J89863K60541
7786D565827L68035K84546l9231m4825m05529l80068j45353l1006n3314L1013
7776D150095l7196O197K66661K59988L24858K71363M47189N97193O69269P60479
7766G716096P83596M66408J53188p35843r94952q54279n88764n70488m55935l89133
7756D529894j56466j83959j19817m0000o6415J59332J20237L60392K73956K16107
7746E093261L40875K60836k81706m55294m38914n40199l56374m30600l21090k78761
7736B592034j63327l28406j04922q5295j15751j28802n7220m0379o6554k5058
7726A476320n3223j94051R0130J2424n1822q5074L9249M9845j48578j45979Q9763
$$ y = [3017046, 3001250, 2990947, 3180742, 3430139, 3432722, 3624646, 3824325, 4115423, 4305286, 4565827, 4933862, 5218408, 5179177, 5134352, 4728823, 4348755, 4203402, 4172396, 4119082, 4150095, 4112899, 4119096, 4385757, 4645745, 4970603, 5241966, 5689155, 6286348, 6955617, 7716096, 8499692, 8966100, 9119288, 8383445, 7388493, 6534214, 5945450, 5374962, 4919027, 4529894, 4373428, 4189469, 4069652, 4029652, 3963237, 4122569, 4242806, 4603198, 4877154, 5093261, 5434136, 5694972, 5413266, 4957972, 4519058, 3978859, 3622485, 3191885, 2870795, 2592034, 2428707, 2100301, 1995379, 1910084, 1794333, 1665531, 1608311, 1567932, 1501378, 1476320, 1423097, 1229046, 1319176, 1331600, 1279778, 1194704, 1233953, 1283798, 1135220, 989241, 1079004]
7715A079004j8610M0245Q6996l6087k9308J059J3292L9233j02109m3170R7518
7704A128063o4352o7369m9436n5878j74891p861J27319J46824o8614J27031J831
7693A042667m1673j06688R5701M869j8756M0614n3816k3298l8947N7036n2437
7682I05272j5394O0375j2490j40224P9091n5431k9342J23001K0965K576l2311
7671I06088Q4323Q8527p1545o6923P4152J9313J45934j70196m7671j39933l1327
7660G90742J35486L4630L5156P704o789O4391J9933n1342r3578N1926J72115n29
7648A159845q5864o9142N5745l3661J35l1594q267J03402L6073l666p9067K5794
7636A069733O4025k2951K5511k2k2691J13312N2239k321q144m6808M8339Q411
$$ y = [1079004, 1060394, 1100639, 1187635, 1151548, 1122240, 1123299, 1136591, 1175824, 1073715, 1030545, 1128063, 1063711, 996342, 946906, 891028, 716137, 708276, 835595, 982419, 913805, 1040836, 1042667, 1000994, 894306, 990007, 994876, 976120, 1016734, 962918, 939620, 900673, 957709, 905272, 889878, 950253, 937763, 797539, 876630, 821199, 791857, 914858, 935823, 938399, 906088, 990411, 1078938, 1007393, 940470, 1014622, 1033935, 1179869, 1009673, 962002, 822069, 790742, 926228, 960858, 996014, 1003718, 996929, 1061320, 1081253, 1029911, 936333, 988259, 1160374, 1159845, 1073981, 1004839, 1060584, 1026923, 1027058, 995464, 987197, 1090599, 1126672, 1123006, 1043939, 1069733, 1133758, 1110807, 1136318, 1136296, 1113605, 1226917, 1279156, 1276835, 1268691, 1221883, 1270222, 1278633]
7624A278633j29601l5724O2785k1357O1470L9632l3038J24193K0106p9114p5169
7613A212816N1998J09557K5524L5622M652m5487N5048j32127K02664k9501r5898
7602A394868l8841R7932J79766p6002J38219p2913J4443j0887J03545K39949j53171
7591A816908L312K2990J5042Q555Q2690J4509K7288N0192r6380O2441J08669N7226
7579B173442j66J16775J19721P6922J36561K35604J02145k5315o1555k2929j4331
7568B836874j6192J37411j8712J7284O4196q0941Q7856J06324J08355J28810J49335
7557C520600J47745N7024J24656K32752K50290K25451j01744J2132r2090j14887
7547D261929N3023J1151K9423Q2006k4929K21096J36407M1704J49269J8240P0328
$$ y = [1278633, 1149032, 1113308, 1176093, 1154736, 1216206, 1255838, 1222800, 1346993, 1367099, 1287985, 1212816, 1264814, 1374371, 1399895, 1435517, 1440169, 1394682, 1449730, 1317603, 1520267, 1490766, 1394868, 1356027, 1453959, 1633725, 1557723, 1695942, 1623029, 1637472, 1626585, 1730130, 1970079, 1816908, 1820220, 1843210, 1858252, 1866807, 1949497, 1964006, 1991294, 2041486, 1945106, 2007547, 2116216, 2173442, 2173276, 2290051, 2409772, 2486694, 2623255, 2858859, 2961004, 2935689, 2874134, 2851205, 2836874, 2820682, 2958093, 2939381, 2956665, 3020861, 2939920, 3027776, 3134100, 3242455, 3371265, 3520600, 3668345, 3725369, 3850025, 4082777, 4333067, 4558518, 4456774, 4468906, 4376816, 4261929, 4314952, 4326103, 4355526, 4437532, 4412603, 4633699, 4770106, 4811810, 4961079, 4979319, 5049647]
7536E049647K51686K25270J88019J66966K54239K54660O8781j8790j52079J46409
7526F434808J42405q131K4487m819L69963L5829J1608K12689J62358J31121J19068
7515G631386L2141K22167K10825J78047K41510J49192J83992K9043K1448j06984
7505H792767Q8194R4631N8373j08220J1940L1203n2756m807M0140J36794o186
7494I082073k7717J75000K16220K40932K47442K30379M75062M10403N39346O98408
7484A2287548O99976O80463Q51056J130774J160267J252582J652827J840867K165023
7475B3721383K344849K786760K622248J534310n01597k214675k802835k354751
7467B5135692j529043j250713p07796j23951J40332R57294J258334J537727K126056
$$ y = [5049647, 5301333, 5526603, 5714622, 5881588, 6135827, 6390487, 6459268, 6440478, 6288399, 6434808, 6577213, 6569082, 6593569, 6588750, 6958713, 6994542, 7006150, 7218839, 7381197, 7512318, 7631386, 7663527, 7885694, 8096519, 8274566, 8516076, 8665268, 8849260, 8878303, 8899751, 8792767, 8880961, 8975592, 9033965, 8925745, 8937685, 8968888, 8916132, 8911325, 8951465, 9088259, 9082073, 9054356, 9229356, 9445576, 9686508, 9933950, 10164329, 10639391, 11049794, 11589140, 12287548, 12987524, 13667987, 14519043, 15649817, 16810084, 18062666, 19715493, 21556360, 23721383, 26066232, 28852992, 31475240, 33009550, 32507953, 30293278, 27490443, 25135692, 23606649, 22355936, 21648140, 21524189, 21664521, 22621815, 23880149, 25417876, 27543932]
7458B7543932K460333K925130L433526L969858M589113N708135N584068K594563
7450E8808658k275307n703256o156593n425103m673752l578586k755182j882743
7442B6358136j354698q47121l47419j39323K42647P37333R59403J384527J602982
7433B8596467J940645K207302K002193Q99430r52595k527022l127944l113218
7425B5925258k612755k328765j919843j652568j473902j003945r87076q44101
7417A3102303n25646m45594l04678j81920j79105l12579k14337j49861j36620
7408A0651963r3766k75948l07281l23220m52342n30126n24164m75243k96589l01095
7398G072189j54193k17686j77640n2476j66119j04963j830j28993j39886j40572
$$ y = [27543932, 30004265, 32929395, 36362921, 40332779, 44921892, 50630027, 56214095, 58808658, 56533351, 50830095, 44673502, 39248399, 34574647, 30996061, 28240879, 26358136, 25003438, 24156317, 23808898, 23669575, 23912222, 24649555, 25608958, 26993485, 28596467, 30537112, 32744414, 34746607, 35646037, 34693442, 32166420, 29038476, 25925258, 23312503, 20983738, 19063895, 17411327, 15937425, 14933480, 13946404, 13102303, 12576657, 12131063, 11826385, 11644465, 11465360, 11152781, 10938444, 10788583, 10651963, 10558197, 10282249, 9974968, 9651748, 9199406, 8669280, 8145116, 7669873, 7373284, 7072189, 6917996, 6700310, 6522670, 6470194, 6304075, 6199112, 6197282, 6068289, 5928403, 5787831]
7388E787831j35977j66840j10880L8011j1210r8464j37673r8610M9134M9661k2105
7377E142878m8375j40276M2357J0489R5253N4389K9418N4430k1218L4955j380
7366E252920m4638O2627n1130j22793O8168J26939p3115R8241j29153j16274J96699
7355E268491J01393k2763Q3474R2137K16158J42444J85339K83529J80173K22703
7345F753078J68216L42129L67053J25931J02854K45637K82888L81881M89502L78613
7335I637782L0759k19624k91577k31249j38067p4039O960N1777K00099L33107
7325I305928J54388L35815N67535O71758O31930Q22545P38011O78918Q18304N30486
7315A5255618j71429p04194r84689p54737n62386m77001k95525o4215j51841o9700
$$ y = [5787831, 5651854, 5485014, 5374134, 5412145, 5400935, 5302471, 5164798, 5066188, 5115322, 5164983, 5142878, 5094503, 4954227, 4996584, 5007073, 5102326, 5156715, 5186133, 5240563, 5219345, 5254300, 5252920, 5208282, 5270909, 5219779, 5096986, 5165154, 5292093, 5218978, 5317219, 5188066, 5071792, 5268491, 5369884, 5347121, 5430595, 5522732, 5738890, 5881334, 6066673, 6350202, 6530375, 6753078, 6921294, 7263423, 7630476, 7756407, 7859261, 8104898, 8387786, 8769667, 9259169, 9637782, 9668541, 9448917, 9157340, 8926091, 8788024, 8713985, 8720945, 8772722, 8972821, 9305928, 9460316, 9796131, 10363666, 11035424, 11667354, 12489899, 13227910, 13906828, 14725132, 15255618, 15084189, 14379995, 13395306, 12640569, 12078183, 11601182, 11305657, 11241442, 11089601, 11019901]
7305A1019901J599R4760J51108L68715L71795L75227L87019N13134N74623M67293
7295A4325174J61523j85791l83162k48930k27755j06758l1651M3282M0886J03781
7285A3490599L02095L69488J59269K74523L99071K55446K70246J80558K90746
7276A5992041M42923K27018L29139M14925L66172L38523L77216M74012M56791
7267A9418760N89786L33743M39297L12001M91022K93209L72844M09618K18267
7258B2878547L41842L38061K80317L47777L92553M11987K44891K81585L60823
7249B5878383L02524K81363M80215M48938L29732M53418N26298M82165N20139
7240B9703175N48727N39460M63842L54662K01340K36777J91092L06116K20329
$$ y = [11019901, 11021500, 11116260, 11267368, 11636083, 12007878, 12383105, 12770124, 13283258, 13857881, 14325174, 14486697, 14300906, 13917744, 13668814, 13441059, 13334301, 13302650, 13345932, 13386818, 13490599, 13792694, 14162182, 14321451, 14595974, 14995045, 15250491, 15520737, 15701295, 15992041, 16434964, 16661982, 16991121, 17406046, 17772218, 18110741, 18487957, 18961969, 19418760, 20008546, 20342289, 20781586, 21093587, 21584609, 21877818, 22250662, 22660280, 22878547, 23220389, 23558450, 23838767, 24186544, 24579097, 24991084, 25235975, 25517560, 25878383, 26180907, 26462270, 26942485, 27391423, 27721155, 28174573, 28700871, 29183036, 29703175, 30251902, 30791362, 31255204, 31609866, 31811206, 32047983, 32239075, 32545191, 32765520]
7231C2765520K92756M42622P74391R10697J204382J361143J708076J471401O30675
7222D1561663N36806J113391J818118K425405K394575K344165K706536L723128
7214E8623787M967509N977615P171506Q019329Q959359R446620R399549R043903
7206A21609177R130184Q981986O963194L623560m2980l515981o353016p188064
7198A33208060n989884n568730o331504p162006o871877n586338l820277l242113
7190H8635331l134590k899400k265931j832032j511589q05917L02110J230499
7182G7718481J867260K980763L388853K415868r02473l894459n648205o480928
7174G1445160o462450n873722m708214l742730k576791j987050j588276j121975
$$ y = [32765520, 33058276, 33500898, 34275289, 35185986, 36390368, 37751511, 39459587, 40930988, 41561663, 42098469, 43211860, 45029978, 47455383, 49849958, 52194123, 54900659, 58623787, 63591296, 69568911, 76740417, 84759746, 93719105, 103165725, 112565274, 121609177, 130739361, 139721347, 146684541, 150308101, 150265121, 146749140, 140396124, 133208060, 127218176, 121649446, 115317942, 108155936, 101284059, 95697721, 91877444, 88635331, 85500741, 82601341, 80335410, 78503378, 76991789, 76185872, 76487982, 77718481, 79585741, 82566504, 85955357, 88371225, 87468752, 83574293, 77926088, 71445160, 64982710, 59108988, 54400774, 50658044, 48081253, 46094203, 44505927, 43383952]
7166D3383952q74542n62392l18571L0928M37108M96666O55250m85847k149481
7157D0613071l451232l762289l373800k916352k337181k099498j695917j384145
7149A9592657j343155j058035p20133q70842p73561o41438p42971m53539n50950
7140A2438033m38100n41826l63712m01377k78425l75753k37211p6336l42016k22527
7130I160750j97412q7365j86647j63661p8964j06193r4706j56442p2413J39085
7120H156032J18084P2329j7265m19539l26523j11729k61827m2325M8085K7643
7110G242965q463j84422K03214L32510J02914L26991L29802O46293M64617N39147
7100I995568Q18081R11922R73088J055491J379835J644730J972206K052856P97649
$$ y = [43383952, 42509410, 41947018, 41628447, 41659375, 42096483, 42593149, 43248399, 42762552, 40613071, 37161839, 33399550, 30025750, 27109398, 24772217, 22672719, 20976802, 19592657, 18249502, 17191467, 16471334, 15600492, 14826931, 14185493, 13442522, 12988983, 12438033, 11999933, 11458107, 11094395, 10693018, 10414593, 10038840, 9801629, 9725293, 9383277, 9160750, 8963338, 8875973, 8689326, 8525665, 8446701, 8340508, 8245802, 8089360, 8016947, 8156032, 8274116, 8346445, 8329180, 7909641, 7583118, 7471389, 7209562, 7167237, 7215322, 7242965, 7234502, 7050080, 7253294, 7585804, 7688718, 8015709, 8345511, 8991804, 9456421, 9995568, 10813649, 11725571, 12698659, 13754150, 15133985, 16778715, 18750921, 20803777, 21601426]
7091B1601426j178469k164999k148637j747541j260496j147965r77549p73249
7083A0202521o16730m57099n63080n69825m91978m13334n02004l63384l26490
7074E898597j80219k25819j80470j17181p6426L5174P9202L4973J27906K63108
7064E658845J00879K00299K2119K73665J33522L29200K84903L7719q8609m81374
7054F471168p08340o03421n04341l14481l52164k57862j73492n5926r2705n5935
7044C352501k23687Q3719K13201J09842O0276J01322R1625K35895K76996L61716
7034D663406M91853L85840K6421m08282n02630m95258n02871k77666j82224l04840
7024B893749j15303j50980k4843j24059o1776j28812l5192m6530L1915L8974J19667
$$ y = [21601426, 20422957, 18257958, 16109321, 14361780, 13101284, 11953319, 10975770, 10202521, 9585791, 9128692, 8565612, 7995787, 7503809, 7090475, 6588471, 6225087, 5898597, 5718378, 5492559, 5312089, 5194908, 5118482, 5153656, 5232858, 5267831, 5395737, 5658845, 5759724, 5960023, 5982142, 6255807, 6389329, 6718529, 7003432, 7041151, 6952542, 6471168, 5762828, 5159407, 4655066, 4340585, 3988421, 3730559, 3557067, 3501141, 3408436, 3352501, 3128814, 3212533, 3425734, 3535576, 3595852, 3697174, 3788799, 4024694, 4301690, 4663406, 5155259, 5541099, 5567520, 5159238, 4656608, 4161350, 3658479, 3380813, 3198589, 2893749, 2778446, 2627466, 2602623, 2478564, 2416788, 2287976, 2252784, 2206254, 2238169, 2277143, 2396810]
7013B396810O1336R150Q5024J15943J69357K0500O993j31712j03924j46469q3002
7002B400006n5459j08227p6722j16079p4077q8143o0718p6060M3573j48758K7244
6991A666580q8054L1539K266O067M02k6818N7910q8683j7456k1057J10801o970
6979A626527J28346K8275N9612L9719O1106q4576q0588J94604l2641r1459q0826
6968A768099j2075L3299n1982q6061P2361j98381o1396R755O0795j18833O119
6957A421700J89391o4452J8841r479J3350M7480N6967N6903r7770l0325k5480
6946A577126J8301p5469r6610k1446O2365l946m8605p5280O2004j46186r762k2418
6934A220074r0874r3145j00L1961J2542K7944L162j35509L9638J71639j01623
$$ y = [2396810, 2458146, 2467296, 2552320, 2668263, 2837620, 2858120, 2865113, 2733401, 2629477, 2483008, 2400006, 2344547, 2236320, 2159598, 2043519, 1969442, 1881299, 1820581, 1744521, 1788094, 1639336, 1666580, 1578526, 1610065, 1612331, 1618398, 1618800, 1591982, 1649892, 1561209, 1543753, 1522696, 1633497, 1626527, 1754873, 1783148, 1842760, 1882479, 1943585, 1859009, 1778421, 1973025, 1940384, 1848925, 1768099, 1756024, 1789323, 1737341, 1651280, 1723641, 1525260, 1463864, 1473619, 1534414, 1415581, 1421700, 1611091, 1546639, 1565480, 1556001, 1569351, 1616831, 1673798, 1730701, 1632931, 1602606, 1577126, 1595427, 1519958, 1423348, 1401902, 1464267, 1460321, 1411716, 1336436, 1398440, 1252254, 1242492, 1220074, 1129200, 1036055, 1035955, 1067916, 1080458, 1108402, 1111564, 976055, 1015693, 1187332, 1085709]
6923A085709l1836P7375p519L9898L3750j55076j6389M2645r0140m9105l1325
6912H97987P3089j1104K1274q1496r1749l0250l9728M1561n381Q3286r9298M2990
6900H01181J05735M5513j0754L6211m1308j28244l8128O5078j54442J19836P2418
6889H73096K621r1462N640l1918K0497Q0251L6261j47849J3772O079m1204R5818
6877H21602L913m5977O2060o1409M9895J01683o3898j9496l3227k9700K990P3852
6865H62288K8008l2499J5965n935R610m9084j1953k7531n6106J04342P0172n9525
6853H47752q7521Q9737q781p6397j5620K3284R9716R6289Q483q0187k9936j9161
6841H47658Q2881n026m9891m323Q7433o8065J42983J4770j82383m9761P1468j05721
$$ y = [1085709, 1053873, 1131248, 1123729, 1163627, 1197377, 1042301, 1025912, 1068557, 978417, 929312, 897987, 971076, 959972, 981246, 899750, 808001, 777751, 738023, 779584, 774203, 857489, 758191, 801181, 906916, 952429, 941675, 977886, 936578, 808334, 770206, 835284, 680842, 800678, 873096, 875717, 784255, 789895, 757977, 778474, 858725, 894986, 747137, 760909, 766988, 725784, 821602, 825515, 779538, 841598, 780189, 830084, 931767, 867869, 848373, 815146, 785446, 788436, 862288, 890296, 857797, 873762, 867827, 877437, 828353, 816400, 788869, 732763, 837105, 907277, 847752, 760231, 849968, 841187, 764790, 749170, 772454, 872170, 968459, 976942, 896755, 866819, 847658, 930539, 925513, 875622, 871299, 958732, 890667, 1033650, 1048420, 866037, 816276, 887744, 782023]
6829G82023m7294J86545K8672j2706M0085J03348M562P0164K4180K1654q0875
6818A120358j6789L3580k3988o1102K39028J3200n1099n625l3474k2584J09216
6807A300721R6965N2056J921m0378O8819O8818j83594J9423J59722R9424m4603
6796A599294k6668q9888R6269P9644p1624P8922j8106J63089r1269j2311J8340
6785A725692J34759P3334m5855N1960k0615j7679J53905Q8256l8858n3566J0615
6774B061948Q7566M5388K3621N5892K3741J27770r4373j54059K8635L4471N1492
6763B292092j9761J8685p306J27657N6688J15491P7867Q4485O3382J18716o9552
6752B858444J23211K01205J56704J82338K17314L70990L48078L81894L74903K76978
$$ y = [782023, 734729, 921274, 949946, 937240, 977325, 1080673, 1085235, 1155399, 1179579, 1201233, 1120358, 1103569, 1137149, 1113161, 1052059, 1291087, 1304287, 1253188, 1247563, 1214089, 1191505, 1300721, 1397686, 1449742, 1451663, 1411285, 1480104, 1548922, 1365328, 1384751, 1544473, 1643897, 1599294, 1572626, 1482738, 1579007, 1658651, 1587027, 1665949, 1647843, 1810932, 1719663, 1707352, 1725692, 1860451, 1933785, 1887930, 1939890, 1919275, 1901596, 2055501, 2143757, 2104899, 2051333, 2061948, 2149514, 2194902, 2218523, 2274415, 2298156, 2425926, 2331553, 2177494, 2206129, 2240600, 2292092, 2272331, 2291016, 2283710, 2411367, 2468055, 2583546, 2661413, 2745898, 2809280, 2927996, 2858444, 2981655, 3182860, 3339564, 3521902, 3739216, 4110206, 4458284, 4840178, 5215081, 5492059]
6742E492059M45066O44191O28545O72425P87906J110035J502834J328327J74997
6733A2786385r53787j504347j261947r50665p11081l98169l82101l24092j08358
6724F191838o7706l685j42P8539P8750J68106R8718J54350J44692M31211M93274
6713G767945K64513L3044j51772j47526k35873p8431j68642O9667J30916J0684
6703G494525P5868J07269P2581P1120J58658N3537J91503Q9158J89762J48897
6693H652878M1310R2147O2214r4692j44501r3336L6833j23875m1765L1998m3443
6682H375768j1676k157Q0533M8981K77091J62122J40652K71778L85183M42788
6672A0171063M96946N51146P44665Q09864P55864R36827J156034J167104J359347
$$ y = [5492059, 5937125, 6581316, 7209861, 7882286, 8670192, 9780227, 11283061, 12611388, 12786385, 11832598, 10328251, 9066304, 8115639, 7404558, 7006389, 6624288, 6300196, 6191838, 6124132, 6120447, 6120305, 6198844, 6277594, 6445700, 6544418, 6698768, 6843460, 7274671, 7767945, 8032458, 8065502, 7913730, 7766204, 7530331, 7451900, 7283258, 7352925, 7483841, 7494525, 7570393, 7677662, 7750243, 7821363, 7980021, 8033558, 8225061, 8314219, 8503981, 8652878, 8694188, 8786335, 8848549, 8753857, 8609356, 8516020, 8552853, 8428978, 8387213, 8419211, 8375768, 8364092, 8361935, 8442468, 8491449, 8768540, 8930662, 9071314, 9343092, 9728275, 10171063, 10668009, 11219155, 11963820, 12773684, 13529548, 14466375, 15622409, 16789513, 18148860]
6663A8148860J608284J727471J989257K277429K272232J469504k62491j560260
6655B7670286k056084j598914j116891n77928r295M66883P28597J195860J340650
6646B6043164J640675K113005K525497L081071L331462L089664K279135L31621
6638D4435294j923457l795022m204335l634439l088597k321997j780601j126463
6630B2560383q42764n95509j49503J05837L49695O49153R08663J208261J221813
6621B5416029L55183j096530k174739k641229k568511k032169j825131j588763
6613A1844140j248024j049941q36469o84525n56518o26387m45599l54047l11104
6604E731526l07015k35925k85341k29005k44994j72392j72436j27258k09366j49061
$$ y = [18148860, 19757144, 21484615, 23473872, 25751301, 28023533, 29493037, 29230546, 27670286, 25614202, 24015288, 22898397, 22320469, 22311174, 22778057, 23506654, 24702514, 26043164, 27683839, 29796844, 32322341, 35403412, 38734874, 41824538, 44103673, 44435294, 42511837, 38716815, 34512480, 30878041, 27789444, 25467447, 23686846, 22560383, 21717619, 21122110, 20972607, 21078444, 21428139, 22077292, 22985955, 24194216, 25416029, 25771212, 24674682, 22499943, 19858714, 17290203, 15258034, 13432903, 11844140, 10596116, 9546175, 8709706, 8025181, 7468663, 6842276, 6396677, 6042630, 5731526, 5424511, 5188586, 4903245, 4674240, 4429246, 4256854, 4084418, 3957160, 3747794, 3598733]
6594C598733j25989j88318p9871j71452K5111p1174k37392o9843j00984J610j21975
6583B458456J2062q6304j82651o5894L7406O4208J0214o5450R6189Q34K046j6616
6571B264500p849K0872M0042J02915L4416j12585K4922R8057j3179J31159p870
6560B575400q1300n1161q1044j94322r673M3985m935l4786K6841M0792J01178
6549B330975R3898Q7037R5615R370j243J9527N2033k95216m6332r0580j01864
6538B153220n9529j11015K6844j07058q8916K3342L550k8170N7643M7902n9484
6527A858329p9266n6393J6621j94697k25791j5618k0018j29041q3560m1583p530
6516A021453j27312O0250p3420o5264R2045j01030m2789j3100J9853O2683M948
$$ y = [3598733, 3472744, 3284426, 3204555, 3033103, 3058214, 2987040, 2749648, 2679805, 2578821, 2580431, 2458456, 2470518, 2384214, 2201563, 2135669, 2173075, 2237283, 2247497, 2182047, 2278236, 2279070, 2281116, 2264500, 2256651, 2277523, 2317565, 2420480, 2454896, 2342311, 2367233, 2465290, 2452111, 2583270, 2575400, 2494100, 2442939, 2361895, 2167573, 2157900, 2201885, 2196950, 2162164, 2189005, 2229797, 2330975, 2424873, 2511910, 2607525, 2616895, 2615652, 2635179, 2687212, 2391996, 2345664, 2255084, 2153220, 2093691, 1982676, 2009520, 1902462, 1813546, 1836888, 1840438, 1812268, 1869911, 1917813, 1858329, 1779063, 1722670, 1739291, 1544594, 1318803, 1303185, 1283167, 1154126, 1070566, 1028983, 1021453, 894141, 954391, 880971, 815707, 907752, 806722, 763933, 750833, 770686, 833369, 838317]
6505H38317K7876J25620j12503l5737J25293p8577o0250k0903j01912K7486Q4846
6494H19556J0736N4141l77p1487j1467o0162J4538q2104J63336J13951n4383j45857
6482G50421Q0346k8343q4999L9306k2005j00357M2125M8351n5112J6151P8421
6471G64305k4410L2314o4840o0356O1029j8772o797M0754k2124J2726q2547K5497
6459F56779r0601r0652N6472J64481j37172M3235K4211Q1283j15210P8206L3610
6448G04642o1105l32j9210J7087m7035L2264q98P8889J3004l2583j50346J27641
6436F62018Q1591Q0468m2248L9127m385J16359n1046j00762n4172K1267j9936
6425G28281p5611J962R3074O9400k0922j830j5499J1193J7760R5218M8637J9616
$$ y = [838317, 866193, 991813, 879310, 843573, 968866, 890289, 830039, 809136, 707224, 734710, 819556, 830292, 884433, 884056, 812569, 801102, 740940, 755478, 673374, 836710, 950661, 896278, 750421, 830767, 802424, 717425, 756731, 734726, 634369, 676494, 724845, 669733, 685884, 764305, 739895, 772209, 707369, 647013, 708042, 689270, 682473, 723227, 701103, 713829, 631282, 656779, 566178, 475526, 531998, 696479, 559307, 602542, 626753, 708036, 592826, 671032, 704642, 643537, 643205, 623995, 641082, 594047, 626311, 625413, 704302, 717306, 684723, 534377, 662018, 743609, 824077, 781829, 820956, 816571, 932930, 881884, 781122, 726950, 748217, 728281, 652670, 654632, 747706, 817106, 796184, 794354, 778855, 790048, 807808, 903026, 951663, 971279]
6413I71279r5268O0806L20K1687K0101Q1110j35428p682J14699k8861J35769o8526
6401A070006n3035K9519N1471q0043J68482p9567k3153P1699j06775k973j6738
6390A028893L4019N7426r6378J29462j459K9720K311M5245l1482m8851J47191
6379A296097l5522m7024M0242P231J18645m2473m2825J6232N7776M3861o574J03440
6367A509106K2578N8410P3837j7246J85727q5358K4653O7696m0418L775J31167
6356A933927J00635k8577J78324L08O472o8936J30876J00847Q4530J08822J09784
6345B657012n9861n6919K19784Q5155M4127J10453n046O2306K0108L1285O9623
6334C178027M1407Q5840L5236p05K33588M3341J17081R507J64429P2246n2062
$$ y = [971279, 876011, 936817, 937137, 958824, 978925, 1060035, 924607, 916925, 1031624, 1002763, 1138532, 1070006, 1016971, 1046490, 1097961, 1017918, 1186400, 1106833, 1083680, 1155379, 1048604, 1045631, 1028893, 1062912, 1120338, 1023960, 1153422, 1151963, 1181683, 1183994, 1229239, 1197757, 1148906, 1296097, 1260575, 1213551, 1253793, 1261024, 1379669, 1337196, 1294371, 1310603, 1368379, 1412240, 1405666, 1509106, 1531684, 1590094, 1663931, 1646685, 1832412, 1747054, 1771707, 1839403, 1798985, 1802760, 1933927, 2034562, 2005985, 2184309, 2184617, 2191089, 2122153, 2253029, 2353876, 2438406, 2547228, 2657012, 2597151, 2540232, 2760016, 2845171, 2889298, 2999751, 2994705, 3057011, 3077119, 3108404, 3178027, 3219434, 3305274, 3340510, 3339805, 3573393, 3616734, 3733815, 3743322, 3907751, 3979997, 3927935]
6323C927935K36940K3314J04140O9363P1124M9940J0776p0592J23210N96J21837
6312D668583R5473j37497K9782P3135R217M2312J22428o797J17831J88304l1517
6301E171254J33269J10735J63892K02477J66959J24474L06496K71525K22064K09429
6291G082574K11434L51047N23126N24745M08915M86727M12250N17244M84164N52050
6281A1554276N57358P64509Q51611O62164R61886J024108O15991L95738N46275
6272A7933916J22658K45136L69024M31908P33521N82804P21414M94064O0282k08021
6262B1486706k73435m55521n37895l42338l68041j58641k5129p7638j95073o39539
6252A8413456p72097q85918r40344r14082p30985p61243o49206o02408l73805
$$ y = [3927935, 4164875, 4188189, 4292329, 4361692, 4432816, 4482756, 4493532, 4422940, 4546150, 4546746, 4668583, 4764056, 4626559, 4656341, 4729476, 4738693, 4781005, 4903433, 4896636, 5014467, 5202771, 5171254, 5304523, 5415258, 5579150, 5781627, 5948586, 6073060, 6379556, 6651081, 6873145, 7082574, 7294008, 7645055, 8168181, 8692926, 9101841, 9588568, 10000818, 10518062, 11002226, 11554276, 12111634, 12876143, 13727754, 14389918, 15351804, 16375912, 16991903, 17387641, 17933916, 18056574, 18301710, 18670734, 19102642, 19836163, 20418967, 21140381, 21634445, 21694727, 21486706, 21213271, 20757750, 20219855, 19877517, 19509476, 19350835, 19325706, 19248068, 19052995, 18413456, 17641359, 16755441, 15815097, 14901015, 14170030, 13408787, 12759581, 12157173, 11783368]
6243A1783368n26290m57019p48497p99126n71890p25832l61743m46678n92680
6234F553613l75907l90495l92773j60128l13607l92765j53987k98357k29539k99465
6224C546590l4142j65820j90745n1531k34276L2714p9869n1067m1842k8019L2458
6213B734451l2064m4767j7716J6949o0264p9892K4305l1287o4271o7336J2700
6202B390808J35204j33626m0058N9344J2860n8851J3693l2936j55067J50306q9421
6191B252256k09725J68745N09J4844l3181o138P6681m8210j56221n60k804j02411
6179A953785q4055J12996k1838p6912r5631J10280p8778j40316P0837r7573R3829
6168A746624m5973L703M5900n3548p6513J09469m5263q242r715n309p1809N0280
$$ y = [11783368, 11257078, 10800059, 10051562, 9252436, 8680546, 7954714, 7592971, 7146293, 6553613, 6177706, 5787211, 5394438, 5234310, 4920703, 4527938, 4373951, 4075594, 3846055, 3546590, 3512448, 3346628, 3155883, 3104352, 2870076, 2902790, 2822921, 2771854, 2730012, 2701993, 2734451, 2702387, 2657620, 2639904, 2656853, 2596589, 2516697, 2541002, 2509715, 2445444, 2378108, 2390808, 2526012, 2392386, 2352328, 2411672, 2424532, 2365681, 2379374, 2346438, 2191371, 2341677, 2252256, 2042531, 2211276, 2211785, 2226629, 2193448, 2187310, 2263991, 2215781, 2059560, 2059000, 2056196, 1953785, 1869730, 1982726, 1960888, 1883976, 1788345, 1898625, 1819847, 1679531, 1750368, 1652795, 1746624, 1700651, 1704354, 1750254, 1696706, 1620193, 1729662, 1684399, 1676157, 1666442, 1661133, 1589324, 1639604]
6156A639604K3221j07445Q7755J2009N0560P3947j5536K9469k613q2961J455Q5978
6144A795443K766P8088K083r072k4464L0550m4363L2013N7422l8792K1894R6428
6132A999996j59952J00082N9493R442K4575N3217j22128P830P8674l7522K8265
6121B041972N8634J4701K6891P7813K31J0583L7390j8145k6357Q6119L0677Q0688
6109B421197j00993O7600Q9719J4670L7905K772J76406k4882j6545l4305m0864
6098B592680Q475J57153R0793R2135k1335Q1779m6250J02171R3126k0242l799
6087C126686J652J08922O8573q898J4729k1376Q8439J01466J1120Q1609J8161
6076C591083J02652k402J36801J10882N9206j8969J7914K7121J44488K8722K0145
$$ y = [1639604, 1662825, 1555380, 1643135, 1655144, 1705704, 1779651, 1764115, 1793584, 1790971, 1708010, 1709465, 1795443, 1798209, 1876297, 1878380, 1869308, 1844844, 1875394, 1831031, 1863044, 1920466, 1881674, 1903568, 1999996, 1840044, 1940126, 1999619, 2009061, 2033636, 2086853, 1964725, 1972555, 2051229, 2013707, 2041972, 2100606, 2115307, 2142198, 2220011, 2220242, 2230825, 2268215, 2250070, 2223713, 2309832, 2340509, 2421197, 2320204, 2387804, 2477523, 2492193, 2530098, 2532870, 2709276, 2684394, 2667849, 2633544, 2592680, 2601155, 2758308, 2849101, 2941236, 2919901, 3001680, 2955430, 3057601, 3150727, 3130485, 3126686, 3128338, 3237260, 3305833, 3296935, 3311664, 3290288, 3378727, 3480193, 3491313, 3572922, 3591083, 3693735, 3691333, 3828134, 3939016, 3998222, 3979253, 3997167, 4024288, 4168776, 4197498, 4217643]
6065D217643J18192J20308K9464J8876K03894N7499k3962J02146J10209L2538
6055D986807R4047N8642N7580J25111R5638L8267Q9676J17184J07406J72432L5539
6044E978329J56023L4304J15316J43488Q2687P988O0623M8538K18051M8329J03143
6033F996819N8151J52441J59845J81329P0132J77256J74784J83656O2766N3744
6023H270923R4931J90934K64465K50082l6736J67117J10554N7012J82036J06365
6013I657683J37256K29717K02847J9096J77127J25664J28913K15701Q8911K62731
6003A1245646J52716q474J93046J87212J50774J50339K13794J01000L64998K55242
5993A3006293J06704K36015K45088J60216K92602K32096J52613K76449K37184
$$ y = [4217643, 4335835, 4456143, 4485607, 4504483, 4708377, 4765876, 4741914, 4844060, 4954269, 4986807, 5080854, 5139496, 5197076, 5322187, 5417825, 5456092, 5545768, 5662952, 5770358, 5942790, 5978329, 6134352, 6168656, 6283972, 6427460, 6510147, 6518135, 6578758, 6627296, 6845347, 6893676, 6996819, 7054970, 7207411, 7367256, 7548585, 7618717, 7795973, 7970757, 8154413, 8217179, 8270923, 8365854, 8556788, 8821253, 9071335, 9034599, 9201716, 9312270, 9369282, 9551318, 9657683, 9794939, 10024656, 10227503, 10246599, 10423726, 10549390, 10678303, 10894004, 10982915, 11245646, 11398362, 11389888, 11582934, 11770146, 11920920, 12071259, 12285053, 12386053, 12751051, 13006293, 13112997, 13349012, 13594100, 13754316, 14046918, 14279014, 14431627, 14708076, 14945260]
5984A4945260K69696L29672J88730L26831L60368L26787K36443K71138K89769
5975A7544694K09510L19488K64739J93176J73069J79205K04711J01580J17338
5966A9307510K33647J89227J3567O033P3996J26127j17202k3877n6302j06799
5956A9645927j16971o2477j81845k90807l15326k54655j52098k41186l36244k41243
5946A7453075l41436k04813l50660l33998l34303l01607k98850k88250k03207
5937A4795951l83054l73175j15211j73931l34598l31522j73048k31498l10362
5928A2369552k13792j84103j86500k44369l8235j90796k64355k2872L007k45824
5918A0781713j50363K5273q9089j13083q4306Q5258n1067q6950l1890j16335m9307
$$ y = [14945260, 15214956, 15544628, 15733358, 16060189, 16420557, 16747344, 16983787, 17254925, 17544694, 17754204, 18073692, 18338431, 18531607, 18704676, 18883881, 19088592, 19190172, 19307510, 19541157, 19730384, 19743951, 19749984, 19823980, 19950107, 19832905, 19809028, 19752726, 19645927, 19528956, 19466479, 19284634, 18993827, 18678501, 18423846, 18271748, 18030562, 17694318, 17453075, 17111639, 16906826, 16556166, 16222168, 15887865, 15586258, 15287408, 14999158, 14795951, 14412897, 14039722, 13924511, 13750580, 13415982, 13084460, 12911412, 12679914, 12369552, 12155760, 11971657, 11785157, 11540788, 11502553, 11311757, 11047402, 11024530, 11027537, 10781713, 10631350, 10656623, 10567534, 10454451, 10370145, 10455403, 10404336, 10317386, 10285496, 10169161, 10119854]
5907A0119854l7326j8232p5955j12365J1759j27197m5266O7508p7425L9131o973
5896I737513k1835j0246k1771k5714P8306J28170n3074K4165o9026P0804J18050
5885I955342k3503J21285J92197L2457J9353N8650Q7854J93434J25952J58328
5875A0921349J07883J24880J62472J31369J39207K58407O0910J43830K34339J20444
5865A2405090R2611K19062J52314P4312J65736J85390J03922m5809J67611K23570
5855A3743809J66627O1273K2697J59064J31902K16101J07938O7164R2868J61868
5845A4931311R6522J87292R8780p1430M1909N7943m3362j733P6732j6857j08897
5834A5248210j4109l1537j07701k0204k8027J62705R4452Q3784K72625K94731
$$ y = [10119854, 10082528, 10064296, 9988341, 9875976, 9887735, 9760538, 9715272, 9782780, 9705355, 9744486, 9737513, 9715678, 9705432, 9683661, 9657947, 9736253, 9864423, 9811349, 9835514, 9766488, 9837292, 9955342, 9931839, 10053124, 10245321, 10277778, 10297131, 10355781, 10443635, 10637069, 10763021, 10921349, 11029232, 11154112, 11316584, 11447953, 11587160, 11845567, 11906477, 12050307, 12284646, 12405090, 12497701, 12716763, 12869077, 12943389, 13109125, 13294515, 13398437, 13352628, 13520239, 13743809, 13910436, 13971709, 13994406, 14153470, 14285372, 14501473, 14609411, 14676575, 14769443, 14931311, 15027833, 15215125, 15313905, 15242475, 15284384, 15342327, 15298965, 15297232, 15373964, 15357107, 15248210, 15234101, 15202564, 15094863, 15074659, 15046632, 15209337, 15303789, 15387573, 15660198, 15954929]
5824A5954929L57661N99768P71425Q25377J029519J257037J526903J721640J979831
5815B6024090K299124K627968L032405L480207L469374L741805L775802L661995
5807E2112770K946670K228862J363596N84547J04829k65974k42704n036L16238
5798E9143798N28084L99625N2254n99052j152192j893915k311483k635325k840947
5789D8690847k593580k465762k147686j993452j688288j469395j226615j061508
5781C4044561p26861n76517l33345l29412l88692m26094l62234m88170m88341
5772B9924895m09989n35900m41984m59562l00659j59437P6994M1545K8801J48866
5762B7913570J21026J28860L00168L46086K36812L44085N12666N11969N09626
$$ y = [15954929, 16312590, 16912358, 17683783, 18509160, 19538679, 20795716, 22322619, 24044259, 26024090, 28323214, 30951182, 33983587, 37463794, 40933168, 44674973, 48450775, 52112770, 55059440, 57288302, 58651898, 59236445, 59341274, 59075300, 58832596, 58827560, 59143798, 59671882, 60071507, 60123761, 59524709, 58372517, 56478602, 54167119, 51531794, 48690847, 46097267, 43631505, 41483819, 39490367, 37802079, 36332684, 35106069, 34044561, 33317700, 32741183, 32407838, 32078426, 31689734, 31263640, 30901406, 30413236, 29924895, 29514906, 28979006, 28537022, 28077460, 27776801, 27617364, 27694358, 27735903, 27764704, 27913570, 28034596, 28163456, 28463624, 28809710, 29046522, 29390607, 29903273, 30415242, 30924868]
5753C0924868M26828L31913N31146N11055M91356N16397N09848M49817O64632
5744C5357860N19436N76593N44631M80592M92990O21812M64723L55706M88836
5735C9903179M52557L78929M30843L00393K19511K71186L36101J80630J84338
5726D2657667K49006K59286J72164M11170M24096M00822N47705N29551Q10121
5717D6461588J186806J241967J429092J947554K144791K501148K975719L470064
5709F3358729L584678L999872M483863M928344N563417O005773O885047P474800
5701A06284523P763176P669738P036767O162172M883033L508995K393232J725453
5693A47427089J531709J660132K052995K178931J700473Q60682m00699j739767
$$ y = [30924868, 31351696, 31683609, 32214755, 32725810, 33217166, 33733563, 34243411, 34693228, 35357860, 35877296, 36453889, 36998520, 37479112, 37972102, 38593914, 39058637, 39414343, 39903179, 40355736, 40734665, 41165508, 41465901, 41685412, 41956598, 42292699, 42473329, 42657667, 42906673, 43165959, 43338123, 43749293, 44173389, 44574211, 45121916, 45651467, 46461588, 47648394, 48890361, 50319453, 52267007, 54411798, 56912946, 59888665, 63358729, 66943407, 70943279, 75427142, 80355486, 85918903, 91924676, 98809723, 106284523, 114047699, 121717437, 128754204, 134916376, 139799409, 143308404, 145701636, 147427089, 148958798, 150618930, 152671925, 154850856, 156551329, 157412011, 157011312, 155271545]
5685A55271545l465060m644286n296661n621082n583504n079218m287303l526389
5677A17768042k525745j252756j88119R09262J720306K371655K787709K952022
5669A24542376K698771K281890K052998J350841K90667p62900j468584j665488
5661A29320571j812496j768127j605971j621194j410777j494843k185574k539927
5653A14881662k934729k998630k589534j924410k560080m980713o086420n318312
5645H5488834m392335l667070k819815k211143k188980k547325k598630k346488
5637F2717048k040511j738818j381164j000300p99263o28546m34293Q692Q34860
5628E5537705k00805k506916l296919k580478j547425j044411n88517j5753J83299
$$ y = [155271545, 151806485, 147162199, 141865538, 136244456, 130660952, 125581734, 121294431, 117768042, 115242297, 113989541, 113801422, 114710684, 116430990, 118802645, 121590354, 124542376, 127241147, 129523037, 131576035, 132926876, 133217543, 132454643, 130986059, 129320571, 127508075, 125739948, 124133977, 122512783, 121102006, 119607163, 117421589, 114881662, 111946933, 108948303, 106358769, 104434359, 101874279, 96893566, 90807146, 85488834, 81096499, 77429429, 74609614, 72398471, 70209491, 67662166, 65063536, 62717048, 60676537, 58937719, 57556555, 56556255, 55756992, 55128446, 54694153, 54702845, 55537705, 55336900, 52829984, 49533065, 46952587, 45405162, 44360751, 43772234, 43756481, 43939780]
5619D3939780K89170L40215K53749j02812n66152o13895q33121r93366r01090
5610D0812478o65835l90721l50030j060722j887264j853054j573237j268610r93445
5601C0769560q56509q62380p42967p36512o68552o34953m40082l89414l00223
5592B5137968J05826P0342L98138P61553J065717J370864L79704P1446L10585
5583B9672143Q23504J443916J990307K447479K734145K935439K941380K914840
5575D7903153K782342K682984K610787K214660J788081J216542P79564N76436
5567F2554549P0523J1968l99446o63814j398671j865587k487376l018528l320733
5558D9482885l416032l431998l469515l168237k887764k669415k369105j996982
$$ y = [43939780, 44228950, 44569165, 44822914, 44720102, 44153950, 43540055, 42706934, 41713568, 40812478, 40146643, 39755922, 39405892, 38345170, 36457906, 34604852, 33031615, 31763005, 30769560, 29913051, 29050671, 28307704, 27571192, 26902640, 26267687, 25827605, 25438191, 25137968, 25243794, 25314136, 25712274, 26473827, 27539544, 28910408, 29290112, 29361558, 29672143, 30495647, 31939563, 33929870, 36377349, 39111494, 42046933, 44988313, 47903153, 50685495, 53368479, 55979266, 58193926, 59982007, 61198549, 61978113, 62554549, 62625072, 62637040, 62237594, 61573780, 60175109, 58309522, 55822146, 52803618, 49482885, 46066853, 42634855, 39165340, 35997103, 33109339, 30439924, 28070819, 26073837]
5550B6073837j910236j605335j333304j134843j051418r04969p00861n95409n26392
5541A6311070n56051l16804j84142l34397j47516k18113k06454j89079k6037L8602
5531A4171079P02k5661L8520q3362J02957K53104Q1661K14156J37389k9354J02554
5520A4963745j86967k88786j11570j95806k93682k47451k46034k89389j09588
5511A2994472r9426O5112o1279m1364N1554N2970O0855J3977J90859J18160O9904
5500A3415794J18778j09106P3730Q21L1741J41364K00673L5046R3330J59056J81661
5489A4342888K44726Q9431K52192K82667J92282K38479K90740J32638K02065L24374
5479A6592482K92901M09052L45003M09447K79691L62978N12775N49589N56327
$$ y = [26073837, 24163601, 22558266, 21224962, 20090119, 19038701, 18133732, 17432871, 16837462, 16311070, 15755019, 15438215, 15254073, 14919676, 14772160, 14554047, 14347593, 14158514, 14132477, 14171079, 14171781, 14146120, 14184640, 14101278, 14204235, 14457339, 14539000, 14753156, 14890545, 14861191, 14963745, 14776778, 14487992, 14376422, 14180616, 13886934, 13639483, 13393449, 13104060, 12994472, 12895046, 12960158, 12898879, 12857515, 12909069, 12962039, 13022894, 13036871, 13227730, 13345890, 13415794, 13534572, 13425466, 13499196, 13500017, 13531758, 13673122, 13873795, 13908841, 14002171, 14161227, 14342888, 14587614, 14677045, 14929237, 15211904, 15404186, 15642665, 15933405, 16066043, 16268108, 16592482, 16885383, 17294435, 17639438, 18048885, 18328576, 18691554, 19204329, 19753918, 20310245]
5470B0310245N28730N89747O02366N80745Q26436P72242Q23080O88927N55373
5461B6277891N41719N21374P02273N71128N13034N12537O66667M59378N01706
5452C1267707K32965K85850M79122L52238L48079L65360L45225M94300M24694
5443C4595540M97448N39111N37584N07515P12506N41092N94119O54524N84024
5434C9763463N68942P20951O05048N96977N66879M51363K95556k74909n44560
5425D2749710p98331r98460j177783j268779j555840j363831j316744j202255
5417C3067687q37266p78498n38200k51126K7872N91403R57358J457064J991756
5408C5688050K646629L410959M317741N422475O591560Q123501R312805J1051239
$$ y = [20310245, 20838975, 21428722, 22031088, 22611833, 23438269, 24210511, 25033591, 25722518, 26277891, 26819610, 27340984, 28043257, 28614385, 29127419, 29639956, 30306623, 30766001, 31267707, 31500672, 31786522, 32265644, 32617882, 32965961, 33331321, 33676546, 34170846, 34595540, 35092988, 35632099, 36169683, 36677198, 37389704, 37930796, 38524915, 39179439, 39763463, 40332405, 41053356, 41658404, 42255381, 42822260, 43273623, 43569179, 43294270, 42749710, 41951379, 40952919, 39775136, 38506357, 36950517, 35586686, 34269942, 33067687, 32230421, 31451923, 30913723, 30662597, 30690469, 31281872, 32239230, 33696294, 35688050, 38334679, 41745638, 46063379, 51485854, 58077414, 66200915, 75513720, 86564959]
5400H6564959J2676911J4459241J6274972J8038404K0115248K2693910K5667230
5393B16490875K9755173L4947015L3694936J3918910j8070127l8386855m0995339
5386B31354588l5622623k9489688k3628839j8879810j5556011j3210744j0979718
5379H3987155r322109p716840o426036n333800m515570l861262l275826k982997
5371D0552715k475306k244268j960360j750820j602643j405540j060820j055375
5363B6997583r58460r87739j018547q58397q24094n50369m24739l17287q4349
5354B0973602k9576o1063K63481M98190N96927O76102m8294j072760j869814j768470
5344A8158325j547775j356877j211149r56978q69576r05354o03601n42352o34316
$$ y = [86564959, 99241870, 113701111, 129976083, 148014487, 168129735, 190823645, 216490875, 246246048, 281193063, 314887999, 328806909, 310736782, 272349927, 231354588, 195731965, 166242277, 142613438, 123733628, 108177617, 94966873, 83987155, 74665046, 66948206, 60522170, 55188370, 50672800, 46811538, 43535712, 40552715, 38077409, 35833141, 33872781, 32121961, 30519318, 29113778, 28052958, 26997583, 26039123, 25051384, 24032837, 23174440, 22350346, 21799977, 21375238, 21057951, 20973602, 20944026, 20882963, 21146444, 21644634, 22241561, 22917663, 22869369, 21796609, 19926795, 18158325, 16610550, 15253673, 14042524, 13085546, 12215970, 11310616, 10707015, 10164663, 9530347]
5335I530347l53859m00239m40959l11196l85844k13031k98866l21632k58137j61360
5325F385224l00054j16268j91959p7211j57832j90409q7312k15733m9522j27961
5315D870963k33394j42053o5763j15366j25468j76345j59417k9902p1165n3656
5305C698434q8623j8950j02376o6912p997p6241q4703j52737J711j25279j10570
5294B865757o7161r7902p3276k2299p9590P0909n6923l2767j58942o6070J17142
5283B398878k9062r184n6787L4114j38496J1826o8664j16727j35124P29J00073
5272A991576o5313l3846J4403j63087m4812J50666o6697j00133o4021n2322J6155
5261A582569r4626p8949m2339m4091o055O1834J34948M6529K2480j29123m7486
$$ y = [9530347, 9176488, 8776249, 8335290, 8024094, 7638250, 7425219, 7126353, 6804721, 6546584, 6385224, 6085170, 5968902, 5776943, 5699732, 5541900, 5351491, 5264179, 5048446, 4998924, 4870963, 4637569, 4495516, 4429753, 4314387, 4188919, 4012574, 3853157, 3823255, 3752090, 3698434, 3609811, 3590861, 3488485, 3421573, 3413576, 3337335, 3252632, 3099895, 3101606, 2976327, 2865757, 2798596, 2700694, 2627418, 2605119, 2525529, 2596438, 2539515, 2506748, 2347806, 2281736, 2398878, 2369816, 2360632, 2303845, 2337959, 2199463, 2211289, 2142625, 2025898, 1890774, 1891503, 1991576, 1926263, 1892417, 1906820, 1743733, 1698921, 1849587, 1782890, 1682757, 1618736, 1566414, 1582569, 1487943, 1408994, 1366655, 1322564, 1316509, 1378343, 1513291, 1559820, 1582300, 1453177, 1405691]
5250A405691N1233J7931j43915q5870Q6900N8635r1046o8535P6486j13668P1150
5239A264992k5023J6529L0654j21883J9992m0731N0388P7878o2561j3045j38828
5228A058362j16013J18824J0643k2433k699M7317r4434Q2229l1645o661k4072
5217A019418l8246q66P0351M147O0607L7919L9237j30449k7227l3815o6417m476
5205I30183p0821j67870P9823K11108j00211Q572k5164j4624r8737j22809J75155
5194H04605J33573M4192m5137P009l1716K02752R4504n9050J44934J76257J27856
5183A599779P5339M1590O083J80552J16071K5449J32481p4149k97081j06770j06334
5172A593010j98712k04375J3550j28430k6652p969j21351p9549N6662q3940j18675
$$ y = [1405691, 1456924, 1474855, 1330940, 1245070, 1331970, 1390605, 1299559, 1231024, 1307510, 1193842, 1264992, 1239969, 1256498, 1287152, 1165269, 1185261, 1144530, 1194918, 1272796, 1210235, 1197190, 1058362, 942349, 1061173, 1071816, 1049383, 1046684, 1094001, 999567, 1081796, 1050151, 1043490, 1019418, 981172, 980306, 1050657, 1054804, 1115411, 1153330, 1192567, 1062118, 1034891, 1001076, 934659, 930183, 859362, 691492, 771315, 982423, 882212, 890784, 865620, 850996, 752259, 629450, 804605, 938178, 982370, 937233, 944242, 912526, 1115278, 1209782, 1150732, 1295666, 1471923, 1599779, 1675118, 1716708, 1722791, 1903343, 2019414, 2044863, 2177344, 2103195, 1806114, 1699344, 1593010, 1394298, 1189923, 1203473, 1075043, 1048391, 1040422, 919071, 839522, 896184, 812244, 693569]
5161F93569M6670m2305r150j1221r5526m1835n1572M9454L0156o2478p2225L9201
5149D72738L4747J8890q6927J9901Q9549J1053q8274J34665m0728j49884P0847
5138D86577k0512K1668K2809r3684Q2516J9128p1422K824M3095L6283j32850k9782
5126C66650p2607p1642O2421M9683J71430j51709k6190p712p2278Q0175j20204
5115B08017O9088M3318M0710J1841m1964L7848j36446Q4223q3k2187J6496k4154
5103B86707L8145L8029j43001m3195Q09J47j694P8713j1318q465N819j9339k6705
5090A94652J7389n0401K7181O6976j0650L8717O9597r5839J5025k8040j04640
5079A39967M5813K4328M1455l5019O8113M4767Q6251j70972m3782O4135M682m1545
$$ y = [693569, 740239, 697934, 688784, 677563, 582037, 540202, 488630, 538084, 568240, 505762, 433537, 472738, 507485, 526375, 439448, 459349, 548898, 559951, 471677, 606342, 565614, 415730, 486577, 466065, 487733, 510542, 416858, 499374, 518502, 447080, 449904, 492999, 529282, 396432, 366650, 294043, 222401, 284822, 334505, 505935, 354226, 328036, 320324, 248046, 328221, 208017, 277105, 320423, 361133, 372974, 331010, 368858, 232412, 316635, 316552, 294365, 310861, 286707, 324852, 362881, 219880, 176685, 177494, 177641, 175947, 254660, 243342, 234877, 240696, 221357, 194652, 212041, 161640, 188821, 255797, 245147, 283864, 353461, 257622, 272647, 244607, 139967, 185780, 210108, 251563, 216544, 284657, 329424, 415675, 244703, 200921, 265056, 269738, 228193]
5067B28193m001P7765k7764j03545J320M4528p1600O5861l4129j19535R8262K5473
5055A80828J54068j78316J2952K5980k3304n9621M4790R9241o8300j06716K41147
5044C22749N7155o8415p5057n5113N2453R5894n7300m0796j00896K7955J20650
5033B79279k6609L0586j5339Q187J01975j66559J6517k455o0370q6405Q8773n1506
5021A16074m3015J17695J03381j05963n6167Q1560O1273j5756r2889l9620p1819
5010E4754L5704J10673o9422l1235P4418J8258O8471r0354p6919m3082Q0017J0499
4998A41782N3919j07426N3273R7927M553l1052m4851o0846P7311M9747m9389N3017
4986B37965j6981o0740K1510n1904L4731K3922J3125p5340R4808p5960L7914O138
$$ y = [228193, 224192, 301957, 274193, 170648, 171968, 216496, 144896, 210757, 176628, 57093, 155355, 180828, 334896, 156580, 169532, 195512, 172208, 112587, 157377, 256618, 188318, 81602, 322749, 379904, 311489, 236432, 181319, 233772, 329666, 272366, 231570, 130674, 158629, 279279, 252670, 283256, 267917, 276104, 378079, 211520, 228037, 225582, 165212, 78807, 167580, 116074, 73059, 190754, 294135, 188172, 132005, 213565, 274838, 259082, 166193, 126573, 54754, 90458, 201131, 131709, 100474, 174892, 193150, 261621, 171267, 94348, 51266, 131283, 141782, 195701, 88275, 141548, 239475, 244028, 212976, 168125, 107279, 184590, 234337, 184948, 237965, 220984, 160244, 181754, 129850, 164581, 188503, 201628, 126288, 221096, 145136, 183050, 189188]
4974A89188R9203n0316L3148l7160j9136j9228m8934N1131j17811R0389J46288
4963C16762L5781n1816m8011j0138k3902k4107K7864J3233P4693Q7106j35306
4952B62159r5018J38973Q0639j86994N7513M6603o7604q394J4433Q0694m4588
4941B78416n7257J15649J05036l6227k236m3928j10274J48005N0496O6975n4981
4930D59674l4936O2177n5624M4054N9901o2319J3851J01448o1267J08850K5768
4919F61577o1221o5750M8282M8902O8179J5532M7356J9870p1249n510K0425P3024
4907G99417K3244P2858K3082Q260J13974m451n354R3128p6642M2417Q6520J30173
4895A306626q1659O9999J02790r238J30336L9345p4242K661O4531n3623J36668
$$ y = [189188, 288391, 238075, 271223, 234063, 214927, 195699, 146765, 197896, 80085, 170474, 316762, 352543, 300727, 252716, 242578, 218676, 194569, 222433, 235666, 310359, 397465, 262159, 167141, 306114, 386753, 199759, 257272, 303875, 236271, 227877, 242310, 323004, 278416, 221159, 336808, 441844, 405617, 403381, 359453, 249179, 397184, 447680, 514655, 459674, 424738, 486915, 431291, 475345, 535246, 472927, 486778, 588226, 526959, 635809, 661577, 600356, 534606, 582888, 631790, 699969, 715501, 762857, 782727, 711478, 705968, 726393, 799417, 822661, 895519, 918601, 926861, 1040835, 1036384, 1031030, 1124158, 1047516, 1089933, 1176453, 1306626, 1224967, 1294966, 1397756, 1388518, 1518854, 1558199, 1483957, 1486618, 1551149, 1497526, 1634194]
4884A634194L6111J17211k4980Q2234Q0785M5140J8130j20858M3278M2323k1600
4873A931968K1331K8164N1420N0016N1656k0571j48894l1504J37259m2845j10953
4862A917047O3374j90868k34942m5228k05959q8546r9016J5151r6497q0414J14979
4851A069081o5462J40121n3099J02162L13574R6775L69894L93350L34658N41709
4841C242763Q53957P15969R37189Q33055R45721J307531J305654J729354K051574
4832A3922767K143176K813644M500520N173487p44821n399738m695122l548624
4824A4165289k612230k127827j497320j179695q09152o24361m88642n16241m12166
4815C897655m91699l46333k52574k27643j88034j23887j36566l29387r5025l3130
$$ y = [1634194, 1670305, 1787516, 1762536, 1844770, 1925555, 1970695, 1988825, 1867967, 1911245, 1953568, 1931968, 1953299, 1981463, 2032883, 2082899, 2134555, 2113984, 1965090, 1933586, 2070845, 2028000, 1917047, 1980421, 1789553, 1554611, 1509383, 1303424, 1214878, 1115862, 1131013, 1034516, 954102, 1069081, 1003619, 1143740, 1090641, 1192803, 1506377, 1603152, 1973046, 2366396, 2701054, 3242763, 4096720, 4812689, 5749878, 6582933, 7528654, 8836185, 10141839, 11871193, 13922767, 16065943, 18879587, 23380107, 28553594, 27808773, 22409035, 17713913, 14165289, 11553059, 9425232, 7927912, 6748217, 5939065, 5314704, 4826062, 4309821, 3897655, 3405956, 3059623, 2807049, 2579406, 2391372, 2267485, 2130919, 1801532, 1706507, 1673377]
4805A673377j79445l4576o1312j70640q9152P0058p8483r9148q8788K7837j25870
4794H43858j75647M0290J7137J27095j26128r4745J0043K4711n4390k0116o2852
4783E29256j65610P8056R769r739p7479k4895n8757L649J39648J458j29725o3799
4771B31832J28951p0271n8467J2591J9455J4467K0876K3951j26011l9465O0009
4760B17918P5553K2759l7780j66237N290R5100n5600J26871p4036n8118P4124
4749B25844J5769p1937j08787M9236m1049K4592N6213K6678J0078l7285j33243
4738A6109P4868L6444j2874M4212m4910k8473j7596q4435P2592M3571k6548k8470
4726D4490Q1676p2850J1030M4069o1599L6766K7294o2726P0830O3681j32365K7976
$$ y = [1673377, 1493932, 1459356, 1398044, 1227404, 1138252, 1208310, 1129827, 1030679, 941891, 969728, 843858, 668211, 708501, 725638, 852733, 726605, 631860, 641903, 666614, 612224, 592108, 529256, 363646, 441702, 451471, 441732, 364253, 339358, 280601, 284250, 423898, 425356, 295631, 231832, 360783, 290512, 232045, 244636, 264091, 278558, 299434, 323385, 197374, 157909, 217918, 293471, 316230, 278450, 112213, 117503, 212603, 157003, 283874, 209838, 151720, 225844, 241613, 169676, 60889, 110125, 69076, 93668, 149881, 176559, 186637, 149352, 16109, 90977, 127421, 114547, 158759, 113849, 85376, 67780, -16655, 55937, 99508, 72960, 44490, 126166, 53316, 64346, 108415, 46816, 83582, 110876, 48150, 118980, 182661, 50296, 78272]
4714G8272m875N0805j4642L3327j8577j83169J28411L9309k6526J5233J7850o0320
4702E5098o169j0451j15333N4817Q0296m2694J7104L4364P0148n8875l291M5345
4690A20359m2784m973q2175p5390Q1058Q2062O0027j36587M1017M9429m3027R3931
4678A42947r0915N312m8703M4793p5616N4066j4034L2861j7156q6547k4251N9734
4666a7509j3393p82P0163L2218m8785j07553m2199J39772J00676P0223J7502p1915
4654A28418O895j05312o4435r8619P9690M7537L1750k060q261K592r1834N0383
4642b3256K1700j4783K709P1588Q2266j54167k6020j0690P8589P2260r4505P1996
4630G7687r215J6274J8794m7837P656J15989L6291r0112q1697l6892Q057j1995
$$ y = [78272, 73397, 124202, 109560, 142887, 124310, -58859, 69552, 108861, 82335, 97568, 115418, 55098, 48929, 38478, -76855, -22038, 58258, 15564, 32668, 67032, 137180, 78305, 75014, 120359, 77575, 72602, -9573, -84963, -3905, 78157, 138184, 1597, 42614, 92043, 49016, 142947, 52032, 57344, 8641, 53434, -22182, 31884, 17850, 50711, 33555, -52992, -77243, -17509, -30902, -31684, 38479, 70697, 21912, -85641, -127840, 11932, 112608, 182831, 200333, 128418, 135313, 30001, -34434, -133053, -53363, -5826, 25924, 23864, 15603, 18195, -73639, -23256, -1556, -16339, -13630, 57958, 140224, -13943, -39963, -50653, 27936, 100196, 5691, 77687, 68472, 84746, 103540, 55703, 63359, 179348, 215639, 125527, 43830, 6938, 14995, 3000]
4618C000L3385K7191p7380q3872M1014Q642k3563m7291J28866P2102j98569J1190
4606a05285J20601P8609l6441j29775Q452J9665Q620O1048J13881M4424m5884
4595A37915j68471Q2692j2514n2935p482q664R8532r395o152j56126M4797M5716
4583a2087J7533j1704R8614j07337l5521m1239K0325M5891l0053P0729N6478m5745
4571B5884Q30r6796k3225R0647l8050N0540j16391K8501J09066l7566q605K5398
4559A0233l2588K3840N9081j875p7323j926M5585m372L7939j30634k9703L0085
4547g1658K3490K4634L9628p7182l6895R1356Q4583j12656k7070M9416o1520O9846
4535d028m2311L7053j0865j7770o241l5989k2269R1664n372j14855K1546J34783
$$ y = [3000, 36385, 63576, -13804, -97676, -56662, -48020, -71583, -118874, 9992, 82094, -116475, -105285, 15316, 93925, 57484, -72291, -63839, -44174, -35554, 25494, 139375, 183799, 137915, -30556, 52136, 39622, -13313, -20795, -29459, 69073, 59678, 53526, -102600, -57803, -12087, 5446, -6258, 92356, -14981, -50502, -91741, -71416, -25525, -55578, 15151, 71629, 25884, 26714, -70082, -93307, -2660, -40710, 9830, -106561, -78060, 31006, -6560, -15165, 10233, -22355, 1485, 60566, 58691, -18632, -20558, 25027, 20655, 58594, -72040, -101743, -71658, -48168, -23534, 16094, -61088, -97983, -6627, 77956, -34700, -61770, -12354, -73874, -4028, -46339, -9286, -20151, -37921, -44162, -80151, -102420, -10756, -16128, -130983, -109437, 25346]
4523B5346O407k8573M9680N6682n0705n2689o327J0470J1873R928J9360n1364
4511H8m3192j0172l7967J16484K6486q6866l8097k2203P4248l1183O3706j840
4499I492j3427l2452L5445q686q4525P7134R8998q696o9028n3877K8758p8803
4487i9667j7021N6683j628M7001j11640P61J21910r928Q3151k4103m7767J26004
4475A23756j8421j50336m542j1216l7832J46728l4040l6826l9850N3403Q926k4764
4463b5014l0124R238p808O3473o8176Q6779K3816K5303j01643K1740N636l3569
4451c0349J9272K7066j42828j6883N7501M5763k8655P4129m4620n2091N0807J9946
4439b0942O0552j32645L5796n31r1504J76801L9880j79334J34421o2832m2513
$$ y = [25346, 31753, 3180, 52860, 109542, 58837, 6148, -179, 10291, 22164, 32092, 51452, 88, -43104, -53276, -91243, 25241, 51727, -35139, -73236, -95439, -21191, -52374, 11332, 9492, -3935, -36387, -942, -9628, -94153, -17019, 81979, 73283, 4255, -49622, -20864, -99667, -116688, -60005, -61633, -14632, -126272, -125511, -3601, -13529, 69622, 45519, -2248, 123756, 105335, -45001, -49543, -60759, -98591, 48137, 14097, -22729, -62579, -9176, -250, -25014, -55138, -45900, -53708, 9765, -58411, 28368, 52184, 77487, -24156, -2416, 3220, -30349, -11077, 15989, -126839, -143722, -86221, -40458, -69113, 5016, -39604, -91695, -40888, -20942, 39610, -93035, -57239, -57770, -149274, 27527, 67407, -111927, 22494, -40338, -82851]
4428h2851m4138L0855p5229J05821r0208J05925J07508K979p7183o3802P2287
4417h036Q1850j74130M9836k8031k4899J74511p4195J957N0486M5598J7698J6067
4405A28712j89474N3783K8011m7912q2683L3420M4133O2610M5425p6945j9863
4394b0783Q46K2807j05326L2912M2591j9564o2606M9509R0953O7244l616r2763
4382B204Q325J26684l9116j61640N310m6190L9742L2027J39615j12736p6531L334
4370g8972j1109P9729r3651N4278N4677p1985J10967L9383l9207q2313L6059k2984
4358b5128n1474k5390L4711J13717n2087N909k5436K6767J1773m7301j8735j9232
4346g1906P1554K6174j52381K086J11350K1876j4336r4143L5813K9941m8201O7075
$$ y = [-82851, -126989, -96134, -171363, -65542, -155750, -49825, 57683, 60662, -16521, -80323, -8036, 73814, -100316, -50480, -78511, -103410, 71101, -3094, -1137, 49349, 94947, 112645, 128712, -60762, -6979, 21032, -26880, -109563, -76143, -32010, 30600, 76025, -920, -20783, -19937, 2870, -102456, -69544, -26953, -46517, -109123, -59614, 31339, 98583, 94967, 2204, 10529, 137213, 98097, -63543, -58233, -104423, -64681, -32654, 106961, -5775, -82306, -78972, -90081, -10352, -104003, -49725, 4952, -67033, 43934, 83317, 44110, -38203, -2144, -25128, -76602, -101992, -67281, 46436, -5651, 258, -25178, 1589, 13362, -33939, -52674, -71906, -352, 25822, -126559, -124473, -13123, 8753, -5583, -99726, -63913, -33972, -82173, -15098]
4334a5098K2093r1509m2439J12307l2115K3484n2811J2023l3857P071j158k6464
4322a18473K2862j53359M7128O8872P6911K2683P0942k3618j02791J16985j19685
4311i1543J9074K5828j1900l1359n1532k8585L5472k516Q7446L8381J4177Q2186
4299H5129o1121n8708j7892k8522M8037j3559j8985J0453j6282N9074R2779j14066
4287c3663k9110J24241r0004j46594J65839p0333M608J21263r3369N1588o0588
4276e6122O873O9049p8539o9712Q6778j5182m9912o606J3401j1003P0799K7740
4264a2436n9019m8569Q6688N2855q7876J1502J18815J8159o6740p3737M3365n3132
4252g0125j7152N0878L9726m5573M9788L411j81489J48487J09094j90078p3992
$$ y = [-15098, 6995, -84514, -126953, -14646, -46761, -23277, -76088, -64065, -97922, -90851, -92009, -118473, -95611, -248970, -201842, -132970, -56059, -33376, 37566, 13948, -88843, 28142, -91543, -72469, -46641, -58541, -89900, -141432, -170017, -134545, -137061, -49615, -11234, 2943, 85129, 24008, -34700, -52592, -81114, -33077, -46636, -65621, -55168, -71450, -12376, 80403, -33663, -62773, 61468, -28536, -175130, -9291, -79624, -75016, 46247, -47122, 4466, -56122, -49249, 19800, -58739, -128451, -41673, -56855, -106767, -113373, -99972, -110975, -40176, -12436, -71455, -120024, -33336, 19519, -68357, -56855, 61960, 80119, 13379, -60358, -16993, -70125, -87277, -36399, 3327, -42246, 7542, 10953, -170536, -22049, 87045, -103033, -177025]
4241a77025N8825J49888r6464p1728R4723o0133J30637R717m5361j04671P6091
4230c5501n882k6474J9319J8332j4289J2284j627m4209j32717Q0252J74787p0354
4218b6079j01355Q7076N5267j4933L2057q4301O4704n4853N2030m7034J3464r574
4206c3531k8476k648N9096q6669K584P2319R0917j14509n6395l0881r336J62851
4194B5322k4521n3342J25430j10845J6843J4742Q4973p7291m8806J65n712K5104
4182b7938Q6167l322n9135m7522r9078O1049l0293l0405J37422j10420p9532J19578
4170h3429L1113K130P0272J7401q9148j5949O6228K950N1423K7245o1846p1558
4158e3168p3511L9992K6745J6257o3925m2251O1708k165j1990M6508l5660J7562
$$ y = [-177025, -118200, 31688, -64776, -136504, -41781, -101914, 28723, 38440, -6921, -111592, -35501, -41383, -67857, -48538, -30206, -44495, -32211, -33838, -78047, -210764, -130512, 44275, -26079, -127434, -40358, 14909, -24, 32033, -52268, 12436, -42417, 9613, -37421, -23957, -33531, -62007, -64655, -5559, -92228, -89644, -17325, 73592, -40917, -97312, -128193, -137529, 25322, 801, -52541, 72889, -37956, -21113, -6371, 78602, 1311, -47495, -47330, -53042, -27938, 58229, 54907, -4228, -51750, -150828, -89779, -120072, -150477, -13055, -123475, -203007, -83429, -52316, -50186, 20086, 37487, -51661, -67610, -1382, 1568, 52991, 80236, 18390, -53168, -126679, -86687, -59942, -43685, -107610, -149861, -88153, -90318, -102308, -55800, -91460, -73898]
4146g3898J8462N4755o1926r1345N1842n750P8348l7941p422M8188n4796O949
4134g4534M9395O3563p8007k566J5831J12250n0442Q835M6865L2034N8536j00919
4122H0841M417P346p8156m7735r0714m4103Q0279L6098p7546J15320N734J950
4110f269m091J44553j46091j1720N679R3080m972o6911q3786L5446m4906o232
4098i6220M898n5097k5008K06718k7410n3139j01786K5360k5089M8716J15240
4087A7183R7269j20852r6124N4488j2888J00561m2629J42389j27692j78972P9770
4076h7497J8183P88R9396j7175q0083R7228k7507J8964l4349j32820Q5206o6432
4064a26098R4634O7462L4146j75626J1765L8452k9569R7109L7164J8814k7045
$$ y = [-73898, -55436, -681, -62607, -153952, -102110, -107860, -29512, -67453, -74875, -26687, -81483, -74534, -25139, 38424, -39583, -42149, -26318, 85932, 35490, 44325, 91190, 123224, 181760, 80841, 85258, 92604, 14448, -33287, -124001, -168104, -87825, -51727, -129273, -13953, -8219, -6269, -10360, 134193, -11898, -23618, -17939, 75141, 70169, 3258, -80528, -45082, -89988, -96220, -91322, -146419, -171427, 35291, 7881, -45258, -147044, -121684, -146773, -98057, 17183, 114452, -6400, -102524, -48036, -60924, 39637, -2992, 139397, 11705, -167267, -87497, -69314, -68526, 30870, 13695, -66388, 30840, 3333, 22297, -12052, -144872, -59666, -126098, -31464, 35998, 70144, -105482, -93717, -55265, -84834, 12275, 49439, 68253, 41208]
4053D1208M1090p845j3572r4249O3488r1839p7549O9820p9851m7614J12087J58810
4041G3984j15113P1323J5187M4243m8346O9853j66560j6610m51p820K0835J5446
4029d4029J32078j8076j28427K1500R4722l9415o0029J45334o0545m9563k9435
4018c5885Q6822J1821q8616l1537J9083K2662P1508j29711Q9293J2191j56363
4007a28732J9769p373j6819O2543L9862L3828P6882l2314j04992P4205N9687m1860
3995C4686M3454o0235j25200O3177M9955j36722M4226j9414N04P4927n2767N1267
3983c2142j6853K0142Q2088k7269Q8712j37541j3401n4776j6649M9595n4512M6845
3971f5761k7744J00530p0062K7814J73483k08368q6145R2960J1240K7201N4188
$$ y = [41208, 82298, 74453, 60881, -33368, 30120, -61719, -139268, -69448, -149299, -196913, -84826, 73984, -41129, 30194, 45381, 89624, 41278, 111131, -55429, -72039, -72490, -80310, -59475, -44029, 88049, 69973, -58454, -36954, 57768, 18353, -41676, 103658, 43113, -6450, -35885, 50937, 62758, -25858, -57395, -38312, -15650, 55858, -73853, 15440, 27631, -128732, -108963, -116336, -133155, -70612, -30750, 3078, 79960, 47646, -57346, 16859, 76546, 34686, 78140, 17905, -107295, -44118, 5837, -130885, -86659, -106073, -105569, -30642, -83409, -32142, -48995, -28853, 53235, 25966, 114678, -22863, -36264, -91040, -107689, -58094, -112606, -65761, -93505, 7025, -63037, -35223, 138260, -70108, -156253, -63293, -52053, -24852, 29336]
3960B9336j84136O5292K09231j29254r333M200n0692J54313m8839L128j07761
3949f4515J33613n0887j50379N6083K6038j0780n138l3895l1994J12066J6018
3938c770j36998O5514J51737m1332n0414J40287j30942r3649L2832n7752M5014
3927g9473J09771o520K0816O8859n2916l6836O0077m2018n7888r047m1830M0672
3915b6333k178j7194L2174r6449J02224n5043l5552J51887m0136o8059M1088J10092
3903I6521N7674j31470L2857J4968p8599M5064j21561K3037k6187j6116P1515
3892c2297K4383k0913J1249o9855Q0129k4360m7163N1573j15662R5147J14116
3881F6347j12069K9668q4372j3329l5616K9535r8273J60428M2550p9274o842k8634
$$ y = [29336, -154800, -89508, 119723, -9531, -18864, -14664, -65356, 88957, 40118, 43246, -64515, 69098, 18211, -132168, -76085, -50047, -60827, -65965, -99860, -131854, -19788, -3770, -140768, -75254, 76483, 35151, -15263, 125024, -5918, -99567, -66735, -124487, -79473, 30298, 23778, 44594, 113453, 60537, 23701, 83778, 41760, -16128, -25175, -67005, -26333, -28511, -45705, -13531, -109980, -7756, -62799, -98351, 53536, 13400, -54659, -13571, 96521, 154195, 22725, 55582, 70550, -8049, 37015, -84546, -61509, -87696, -103812, -32297, -7914, -28827, -17578, -87433, -7304, -31664, -78827, -27254, -142916, -47769, 66347, -45722, -16054, -100426, -113755, -149371, -119836, -218109, -57681, -15131, -94405, -101247, -129881]
3869a29881O352O2418m3532L6077J754P9728O7241O0753j46430l9788m2359P3794
3857a3873k2689l9048j1142N8953n5549M8755N2166n6218n6801J22305P1942r0296
3845H505m8242j07278J01361P270O8101m9966J42729n9232l6596r4515J84476
3834A16613p4474J2705j23513K5059K418m5502k9815J19640n8250P1763K2337
3823C8981L1716J3147K2241n9196j77195N6779J50463J02717k00374j16840O5137
3812g2424M5218Q398L5360j20097j6898J61671q6080K7763J29408n9567j53519
3801a00767P3230m7684O6878M6051o2199M6359M2437J4645j42012P5213P0845
3790H2996q7013r5960m0268n5990R5327l4550J6218J36749q8486K7134p4078J0511
$$ y = [-129881, -123529, -61111, -104643, -68566, -66812, 12916, 80157, 140910, -5520, -45308, -87667, -13873, -36562, -75610, -86752, -27799, -83348, -34593, 17573, -38645, -95446, 26859, 98801, 8505, -39737, -147015, -45654, -38384, 29717, -20249, 122480, 63248, 26652, -67863, 116613, 42139, 54844, -68669, -43610, -41192, -86694, -116509, 3131, -55119, 16644, 38981, 70697, 83844, 106085, 46889, -130306, -73527, 76936, 179653, -20721, -137561, -72424, -27206, -18808, 16552, -103545, -120443, 41228, -44852, -17089, 112319, 52752, -100767, -27537, -75221, -8343, 37708, -24491, 21868, 64305, 78950, -63062, 12151, 82996, -4017, -99977, -140245, -196235, -100908, -135458, -119240, 17509, -70977, -43843, -117921, -107410]
3778a07410J18933l0964N0109r7680P1915J1676l7970R1032r0507n508M0565j26718
3766a12527P7969o3950P2976M827j27309K7861P4548O3636l8235k9949O5175n7977
3754d2955L550p3010q209O6436j8037R8833Q501j26004J19362N6121m5948l8808
3742a68J5394p931j20779O4484N8881J13896K2940q5103K7302j6166J1448o5416
3730A8782o5813l147J16120j73879M322J76219l2709k4057L3106j1021l0434k4215
3718a6726j7241O838L5001k0934J3417n6100L0679J14879j59090k4637J21172
3707B7258k5835m753o2289Q5376m7324M7510q6562k1565O1321P4763O3013q7023
3695B3890j7317q2691O0437R8266j1548o9540J5300k7644M4187q9132N8879n7722
$$ y = [-107410, 11523, -19441, 30668, -67012, 4903, 16579, -21391, 69641, -20866, -26374, 14191, -112527, -34558, -98508, -25532, -20705, -148014, -120153, -45605, 18031, -20204, -50153, 15022, -42955, -39405, -112415, -120624, -54188, -72225, 26608, 35109, -90895, 28467, 84588, 38640, -168, 15226, 7295, -113484, -49000, 9881, 123777, 146717, 61614, 88916, 72750, 84198, 18782, -47031, -50178, 65942, -107937, -103615, 72604, 39895, 15838, 48944, 37923, 7489, -16726, -33967, -27129, 7872, -13062, 355, -55745, -25066, 89813, -69277, -93914, 27258, 1423, -3330, -65619, 19757, -27567, 19943, -66619, -88184, -26863, 47900, 110913, 23890, 6573, -76118, -15681, 82585, 71037, 1497, 16797, -10847, 33340, -55792, 3087, -54635]
3683e4635P9967j14991l7820L117Q7386n1681j7860J51819J0493l994n3714m0119
3671d2032k0854N3723m7730m8325M2736J23300m8583M3200m8545j06605J09418
3660I703J22244q7594p4198J9503J09316o3255o0084n482n4480n4625j3077P5555
3648g6474J0086J3392P8435R098N7458m3749r4331L4727j04685O9386k3907R2973
3636B2409j6606p173j2405n1705M2693m8983m5792O9118N6809p2305Q1997j7945
3624A12n8377Q8225K4513L3951j00780K6065Q2517j01677M3374m2126K3048r7337
3612g8492Q7323k3670k1318M1881n4462M7543J7513L5646L2127r1258p9270P6517
3600i920N1451m1570j4459K8391j1012O0922p9461K1722m6972m9237Q9075l505
$$ y = [-54635, 25332, -89659, -127479, -124362, -36976, -88657, -106517, 45302, 55795, 51801, -1913, -42032, -62886, -9163, -56893, -105218, -62482, 60818, 12235, 55435, 6890, -99715, 9703, 131947, 44353, -29845, -10342, 98974, 35719, -24365, -29847, -84327, -138952, -152029, -76474, -66388, -52996, 25439, 34537, 91995, 48246, -46085, -11358, -116043, -46657, -70564, 22409, 5803, -1370, -13775, -65480, -22787, -71770, -117562, -48444, 8365, -63940, 18057, 112, -58265, 29960, 54473, 88424, -12356, 13709, 96226, -5451, 37923, -4203, 18845, -78492, 8831, -14839, -36157, 5724, -48738, -1195, 16318, 51964, 84091, -7167, -86437, -9920, 41531, -39, -14498, 13893, 2881, 63803, -15658, 6064, -40908, -90145, -1070, -4575]
3588d575m0790J53035p7196n2143M3990K6635P5515m1099n2449O0970l6404j8007
3576C7482r8792k0647Q3592P3667j00492P1127m4010p1635L995m4884J58152O4128
3564A11683p1181k7022o7449j5344k7812n4920m901J30238Q5853m4542K1365k837
3552C3131L4225p0495k4211l9747K5957R044J0310L9900n7444n57j4884j4718
3540f9489K5316N3762K9094n8957j5790M4518O9607j15837Q6116j735j23533r7740
3528a74668P8104J21599J8905j31847n3778J44416k1503n8192N4774J25032q3566
3517A9276o9298L1141M1940J0392k9311r8216j0895J27812j16295O5684P1724
3506D3954N0500j42488Q5187m6404P201M7967q7812p33J2606M3148j19544n424
$$ y = [-4575, -45365, 107670, 30474, -21669, 22321, 48956, 124471, 83372, 30923, 91893, 55489, 37482, -61310, -81957, 1635, 75302, -25190, 45937, 1927, -69708, -65713, -110597, 47555, 111683, 40502, 13480, -53969, -69313, -97125, -152045, -156946, -26708, 59145, 14603, 35968, 33131, 67356, -3139, -27350, -67097, -41140, -32096, -21786, 18114, -39330, -39887, -54771, -69489, -44173, 9589, 38683, -20274, -36064, 8454, 78061, -37776, 48340, 46605, -76928, -174668, -96564, 25035, 43940, -87907, -141685, 2731, -18772, -76964, -22190, 102842, 19276, -50022, -18881, 23059, 33451, 4140, -94076, -104971, 22841, -93454, -27770, 43954, 94454, -48034, 37153, -9251, -2050, 45917, -41895, -42628, -30022, 13126, -106418, -111842]
3494a11842J1696J7240Q2845J6457N5193n3614n0864J20199j60256L8721L1247
3483b978J0732k6943o2497O441K4753n8276M207R2739J04658j5838j36174Q2449
3471B3273l4977p924O0764K6690j9286m7332j2623p4499j0120Q691J18684K0159
3459E1500o4966l280j39113J24488m4928L7120L2856l9843O8677n2784J5099J08823
3447I3649r4196R6939J8664q1982L4181P7695j24007j44829Q4515J52802j22327
3436h896q1338J04395M3106j15282o955J3939j7558J027Q508O0778n7561o5011
3424a20848n5443J15202l0115Q4544j9264J11417o7808n968M3437j16920r0833
3413a52599n4262J71416K3608j16919K50995j57084o7949R390L1836p87R2414
$$ y = [-111842, -100146, -82906, -61, 16396, 71589, 17975, -32889, 87310, -72946, -34225, -2978, 7754, -19189, -81686, -75245, -50492, -108768, -104561, -11822, 92836, 76998, -59176, 23273, -11704, -19628, 41136, 67826, 48540, 1208, -11415, -85914, -96034, -87343, 31341, 51500, -13466, -16746, -155859, -31371, -76299, -39179, -6323, -46166, 22511, -30273, -15174, 93649, -547, 96392, 115056, 33074, 67255, 144950, 20943, -123886, -39371, 113431, -8896, -90234, 14161, 57267, -58015, -64970, -51031, -68589, -67562, -59054, 1724, -55837, -120848, -176291, -61089, -91204, -6660, -25924, 85493, 17685, 11717, 55154, -61766, -152599, -206861, -35445, -11837, -128756, 122239, -34845, -102794, -93404, -61568, -62355, 30059]
3402C0059j511m3227J09891K135j899P5840j31656l1420M487l8474L1570p2281
3390f6486Q7511L0567J9980l3637j40752J04962q7420P315p685J19861J34980
3379A69196j42848o8934n3722J54716O4743j46283j06906J09071J2567l4892O6011
3368B2719j41921K417M4336p3105J50155L4860l6478q8017O0830j0829J35308
3357A00275m0838r356k1689j0816k2417j2554k2077R4659o4822n541O4079o4045
3345a5142L0773p9695m5666Q0372j02493J2541J54547r735J47041j27227p0493
3334b5177J35664m2525k900l3408m6769N2650o0695l72L784m4658O0875k1260
3322b4791L1754L1210M951l8931J8276r209N9412j8900l2265N0510P6627p2293
$$ y = [30059, 28548, -14679, 95212, 97347, 95448, 171288, 39632, 8212, 12699, -25775, 5795, -66486, 21025, 51592, 71572, 37935, -102817, 2145, -85275, -77960, -85645, 34216, 169196, 26348, -42586, -96308, 58408, 123151, -23132, -130038, -20967, -8400, -43292, 22719, -119202, -116785, -72449, -145554, 4601, 39461, 2983, -85034, -24204, -35033, 100275, 59437, 50081, 28392, 17576, -4841, -17395, -39472, 55187, -9635, -15176, 48903, -15142, 15631, -64064, -109730, -29358, -131851, -119310, 35237, 25502, 172543, 45316, -25177, 110487, 67962, 65062, 31654, -15115, 37535, -23160, -23532, -19748, -64406, -3531, -24791, 6963, 38173, 43124, 4193, 22469, 13260, 72672, 53772, 21507, 72017, 148644, 76351]
3310G6351m6701n2721m606r1807J40208M7974p2063q2791O1123j46794Q5740K47522
3298A61435j96111n5Q2026m2572o3968P0542j32761L9624L6221k6226L7425P3787
3286C9367m2N3882j16535n2231Q1308P7678j32255n0913L2170J5009j15133J29022
3274c8673P2082K3051O4990m6479q6061L3528j06448p4494l599P5689R9496L8339
3262E1421n0150n0089K083O6133N6148m9186n2332L7072r0284J35534q794N876
3250E3432n2866n1589J19974Q4m2855m5625R6148n4786l2410n4666L9451l3673
3238e9381J59149q3936j10189L4703J3795N5249l8589O3284p7338J3651R0087
3227F0485l5411P0082j30879l712J1754m2790p2368M3879j166J7057J6531M3194
$$ y = [76351, 29650, -23071, -27677, -119484, 20724, 68698, -3365, -86156, -25033, -171827, -86087, 161435, -34676, -34731, 47295, 4723, -59245, 11297, -121464, -81840, -45619, -71845, -34420, 39367, 39325, 93207, -23328, -75559, 5749, 83427, -48828, -99741, -67571, -52562, -167695, -38673, 33409, 56460, 121450, 74971, -11090, 22438, -84010, -158504, -162103, -86414, 13082, 51421, 1271, -48818, -46735, 19398, 75546, 26360, -25972, 11100, -79184, 56350, 47556, 53432, 566, -51023, 68951, 69035, 26180, -19445, 76703, 21917, -10493, -65159, -25708, -59381, 99768, 15832, -94357, -59654, -45859, 9390, -29199, 34085, -43253, -29602, 60485, 25074, 95156, -35723, -39435, -27681, -70471, -142839, -98960, -100126, -83069, -66538, -23344]
3215b3344O0133K259j5564J02922q62j28436J7002Q6148p8245J0739m1613n478
3203a4339J12481j74063J0451J54790j0977n5906M1583n9266p0435N0699J4203
3192g79p5019j9823P0485J57261n7749p8786l9616J7794j0291N4577l5661n539
3180b3146q6626L8692Q3879m2641r032N1885J00910r9082L1721m7588k0060o9518
3168i0606Q1618L7316l8737p7010M7865p3788N4178L9065m1479L5396O9647k8867
3156A4598j05743k1783P9387k2841M362n3933k4852O1292O8896L7379M2317p0964
3144H115p9534O7006L0778N4771o3621Q0129p5251j7596m9334k0544J3964M5248
3132e869n0932J01844N0967K6207n4451q5031j16488N7544K3516r1967O8740P0054
$$ y = [-23344, 36789, 39048, 23484, 126406, 125544, -2892, 14110, 100258, 22013, 32752, -8861, -14339, 98142, -75921, -65470, 89320, 78343, 22437, 64020, 4754, -65681, -14982, -779, -75798, -95621, -25136, 132125, 74376, -4410, -44026, -26232, -36523, 18054, -17607, -23146, -109772, -71080, 12799, -29842, -38874, 13011, 113921, 14839, 46560, -1028, -21088, -90606, -8988, 28328, -10409, -87419, -39554, -113342, -59164, -20099, -61578, -26182, 43465, 14598, -91145, -112928, -33541, -56382, -52020, -105953, -130805, -69513, -617, 36762, 79079, 8115, -71419, -4413, 26365, 81136, 17515, 97644, 22393, 4797, -44537, -65081, -51117, -5869, -56801, 45043, 96010, 122217, 67766, -17265, -133753, -76209, -52693, -144660, -75920, -5866]
3120e866o3448j3972J02555M9955j9863o2979J00020p1897L481L2950J74456q6392
3108A39000j49496O1980n7954p1039j1061Q9303l892k8292k5696L6006o4925M5484
3096d0582N1303R9923n3541l3126l1388K621M475J09557q9177l0553n3182J37258
3084G3588M8011n2012n1952m5033J06275j19603O8637q2765M4064J52332q470
3073A33072j01887n4733o5096n6427n2569P6473J2249O5221O8883n3606k7334
3062e5754Q7341l2547L0839k0371o674l1308P3748K4205Q792J1609L745p9797
3050A3828r7800p422j5205P0308P1306N8976k4174o0332M8477n6905j4882M0063
3038B6238N8256q0884J48615j21530o1654r563M5554o6320Q3193m0028n7632K8048
$$ y = [-5866, -69314, -83286, 19269, 69224, 49361, -13618, 86402, 14505, 17986, 50936, 225392, 139000, -10496, 51484, -6470, -77509, -88570, 733, -3159, -31451, -57147, -21141, -86066, -40582, 10721, 110644, 57103, 23977, -7411, -4790, -315, 109242, 20065, -10488, -63670, 73588, 121599, 69587, 17635, -27398, 78877, -40726, 27911, -54854, -10790, 141542, 133072, 31185, -23548, -88644, -145071, -197640, -121167, -108918, -43697, 25186, -28420, -55754, 31587, -960, 29879, 9508, 2834, -28474, 45274, 69479, 78271, 89880, 93625, 13828, -83972, -91394, -106599, -36291, 35015, 93991, 69817, 9485, 57962, 1057, -13825, 26238, 84494, 3610, 152225, 30695, -30959, -40522, 5032, -61288, 21905, -18123, -75755, -47707]
3026d7707m1363J87355l1070m4743K5074n493K3738L0243Q475m2156j6861o4406
3014a8914L8162R2187j21437P5284j05453J7301j12549R6601O2072K0336j9189
3003B4401q1746K1003O0661R4776l4163j15145k4456l1078J24062k5915j20834
2992a08434q4161P5834j439M740J2930M8225Q75K3591J49208q2902K2893J14910
2980A76270r7832n4891o80P2917k0664j3771j00750J06491l6042m924r0298l2217
2968i6391P6622M3569p5806o45R2336J9323m2424m9588m8361M4140J78257K2973
2956A64005Q056m4359j18680R7003j02844n4235L3983o0346M8672L1857J4654
2945A7766k4744k5741J6722K673k848l3337M1174Q3828q8438Q4857o65L6470k0581
$$ y = [-47707, -89070, 98285, 67215, 22472, 47546, 42053, 65791, 96034, 104509, 62353, 45492, -18914, 19248, 111435, -10002, 65282, -40171, -22870, -135419, -38818, 23254, 43590, 24401, -57345, -36342, 24319, 119095, 84932, -30213, -54669, -85747, 38315, 12400, -108434, -192595, -116761, -118200, -113460, -100530, -52305, -51430, -27839, 121369, 38467, 61360, 176270, 78438, 23547, 22867, 95784, 75120, 61349, -39401, 67090, 31048, 26124, -64174, -96391, -19769, 23800, -52006, -52651, 39685, 59008, 16584, -33004, -81365, -37225, 141032, 164005, 172061, 127702, 9022, 106025, 3181, -51054, -17071, -77417, -28745, 3112, 17766, -6978, -32719, -15997, -13324, -16172, -49509, -8335, 75493, -12945, 71912, 71247, 107717, 87136]
2932H7136l0349O0915r77j64797j48313j7758J56740P870O5097L1591K794m7143
2920B806J5726k0659l465q615r1816N276J4490K55j0839L7835l9063M4274R9564
2907D5769K3466J18331j14120k324l3338k8787k4487M6550j25647N5105K7330
2896a2152L0818J4019L2199O5607j42916m2461J27863J8197o1818q0021N8612
2885G947q6776N0684j4279N1187j02535n314J03356l2352o2210M5405k4889k7030
2873i6806J57285M2617r0081n7270J03991j07010M1979n2818N3779J4626L9719
2862E0011K4226m9035q713J18633q5840p956k5959K0468m2146J6898J42084q4107
2850F8564m3850N829q9166k332Q657N0653R8514L1197O6239j43195m3218K9533
$$ y = [87136, 56787, 117702, 116725, -48072, -196385, -214143, -57403, -49533, 15564, 47155, 49949, 2806, 18532, -2127, -5592, -14207, -106023, -100747, -86257, -86002, -96841, -59006, -98069, -53795, 45769, 69235, 187566, 73446, 71122, 37784, 8997, -15490, 31060, -94587, -39482, -12152, 18666, 32685, 64884, 130491, -12425, -54886, 72977, 91174, 29356, -50665, 7947, -78829, -28145, -42424, 8763, -93772, -99086, 4270, -28082, -90292, -44887, -69776, -96806, 60479, 103096, 13015, -44255, 59736, -47274, -5295, -58113, -4334, 10292, 50011, 74237, 25202, 16489, 135122, 49282, 41326, 15367, 35835, -6311, 10587, 152671, 68564, 24714, 30543, -58623, -60955, -52298, -1645, 96869, 128066, 194305, 51110, 7892, 37425]
2838C7425j12310J12358m141n343n0629m6820l960K9402J60887j05509J16244
2827A27604q871p8755J53186j18337n2010k2774J1532L029m2705k0290L3625l8524
2815e3290j07974J76651P544l9347n683K0617j0320m5364P7189n3649P8536N9531
2803A04441j56366O6939l311p1169J34424p285q6562k1254j7446J4273O2016N935
2791B4635n0431l5850J08081M9601r729j745J1963k8057P709K8279j9360j21723
2779c6627m0804L4190j2370M181M1957k3611o1479M6321M8274K3944k91k5390
2767a705k8112m2706L8155o9089O0717P8202o7035j4280M9135n5712k8457M6218
2755c4669P9914k9515j6457p8358J6620N5138Q005p407o4648o448J43849n9130
$$ y = [37425, -74885, 37473, 33332, 27989, -22640, -69460, -73420, -44018, 116869, 11360, 127604, 118733, 39978, 193164, 74827, 22817, 43, 11575, 14604, -28101, -48391, -14766, -53290, -161264, 15387, 22931, -16416, -22099, -1482, -11802, -57166, 20023, -33626, 44910, 104441, -51925, 15014, 11703, -59466, 74958, 67673, -18889, -40143, -57589, -43316, 18700, 24635, -25796, -61646, 46435, 96036, 86307, 84562, 96525, 68468, 76177, 104456, 85096, -36627, -77431, -43241, -55611, -51430, -9473, -33084, -94563, -48242, 32, 23976, 23685, -1705, -29817, -72523, -34368, -103457, -42740, 35462, -31573, -45853, 3282, -52430, -80887, -34669, 45245, 15730, -727, -79085, -62465, -7327, 678, -6729, -71377, -77825, 66024, 6894]
2743F894J3114O3936L8370J5864j20617p2158N774K9908P5627n4502p7471k1204
2731i6465J7478p2753L9235J29907o609m3983j86514J40762O1234N3608L5171
2720G1071j10601J01879n5592k6044o135M3211j5074O4960k1850k1659L804m8960
2708b0990R0623K1706K6381j30629l0528n0124k6449N4596Q5654j9274j0680j7931
2696b7645M9009Q9826L619m2729l071j07111R9j09325Q3081p5147K01862l6884
2684B5584p3383j5498P3123p5204k5496J04302o1531j7150p8427q352K2110J00134
2672b9788o5736N2822j9194M1125J45625N0976j28835N5965l0078r4126m096Q702
2660a6638L7859N2920K5794l5031N3819o4624N576j49289l1124P3372j12991J96539
$$ y = [6894, 20008, 83944, 122314, 138178, 17561, -54597, -48823, -18915, 56712, 2210, -75261, -96465, -78987, -151740, -112505, 17402, 10793, -33190, -219704, -78942, -17708, 35900, 71071, -39530, 62349, 6757, -19287, -25422, 17789, 2715, 67675, 45825, 24166, 27970, -20990, 69633, 91339, 117720, -12909, -43437, -93561, -120010, -65414, 20240, 966, -9714, -27645, 21364, 111190, 114809, 72080, 69009, -38102, -38003, -147328, -64247, -139394, 62468, 25584, -47799, -63297, 9826, -65378, -90874, 13428, -48103, -65253, -143680, -152032, -129922, -29788, -95524, -42702, -61896, -20771, 124854, 175830, 46995, 102960, 72882, -21244, -25340, -16638, 21221, 74141, 99935, 64904, 118723, 54099, 59675, -89614, -120738, -47366, -160357, 36182]
2648C6182O2364p910l0785m7368Q1495j9931L189M746j8533k2796l7209q371m257
2635i184l5497J36408J4026L8639N9055k29649K1825l840J42665k0927r0275l3779
2623a0533j7117N6325l7754k3722j20365O8956R5448k129j03458J0168J12335
2612B8154q338J5792L5069n7086M5714M1846K0607o4555N9819q5230k5285n124
2600A383n9999O3939J0864N0930r5491J01135j314M5L1721K7011k0020j4835r3794
2587A575l5583j9565o3998J04850k7920k4529r120J60997j33551o2741K08515
2576I8930r9964k5094K8316m9897j6516k9444L5853K5811P5857l4669N9879J9492
2564H8554j07233M1458n4518N9089K2675j34957J02041M0740K2274j4514n2520
$$ y = [36182, 98546, 90636, 59851, 12483, 93978, 74047, 77236, 81982, 63449, 40653, 3444, -4927, -9184, -44681, 91727, 105753, 144392, 203447, -26202, -4377, -8217, 134448, 113521, 23246, -10533, -27650, 28675, -9079, -32801, -153166, -84210, 11238, 9109, -94349, -84181, 28154, 19816, 35608, 70677, 13591, 59305, 101151, 121758, 57203, 117022, 31792, 6507, 1383, -58616, 5323, 16187, 67117, -28374, 72761, 71447, 71492, 103213, 130224, 110204, 95369, 1575, -34008, -53573, -117571, -12721, -40641, -65170, -74290, 86707, -46844, -109585, 98930, -1034, -26128, 2188, -47709, -64225, -93669, -57816, -32005, 43852, 9183, 69062, 88554, -18679, 22779, -31739, 27350, 50025, -84932, 17109, 57849, 80123, 65609, 13089]
2553A3089l2666j00494K1890Q4136Q4965L5538p3996j07586N5173K7291L2512
2542C9852l0166q8901Q9741K958n0129J08182N502N5620j68125j294N8135N9038
2530H0413r841j11395J18947l675r4251L8851O6889M4119j4734L1917r3628q6523
2518c2911J16852o8120r184J78444j57019j5102o0941o975K2868M4490p6585k4152
2506h8335J35675j08992J79136k9325j449q6792m9913J79744p4062j3622M1924
2495H3989r3220o7727J0682R8906o1746M7636P1727K3540o4178j04560J04430
2484D9479p5205o2628J03118K8000n7496J7333j115j00771P5417J14239r8522
2473h151l7204j07477J24291M1351j26013N8708L9139j4487L6244N744N955L8819
$$ y = [13089, -19577, -120071, -98181, -14045, 70920, 106458, 32462, -75124, -19951, 7340, 39852, 9686, -79215, 10526, 13484, -36645, 71537, 77039, 132659, -35466, -36760, 21375, 80413, 70572, -40823, 78124, 74449, -19802, 19049, 85938, 130057, 115323, 147240, 53612, -32911, 83941, 15821, 6637, 185081, 28062, 12960, -47981, -54956, -32088, 12402, -64183, -88335, 47340, -61652, 117484, 88159, 86710, -82, -49995, 129749, 55687, 42065, 83989, -9231, -76958, -66276, 32630, -29116, 18520, 90247, 113787, 49609, -54951, 49479, -25726, -88354, 14764, 42764, -14732, 2601, 1486, -99285, -23868, 90371, -8151, -45355, -152832, -28541, 12810, -113203, -54495, -15356, -29843, 6401, 12145, 18100, 56919]
2461E6919j04054K7907o8342p2906J11323J18657j7389j54333M1165M308R1131
2450C4386L1251O6200k09643L664J18705o4946m2144M2076K8688R328O3374n5126
2438B5813P3234r1256k2546l163O648M0162M1573o2492j353O9967m9574k242N4113
2425G8884R15q847J3058j36895K8365P1672p330M4901J9935R484r3008P2298N9299
2412A52731o1313j8781L9110q8527j08947O1802Q9002k8337J3855k9466J2858
2401C3987m788N6570l5263j2555m2717j6256p9798K8082J3547J14274m3622j26261
2389a14800N5707P8487K0308j8535P3474p9525q5729Q6971Q4849j10843o8181
2378g7817N9709L1281N9366K0139j14141J51624K5851j89002O5110P919k7415
$$ y = [56919, -47135, -19228, -87570, -160476, -49153, 69504, 52115, -102218, -61053, -56745, 34386, 65637, 131837, -77806, -74142, 44563, -20383, -62527, -20451, 8237, 17565, 80939, 25813, 99047, 7791, -14755, -17918, -11270, 28892, 70465, 7973, 6620, 76587, 27013, 24771, 78884, 79799, 70952, 84010, -52885, -24520, 47152, 39822, 84723, 104658, 114142, 21134, 93432, 152731, 91418, 72637, 111747, 23220, -85727, -23925, 65077, 36740, 50595, 21129, 33987, 29199, 85769, 50506, 37951, -4766, -21022, -100820, -72738, -59191, 55083, 11461, -114800, -59093, 19394, 39702, 21167, 94641, 15116, -70613, 16358, 101207, -9636, -77817, -18108, 13173, 72539, 92678, -21463, 130161, 156012, -32990, 32120, 40039, 12624]
2367A2624O790k3133O3603j29298K6115J08766k7014J35750j06716J3002m5440
2356C5049m6120O9650j14821K1415N6178j61400L684K6699m4093M8166R5792l1740
2344d1541O2159M6800r8060K9036L7379L1499j26884o0802J05484p4636l4850
2333a24416N6539P8835p2812j116O7055o6973p601N6967N3041K9925K9243N262
2321A03949m2340l3960p8881j7288Q5167j02287P6535R737j32180J45241J30042
2310A43735j47454R2326K0038o6441l4262J7568k5495l7593m2888L024R2708k7083
2298a1817q3683J66352J2058o5844p4095N1704Q6788k5045r981o0390Q2871m0529
2286B8389R648K8657j08488m1594J43373p2485n4705R7867m892k9329r8753N6564
$$ y = [12624, 19414, -3719, 59884, -69414, -43299, 65467, 38453, 174203, 67487, 80489, 35049, -11071, 58579, -56242, -34827, 21351, -140049, -136365, -109666, -153759, -105593, -9801, -41541, 20618, 67418, -30642, -1606, 35773, 67272, -59612, -120414, -14930, -89566, -124416, -67877, 10958, -61854, -62970, 4085, -62888, -70489, -13522, 39519, 69444, 98687, 103949, 61609, 27649, -51232, -68520, 16647, -85640, -9105, 632, -131548, 13693, 143735, -3719, 88607, 108645, 42204, 7942, 25510, 15, -37578, -80466, -77442, 15266, -11817, -95500, 70852, 82910, 17066, -57029, -5325, 81463, 56418, 46437, -13953, 68918, 28389, 38037, 66694, -41794, -83388, 59985, -12500, -67205, 30662, 25770, -3559, -102312, -45748]
2274d5748J33731q7289l0000j4595O3508j7736o8039L1198n8677P8852J12072
2263I7277j89512j4383J09057J5121p4460o7129P0220R93J00666l9859j09388
2252a01397Q079K6888N7333j5722M8095P4357j91511l6243l579P4901M085L9281
2240a5433j33343Q3858K5392J01908q7473L4098J02053m5588L0579q7848m313
2229C890J44592n7975l8055j0086o8013l2697J42303Q3355j35574j13861J14208
2218C2087m7301Q4182m1810l8329k4654o3751L3244N7107p542J4584L0932L2696
2206F1445j01863J4410M3890j01788J14194l8224J53290j48965Q8166J8810r955
2195I3410p4566K8891O4675o2314J01685L1540j24698K6009m9577L4960J07692
$$ y = [-45748, 87983, 694, -29306, -43901, 19607, 1871, -66168, -34970, -93647, -14795, 97277, -92235, -106618, 2439, 17560, -56900, -124029, -53809, -52816, 47850, 7991, -101397, -93318, -66430, -9097, -24819, 23276, 97633, -93878, -130121, -133700, -58799, -54714, -15433, -148776, -64918, -39526, 62382, -25091, 9007, 111060, 65472, 96051, 8203, 3890, 148482, 90507, 52452, 42366, -25647, -58344, 83959, 167314, 31740, -82121, 32087, -15214, 68968, 27158, -11171, -35825, -99576, -66332, -9225, -16767, -2183, 28749, 61445, -40418, -26008, 17882, -83906, 30288, -7936, 145354, -3611, 84555, 103365, 93410, 18844, 47735, 112410, 50096, 151781, 183321, 58623, 84632, 35055, 70015, 177707]
2184A77707p1302j24516L744m5447R0353K9064o307m7065k7381o6642p1543J52682
2172f653L569l8073L5125j10828R2430j20356R6861L2428m6244J24920k053p9419
2160a8293N3468r2441j07346K29992q0001o9560L4534L5798M5573J6912n1649
2149c013j9455K5310m2458J44895L0765q0946m5641J6245n1243K1864N3137O5376
2137A14836r6755K9274j15200j15539j9093P2957J73771J9482j8448K1832j14682
2126d7565m1424L4993P1626j76592N3923J55510m0490R7808j44220m0192N6447
2115b0176r3375O6696R5428j72005J9898p0700p56O831L1504k5493M0810J06461
2103a4877P5997L9158j6767q4514o3256M8856J7381l645l2391J31761l2905p4773
$$ y = [177707, 106405, -18111, -14367, -59814, 30539, 59603, 53296, 6231, -21150, -87792, -159335, -6653, -3084, -41157, -6032, -116860, -24430, -144786, -47925, -15497, -61741, 63179, 61126, -18293, 35175, -57266, -164612, 65380, -14621, -84181, -49647, -13849, 31724, 48636, -3013, -22468, 2842, -39616, 105279, 136044, 55098, 9457, 25702, -25541, -3677, 49460, 114836, 18081, 47355, -67845, -183384, -202477, -129520, 44251, 63733, 45285, 67117, -47565, -88989, -53996, 17630, -158962, -105039, 50471, 9981, 107789, -36431, -76623, -20176, -113551, -46855, 48573, -123432, -103534, -174234, -174990, -168159, -136655, -162148, -121338, -14877, 61120, 100278, 83511, -1003, -64259, -15403, 1978, -1667, -34058, 97703, 64798, -9975]
2091i975J0390m437m2562M9757N4380o6247k5310N7395p9542L0852J57144m6118
2079H5727m9442l1059L0861o6979M8968r457M2583l3924J7012l9406N9293m0609
2067A3568k3594N6921n070j75749N9025J32064n4178p9214J08705k4995o2389
2056e4906R0260j0465m5935o4505R1091p6816n394N2101O0584j9333m2417Q3124
2044E7389J9062o4868L6271P6369j2543j5047M744M7394n8842n5474l7782N6523
$$ y = [-9975, 415, -4022, -46584, 3173, 57553, -8694, -34004, 23391, -56151, -25299, 131845, 85727, 36285, 5226, 36087, -30892, 18076, 8619, 51202, 17278, 34290, -5116, 54177, 13568, -10026, 46895, 41825, -133924, -74899, 57165, 2987, -76227, 32478, 7483, -54906, 35354, 24889, -21046, -85551, 5540, -71276, -76670, -24569, 36015, 16682, -25735, 57389, 76451, 11583, 47854, 124223, 111680, 96633, 101377, 148771, 89929, 34455, -3327, 53196]
$$ [...]
##END NTUPLES=NMR SPECTRUM
##END=
