##TITLE=1H_EC-3328(2)
 CDCl3
 8 sc, 
 8.5.2024
##JCAMPDX= 6.0         $$ Bruker NMR JCAMP-DX V2.0
##DATA TYPE= NMR SPECTRUM
##DATA CLASS= NTUPLES
##ORIGIN= UXNMR, Bruker Analytische Messtechnik GmbH
##OWNER= root
$$ XWIN-NMR		Version 3.5
$$ Wed May  8 13:49:27 2024 Russian Standard Time (UT+4h)  she@DPX200
##.OBSERVE FREQUENCY= 200.1309
##.OBSERVE NUCLEUS= ^1H
##.ACQUISITION MODE= SIMULTANEOUS
##.ACQUISITION SCHEME= undefined
##.AVERAGES= 8
##.DIGITISER RES= 18
##SPECTROMETER/DATA SYSTEM= spect
##.PULSE SEQUENCE= zg30
##.SOLVENT NAME= CDCl3
##.SHIFT REFERENCE= (INTERNAL, CDCl3, 0, 16.4741)
##AUDIT TRAIL= $$ (NUMBER, WHEN, WHO, WHERE, WHAT)
$$ ##TITLE= Audit trail, XWIN-NMR		Version 3.5
$$ ##JCAMPDX= 5.01
$$ ##ORIGIN= Bruker BioSpin GmbH
$$ ##OWNER= she
$$ F:/spectra/data/she/nmr/H-F/1/pdata/1/auditp.txt
$$ ##AUDIT TRAIL=  $$ (NUMBER, WHEN, WHO, WHERE, WHAT)
(   1,<2024-05-08 13:48:10.96 +0400>,<she>,<DPX200>,
      <created by zg, POWCHK disabled, PULCHK disabled
       configuration hash MD5:
       00 E9 B6 7A A2 85 ED C7 34 08 36 98 17 FE 4E 26
       data hash MD5: 16K
       07 A6 EA 9C 15 47 E1 17 89 3E 05 1A 0C 26 AC 34>)
(   2,<2024-05-08 13:48:18.70 +0400>,<she>,<DPX200>,
      <Start of raw data processing
       efp BC_mod = 2 LB = 0.24 FT_mod = 6 PKNL = 1 PHC0 = -25297.75 PHC1 = 6.387491 SI = 16K 
       data hash MD5: 16K
       8C 2D 94 68 DC FC 77 70 A4 4D 63 96 4B 34 39 9D>)
(   3,<2024-05-08 13:48:37.48 +0400>,<she>,<DPX200>,
      <pk PHC0 = 0.331845 PHC1 = 4 
       data hash MD5: 16K
       E3 5B 22 CE 3F 93 BC 77 B7 BD ED C9 E8 CC A1 B3>)
(   4,<2024-05-08 13:48:43.17 +0400>,<she>,<DPX200>,
      <abs ABSG = 5 
       data hash MD5: 16K
       2F 47 7F 1B F7 5F FE 56 B0 28 DB 51 D5 82 53 9B>)
$$ ##END=
$$ 
$$ hash MD5
$$ 4A 2B 3E 28 A6 5E A4 0B 25 B3 E9 DF 4A 3D 84 BB
##$RELAX= 
##$RELAX= 
##$RELAX= 
##$RELAX= 
##$RELAX= 
##$RELAX= 
$$ Bruker specific parameters
$$ --------------------------
##$DU= <F:/spectra>
##$EXPNO= 1
##$NAME= <H-F>
##$PROCNO= 1
##$TYPE= <nmr>
##$USER= <she>
##$AMP= (0..31)
100 100 100 100 100 100 100 100 100 100 100 100 100 100 100 100 100 100 
100 100 100 100 100 100 100 100 100 100 100 100 100 100 
##$AQSEQ= 0
##$AQ_mod= 1
##$AUNM= <au_zg>
##$AUTOPOS= <>
##$BF1= 200.13
##$BF2= 200.13
##$BF3= 200.13
##$BF4= 200.13
##$BF5= 200.13
##$BF6= 200.13
##$BF7= 200.13
##$BF8= 200.13
##$BYTORDA= 1
##$CFDGTYP= 0
##$CFRGTYP= 5
##$CHEMSTR= <none>
##$CNST= (0..31)
1 1 145 1 1 1 1 1 1 1 1 1 1 1 1 1 1 1 1 1 1 1 1 1 1 1 1 1 1 1 1 1 
##$CPDPRG= <>
##$CPDPRG1= <>
##$CPDPRG2= <>
##$CPDPRG3= <>
##$CPDPRG4= <mlev>
##$CPDPRG5= <mlev>
##$CPDPRG6= <mlev>
##$CPDPRG7= <mlev>
##$CPDPRG8= <mlev>
##$CPDPRGB= <>
##$CPDPRGT= <>
##$D= (0..31)
0 1.2 0 0 0 0 0 0 0 0.06 0 0.03 0 0 0 0 0.0002 0 0 0 0 0 0 0 0 0 0 0 0 
0 0 0 
##$DATE= 1715161690
##$DBL= (0..7)
120 120 120 120 120 120 120 120 
##$DBP= (0..7)
150 150 150 150 150 150 150 150 
##$DBP07= 0
##$DBPNAM0= <>
##$DBPNAM1= <>
##$DBPNAM2= <>
##$DBPNAM3= <>
##$DBPNAM4= <>
##$DBPNAM5= <>
$$ [...]
##$SUBNAM3= <"">
##$SUBNAM4= <"">
##$SUBNAM5= <"">
##$SUBNAM6= <"">
##$SUBNAM7= <"">
##$SUBNAM8= <"">
##$SUBNAM9= <"">
##$SW= 18.0517689322627
##$SWIBOX= (0..15)
0 0 2 0 0 0 0 0 0 0 0 0 0 0 0 0 
##$SW_h= 3612.71676300578
##$TD= 16384
##$TD0= 1
##$TE= 0
##$TE2= 300
##$TE3= 300
##$TEG= 300
##$TL= (0..7)
0 120 120 120 120 120 120 120 
##$TP= (0..7)
150 150 150 150 150 150 150 150 
##$TP07= 0
##$TPNAME0= <>
##$TPNAME1= <>
##$TPNAME2= <>
##$TPNAME3= <>
##$TPNAME4= <>
##$TPNAME5= <>
##$TPNAME6= <>
##$TPNAME7= <>
##$TPOAL= (0..7)
0.5 0.5 0.5 0.5 0.5 0.5 0.5 0.5 
##$TPOFFS= (0..7)
0 0 0 0 0 0 0 0 
##$TUNHIN= 0
##$TUNHOUT= 0
##$TUNXOUT= 0
##$USERA1= <user>
##$USERA2= <user>
##$USERA3= <user>
##$USERA4= <user>
##$USERA5= <user>
##$V9= 5
##$VALIST= <valist>
##$VCLIST= <CCCCCCCCCCCCCCC>
##$VD= 0
##$VDLIST= <DDDDDDDDDDDDDDD>
##$VPLIST= <PPPPPPPPPPPPPPP>
##$VTLIST= <TTTTTTTTTTTTTTT>
##$WBST= 1024
##$WBSW= 4
##$XGAIN= (0..3)
0 0 0 0 
##$XL= 0
##$YL= 0
##$YMAX_a= 235077
##$YMIN_a= -301278
##$ZGOPTNS= <>
##$ZL1= 120
##$ZL2= 120
##$ZL3= 120
##$ZL4= 120
##$ABSF1= 16.49616
##$ABSF2= -1.555744
##$ABSG= 5
##$ABSL= 3
##$ALPHA= 0
##$AQORDER= 0
##$ASSFAC= 0
##$ASSFACI= 0
##$ASSFACX= 0
##$ASSWID= 0
##$AUNMP= <proc_1d>
##$AZFE= 0.1
##$AZFW= 0.1
##$BCFW= 0
##$BC_mod= 2
##$BYTORDP= 0
##$COROFFS= 0
##$CY= -3
##$DATMOD= 1
##$DC= 0
##$DFILT= <>
##$DTYPP= 0
##$F1P= 0
##$F2P= 0
##$FCOR= 1
##$FTSIZE= 16384
##$FT_mod= 6
##$GAMMA= 0
##$GB= 0
##$INTBC= 1
##$INTSCL= 3.70164e-10
##$ISEN= 128
##$LB= 0.24
##$LEV0= 0
##$LPBIN= 0
##$MAXI= 10000
##$MC2= 0
##$MEAN= 0
##$ME_mod= 0
##$MI= 1.114404
##$NCOEF= 0
##$NC_proc= -8
##$NLEV= 6
##$NOISF1= 3.799351
##$NOISF2= 2.8
##$NSP= 0
##$NTH_PI= 0
##$NZP= 0
##$OFFSET= 16.47412
##$PC= 1
##$PHC0= -25297.42
##$PHC1= 10.38749
##$PH_mod= 1
##$PKNL= yes
##$PPARMOD= 0
##$PSCAL= 0
##$PSIGN= 0
##$REVERSE= no
##$SF= 200.12940940229
##$SI= 16384
##$SIGF1= 3
##$SIGF2= 2
##$SINO= 5.538805
##$SIOLD= 16384
##$SREGLST= <1H.CDCl3>
##$SSB= 0
##$STSI= 16384
##$STSR= 0
##$SW_p= 3612.71676300577
##$SYMM= 0
##$S_DEV= 0
##$TDeff= 16384
##$TDoff= 0
##$TI= <>
##$TILT= no
##$TM1= 0
##$TM2= 0
##$TOPLEV= 0
##$USERP1= <user>
##$USERP2= <user>
##$USERP3= <user>
##$USERP4= <user>
##$USERP5= <user>
##$WDW= 1
##$XDIM= 16384
##$YMAX_p= 533107413
##$YMIN_p= -1321255
$$ End of Bruker specific parameters
$$ ---------------------------------
##NTUPLES= NMR SPECTRUM
##VAR_NAME=  FREQUENCY,     SPECTRUM/REAL,   SPECTRUM/IMAG
##SYMBOL=    X,             R,               I
##VAR_TYPE=  INDEPENDENT,   DEPENDENT,       DEPENDENT
##VAR_FORM=  AFFN,          ASDF,            ASDF
##VAR_DIM=   16384,         16384,           16384
##UNITS=     HZ,            ARBITRARY UNITS, ARBITRARY UNITS
##FACTOR=    0.220516191357247, 1,           1
##FIRST=     3296.95574319744, 0,            0
##LAST=      -315.76101980833, 0,            0
##MIN=       -315.76101980833, -1321255,     0
##MAX=       3296.95574319744, 533107413,    0
$$ Real data points
##PAGE= N=1
##DATA TABLE= (X++(R..R)), XYDATA
$$ [...]
8239 68581339 70073064 72141709 74444158 75990210 79109271 81751340 83976337 86934933
8231 86934933 90260990 94174880 98018342 101928912 106416094 110736571 115250916 120603361
8223 120603361 125169667 130600706 135722928 140778998 146270195 152375624 159149255 166698511
8215 166698511 175133553 184230574 195311896 206961340 219980200 234866755 252199923
8208 252199923 272332898 293804343 314553712 336378053 357175408 374239441 383422085
8201 383422085 387557812 390390711 392933215 387230193 375499978 365222321 359615367 357301272
8193 357301272 359891900 369267070 370914686 380522485 395708796 411801726 428776048 443117581
8185 443117581 453238682 459183846 462743561 459024654 447897982 432578548 415994381
8178 415994381 400189181 382849463 362761653 343604793 328418811 315185883 303462681
8171 303462681 294193573 285644072 278079764 271681782 266786387 262499265 259633430 257636350
8163 257636350 256665340 256383502 256130917 252790188 246644336 240656301 235033292 227327107
8155 227327107 216333937 203875764 193326793 184057605 176463033 169109595 162241621 156554837
8147 156554837 152056335 148213722 144675656 141689669 138335238 135639515 133566440 131117995
8139 131117995 128314866 125174282 122255553 119443020 116217596 113218089 110684132 107510033
8131 107510033 104369417 101717122 99520833 96955040 94340693 91825874 89343246 86932199
8123 86932199 85417169 83698370 82051710 80780130 79775448 78529694 78091931 77484907
8115 77484907 76858102 76559927 76579587 76830633 76949021 77703628 79467720 80291698 80183831
8106 80183831 80348123 79288178 79042688 78702091 78767864 78084088 77590043 76076990 74776772
8097 74776772 74005239 72835176 71314565 69308289 67000768 65015030 64205107 63417647 62882095
8088 62882095 62787407 61573739 60728357 59717670 58638655 58818940 59151459 58620721 58327234
8079 58327234 58574623 59074077 58748221 58868726 59097416 59529466 59899782 60419817 60910418
8070 60910418 61321176 61526690 62089720 62683930 62945974 63176931 63677380 64197536 64532771
8061 64532771 64406909 65159921 65279704 65403629 65961565 66513728 67721043 68899910 70658347
8052 70658347 71872006 73079520 74621477 76283933 78396335 80600943 83011898 85082125
8044 85082125 87566508 90232521 92750366 94785376 96463828 98343585 100746637 103213617
8036 103213617 106629953 110675940 114651042 118638003 123601034 128834823 134926469 140418063
8028 140418063 145260772 151390035 159534290 168761226 176693026 184095824 192353013 201089184
8020 201089184 210189526 217434406 223902188 231986403 240851001 250866100 264977984 283153548
8012 283153548 305874476 335968599 376415373 411368203 398648123 368604031 348558278
8005 348558278 331539792 312405661 290604540 269468104 251913164 238898703 226853070
7998 226853070 216135386 207684655 201817009 197867643 196436546 195804375 196590265 198115063
7990 198115063 200753388 203169494 204679250 205040250 205824010 208107862 207918094 205937458
7982 205937458 201984518 196241414 189896431 183725765 179034709 175535097 173477341 173145480
7974 173145480 173698395 175353134 176999957 178400759 179546699 179559420 177163677 171970503
7966 171970503 166741666 162625774 158872065 155017524 149826689 145047186 142012642 139334399
7958 139334399 136844533 133781785 132331273 131906534 132290342 131408990 130654823 128364966 126971289
7949 126971289 126192385 125584450 123488713 120007001 116472960 112484598 107935351 103261608
7941 103261608 98662706 94732105 91121116 88199165 85378261 82359588 79401678 76402197
7933 76402197 74196838 71416052 69193576 67086817 65026849 63574619 61975365 60297486
7925 60297486 59639427 58068273 56893029 55761961 55016422 54265495 53901287 53246686 52541342
7916 52541342 51694919 51035749 51105030 50607994 50627895 50329811 49242538 47675571 46523890
7907 46523890 45841408 45474047 44992504 44145957 43499875 42474723 42272106 41850440 40973097
7898 40973097 40515175 40539934 40209334 40072835 40551913 40607462 40780645 40973232 40812086 41160207
7888 41160207 42150205 42625291 43228809 42737184 42147923 41582285 41082152 40670586 40828054
7879 40828054 39921510 38676711 37297000 35949415 35109708 34269010 33422215 32542279 32356968
7870 32356968 31890839 31642441 31986368 32046054 32357137 32170050 31724868 31392281 31927161 32103795
7860 32103795 32192997 32277231 32859648 33676516 34565261 35376756 36297062 37987335 38647422 38344948
7850 38344948 37520064 36799768 35828859 34965757 34485911 35144832 35480011 34590602 33476042
7841 33476042 32044899 29809240 28917357 27941166 26539556 25863481 24945827 24288094 23523820
7832 23523820 23731868 23545513 23657972 23562781 23335354 23204909 22914864 23464509 23058016 24088737
7822 24088737 25019156 25268844 25434336 25556739 25544196 25255385 25057651 24498583 24127167 24075691
7812 24075691 24221641 23663560 22779089 21585720 20196747 19437532 18791930 18036731 17205781
7803 17205781 16552933 16230962 15587508 14935152 14824917 14362154 14014682 14329584 14273955 14192419
7793 14192419 14466733 14878122 15158199 15164771 15525811 15738125 15275511 14968918 15271736 15009188
7783 15009188 14928408 14507945 13984033 13576629 12879622 12642161 12376175 12328969 12142219 11685514
7773 11685514 11459642 11828435 10917511 11094732 11567465 10932774 10554612 10859684 10704401
7764 10704401 10667933 10947524 10657158 10708218 11020460 11419017 11631325 12058342 11378824 10696855
7754 10696855 11028715 11267006 11543866 11189555 10877189 11400690 11573284 12158991 11904633
7745 11904633 11613081 11460795 11597587 11604790 11067876 10760918 11160332 11315613 11961373 11646010
7735 11646010 11361000 10885505 10410939 10024823 10176546 9443381 8816371 8616250 8525700 8218642
7725 8218642 8673441 9200491 8987663 8801627 8044997 8739956 8504603 8234860 7946608 8718827
7715 8718827 9338646 8959901 8868768 9006203 8821346 8846605 8825869 8625514 8955332 8920256
7705 8920256 9478244 9289645 8817194 9075341 8948360 9186762 8999867 8730947 8399783 7879892
7695 7879892 8170827 8207109 7291408 7015152 7425974 7691442 7733596 7069696 6705876 7042215
7685 7042215 6822696 7043043 7289784 6982880 6891533 6905698 6748711 6556637 5985102 6417709
7675 6417709 5909922 5357573 5469082 5777186 5502539 4992249 4769635 4789632 5174666 4777739
7665 4777739 4452225 4563464 4604207 4750605 5042932 4318743 4657590 4688193 4588700 4769385
7655 4769385 4572388 4374110 4827654 4669242 4474065 5104784 5216742 5353984 5575609 5257911
7645 5257911 4992188 4761488 5127374 5118713 4606971 5045972 5217435 5155161 5113563 5341777
7635 5341777 5104781 4983240 4696028 4765133 4616598 4918281 4914068 5129974 5020557 4845134
7625 4845134 4718824 4601195 4659207 4728403 4917211 5357238 4380007 4936757 4802376 5337203
7615 5337203 5478470 5093848 5169748 5212843 5327930 5333915 5546323 5682641 5410607 5227690
7605 5227690 5497998 5596506 5470477 5380281 5489813 5421229 5232355 4861782 5122759 5116406
7595 5116406 4771026 4553297 4551806 4730481 5222480 4838396 5251397 5070046 4894822 4691833
7585 4691833 4440349 4278142 4693914 4501556 4453507 4555013 4557691 4553494 4289975 4039384
7575 4039384 4324133 4951838 4859631 4243881 4041894 4597093 4678792 3651603 3691356 4452323
7565 4452323 4390552 3956199 4357864 4343940 4317273 4145691 4114422 3702187 4095155 4242191
7555 4242191 4152186 4201291 4695262 4796994 4656117 4787773 4955571 4871866 4887847 4794301
7545 4794301 4617954 4778692 4780445 4629367 4700275 4465469 4870132 5271960 5375712 5107462
7535 5107462 5642357 5860765 6315883 6669824 6383455 6347195 6533800 6301709 6226541 6531510
7525 6531510 6201493 6732423 7282475 7234480 8038230 8470369 8503742 9117361 9441397 10033555
7515 10033555 10066139 9783010 9764824 9041212 8447490 8364962 8658858 8690344 8456779 9058000
7505 9058000 8753759 9416538 9830371 10176037 10066067 10692201 11121368 11644456 12227659 12364664
7495 12364664 12327623 12760345 13011254 13109406 12646308 12036011 12072937 12238530 12204329 12085923
7485 12085923 12280761 12349836 12657847 12473592 11954026 11412303 10836460 10602476 10226553 9654874
7475 9654874 8692081 8352014 8198785 7917306 8269079 8202642 7994457 8086479 7960608 8773448
7465 8773448 9109271 9539438 10769794 10921107 10887222 11879129 11591738 11466474 11709787 11701465
7455 11701465 11707615 11565895 11466569 11579399 10656596 10457167 9594624 8949628 8953046 8063930
7445 8063930 7063653 6723103 6134894 5233090 5297952 4591249 4433727 4247452 3746721 3087850
7435 3087850 3145814 3378654 3052289 3059616 3063164 3232933 2644423 2888163 2906619 2858899 3243341
7424 3243341 2941565 3248794 2276337 1976801 2127845 1905810 1566150 1650351 2132787 2021332
7414 2021332 1693571 1542059 1597341 1756063 1622516 1704043 1611300 1676845 2137016 2649097
7404 2649097 2714102 2389388 2033478 1692648 1706998 1628312 1708246 1731232 1703600 1306848 1255016
7393 1255016 1418893 1023249 1320790 1284751 1045115 1974135 1928137 1738442 1933037 1613636
7383 1613636 1739445 667244 1098005 1984252 1993537 1872514 1917534 1832984 1967344 1839455
7373 1839455 1678053 1419921 1867491 1936054 1790144 1449273 1511935 1850019 1974430 1833378
7363 1833378 1555140 2034579 2112111 2128926 1900828 1562363 1691980 1448870 1342242 1343572
7353 1343572 1244249 1129897 1151381 1377070 1176755 875483 1205193 1725338 1712587 1535925
7343 1535925 1246546 717334 310849 197895 401593 631756 675679 913273 902990 1288763
7333 1288763 1724395 1379673 1314161 1437638 1122912 794653 334360 639807 596906 315213
7323 315213 655213 539746 224830 210271 633256 666531 566930 363349 642716 774597
7313 774597 55109 64706 15815 185488 39500 505440 71305 151769 -216803 113651
7303 113651 362833 204219 38236 -141547 416857 176243 452667 533452 21240 -12488
7293 -12488 343870 333387 -336976 -305795 -479945 -259935 177816 -303699 -144666 176096
7283 176096 -60779 -210781 -507297 -178804 529149 427112 -225223 -89932 -144520 -59120
7273 -59120 238977 -73258 237708 12599 251257 238309 297689 97874 77072 14564 -5222
7262 -5222 -215570 125383 -249866 -761267 -552689 -289895 -126962 7704 432849 223999
7252 223999 -291557 -812249 -218940 396092 163859 -278605 320791 703089 427385 638473
7242 638473 -292844 -418856 86277 -206069 76152 187344 832 -152119 -372318 -504154
7232 -504154 -152085 269137 -114662 -273820 -262369 -740881 -786202 -134591 -428447 -518127
7222 -518127 -225061 -115417 -130665 -222053 271757 358465 92940 -1803 -67458 260837 185020
7211 185020 -150640 -170208 -202538 -526806 -507587 -339761 -509298 -162930 -35757 -13237
7201 -13237 297254 275670 185801 -1005 -143802 -131044 -462055 -479434 -595572 -669802 -92494
7190 -92494 -33526 -563440 -764088 -591896 -614860 -1068536 -820939 -626224 -85261 166993
7180 166993 143314 157318 374743 118776 -497217 -167260 21722 -378291 -320297 -448323
7170 -448323 -295499 -657195 -478088 -491176 -729372 -457243 -334796 -84001 -401845 -494721
7160 -494721 -897524 -1067328 -63089 -99357 -290234 -65075 -224132 -443833 -687302 -357585
7150 -357585 178590 -151171 -188724 -335370 -306515 149997 670340 324988 -193845 -311036
7140 -311036 -509699 -149009 237197 791677 348778 -464712 -286608 -68916 -305488 -227734
7130 -227734 -91077 -108419 -519523 -22503 518979 524331 -48953 -278304 -450929 -672569
7120 -672569 -748433 -1046316 -1321255 -757328 -727416 -446121 -133909 -66404 -6538 -214849
7110 -214849 -569951 -6865 -156440 289001 -96160 -500552 -257390 -206950 -491999 -456393
7100 -456393 -38190 -290025 -61712 104298 39264 63943 83542 -415679 -497082 -561369 -434104
7089 -434104 -479171 -599048 -131497 -569180 -499999 -723238 -362940 -572586 -215606 -70492
7079 -70492 -531482 183051 -439243 -186929 -364861 -279176 -91681 48315 -189529 -30811
7069 -30811 -253772 -214516 -837199 -768132 -324329 -440151 -554623 -127863 -141091 78119
7059 78119 -138797 3972 142752 -344850 -263072 -331198 -276344 -672787 -488578 -200052
7049 -200052 88518 -38320 -300754 -307187 -322575 -235443 -23934 17679 24623 -249417 -56165
7038 -56165 -68282 -446173 -331196 -133702 -526135 -370989 24109 -35712 69879 308976
7028 308976 45060 384119 62731 -248435 -117156 -180920 -221042 -57926 273737 -170566
7018 -170566 -428715 -406381 -178558 -537070 -291678 -39289 54764 -279879 9562 -178756
7008 -178756 -661383 -149706 -51377 -44522 217014 402479 -332087 -391358 -536627 -604684 -415406
6997 -415406 -487307 -129613 107714 172111 -303703 -543411 -172463 -25534 -302136 1100
6987 1100 -478967 -509705 -222929 -128933 -523849 -49958 -37857 -402981 -122587 20791 219576
6976 219576 570601 317908 -299717 340590 795321 621903 -43357 -117102 192665 246818
6966 246818 -38890 -411260 -287527 -55751 -33953 43991 -13322 -497781 134634 463339
6956 463339 -144359 -201833 -597994 -140451 -99698 -44478 194010 488182 -110412 -448175
6946 -448175 126010 291477 198413 197595 182487 188553 138520 -67579 -568677 -169384 -213446
6935 -213446 -115079 -22666 50554 378007 248183 406739 646292 833719 229717 -156095
6925 -156095 -158090 -113734 -253741 -472226 -659160 -527304 -505429 -384416 -249264 -310342 -269769
6914 -269769 -463198 -353569 -86985 361782 368796 323704 230174 -24792 347865 520497
6904 520497 24091 38370 181786 -320048 -458963 -120873 -301342 -193349 -281763 -555702
6894 -555702 -548035 49041 -107 -246344 -122784 -241521 -444018 205794 582097 89635
6884 89635 -546163 -861410 -529481 -468156 -133582 465336 363264 -163245 93458 293068
6874 293068 867367 785523 242218 220046 -140013 -205540 -120 237240 249086 532390
6864 532390 768936 619966 1075633 767922 1410063 1211090 712586 878111 997723 1236655
6854 1236655 1085646 1246150 1502117 1658051 1960347 2042449 1797907 2423096 2707203 2185206
6844 2185206 2047894 2042597 2072429 1852541 2206358 1650336 1928832 1777240 2122584 2258869
6834 2258869 1991923 2213637 1710098 2095269 2218637 1813722 1551353 1311189 1806215 1643428
6824 1643428 770881 321004 47767 287741 248396 162566 329901 581041 -70568 125419
6814 125419 91959 194013 745361 672441 546135 707073 248114 -27105 -77615 269951
6804 269951 576794 349357 534078 543865 294762 -273694 -139768 -514434 -752580 -84787
6794 -84787 -438282 -551000 -652771 -281378 321285 434782 742835 781485 780905 366631 352037
6783 352037 515471 478645 337286 456560 617197 216792 363525 848322 867623 772021
6773 772021 313299 257501 593010 148607 157517 -250035 -39902 437741 711623 350738
6763 350738 157997 33222 380535 703615 681353 522179 804132 1166780 1430278 1224210
6753 1224210 791372 1113850 864819 778077 407921 914875 1012192 719430 909785 647895
6743 647895 419538 691634 780622 876787 470181 723654 1002353 801213 754273 822905
6733 822905 584094 27806 -162509 239807 32634 -146930 74905 -16504 -243798 -101334
6723 -101334 -414113 -493574 -778513 -755558 -260457 -358078 -225956 -524222 -480152 -279311
6713 -279311 -251108 -154445 35660 266340 98376 -153484 193984 -36503 13413 504900
6703 504900 167144 -43797 434099 287226 206455 347458 305769 493027 714960 69240
6693 69240 -388037 -366252 -247883 -102268 306918 45933 -447790 -43922 -234985 -73423
6683 -73423 2238 -139688 -419759 176152 310657 -13720 814392 339170 -297819 -233757
6673 -233757 -162385 30390 -205900 -84697 -314361 -647249 -537644 -129138 -687909 -801493
6663 -801493 -239235 -683302 -490136 -187926 161328 -348173 62713 151113 28786 19024
6653 19024 175327 -329827 -570518 -401091 -213812 123352 -72706 429022 324775 146732
6643 146732 449833 234909 60516 -492828 -735848 -879511 -515694 -375196 -275994 -333603
6633 -333603 -358676 193872 76369 -268848 -101113 -3677 54976 78028 -674873 -2981
6623 -2981 475297 54901 104425 53493 85522 356269 9054 281117 3518 -172869 41017
6612 41017 -116814 299976 -93023 -156883 -182267 -657733 -176326 -317899 53032 224172
6602 224172 290869 500825 33888 -368860 -89409 -799395 -327241 -115001 -178899 -680609
6592 -680609 -1103824 -976181 -126810 -249713 -684256 -502192 -707213 -281525 -236027 -25124
6582 -25124 121096 88460 174577 163271 -81605 -228545 -198036 -524470 -808717 -373870 -130767
6571 -130767 32063 157151 480915 438875 335154 281495 -312320 -370787 -48662 -180660
6561 -180660 -340202 -16610 -484119 -778700 -440265 -85341 9722 -277294 -128241 -557548
6551 -557548 -545071 3138 555750 283434 -10722 262364 261350 90417 246906 113081
6541 113081 305896 293657 110447 23494 -108522 -124205 103400 218665 266016 453657
6531 453657 552338 374815 310251 178332 -38322 20909 243696 -111521 -331980 -35245
6521 -35245 627826 690220 452364 754119 544536 350552 157260 -96307 135130 171791
6511 171791 353325 354435 395393 -125924 -170803 223294 472597 735501 1012064 220635
6501 220635 -67736 497546 782764 528539 480733 370570 111208 400250 606554 482608
6491 482608 106900 431747 733413 804754 544632 -166324 32184 -144534 -512280 -162846
6481 -162846 -165736 -135475 -74065 312947 360794 452891 592224 346112 -244388 225046 282968
6470 282968 80914 135955 555914 172290 44636 10039 547984 586704 -82956 175064
6460 175064 94128 285294 398062 1224039 1351471 1227369 1032981 1701181 1752721 1230450
6450 1230450 941493 713879 578179 433629 535242 892510 911119 265087 326283 233301
6440 233301 97533 232403 430147 208975 291319 189701 449493 426295 597420 788662
6430 788662 570062 357987 908848 470877 526100 384326 462055 470958 347228 354288 299410
6419 299410 264839 656634 343942 275029 548208 523583 812972 788527 1023621 522405
6409 522405 819476 636654 474343 610875 1108814 1577586 1659071 1331884 702530 679409
6399 679409 749139 156753 70144 707955 830028 767246 619387 634407 615521 537375 666814
6388 666814 537252 527295 494970 416440 382022 -184334 -279265 294503 127527 44134 213526
6377 213526 335596 -11920 -4751 -451307 106607 496340 401666 333847 276735 250848 292238
6366 292238 274939 -120881 -204190 406714 576422 432883 479345 360035 424695 59556
6356 59556 75258 172090 240895 78393 187244 569978 692153 559688 -112262 35332
6346 35332 295722 307994 191912 -50245 270587 349653 409196 220608 815942 985843
6336 985843 872428 1212940 525412 -177379 -19022 129027 10486 320101 107217 -40045
6326 -40045 113050 462990 197125 237622 -10508 -18317 158195 340688 604628 261349
6316 261349 -68096 -172962 263411 423891 846294 959418 941688 461409 451649 408945
6306 408945 -360486 -214597 207474 -190381 206511 344040 616977 817998 931530 1044229
6296 1044229 233543 255267 589383 757164 431754 167202 258958 499420 697741 430217
6286 430217 630310 560379 596113 661023 192323 418832 401955 47673 546641 908567
6276 908567 703054 220644 443445 775455 646547 385469 334047 273486 223760 -79004
6266 -79004 367596 535636 669688 408189 417880 104582 483852 234661 -137325 225432
6256 225432 -34990 290245 478687 464683 210174 285162 68186 252764 130524 90763
6246 90763 297729 742232 108419 266134 -2118 248055 270120 50881 -82509 98588
6236 98588 271782 93480 103695 -205351 229517 727265 421330 -31661 -131784 -55762
6226 -55762 -91273 -272109 -198899 235221 -247703 -329870 157148 199999 514581 147070 -61153
6215 -61153 190830 35901 277597 248851 89415 135188 -121648 -26907 257442 -306994
6205 -306994 -35388 -94266 89349 44856 98112 92597 -551178 -216779 -109810 -81276 -626700
6194 -626700 -461816 -313861 6839 -162586 13140 166242 345308 147921 126277 -137335
6184 -137335 36894 -35244 -341095 -31229 235580 923653 1459767 872761 594513 1122034
6174 1122034 558127 156595 -185821 -61091 124904 388064 357634 -275588 -152181 674647
6164 674647 1141847 647854 196443 -271393 351571 125251 409579 621911 694127 837492
6154 837492 584703 823181 325194 130926 215455 586121 305277 196384 -125290 7379
6144 7379 737481 321387 521059 257190 251188 247728 185695 710945 306158 294549 706955
6133 706955 290770 -196691 123430 792858 499737 228247 503942 289762 234721 283127
6123 283127 427790 240219 -326936 -144973 -489248 -397177 165095 821189 252028 1527
6113 1527 304540 188075 136156 56321 398446 142180 -37428 -322071 295079 383277 324340
6102 324340 880788 603982 524372 389868 608865 1123504 860171 523169 942399 1288263
6092 1288263 1001139 978090 1578561 1838362 1217271 1352358 1649388 1280384 223256 586129
6082 586129 283304 235445 108548 -65936 -123224 497661 622871 216395 86033 84318
6072 84318 110744 22058 183980 -18907 -33911 417293 257478 101403 -151878 -277454
6062 -277454 -2597 45754 -157853 -386438 -474660 87460 -3158 93834 198075 288548 565171
6051 565171 149352 100785 -311082 42470 443795 -150608 -125486 -169043 251352 868176
6041 868176 901271 246257 -97178 -13951 237651 890065 1037624 349787 239489 122275
6031 122275 -215720 -225532 31137 393251 379873 417338 282772 490461 47258 125112 37221
6020 37221 152211 -120654 -396449 239628 717961 83339 195986 322542 302784 -72261
6010 -72261 149486 75072 208350 403482 544640 694468 833189 557933 222593 511565
6000 511565 335302 -119788 197847 350797 152050 393842 843318 669441 332953 62232
5990 62232 640604 1058939 509247 523349 754682 1179865 797435 245429 166616 -96831
5980 -96831 542424 1190914 1167236 578168 362856 202546 404733 280106 250135 554101
5970 554101 194757 236804 17943 -467193 436349 487698 344144 744971 316866 465126
5960 465126 630296 611198 930449 913027 615494 862111 281286 -264584 176383 56191
5950 56191 122894 450725 543945 607272 941154 817672 213707 597391 737761 698098 925547
5939 925547 625604 137296 359628 903459 443863 -25499 357119 133202 40062 -35131
5929 -35131 611547 -12234 555368 829265 473168 368386 250423 626318 219853 293120
5919 293120 453521 134365 338416 592024 667255 492001 543115 319330 104296 246458
5909 246458 370764 111891 308653 10499 496785 566379 154140 -2309 648389 985972
5899 985972 522294 265869 -12995 202788 211464 149710 580807 810122 347411 240529
5889 240529 468224 569407 1038807 664201 125520 112969 506660 474579 167276 680705
5879 680705 431446 552322 378166 342297 634630 890822 591608 1162026 1362156 814996
5869 814996 777010 431086 263104 635356 1053981 835638 743996 782659 895886 1168113
5859 1168113 1339806 1024080 873589 1296847 1159482 1320768 1295992 1362529 1192920 820586
5849 820586 736641 1110805 983713 1208270 1352964 854672 1121195 1147118 1184994 1672007
5839 1672007 1353511 1544085 1744013 1447634 1211264 1494915 1676270 1733744 1529170 1288555
5829 1288555 1560281 1629714 1748260 2048675 2333098 2128322 1778813 1492282 1617990 1792696
5819 1792696 1739614 2235612 2309469 2229186 2004834 1763012 2030155 2045646 1720364 1580935
5809 1580935 1638555 1794354 1744745 1145536 1238145 1970975 1808038 2136765 2222422 2012963
5799 2012963 2100459 2126923 1723855 2026783 2235237 1795395 1546834 1651168 1941344 1810349
5789 1810349 1876251 2094217 2429203 2337888 2394761 2389124 2576195 2134347 1742514 1433800
5779 1433800 1418147 1672326 2068400 2160079 2404706 2659249 2402144 2593147 2287689 1925442
5769 1925442 1948312 2373188 2526890 2485414 1927549 1491178 1761058 1575557 1703572 2233053
5759 2233053 2237660 2450873 2188675 2645363 3265574 2914922 2331075 1759814 1990620 1913906
5749 1913906 2099898 2263079 2495693 2538559 2473595 2715024 2800282 2895854 3071622 2755832
5739 2755832 2098488 2290783 2364419 2169848 2238506 2333454 2597964 2858010 2560958 2889839
5729 2889839 3424206 3174730 2962128 2781279 2797314 2724116 3121729 3138902 3107745 3191428
5719 3191428 3305608 2901307 2735431 2382445 2595373 2918259 3234359 3610497 3803742 3325476
5709 3325476 3083629 3056951 3194904 2845885 2755655 3058354 2869510 2905576 3196573 3690592
5699 3690592 3928412 3677037 3513656 3717429 3952814 3569074 3494133 3409684 3235861 3544782
5689 3544782 4092924 3917476 3548768 3894643 4037178 4132064 3677968 3963402 4001008 3821184
5679 3821184 4398821 4512017 4137607 4365208 4206871 4336727 4460739 4477528 4459664 4862640
5669 4862640 4462236 4255670 4774655 4820908 4279488 4060532 4242856 4346902 4444213 4270874
5659 4270874 4409271 4658281 4885024 4739158 5107690 4835296 4874144 4674092 4508134 4732216
5649 4732216 4688630 5265230 4577973 4524264 4706946 5160491 5001476 4758523 4685731 4831621
5639 4831621 5238869 5755934 5140906 5242091 5154994 4977753 5370007 5184076 5304741 5404926
5629 5404926 5739904 6032704 6096375 6190644 6317356 6363528 6485752 6834849 6992947 7061662
5619 7061662 7161406 7296044 7364847 7469738 7492828 7272709 7501489 7799616 8074488 8728024
5609 8728024 8563910 8755743 8595258 8290723 9050626 8996744 9412119 9836336 9988421 10335076
5599 10335076 10151700 10597806 10390744 10955514 11663752 11813102 12030376 12308035 12690398
5590 12690398 12898989 12672324 13103510 13840100 13914814 14374736 14421890 14471788 14314026 15533884
5580 15533884 15659591 15626736 16118067 16794267 17126297 17617404 18217851 18435391 18661380 19163704
5570 19163704 19408086 20310660 20499018 20753087 21498809 22801680 23057802 23887943 24803678
5561 24803678 25217062 26123865 26937374 28205709 28973335 29909255 31407255 32602072 33890594
5552 33890594 35331155 36308320 37629991 39066797 40903737 42807367 44510084 46519721
5544 46519721 48980194 51942649 54957847 57838550 61006201 65392128 69647545 74815145
5536 74815145 80035322 85212600 89845260 93074764 96550049 98660160 99460624 98459581
5528 98459581 96653249 95164307 94091502 92763666 91213721 90498643 89680526 89356129 89784706
5519 89784706 90999796 92955193 95718888 99282451 103446341 108362388 114036650 120535639
5511 120535639 127615002 135924110 145189125 154416970 162514063 169194287 174726584 178020906
5503 178020906 179030567 176071297 168760739 160681760 152708880 144667019 135339883 127696094
5495 127696094 121123901 115569847 110948191 107270882 105004248 103635591 103345470 104043872
5487 104043872 105200111 106465454 108493946 111301025 114769600 118433414 122587941 126319935
5479 126319935 128763385 131223948 133462672 133817076 131477912 127171292 121927072 115950470
5471 115950470 109025219 103408659 97669998 93240446 89080865 86048779 83540747 80987487
5463 80987487 79423382 78400659 77860923 77410743 77264283 76464995 75866584 74525612 72792487
5454 72792487 70951877 69171093 67917318 67200874 65906899 64403817 63267191 62166158
5446 62166158 60643163 59966362 59907873 59392966 58934039 58814396 59050067 59347100 60214109
5437 60214109 61284141 62512366 63460820 65189859 66735257 67523221 67639060 66047248 63300916
5428 63300916 60508750 57033968 53900139 51358556 49669954 47631704 46064422 44260768
5420 44260768 43544900 42450301 41507767 40928188 40515034 40268496 39540266 39220962 39129567
5411 39129567 39527507 39335348 39908988 39915342 40289601 40477247 40262928 39515180 38091593 36197579
5401 36197579 35538120 33182680 31579246 29663353 28324810 27234016 25809661 25108227
5393 25108227 24562962 24047628 23312041 22574732 22061898 21562283 21364834 20827230 20623972
5384 20623972 19636314 19201944 18785355 18740667 18316207 18531518 18242005 17354632 16860846 15987363
5374 15987363 15589062 15302844 15456306 15121851 14675873 14029590 13412709 13573615 13113725
5365 13113725 13227515 13127131 12290082 11997510 12236325 12721210 12546222 12508112 12098116 11477198
5355 11477198 11334104 11223309 10828845 11060885 10744999 10581908 10154150 9466391 9325195
5346 9325195 9548582 9286590 9335394 9196006 8813086 8248120 8193037 7994214 8062334 7949082
5336 7949082 8193082 8161819 8086899 7986797 7669990 7670058 7822253 7777587 8188307 8463038 8159857
5325 8159857 8123037 8030140 7314039 7484352 7587120 7193284 7229013 7438895 7397069 6824574
5315 6824574 6641766 6639787 6792167 6973299 6964268 6996326 6962593 7135786 7392484 7111444 6729674
5304 6729674 6609269 6564884 7202581 7074740 6945071 7086160 7156626 6935875 6748617 6953484
5294 6953484 6945109 7057038 6711491 6625320 6722383 6938826 6384430 6453212 7056693 7476973
5284 7476973 8083721 8036147 8323997 8491845 8036619 8333165 8840466 8273151 8730364 8705096
5274 8705096 9375603 10084287 9801032 9780133 9356972 9595810 10276997 10491530 10877167 10782334
5264 10782334 10777145 10996180 10986153 11281178 11957565 12712011 13260909 13723661 13620520 14406021
5254 14406021 15154552 15957196 16708011 18026750 18996240 19456428 19678569 19831700 19191528
5245 19191528 17706979 17574086 16392185 14683473 14298790 14391372 14335904 13940470 13659671
5236 13659671 13348347 13143627 12711625 11956029 11567706 11134774 11182204 11044257 10899108 11059503
5226 11059503 10614657 10570429 10622361 10785112 10537264 9919907 9680883 10149300 10519965 10567895
5216 10567895 10490812 10282450 10981164 10810222 10468842 10673258 10669792 10479000 10909193 11259356
5206 11259356 10423544 10496910 10305172 9866910 10053022 9911847 9594794 9512536 9485140 10245642
5196 10245642 10269784 10146273 9925464 8975218 9039957 9371780 9480807 9935649 9916378 9989394
5186 9989394 10070929 10564422 10074310 9886610 10089819 9805516 9801822 9635056 9408571 9422324
5176 9422324 9887903 9618196 9807068 9784653 9231712 9192434 9123304 9257678 9717639 10007961
5166 10007961 9466841 9539376 9910765 9993469 9991194 10513568 10015283 10153205 10111992 10207851
5156 10207851 9939922 10290457 10535401 10562007 10866049 10804705 11340267 11327977 11180627 11087569
5146 11087569 11123283 10974924 10954448 11642418 12285134 11717226 12031536 12441169 12026272 12015862
5136 12015862 12488901 12128072 11995303 12128326 12477138 12504644 12556526 12510805 12870026 13058726
5126 13058726 13213411 13269920 13650880 13875548 13604044 13805799 14034527 13502634 13316161 13255263
5116 13255263 13397581 13061845 13371174 13915855 13798518 13333990 13335972 13699195 13884447 13580075
5106 13580075 13373662 13730329 14238127 14362261 14547142 14569585 15141901 15405613 15891641 16164371
5096 16164371 16298987 17458126 18629749 19251681 20351155 21044942 21466034 22337067 23031253
5087 23031253 23988065 24651120 25426944 26828403 27140124 27417313 27620595 27323237 26626451
5078 26626451 26130323 26358940 26237211 26081530 25617888 25755792 25705223 26056095 26299244 26932016
5068 26932016 27240540 28315000 29477472 30432669 31513104 32859995 34123161 36178878
5060 36178878 38450750 40012667 41321219 42443936 43080790 42435239 41191887 39258576
5052 39258576 37254170 35548074 33426143 32106125 30905984 29830604 29222283 28593337
5044 28593337 27811763 27462806 27222685 27588160 27791077 27684525 27829720 28385073 29471068
5035 29471068 29880537 30823123 31369787 32096890 32726524 32694561 31940924 31508021 30695003 29811612
5025 29811612 28538726 27052977 26343801 25240448 24834006 24139215 24237582 24149638 23724688
5016 23724688 23318949 22818580 22957984 23092544 22458801 22503648 22723903 22983244 23099925 22822858
5006 22822858 23206836 23473844 23305991 23775409 24206549 24084608 24233479 24631912 25244113
4997 25244113 25630914 25709976 26041673 26204950 26564289 27323883 28188454 28491655 29172002 30155049
4987 30155049 30799532 31455747 32219947 33563946 33780244 34317560 35579693 36922656 38033546
4978 38033546 39148308 40526541 41723789 43455262 44768775 45783869 47292890 48619302
4970 48619302 50480897 52028933 54388943 56930908 58984735 61526923 64643724 68453121
4962 68453121 71916894 76294105 81136780 86139715 91861626 96074640 99493835 102957649
4954 102957649 106095706 109389107 112784469 115444058 115734000 113864637 112093368 110202978
4946 110202978 108135312 106162705 104561625 103699298 103662181 103856021 104723479 106577503 109563888
4937 109563888 113451700 118116703 122932111 129236286 136008072 142966846 150471610 155038807
4929 155038807 157555371 160302832 163738808 167838527 172338348 174922082 174328454 170325280
4921 170325280 163262449 155732501 148246111 139819115 131912012 125182663 119788624 115530401
4913 115530401 111793426 109545102 108473423 108027597 108651260 109413785 111026293 112201334
4905 112201334 113874262 115006704 115536066 115153790 115117782 115162977 115081153 114540735 114039829
4896 114039829 113761726 111868772 109035687 105235167 100650425 96174139 92251729 87653216
4888 87653216 83525772 80295184 77488966 74925020 73246529 72298322 71673096 69847060
4880 69847060 68915596 68011930 66236073 65097219 64288518 63382126 63139647 63328434 63262115
4871 63262115 63418166 62563806 61825607 61282396 61025621 60974327 61444158 62085589 62859604 63302774
4861 63302774 64535183 65363761 65540593 66686222 66341645 65570960 64344148 63717320 62592199
4852 62592199 61688831 60568867 59852669 59145923 58831283 58568399 58119366 57740395 58014916
4843 58014916 57948560 57310039 58057683 58876880 59543415 60644880 61865212 62934798 65126066
4834 65126066 67561604 70151111 72562219 73200611 72169216 70297757 68610465 66317632
4826 66317632 64289553 62535727 60726494 58900842 57542282 56950880 56143397 55453700 53959593
4817 53959593 53528490 53100574 53145615 53059248 52552503 52388906 52479685 53514079 54398113 54934162
4807 54934162 55616143 56404701 56950988 57695777 57346063 56631271 55273330 54201979 53956484
4798 53956484 52875409 52266204 51223978 51446168 51733418 51228315 51271222 51023789 51020784 51300961
4788 51300961 51886899 52278360 52145828 51870622 51387602 51470236 51633557 51103440 51108646 51615462
4778 51615462 51708401 51957517 52047925 52601088 53000505 53655095 54179670 54920442 55534465 55476374
4768 55476374 55828877 56781159 57219406 57765619 58626848 59658633 60510550 61706608 62865554
4759 62865554 63841800 65238943 66719579 68742974 70127882 70328238 71329668 72214022 73340150
4750 73340150 74811798 76296610 77840319 79946658 82595143 84955656 87674074 90223285
4742 90223285 93651659 96800840 99677832 102574898 105304810 107234642 108402562 108499359
4734 108499359 108398378 106796919 105414429 103996752 102724317 101260604 100073954 100005114
4726 100005114 100089458 100733249 100420861 100073900 98968644 96875858 94904569 93044543 91496815
4717 91496815 90284050 89628831 89007364 89261313 89927780 90442377 91149667 92384885 93817450
4708 93817450 95824127 98706821 101569554 102990559 103618950 103746536 102810256 101639564 100850498
4699 100850498 100305099 99809586 99569230 99047354 98034913 96911436 96870320 97787950 98583895
4690 98583895 99247621 100530370 101425523 102381361 104127825 106817739 109535442 112284191 113780381
4681 113780381 113004643 110773524 107681419 105175340 103289401 100845444 99241131 98024819
4673 98024819 97100551 95820569 95564322 95256669 94662473 95432384 96186200 97204517 98092044
4664 98092044 98678223 99107790 99582064 100438273 101260946 102690577 103806520 104430594 105331034
4655 105331034 106179362 106836592 107446428 108876175 110504538 112476837 113513025 115059148
4647 115059148 116528542 118497344 120686109 123222478 125604287 128081617 131408158 134368887
4639 134368887 137780745 141348813 144491020 146743183 149091704 151831931 155256608 158575669
4631 158575669 162095887 166827678 172090024 178305355 184590043 191387103 198189855 203713380
4623 203713380 209642120 215791190 222227135 229571571 236461179 243142981 249626981 255369822
4615 255369822 261727248 269047480 277217836 285309756 293146107 301769340 312341900 324288247
4607 324288247 336951652 349073028 360846751 372155075 382351432 392779963 405321912
4600 405321912 421356113 440728673 463296725 484956699 496957643 491916025 476218920
4593 476218920 456266064 435832621 416195274 399055570 385553794 374024536 361895384
4586 361895384 346990582 332169578 319763427 308304607 297100839 286088559 276289867
4579 276289867 268330127 262142346 258113880 255066855 252642130 249962562 247930243 246914390
4571 246914390 246998006 248701885 252044937 256491827 260398745 261519046 258521769 253901509
4563 253901509 249199187 244450043 239866623 235766745 232747619 229722711 225584585 220778720
4555 220778720 216738840 212971925 210872609 209567361 208975341 209159142 209648644 210505609 212986379
4546 212986379 216060125 219425530 224101775 230401675 236420946 241608748 245133032 244104624
4538 244104624 237654426 230525845 223186435 215243758 206181260 196872574 187532408 178990874
4530 178990874 172242097 166661847 161841233 158054214 155172486 153039797 151830684 151978190
4522 151978190 152475064 153464933 155622826 157732893 160282406 162757851 165396359 167451461
4514 167451461 167808831 165114295 159922537 153351804 147077542 141599918 136144784 130460427
4506 130460427 126718897 124201716 121479017 119197204 117650140 115295546 113396546 112244903
4498 112244903 111786263 111672166 111137501 111438822 110547482 109169565 107639950 105720489 104161521
4489 104161521 102551312 101726514 100709152 99068136 97507363 96675140 96049715 95306976 94707385
4480 94707385 94740514 94535032 94498937 93292045 91970506 89898454 87312086 85056987 82397680
4471 82397680 79997449 77439438 75227445 73560183 71489348 70897951 70241818 69791190 69982905
4462 69982905 69493356 68937320 68969103 69313403 70143794 71560286 73116682 74106599 75137058
4453 75137058 75710096 75545798 75850050 74578573 73087190 71930778 70418382 69117321 67683352
4444 67683352 66787880 65406658 63253713 61825282 59738712 58149633 57053856 56328900
4436 56328900 55450669 55052466 53746744 52937384 52416031 51932042 51797904 51332875 51155706
4427 51155706 50247052 49319370 47673620 46881504 45891233 44721714 43830992 42862075 42201593
4418 42201593 41767813 41722853 40742231 39720344 38616797 37143961 36504647 35952717 35565355
4409 35565355 34751762 34194140 32877863 32022354 31371769 30972488 30336538 29813893 28982255
4400 28982255 28361479 28238877 28485541 28234135 27829432 27481747 27496731 27560449 27348463 26980215
4390 26980215 26022653 26173080 25828372 25295638 24656200 24786884 24413509 24422195 23830386 23416490
4380 23416490 23646231 24032476 23067289 23373303 23398845 23118164 23650566 23285652 22438085 22828882
4370 22828882 23088973 23364930 23045439 22849866 23358957 23669723 23714964 23759785 23326948 23791048
4360 23791048 23851955 23403410 23832631 23995412 24213092 24057927 23814983 24031761 24297391 23657312
4350 23657312 23551707 23734965 23621979 23431157 23951257 24558704 24821294 24950885 25263851
4341 25263851 25640742 26706598 26414843 26989661 27179795 27596572 27253675 27014096 26763193
4332 26763193 26554020 25976859 25290025 25073131 24660122 24257874 23438108 23577335 23462847
4323 23462847 23758143 23508283 23437674 23979782 24751118 25286335 25941421 26374720 27062487 26731193
4313 26731193 26724597 26417583 25683561 25291213 24723930 24601469 23960123 22523281 22305863 22261623
4303 22261623 22062919 21306875 20717902 20729138 20462055 20846922 20847930 20493554 20750208 20701675
4293 20701675 20375694 20920862 20756066 20792067 20642909 21257187 21028927 20330101 20640780 20605331
4283 20605331 20812591 21348564 21315296 21529046 21812549 22441080 22419659 22226614 22266441 22300308
4273 22300308 22288922 22791213 23354440 23661879 23723669 23645180 23895276 24425640 24396885 24836430
4263 24836430 25026365 25565374 26325744 26581647 27169994 27041529 28033371 28653410 28888006
4254 28888006 29446374 29625576 29757369 30220407 30308411 30221997 29844653 29493344 29323902 29285762
4244 29285762 29202156 29706888 29401546 29950503 30847522 30984071 31402224 31981377 32583656 32912615
4234 32912615 33850553 33802861 33943179 34325042 34354332 34151548 33966988 34004168 33618382 33734310
4224 33734310 33706506 33423959 33160835 32925075 32703916 32296865 32036153 32073020 31882308 31913111
4214 31913111 32179842 32068435 32245382 32890521 33058149 33005313 33575980 33539686 33703724 33877992
4204 33877992 34496185 34721300 34387415 34651848 34262942 34379542 34798425 35346320 34980069
4195 34980069 34909896 35283072 35094171 35733761 36011232 36358285 36083285 36788741 36730195 36633720
4185 36633720 36862245 36534316 36984839 37185797 37579069 38448463 38817831 39323910 39081469
4176 39081469 39613333 40152083 40397997 41069545 41231275 41975216 42450883 42868420 42621139
4167 42621139 42546212 42246744 42512583 42949159 43365291 43784461 44008843 44771326 44726265 44777705
4157 44777705 45349609 45350793 45385116 45376551 45988229 46349327 46347665 46737562 47127299 46976193 47424389
4146 47424389 47846128 47763791 47496284 47563101 47548141 48386102 48813002 49222880 49000498 49101112
4136 49101112 49402131 50314956 50936863 51311078 52316575 52801719 53528297 54629754 55852116
4127 55852116 56962529 58352136 59337451 60392110 61483865 62661945 64435996 65655426
4119 65655426 67383323 69701924 71287090 73377403 74735014 76712603 78848922 81187969
4111 81187969 84089583 87461649 90877151 94497451 98528729 102758010 106132504 109737493
4103 109737493 113600694 116905603 119885716 123451697 127977150 133889012 141036661 148530226
4095 148530226 156356337 165123298 173582367 183279010 194875686 208789068 224088314 242833679
4087 242833679 265572971 293032293 328138234 369422798 399257318 407443585 397881643
4080 397881643 367045824 329235916 294892786 263940327 235264876 209346875 187286267
4073 187286267 169802091 155578789 144480158 135300152 127758847 122228660 117520419 113531910
4065 113531910 110660142 109305111 108127213 106846620 106380495 106392302 107420187 108373097 109777121
4056 109777121 111516954 113950562 116102984 118658307 122373725 126238401 129390013 131853550
4048 131853550 134297557 136868641 140052370 143533314 148394943 154008014 160454046 167845359
4040 167845359 175969449 185503456 195976631 207740510 222686461 240252215 261479862
4033 261479862 288485944 322888808 359262895 378918655 381596306 382206389 364800414
4026 364800414 328604787 292284344 262126592 235034340 210649144 188470179 169982776
4019 169982776 154563970 141191648 129700660 120648329 112963291 106852346 101669439 96545090
4011 96545090 92662282 89156595 85991376 83394044 81526226 79170712 77225057 75792876
4003 75792876 74262452 72842735 71579066 70556233 69707330 69419999 68932323 68300486 67774035
3994 67774035 67083381 66201831 64940914 64993540 64594533 64295802 63717014 63725340 63561048 63074056
3984 63074056 62869169 62855179 63043246 62881562 62612333 63424872 64411502 65169036 65441450 65425088
3974 65425088 65058808 65553959 66393586 66376364 66691024 67771525 69495467 71089330 72539504
3965 72539504 73279898 72808112 71423776 69902654 68737831 67589873 67124363 66076243 65759078
3956 65759078 66056450 66546331 67080707 67992532 69096376 70367655 71563243 73271526 75369214
3947 75369214 78013374 80986191 83637066 87168240 90717464 95438418 100165992 104675902
3939 104675902 110386999 115470847 120446464 125888752 129243058 131490018 131896987 130167259
3931 130167259 126864246 121587070 115620494 108850296 102587017 96445590 90902698 86563467
3923 86563467 82722982 78847123 75789954 73138121 71310145 70681936 69989498 69812058 70491828
3914 70491828 71884567 73701480 74054158 72638139 71113755 67554796 63347844 59175364
3906 59175364 55285806 52133517 48963912 46462527 43964522 41916281 40470718 39149440
3898 39149440 38148214 37077861 36385567 35543447 35074068 34378485 33967717 33197967 32333851
3889 32333851 32013955 32309507 32113829 31780982 31331568 30814582 30249606 30025162 30362702
3880 30362702 30105238 29840075 29156445 28725425 28195751 28139758 27186765 26668843 26515648 26206536
3870 26206536 26102761 26435765 26565858 26336514 25757395 25802049 25630303 25337600 25768056 25682426
3860 25682426 25551246 24696685 24937991 24805734 24762635 24442642 24200380 24115764 24666110 24499755
3850 24499755 23900034 23630834 23690820 24076922 23655318 23733684 23554537 23098273 22834879 23077602
3840 23077602 23280631 22716775 22658994 22665923 22615583 22740668 22610503 22371428 22753944 22852798
3830 22852798 22380991 22669902 22555515 22319252 22539073 22711181 22535470 22476236 22732179 23248178
3820 23248178 23369135 23709421 24261065 24150612 23534980 23168792 23274209 23603335 23479308
3811 23479308 23916195 24364813 24874625 24853555 24803946 25052772 25502629 25583794 25117402 25248985
3801 25248985 25477133 24990472 25018749 25389987 25286297 24740282 24573292 24566524 24855851 25188171
3791 25188171 25328983 24935521 24521858 24629760 24860615 24599685 24685076 25579720 25628542 25880131
3781 25880131 25596212 26300484 26994192 27503272 27751021 28785034 29432186 30342394 31425078
3772 31425078 32422437 33529914 33828105 33843764 34107936 34781426 34464996 34283453 35040182
3763 35040182 35498230 36131968 36738506 37604622 38454437 39583284 41041493 42853067 44001265
3754 44001265 45708936 47728848 50016590 52191796 53902421 54728874 56117073 58146852
3746 58146852 59674439 61408052 62792464 64969096 67391585 69646108 71703117 73202302
3738 73202302 72449532 70796467 69738816 69488098 68558489 68035079 68409487 69296843 70846037
3729 70846037 72605400 74732084 77592519 81062093 84909384 89351633 93969767 99033041
3721 99033041 105779711 111933782 116171862 116118135 111801290 105899723 99453229 91729671
3713 91729671 84246345 77575636 71218544 65132051 60700699 57120496 53838854 51011508
3705 51011508 48608846 46654883 44927568 42659133 41687935 41001911 40092614 39681489 38874014
3696 38874014 38642408 38601645 37936795 37267617 37040605 36573151 36498822 36767979 36563202 36429069
3686 36429069 36739779 36774334 37125345 37262109 37744663 38110762 38903293 39636525 40439513 41335598
3676 41335598 42225039 43335168 44730720 45992291 47667716 49915840 51771225 53798210
3668 53798210 54869687 55590109 56009832 55749249 55049623 54062911 53327143 52688855 52033233
3659 52033233 52677469 53018543 53060795 53464093 53938946 54760314 56170078 57526310 59693425
3650 59693425 62327370 64541257 67849494 70997666 75026623 79859499 83326331 85584084
3642 85584084 85526380 83995347 82204961 79737434 77533863 75103501 73975850 72806064
3634 72806064 71925620 72152026 73267843 73574681 74367183 75973791 77277571 79034310 81286699
3625 81286699 84504151 88009002 91773601 96649970 102012905 108010865 114197482 119084945
3617 119084945 120461857 118180151 112825470 106350869 100053397 93792217 88296602 82580333
3609 82580333 78579510 74905644 72461112 70568789 68893664 67806702 66727037 65912034
3601 65912034 65538704 65485699 65451553 66028634 66911556 68112008 69540294 71475584 73233841
3592 73233841 74976953 75182367 73903613 71392749 67742785 64322253 61176893 57158840
3584 57158840 54085577 51425746 49275179 47836449 46619378 45233464 43806005 42506698
3576 42506698 41514900 41204476 40852238 40084267 39507978 39381361 39073190 39147646 38092653
3567 38092653 37722896 37063436 36822585 37278240 36824619 36805050 36893373 37247619 37476331 38171396
3557 38171396 38951771 39785394 39976160 40234806 40840196 41929401 42832433 43483125 44507670
3548 44507670 46236198 47785258 49634411 51435832 53362252 55487922 58116796 61091050
3540 61091050 63827660 68108024 72932416 77190969 82801354 88562316 91451662 91521069
3532 91521069 88696068 84650650 80503079 77012261 73774044 69929263 67160887 64749377
3524 64749377 62375181 60397751 59073039 58498239 57335486 56560500 55751684 54360140 52609568
3515 52609568 51409527 49836445 49135420 47740734 46964851 46638842 45899888 45624786 46055982
3506 46055982 46074387 46138444 45761509 45620499 45688916 46146833 46137582 46849882 48001016 48430178
3496 48430178 49195449 49587487 49691016 49780393 49884617 50200838 51326426 51376282 51879385 53171998
3486 53171998 53905500 54387901 55456037 57278020 58459475 60009895 61428342 63022409
3478 63022409 65037035 66981689 68890287 70884026 73629304 76953005 80422246 83780886
3470 83780886 87840376 92081849 96393410 100150208 104637163 110090904 115699793 121126183
3462 121126183 125460077 129589544 134396292 140379756 148418730 157923288 168331527 179454619
3454 179454619 191333460 204106717 218099535 234279029 253045025 274546386 299369013
3447 299369013 329150872 365734207 409923271 460844883 510322721 533107413 511195445
3440 511195445 466087810 420586732 377834629 334996177 293726410 257158879 226545493
3433 226545493 202428975 182532410 166029785 152128955 140989414 131469260 123689805
3426 123689805 117019457 111233184 105852076 100634206 95690371 91115572 87891628 84264873
3418 84264873 81300131 78854366 76693055 75224391 74808229 73641830 73784131 74977713
3410 74977713 75083698 73635634 71021280 67735322 65005655 61979231 59544664 57314504
3402 57314504 55383834 54451036 53286070 52205458 51974057 51844743 49859634 47574826 44560687
3393 44560687 42778034 41248434 39929461 38103299 36418923 35213159 34404525 33036851
3385 33036851 31735282 30675111 29493435 28834379 27688381 27432879 27167506 26325617 25763378
3376 25763378 25282981 25114728 24440109 24100597 24279243 24086139 23645043 23129991 23085588 22949824
3366 22949824 22804060 22595513 22828612 22344670 22055820 21809341 21954138 21679836 21021976
3357 21021976 20562341 19921953 19946540 19855464 19813644 19734098 19478761 19031183 18645437 18785536
3347 18785536 18965044 18489730 17981436 18226035 18160845 17566883 16968943 16705776 16832589 16434154
3337 16434154 15547371 15631152 15855851 16017787 16258037 16634037 16864569 16376294 16553941 17102956
3327 17102956 17168499 17102159 16491915 16372879 16646450 16461504 15779618 15540013 15158879 14578135
3317 14578135 14750290 14772520 14343027 13730252 13978070 13849424 13163065 12246692 12185817 11871880
3307 11871880 11688843 11567441 11710431 11488095 10982539 10711765 11067989 11077253 10861266 11082340
3297 11082340 11113531 11431218 11741553 11843396 11945576 11594369 11905085 12650155 12154799 11861179
3287 11861179 11627916 11427767 11862354 11737430 11724156 11347982 11175170 10957662 10126837 9940223
3277 9940223 9697230 8691080 8981198 9066116 8824890 8722421 8514051 8640826 8575241 8237993
3267 8237993 8260716 8400043 8687430 9100007 8545223 8819230 8411503 8320902 8360380 8066223
3257 8066223 7924619 7928200 7859794 7804686 7838359 7682186 7525159 7981526 8102642 8563029
3247 8563029 8286682 8400896 8139231 8028197 8573962 8179276 8008358 7498766 8135194 8204313
3237 8204313 7643210 7562320 7736796 7458832 7412626 7506842 7550246 7584943 6915476 6522995
3227 6522995 7059111 7306852 7281369 7065566 6747651 7280588 7363562 6862343 6764281 6535162
3217 6535162 6087443 6197519 6216792 6112705 5736200 5759253 5753265 5280622 5746107 5738682 5791501
3206 5791501 6192233 6023464 5793604 6032711 6047420 5745881 5907467 5737349 5298974 5649749
3196 5649749 6086094 5420772 5622289 5426231 5137772 5249106 5116377 5278344 5497818 5834126
3186 5834126 5844921 5452862 5799397 5636664 5159101 5799439 5629583 5509506 5578990 5396983
3176 5396983 5518083 5484040 4768941 4681038 4918550 5134416 5359952 5200224 5091498 5319283
3166 5319283 5029888 5391813 5259456 4791783 5097223 5103380 5232298 5206231 5254709 5141773
3156 5141773 5311097 5231935 4903975 5154326 5409504 4951584 4803369 5192664 5866661 5870598
3146 5870598 5682830 5588354 5554369 5715335 5486919 5719318 5934413 5568617 5319451 4958704
3136 4958704 5283607 5120334 4597749 4643367 4282051 3858997 3798331 3783214 3942461 3432005
3126 3432005 3401502 3112687 2562643 2289738 2668600 2601819 2567666 2789660 2049409 2027478
3116 2027478 2542833 2768559 2331638 1975761 2437062 3066920 2797598 2668845 2476810 2134208
3106 2134208 1944118 2411124 2527536 2672501 2031152 2266524 2310301 1755389 2357243 1964857
3096 1964857 2148481 2357786 1898196 1889410 1451006 1202019 1823659 1846126 1891490 1946845
3086 1946845 1460342 1622004 1635044 1530813 2111499 2142275 2340036 2065436 1995187 1479090
3076 1479090 1390644 1916987 1713082 1925145 1816280 1886204 1790703 1844398 1735498 1437109
3066 1437109 1443680 1578661 1888028 2156702 1950446 1537043 1702568 1292490 970682 2104095
3056 2104095 1692044 1603919 1421401 1008033 913064 1690443 1764960 1402883 974575 864541
3046 864541 981671 1240435 1732083 1417511 1077962 920912 1093977 1273756 1399680 1254308
3036 1254308 1408510 1090261 1034623 921706 509315 792624 1110547 984498 756202 769479
3026 769479 1399330 1730153 1207797 935182 668093 658923 1392580 1262166 595115 843711
3016 843711 1112396 1323988 1384703 1223764 1641330 1243766 892375 1289761 1198929 1129090
3006 1129090 1274046 879829 826116 974046 970823 1085248 1114177 1245390 1148542 1417020
2996 1417020 841959 911089 1390900 951043 1002104 1016078 1398674 1245537 1152710 708315
2986 708315 1253755 1528502 1152753 606915 1001569 1178258 1302672 1554283 1812034 1510576
2976 1510576 780586 504937 1192514 1197323 1190149 1442016 1148122 1104307 998338 1078819 1460975
2965 1460975 1600138 1326622 1768272 2032411 1523869 1351646 1555846 1234273 1460755 913967
2955 913967 1213133 1482432 1416856 1196974 843415 806319 1149216 973751 1169446 902248
2945 902248 1302046 1667891 1609362 1724500 1961648 1503770 1384384 1451201 1250486 1342984
2935 1342984 1450237 1573054 1643428 1810419 2327307 2581941 2198874 2597748 2421951 2032563
2925 2032563 2022689 2876255 2758800 2057838 2104004 2368152 1714321 1815303 2101426 2288541
2915 2288541 2147609 1685853 2142426 2568176 2664658 2338282 2362625 2865447 2768803 2886691
2905 2886691 2593883 2805405 2470606 2231272 2691003 2867916 2838392 2999200 3453889 3346818
2895 3346818 2981082 3277814 3038783 2769173 2929649 3254064 2921587 2769756 3012123 2900610
2885 2900610 3213553 3053109 3584547 3152090 3527202 3431687 3382026 3636871 3575190 3938802
2875 3938802 3834238 3581111 3865514 3815388 4414092 4778814 4398591 4685272 4675683 4381516
2865 4381516 4138453 3993002 4087163 4315092 3961755 3480732 3086391 3544028 3575493 3781389
2855 3781389 3965326 3711938 3654597 3711015 3922102 3670322 2838680 2612337 2910250 2863468
2845 2863468 2649827 2652537 2635762 3075254 2970791 2893741 3064104 2786331 3203410 3461072
2835 3461072 2877126 2717768 2967024 2546958 2821964 2628414 2304142 2853662 2586987 2581248
2825 2581248 2831938 2330698 2179471 2526689 3184256 2792627 2010764 1725793 1870309 2454853
2815 2454853 2089438 1848563 2019284 2162150 1625964 1577770 1937585 2401553 2441549 2705482
2805 2705482 2722086 2439184 2418770 2000185 1854323 1903361 1727204 1289111 1116007 1368408
2795 1368408 2019270 1907137 2332256 2500883 1948202 1902623 2079736 1663183 2006686 1829158
2785 1829158 1812196 2080344 2327535 2339704 2444766 2353128 2233687 2198940 1952939 1950739 1766666
2774 1766666 1674495 1699889 1697503 1363577 1569492 1781029 1812470 1758886 1799672 1741095 1993222
2763 1993222 2726695 2332306 1905216 2098202 2243251 2422326 2393622 1782960 1881691 2195113
2753 2195113 2155323 1645757 1775367 1348834 1712353 2391179 1935692 1624875 2263425 2068484
2743 2068484 2018894 1621388 1448070 1617187 1470780 1833574 2112893 2396329 2128970 2028550
2733 2028550 2002184 2164052 2033221 1703223 2152454 2260779 2025514 2840190 3028409 2636306
2723 2636306 2561146 3129974 2856403 3192984 3368610 3584020 3855581 4116668 4271619 3979850
2713 3979850 3550545 3980447 4064244 3829804 3225487 3129617 3106802 3130284 2986394 2872891
2703 2872891 2948005 2822598 2474511 2586841 2839903 2921106 2616979 2066260 2085295 2785975
2693 2785975 2966417 2624460 2560723 2859403 2517571 2959959 3726966 3962964 3895978 3601835
2683 3601835 3430644 3446386 3633636 3632683 3387382 3501950 3439601 3499335 3590329 4252534 3969737
2672 3969737 4266162 4569024 4683102 4359897 4219624 4813036 4705113 4681926 4601115 4562674
2662 4562674 4130500 4861153 4831323 4753944 5098503 5324372 5274123 5975645 5910554 6236011
2652 6236011 6086467 5480385 5816396 5858897 5587515 6141001 6611778 6619833 6615796 6281097
2642 6281097 6686812 7408310 7663610 7823004 8108213 8312505 7897979 7770065 8298029 8139062
2632 8139062 8508433 8458446 8669545 8985687 9064581 9701939 9206102 9514918 9790374 10002322
2622 10002322 10430182 10686259 10237329 10210712 10430811 11058024 11208263 11390395 11727302 11958538
2612 11958538 12206352 13013278 13492290 13596834 13717434 13947427 14514325 14620002 15181273
2603 15181273 15502343 15701584 16240995 16613279 17370517 17794281 18497929 18870549 19747041
2594 19747041 20115452 20344928 20929673 21422084 21887644 22922749 23982569 24535484 25458757
2585 25458757 26232558 26654492 27371780 28518524 29690241 30935886 31988373 32857642 34719892
2576 34719892 35902689 37521923 38998696 40245900 41482538 43355492 45018605 46174994
2568 46174994 47709438 48781570 49945836 51131523 51374174 50550867 49740633 49322478 48417355
2559 48417355 46893191 46413539 44931286 43788571 42619363 41220589 39994470 38653738
2551 38653738 36843173 35863655 34602634 34455839 33898157 33444083 32587732 30906529 29272220
2542 29272220 27927668 26451193 25583259 24088896 23110682 23245607 23150346 23584183 24826118
2533 24826118 25851789 24514188 22422066 20681900 19454665 18084432 16536948 15152971
2525 15152971 13940767 13092105 12759126 12051615 11653129 11271893 11013029 11089545 10775578
2516 10775578 10518940 10272128 10027049 10202787 9929149 9650855 9779883 9273309 9535351
2507 9535351 9805456 9910822 9698578 10443730 10943708 11395924 11760089 11708352 10815941 10277865
2497 10277865 9504974 9206691 8350427 7723165 7079714 6983379 6636396 6226185 6148129 6152059
2487 6152059 6498878 6531687 6368408 6043617 5900445 5830152 5490300 5086461 5256943 4760982
2477 4760982 4575388 4171438 4258532 4482955 4627785 3630464 3151102 3209952 3303897 3011516
2467 3011516 2582697 2669335 3043172 3169081 2953636 2522469 2213568 2258540 2713986 2312259
2457 2312259 2374902 2433072 2647267 2416876 2492367 2632444 2596012 2937569 2690943 2453207
2447 2453207 2411027 2194884 1986070 1899744 2192290 2579785 2250766 2509522 2485903 2256775
2437 2256775 2145690 1720984 2088965 1883084 2066835 1886773 1579668 1889813 1924587 1379439
2427 1379439 1656663 1555267 1550563 1015887 1565180 2026829 1772286 1535804 1849421 2204271
2417 2204271 1749281 1533606 1317343 1446968 1136053 1382340 1066734 858309 1453705 1202420
2407 1202420 957463 1313641 1805450 1452503 1716474 1126730 837746 1108627 1148668 1652935
2397 1652935 1409921 1196136 884026 1108239 884449 1161407 663894 521922 470493 602898
2387 602898 717239 858180 864161 1042048 965931 719296 455459 343594 858420 955986
2377 955986 701126 889665 842560 1231636 1407668 656909 749365 865325 929614 729418
2367 729418 878200 1134183 445242 516904 715670 870423 974348 1026141 666788 468779
2357 468779 1107672 558018 577793 454551 532386 865682 739287 611682 783520 1021125
2347 1021125 825804 758292 842949 546254 278549 430848 224204 665571 864082 252841
2337 252841 -159084 485650 797648 806504 685294 358863 632151 1071312 875880 998352
2327 998352 930720 1161843 1577570 1524307 1114975 1124038 997638 724215 1001168 862527
2317 862527 977214 1747435 1993625 1441867 1226168 1097577 1095473 1362073 1263371 1304614
2307 1304614 962898 682240 785106 1004954 1395735 1683795 1834531 1335362 1189515 1762547
2297 1762547 1458657 1265365 1313730 1035717 1268190 1605504 1323076 1365911 1906337 1665956
2287 1665956 1436503 1782089 1904058 2305678 1942382 1211252 1197114 1289104 1574244 1761627
2277 1761627 1959268 1457251 1490941 1804491 2094424 1754709 2287488 2502855 2297061 2241281
2267 2241281 2185398 2833023 2917555 3042944 3509684 3030426 2901349 3121865 2706278 2862192
2257 2862192 3876969 3761164 3087216 3117590 3101087 3544813 3571123 3563356 3171707 3282968
2247 3282968 3564515 3923002 4314737 3778888 3799645 4090446 4479001 4559365 4204563 4034761
2237 4034761 4205690 4361536 4187571 4382246 4752784 5030540 5267271 5630648 5577569 6119178
2227 6119178 6051598 5145154 4885934 4387388 5071832 4790439 4146883 3544823 3484936 3924657
2217 3924657 3737231 3347124 3724280 3026508 3119713 3266172 2955340 3028267 3465953 3717670
2207 3717670 3191748 2817253 2724734 2698147 2540811 2884011 3269628 3186577 3258905 3279933
2197 3279933 3151747 3415888 2806628 2745189 2669360 2571931 2126436 2259141 2295911 2444572
2187 2444572 2119644 2015829 2586117 2727971 2129798 1474279 1795566 1924996 1326634 1509809
2177 1509809 1090277 880524 1504237 1514392 910962 728013 774626 1260495 1171994 1101132
2167 1101132 1077735 1313945 1480636 1325683 1152922 748538 688309 560313 884781 775634
2157 775634 903020 1259203 1158823 134369 283783 89551 145497 775320 615232 642509
2147 642509 577586 858977 835976 545783 44667 192410 456741 180172 186013 335705
2137 335705 562778 480665 312676 525699 418042 56863 358926 602266 31939 254104
2127 254104 169458 33282 87683 137182 638061 687408 253842 410765 788304 534344
2117 534344 445291 409047 319259 250691 -123558 -156381 67434 -275292 163728 351786 -418858
2106 -418858 -341235 132846 105073 17592 119288 439788 645178 -131626 -252870 288185
2096 288185 142668 -158307 -599373 -24613 193534 540658 -236901 -883911 -125695 -427381
2086 -427381 -494473 121004 -334761 214982 411139 -69340 53906 -108865 211783 -12427
2076 -12427 -52277 64366 -27298 370527 -184288 8761 -315586 -82539 20225 -180727
2066 -180727 -356445 -251160 -199392 231855 406142 24101 -117575 -455181 -423781 -7558
2056 -7558 -152814 -453851 -47052 -87983 43699 -80664 -73176 -634304 -508628 -573863 -682569
2045 -682569 -329065 113380 122405 393395 348221 -142918 -140778 -362521 -145006 -677444 -563694
2034 -563694 -407267 -555429 8233 -214607 -71187 -51042 -192644 -568820 -173668 -578580
2024 -578580 -259856 -230875 266762 592543 512856 586338 -13923 -31644 22215 -354501 -504549
2013 -504549 -689236 -749619 -770089 -457155 -470564 -186167 149658 502321 221496 6310
2003 6310 -251878 -912306 -831512 -590139 -233856 -303434 -487189 -199546 105981 -85761
1993 -85761 -80737 132625 158462 454907 291644 -415865 -712329 -971102 -835895 -1064381
1983 -1064381 -1124047 -739325 -585311 -301825 345881 225019 -263455 -668654 -414809 120993
1973 120993 363834 -374739 195189 492302 110902 70945 14214 -134810 1525 17147
1963 17147 -170156 -165282 -174472 -240239 -442818 -87021 204685 -212727 27860 -420446 -585537
1952 -585537 -375263 -27860 165982 62684 -106842 -162959 -209008 268224 316824 248664
1942 248664 -17147 -313811 -325848 -396964 -324742 -355188 -586513 -209964 -205558 -484260 -620900
1931 -620900 -979022 -985815 -1100474 -935056 -643938 -433535 -366854 73523 -208817 -329887
1921 -329887 -163982 -140540 -180047 -104777 -298005 -137223 -1638 355142 36569 -332955
1911 -332955 -301591 -483375 -341894 -339566 -410496 -488311 -843242 -393295 -221488 -522145 -426508
1900 -426508 -244557 -380870 -205153 -500402 -497686 -422298 -253201 -180082 -3483 -206314
1890 -206314 -716668 -153924 217136 -148122 -356351 -402613 -423992 -678142 -291906 -125330
1880 -125330 -74341 18090 -217304 -119361 -256954 -127137 -523406 -227419 104906 268529
1870 268529 -271677 -235446 -208764 -502275 -86161 -180540 -58547 270122 172733 -635490
1860 -635490 -869144 -786613 -402212 -37268 -522884 -174592 -203399 -487024 -158853 -374206
1850 -374206 -401125 6398 -89037 -862781 -498097 41784 3564 -359143 -207545 -28504
1840 -28504 -180248 265443 488095 178613 297694 196240 -527915 -109092 -275962 -91265
1830 -91265 -6303 -22952 -218295 -561169 -219494 -190070 -233443 135575 223856 140598 -76340
1819 -76340 -359185 -77991 -391657 -395254 -222110 29025 294146 -60585 -95471 -139219 -220797
1808 -220797 -543880 -389640 -451676 -268343 239933 -317663 -753543 -172853 -11900 8440
1798 8440 148615 36560 162127 253819 -82599 -448274 -492017 -119351 -98647 -369236 -256672
1787 -256672 -59967 -122636 -61824 -245421 179823 184290 -167926 -401684 -274570 -18038
1777 -18038 -735619 -441364 174001 203682 -178246 -416543 -901213 -557777 -635851 -28231
1767 -28231 107716 -278073 -290599 -132955 -276175 117952 349068 122694 58 -225283
1757 -225283 103570 134966 450608 313710 493704 455504 2142 193325 401417 208483
1747 208483 204480 116937 -173873 148380 -263134 -329248 6905 -304205 -13026 -4371 -239974
1736 -239974 209783 343721 291292 167032 -137374 -380023 -630482 137429 -193622 -607033
1726 -607033 -461391 -875304 -474516 295377 142539 210195 -84838 -406241 -294098 -599774
1716 -599774 -544283 -26696 -8511 -415093 -253252 -307036 15257 -59356 -57591 -131163 110522
1705 110522 34842 122517 -121702 104705 419933 649696 805349 459758 592227 223327
1695 223327 265769 275199 -87315 -131419 323529 323782 -6066 582598 733284 346100 663957
1684 663957 347345 265935 59939 -274148 -684 236328 -448897 -342076 228972 -159647
1674 -159647 210668 714425 121067 424929 206907 -267243 -93204 -310472 -553620 -55247
1664 -55247 596875 698276 104157 -281949 -282376 42908 -82323 -34537 197304 594847 865168
1653 865168 481292 216679 105635 63810 -393736 -936719 -375381 -82618 -329129 158161
1643 158161 -128423 -141077 28819 -6119 -364430 -293786 -263617 278660 166362 -248717
1633 -248717 -134834 337706 395200 472778 827044 370204 -40100 163054 404377 53337
1623 53337 270158 381495 446350 531574 391115 829061 919506 467586 839506 86379
1613 86379 -25267 325848 14173 -164296 17540 313920 510793 617620 635684 543714
1603 543714 738709 557352 -141098 105762 346392 655867 529623 166123 398708 998468
1593 998468 1003685 800183 746026 568350 450576 584125 668104 461236 1055992 269440
1583 269440 238503 479757 510240 1045157 581411 577978 816141 681015 467251 360485
1573 360485 372476 564191 639258 394852 653784 692798 205507 261591 518954 543529 264812
1562 264812 509350 543033 398197 269907 472431 154153 446827 388156 712248 1175412
1552 1175412 1270234 896946 327875 642029 441910 402057 1339109 1178995 905350 1046878
1542 1046878 957933 931890 683017 644083 723718 450276 1036994 1184130 1190654 1019045 1329053
1531 1329053 1360518 1239684 1584434 1501150 2008145 2034610 2017722 2369246 2370123 1828822 2407050
1520 2407050 2981727 3056779 2944286 3514193 2953211 3046011 3533590 3302997 3422774 3273824
1510 3273824 3447698 3489329 3436927 3556191 3342397 3857112 4108730 3691011 3759077 3602928
1500 3602928 3383204 3698734 4234284 4042897 4262911 4658057 4673986 3896824 4038687 4346392
1490 4346392 4506153 4557991 4820789 4699403 5400331 5486895 5564345 5586184 5597426 6340262
1480 6340262 5898105 6276379 6045695 6149280 6787876 6804082 6865476 7275880 7284690 7140243
1470 7140243 7532924 8746695 8970536 9480513 9981568 10421073 11103109 11807461 11756899 12306607
1460 12306607 13249905 14627415 15684883 16784661 17909616 18597535 19901333 21294936
1452 21294936 21586035 21956775 22592148 24323521 26836131 29326890 31088359 32672837 34873018
1443 34873018 36897604 39204133 42979106 46876327 51011402 56153321 62538293 70235059
1435 70235059 79852336 92290341 109123988 117149569 104740225 90242155 80300333 71858246
1427 71858246 62597546 52803591 44782383 38452515 33849049 30008902 26601363 24569015
1419 24569015 22230673 20891307 19429689 17964870 16519915 15201018 14167959 13003426
1411 13003426 12080225 11197464 10846100 10784116 10050304 9505996 8775200 8409246 7993869 7422592
1401 7422592 7841290 7294002 7266641 6784958 6485935 6446378 6344860 6218025 5377954 5164369
1391 5164369 5073412 4745131 5217647 5183160 4974285 4556047 4649372 4420610 4106318 4609868
1381 4609868 4916051 4488213 3552373 3458101 3488588 3502521 3344062 3209473 3281088 3060745
1371 3060745 2854657 2940927 2423087 2445615 2058579 2288860 2374178 2387949 2957264 2540314
1361 2540314 1919061 1935133 2256099 2087908 2208302 2057321 2348200 2202542 2325110 2091471
1351 2091471 2178976 1972185 1660015 1451810 1841627 1791181 1823851 2231511 1906417 1680925
1341 1680925 1817700 1351978 1101671 1103090 1278989 1386243 1328408 1957237 2202445 1904983
1331 1904983 1675287 1705231 1481523 1044245 664246 1145885 1039238 1040224 831223 777320
1321 777320 453335 997845 1243518 958552 525349 395963 536164 555720 817689 1300036
1311 1300036 1519485 1152901 1217536 834572 516897 1127852 668199 136812 606658 761026
1301 761026 850130 489160 112300 209930 602581 678199 327852 16275 -175458 20301
1291 20301 285671 565428 751764 274392 773451 858155 345074 56314 413889 -70489
1281 -70489 -113796 -83027 -575840 -139761 241309 133156 582809 627535 887676 1082489
1271 1082489 709568 295311 -487375 234471 186461 260014 206631 157615 -55124 63810
1261 63810 246902 600073 519232 219085 -428401 -123519 226501 211275 484243 311084
1251 311084 -66532 -573634 -277625 -111306 -323406 91016 350861 13430 139400 186385
1241 186385 170765 23745 -99418 525022 322962 76296 -344069 -290449 82961 99185
1231 99185 -108594 -298753 25404 103276 136104 190011 228707 44558 -209476 21714 269161
1220 269161 162385 144269 -102050 26028 -219286 145367 321468 175732 -16513 273321
1210 273321 577177 335427 271867 228445 108802 132845 20511 121126 -182724 -58937
1200 -58937 235625 424033 466093 705975 528067 -268757 -169512 53731 177105 137703
1190 137703 242327 387348 270882 190424 -133962 -129056 -258721 -15370 258333 454835
1180 454835 776122 749987 208417 149955 64096 40835 99683 162683 376383 408249 -364128
1169 -364128 500230 475183 356418 623259 633222 394979 451862 446035 494700 528744 299340
1158 299340 5226 6859 194574 325899 168871 34516 216537 -249927 187384 -331014
1148 -331014 -354738 -257584 68121 -17492 158109 216071 350718 264368 352327 -126451 -607995
1137 -607995 128708 212290 249676 337156 463955 -6354 -491544 -462112 -382371 -40 317691
1126 317691 443286 -350572 164001 70438 -206539 -354732 -178296 431912 548380 222980
1116 222980 -323983 -60343 63487 -112556 46715 210206 49677 107875 -240441 -728141
1106 -728141 -761450 -687967 -98207 232648 202494 -278668 -512215 -618635 -321924 -45673
1096 -45673 176451 -265067 -58197 447345 -13307 -304317 -335329 -426558 -78562 -81139 9511
1085 9511 -294625 -160576 33822 -438611 -47573 261885 563131 859539 177980 -44485
1075 -44485 -97256 13147 -120149 18025 105044 156224 -221848 -280736 189481 -9495 611857
1064 611857 26253 -732955 -672574 66820 -367999 -199749 221554 239985 -207881 -19935
1054 -19935 -27626 77594 -35130 -452119 -688691 -417289 -211235 -560581 -332599 -234761
1044 -234761 -40200 -161866 -277206 -534553 -1076225 -1268970 -751624 244440 153512 24324
1034 24324 -230481 -248902 -400363 -596482 -283781 -52305 189979 -109683 152383 128846
1024 128846 510432 346171 -53902 -249451 -487789 -860761 -742411 -229782 -377007 -483156
1014 -483156 -494707 -288297 -538867 -547151 -423822 -118161 -213660 -208194 -11713 -246419 -286126
1003 -286126 -152935 98378 16333 -14022 -535344 -438251 453195 724401 888340 437003
993 437003 93429 -76742 84758 -107588 196742 135388 -126640 -578811 -105935 -302471
983 -302471 -254617 321676 452605 301496 -20495 -305226 64560 635418 153500 -281045
973 -281045 -388159 -389107 -210577 -319049 -64829 293007 17381 -101129 161637 126833 -149125
962 -149125 -108318 -1036020 -772958 -600434 -383184 -267099 -603987 -581767 -533450 -315851
952 -315851 39865 115483 342570 404861 -3589 -165820 -53716 -376586 132845 -34900
942 -34900 -203860 -294980 -474967 -115074 564502 423630 46545 104391 -99671 -39174 -110210
931 -110210 165530 473327 632154 399578 28118 -241269 -435910 -168486 -296228 -570658
921 -570658 -174143 401638 113106 -520337 -69033 252671 105361 371102 379335 92292
911 92292 -60676 222421 330278 -317014 25066 11799 -148487 -318958 -257867 40077
901 40077 471857 226497 117487 755953 382823 64007 -75068 -16517 79938 191344
891 191344 40862 -463983 -793056 -412168 -239257 -93241 -465269 45010 284704 350885
881 350885 62880 -171390 -233477 -162242 100194 -35945 61914 459229 378044 349193 287883
870 287883 583039 290622 219230 -182144 -49048 -207802 138102 525060 205993 531670
860 531670 369339 292056 -47984 -79319 -65679 287140 -201086 -132305 -126290 99756 -244544
849 -244544 123773 100872 -83715 -341169 -549277 -623780 -545494 -298631 -146842 178906
839 178906 287693 -298164 -440917 -14983 58299 213444 30018 125552 445332 -68158
829 -68158 -302866 -289060 -221662 -180410 -202720 -360208 -467464 -107253 28107 -460197 -257691
818 -257691 -32278 -179924 -152937 180784 -40814 15874 -87497 -530834 -328530 205726
808 205726 -99050 -520673 -602026 -318365 354186 118153 -263570 -367338 -135402 -128872
798 -128872 303049 222999 -7710 288323 13957 -78014 107567 68607 -22294 -309204 -36223
787 -36223 70490 -26851 16088 -98068 -490714 314412 23991 29081 320329 162422 106497
776 106497 164946 -175371 -292513 72265 2259 -211778 510419 534103 169290 2607
766 2607 -41122 246044 -97635 -28896 -148844 -187497 -483239 -643750 25744 156019 -189482
755 -189482 139729 561254 446468 402123 88850 122951 301987 488820 -98805 -158490
745 -158490 141273 -29432 422221 282563 142823 177454 124364 240662 296545 182472
735 182472 285946 16185 111362 -57818 -154831 -669043 -483505 45212 96749 -40860
725 -40860 77867 408159 -453051 228537 22766 -593290 56801 -232829 179789 121239
715 121239 -16337 -391439 -343124 -32209 -170999 -641171 -428026 -97308 -120868 -608313
705 -608313 -670709 -107827 223716 112459 -106675 -155689 -596602 -617086 -713349 -709348 -209671
694 -209671 -400631 -478475 -674045 -904936 -976989 -669639 -278401 -272617 -271638 225436 -122270
683 -122270 -164382 44694 181161 -19731 412456 728715 93671 54872 -58282 -111326
673 -111326 449892 318592 -821789 -623407 -294182 -11306 142729 -301763 -143791 114880
663 114880 5909 3467 -180813 100249 -44918 235782 187796 -121712 -517996 -386444
653 -386444 -347246 -176556 -39013 73365 -70720 149529 312273 393382 479363 316217
643 316217 553808 913736 142382 -568585 -332643 -132767 54999 285953 360062 649112
633 649112 371632 -2328 -455440 -539311 -33625 -177264 -193558 132445 -185319 -563155
623 -563155 -744808 -495161 -444715 -141290 17664 -274601 7479 -23911 -166052 -219745
613 -219745 5532 202490 159659 337796 428068 161703 -197361 -256128 -249526 -427162 -450603
602 -450603 -508431 -42244 530484 1180 -443673 -107686 -269254 605701 339303 -107948
592 -107948 -91247 46799 109435 84853 10470 -197434 657595 512981 814466 573913 254923
581 254923 118197 -33246 -368772 -428149 67389 -254125 -158240 -379920 -405503 146526
571 146526 53166 100354 126973 347139 89884 196038 44289 -15311 -116331 33856 108330
560 108330 -142328 -177860 291823 249966 -93409 -332178 -697121 45066 155367 136694
550 136694 142043 443640 109633 -268307 -393893 -340822 18990 -7961 -510433 -465146 -435063
539 -435063 -59030 -442723 -14694 -525661 -282672 195771 -411475 -234325 51512 -386623
529 -386623 -334271 -150021 -485257 -468526 -92158 -91145 258812 216036 -248287 -620632 212862
518 212862 268142 111819 460897 279520 203254 278202 -113140 152766 -24583 -234907
508 -234907 -123409 99757 396304 249063 411938 195005 149926 -157343 153225 239567
498 239567 273883 353983 356496 290260 338268 261891 27763 173336 111639 157430 -135231
487 -135231 1037 55560 20208 -169619 -163879 498419 -233049 -232160 -18745 79284 -368295
476 -368295 -56029 363188 470592 483457 345187 448327 662268 520150 301110 244352
466 244352 178502 -391456 -15343 257618 -644488 -695407 68012 349779 175468 22063
456 22063 21346 -418661 -399780 -177769 289696 -42320 -170690 14711 167636 4198 -68498
445 -68498 -148434 690476 256347 -9638 204054 130794 126579 741953 677146 417389 368664
434 368664 196845 -289994 -861535 -253987 -467150 -664814 -247937 -176279 -280042 -70288
424 -70288 -472873 -317370 -193571 -56107 460825 201333 396736 389212 276315 -36945
414 -36945 -231295 -86209 74064 252522 -125844 112937 -16463 254581 -255020 -383969
404 -383969 -435529 -397326 -158587 -187973 -59002 -154920 -241068 -283976 -510200 -34287 357154
393 357154 282937 -151991 198064 16651 176182 -13396 -341701 -559441 -489967 -276879
383 -276879 -216353 -261469 -88931 32512 247155 -46617 -378464 -379784 -147011 -125948 -420306
372 -420306 -495166 -13746 -124025 -551683 -604527 -453244 -205201 -161651 -118870 -116169 78271
361 78271 249855 -108941 157082 318392 198072 43754 -120396 25281 -187641 272677
351 272677 -147159 -258822 -108413 -277762 302017 551852 119849 -150001 -231403 -268678
341 -268678 -790971 -39710 -247544 -141975 78867 107328 450442 730034 532536 427375
331 427375 75283 -106735 -709101 -275418 -226140 -203102 100868 -14151 -4759 419 -463319
320 -463319 -688345 -468336 -235002 -100907 -544954 -18137 193188 3623 -4797 174524
310 174524 -9635 53802 -84427 -39993 -393970 -347757 -205799 -220192 -317316 -779305 -758635
299 -758635 -437005 -166931 405676 362595 184490 92860 40995 -133330 -192447 -635326 -457086
288 -457086 -97903 -3964 -66923 -60666 -383183 -514292 -71922 -170344 50202 307 -306389
277 -306389 216596 271341 -250797 -530337 -438722 -387759 -350228 -448593 -334675 243986 126444
266 126444 -62315 263940 -169334 -277125 413924 -595 -140731 50518 -269589 170419
256 170419 -74676 -127483 -33104 -265133 90494 -340246 -216768 -277497 -771628 -516664
246 -516664 -358893 350677 880777 372756 -364462 -755344 -267964 -105478 -128329 104955
236 104955 91130 -167694 -107580 171217 478889 73829 -314934 -158494 66096 144839
226 144839 -94474 -74725 96173 238427 -107457 62146 206463 -241134 -277008 -647965
216 -647965 -455956 -40698 -226187 -526712 -174555 -393824 132592 406886 312642 356339
206 356339 -16039 -47228 -377670 -143774 -377962 -529542 -298092 -339264 -128545 219327
196 219327 78439 -35498 111737 -296706 -132043 80069 -163685 -494596 -549633 -232045
186 -232045 -363509 -304578 -184411 -210551 -61956 -35857 -375963 -161290 116120 -225921
176 -225921 -140485 -271177 -79317 -45447 -451502 -539152 -296405 247232 611866 438697
166 438697 458149 116007 660212 393466 170297 427074 69861 368787 300864 237588
156 237588 278597 57518 -513009 -727255 -784380 -328619 -39032 -123147 -226560 -39254
146 -39254 -79804 -293267 -171183 -316416 -304591 -14694 464223 401807 -150331 8863 59735
135 59735 -80266 179735 26105 -37858 157035 80711 150951 -443796 -275587 -70406 -120908
124 -120908 -237586 -316826 -52486 -262050 -499100 -393274 270616 272860 79374 6852 -171538
113 -171538 27067 -298630 -344308 -21283 -304901 -303896 -39244 401193 649946 546602
103 546602 -256052 -336675 217315 127875 -11604 -472060 -385347 -277017 -85027 -313383
93 -313383 -189361 57171 -166559 37728 -282384 -389772 -529193 -612236 -60155 99433
83 99433 -377200 -402418 -135862 244287 -149721 -101857 17610 -23356 294944 -178478 65971
72 65971 7731 63389 37580 -7393 -269936 -486464 -213278 -135418 -177578 21943 390794
61 390794 437753 -71879 11209 9813 216039 171459 180474 40818 111411 191475 -240815 -169608
49 -169608 -4652 -257729 -375686 -316313 -149755 -575371 -405541 -227788 -208245 -159474 -142266
38 -142266 189832 -154251 -113779 -6741 -18312 -165315 83369 -34718 -243521 -113931
28 -113931 217895 -132412 -97431 -67473 362486 192845 -198051 -142383 -314050 -338476 1138
17 1138 163115 -13743 61303 216635 679 113667 -10171 -177222 -53043 233377 88668
6 88668 175433 188865 181881 -109780 -705914 -774370
0 -774370
$$ Imaginary data points
##PAGE= N=2
##DATA TABLE= (X++(I..I)), XYDATA
16383 -4242740 -4318520 -4110676 -4312280 -4349244 -4452734 -4291724 -3985663 -3681282 -3331886 -3930747
16373 -3930747 -3685829 -3781759 -3541837 -3297302 -3297364 -3256964 -3278970 -2990234 -3213446 -3088777 -3077738
16362 -3077738 -2847085 -2938474 -2712260 -2485975 -2319860 -2115791 -2071477 -2175400 -2250606 -1891262
16352 -1891262 -1397395 -1200165 -1555154 -1724924 -1617745 -1369770 -1179018 -1235587 -1338024 -1020858
16342 -1020858 -1364425 -1648934 -1072164 -867768 -522041 -483236 -477475 -280962 -512027 -576678
16332 -576678 -812490 -441309 -372931 -420114 -481094 -528883 7091 305104 194289 115740
16322 115740 122720 -41147 14771 539498 940865 805201 1007622 1223786 1418937 1000830
16312 1000830 581302 527961 720229 728813 1035417 1483115 1191027 1099257 1336449 1301648
16302 1301648 1035389 1371224 1320821 1601125 1595925 1727683 1850930 1964745 2269554 2200723
16292 2200723 2328730 2542062 2598711 2305924 2594199 2830322 2634201 3001639 2558635 2192287
16282 2192287 2381375 2612290 3245620 3252920 3287226 3145461 3424789 3747242 3581587 3704465
16272 3704465 3803505 3944316 4117407 3661696 3891892 3900758 3878683 4069607 3706979 3841330
16262 3841330 3812749 3966297 3947564 3965205 4313255 3909929 3802158 4046690 4011671 3983379
16252 3983379 3860470 3687388 4401393 4215032 3831395 3978268 4274396 3879340 4264275
16243 4264275 4595048 4320627 4407265 4463635 4758104 5105226 5237497 5197170 4797371 4288987
16233 4288987 4562564 4924577 5287699 5507858 5426822 5359993 5217221 5264836 5514151 5485236
16223 5485236 5433280 5641779 5294943 5596780 5909095 5934577 6188310 5917738 6105166 5675587
16213 5675587 5957377 5789126 5808268 6256109 5710766 5951176 5980543 6054982 6093921 6372810
16203 6372810 6479259 6534262 6044662 5874958 6152743 6323811 6533620 6469394 6753482 6153601
16193 6153601 6271831 6567268 7248969 6717915 6923837 6981262 6812665 7152842 7191117 7472806
16183 7472806 7178638 7204128 7371532 7267059 6724585 6755362 7209448 7254756 6904895 6636786
16173 6636786 6877074 7436870 7831987 7586858 7556840 7297336 6924379 6829115 7241596 6974374
16163 6974374 7581222 7696661 7312046 7127390 7219676 7272987 7320706 7284437 7132368 7321111
16153 7321111 7307827 7494701 7976880 7871741 7318731 7509311 7808112 7915940 7650522 7554960
16143 7554960 7084661 6976083 7031964 7165119 7447927 7652727 7857158 7894785 7701781 8000776
16133 8000776 7730787 7709127 7630819 7536356 7724660 7596311 7585713 7682533 8208779 8150849
16123 8150849 8346398 8642803 8170340 8272449 7629916 7779587 7971198 8595267 8702845
16114 8702845 8118595 7609779 7458446 7525804 7666269 8332748 8320081 7980046 7787222 8052838
16104 8052838 8113854 8333143 8008210 8020854 7964158 7917856 7796306 7992211 7807628 8120746
16094 8120746 8423207 7875701 7740734 7566787 7783402 8056244 8146484 8216943 8162169 7937776
16084 7937776 8212437 7960078 8127135 8186676 8056535 8357396 8163736 7770994 7698233 8361876
16074 8361876 8169275 7883636 7561981 7912111 8272344 8098578 7956807 7718725 7937736
16065 7937736 7790200 7837624 8029377 7772877 7601892 7882514 7758779 7590826 8477493 8420289
16055 8420289 7979236 8165026 7966572 8056106 7854166 7612552 8000674 8288537 8268902 8322099
16045 8322099 8384296 8298303 7954485 8461781 7970642 7755542 7780120 7922281 7805651 7836066
16035 7836066 8072565 8400958 8521802 8727133 8583163 8373493 8060665 7694636 7838991
16026 7838991 8359352 8008727 7793869 8144667 8146637 8085417 8068550 8385930 8236294 8315303
16016 8315303 8205750 8260025 8533331 8833248 8827965 8481707 8037799 8175614 8094212 8134764
16006 8134764 8032132 8323069 8707521 9043388 8389012 8371093 8123016 7607700 7908344 8256366
15996 8256366 8854552 8717249 8432844 8148698 8382305 8421697 7968664 7805717 7881563 8064445
15986 8064445 7952279 8266211 8417692 8054317 7597044 7650640 8114747 7943957 8586603 8773190
15976 8773190 8277543 8320719 8270835 8351048 8424366 8492026 8867376 8872809 8328094 8803194 9201325
15965 9201325 8740687 8263565 8482570 8092617 8207574 8209866 8233541 8829695 8623117 8171439
15955 8171439 8242597 8416173 8232298 7985277 7993869 7648270 8068487 8734140 8439166 8238421
15945 8238421 8003519 8139737 8052694 7796983 7618142 7673276 8049975 8220911 8134628 8171805
15935 8171805 8256198 8206002 8285377 8236459 8234068 8317272 8199547 7596852 7646119 8090721 8065075
15924 8065075 8384646 8529758 8389515 8176095 8161295 8502472 8324698 8122208 8860874 9095378
15914 9095378 8843977 8606499 8429018 8632302 8471062 8205679 8122245 7820551 8262586 8694345
15904 8694345 8566351 8079252 8038204 8301461 8713766 8609978 8497573 8561135 8383489 8506999
15894 8506999 8325452 8812713 8716679 8166283 8070596 8370011 8203625 7987063 8482796 8284106
15884 8284106 8740227 9021135 8806129 8471101 8225300 7839129 8293643 8727178 8503316
15875 8503316 8629246 8566177 8387628 8421807 8557916 7948507 8096722 8462749 8431554 8250482
15865 8250482 8542812 8693323 8517286 8381854 8278744 8846561 8928266 8667784 8944212 9002207
15855 9002207 8843103 8314141 7724552 7954101 8487377 8630777 8181231 8379786 8751091
15846 8751091 8401601 8105395 7914164 8219057 8446527 8478726 8668249 8600506 8510789 8583964
15836 8583964 8492577 8195046 9044890 8501851 8235815 8543761 8506177 8736017 9123074 9137020
15826 9137020 8939488 8683455 8450388 8391329 8398583 8430447 8033880 8109934 8100360 8232612 8143369
15815 8143369 8053275 8381709 8814488 8516744 8963673 8869668 8492164 8252189 8543493 8622669
15805 8622669 8344013 8346234 8129193 8729200 8797936 8394712 8126279 7661937 7520729 8252106
15795 8252106 8837769 8917460 8693576 8359519 8334273 8211831 7962127 8088588 8006182 8330540
15785 8330540 8139587 7757393 7676541 7780943 7655969 7709282 8091541 7918931 8011966 7837845
15775 7837845 8041542 8277669 8124480 7908749 8138096 8586272 8075803 8054094 8182143 8248485
15765 8248485 8330494 8523236 8781220 8259969 8117167 8326193 7957319 8052421 8370455 8894339
15755 8894339 9049590 8613857 8629744 8212080 8119167 8555968 8354701 8117187 8305384 8711141
15745 8711141 8706559 8419237 8372706 8192450 8176660 8455952 8162840 8609974 8181778 7777218
15735 7777218 8236260 8471865 8519095 8274143 7994724 8178909 8552482 9004007 8877252 8448170
15725 8448170 8666308 8427158 8429226 8408881 8723941 8727167 8444358 8356724 8554095 8516730 8935978
15714 8935978 8234928 8326941 8232219 8389012 8440542 8388732 8325923 8496158 8421779 8568114
15704 8568114 8675958 8489513 8220967 8128365 8056893 7976915 8379632 8195487 8781136 9167318
15694 9167318 8658664 8139764 8379199 8408758 8279048 7783487 8217892 8121857 8043061 8503814
15684 8503814 8663768 8928680 8611053 8466693 8601753 8234197 8615908 9085168 8834869
15675 8834869 8572643 8585319 8467105 8635422 8507601 8198759 8667193 8995652 8558522 8198922
15665 8198922 8683315 9230895 9242913 9302541 9390197 9080356 9299074 9170889 8543857 8627425
15655 8627425 8627709 8631488 8374732 8754995 8586868 8640025 8576953 9040131 8795688 8128914 8481402
15644 8481402 8542204 7944835 7955687 8455003 7956290 8202894 8107310 8382158 8422052 8795515
15634 8795515 8623632 8852865 8628239 8643034 8660624 8650384 8412910 8748227 9031192 8539364
15624 8539364 8574174 7918776 8220038 8495536 8350998 8479116 8743655 8738704 8751774 8619249
15614 8619249 8709874 8594260 8598482 8536045 8741369 8615714 8673700 8422534 8659890 8587182
15604 8587182 8985350 8887349 8494003 8106061 8158717 8427228 8454215 8573529 8330157 8651070
15594 8651070 8468194 7857069 7814137 8393539 8830892 8686368 8253439 8490542 8262778 8625453
15584 8625453 8355777 8291152 8183230 8610347 8562756 8378667 8309090 8209392 8620796 8846075
15574 8846075 8951529 9153523 8868777 8340801 8277835 8739947 8622634 8582273 8803628 8737347
15564 8737347 8818194 8622801 8642461 9007780 8718910 8296810 8418508 8500515 8591538 8261501
15554 8261501 8510873 8948192 9144191 8989775 8720402 8488964 8847769 8721341 8971183
15545 8971183 8656490 8528420 8334072 8148187 8255866 8517344 8849984 8703799 8615340 8194642
15535 8194642 8544876 9188870 8565023 8251543 8983388 8894026 8436874 8931779 8485114 8422769
15525 8422769 8292489 8558130 8253330 8275523 9112893 9036124 8635192 8594485 8947142 8881497
15515 8881497 8978924 9286452 9132782 8720219 8004891 8128985 8755813 8458648 8676747 8775907
15505 8775907 8747999 8341154 8685898 9037263 9355601 8972560 9006469 9213558 8529329 8870076
15495 8870076 8828476 8426327 8450745 8733611 8613510 8689586 8779770 8773260 8749883 8272069 8579595
15484 8579595 8689589 8471937 8402324 8540175 8921418 9119657 8598566 8638448 8522662 8808619
15474 8808619 8852212 8941275 8719270 8430672 8601545 8563450 8694950 8685245 8452761 8857595
15464 8857595 8896791 9149719 9096131 8860394 8916961 9076957 8648238 9026833 9103475 8742380
15454 8742380 8840214 9225122 8892821 8829798 8830219 8834784 8570907 8903710 9206798 8972805 8364834
15443 8364834 7998281 8484215 8586226 8368258 8161877 8566289 8536841 9130256 8786785 8511962
15433 8511962 8668159 8686130 8447026 9041816 8908587 8892549 8837534 8675991 8775505 8720573
15423 8720573 8869656 8871906 8775700 8757752 8240565 8147819 7997798 8133191 8403500 8480310
15413 8480310 8717055 9045902 9008122 8845699 8909538 9129764 9229154 9228684 9232160 8616238 8640456
15402 8640456 8553849 8586547 9052835 9100830 9513760 9494582 9185279 9021763 8870741 8626893
15392 8626893 8269003 8355357 8346890 8461452 8388717 8845099 8613158 8455661 8557658 8044508
15382 8044508 8157091 8107645 8628250 9345571 9349421 9019123 8473469 8546806 8631667 8567217
15372 8567217 8892983 8783093 8464995 8459610 8703626 9036683 9202237 8800954 8592817 8394744
15362 8394744 8422727 8648034 8842410 8446179 8688812 8981389 9568846 9204161 9239514 9566922
15352 9566922 9279423 8998711 8784271 8957221 9052162 8916202 8986002 9167460 8951440 8962586
15342 8962586 9143475 9072152 9160708 8792116 8395355 8103123 8348576 8611735 8645375 8635207
15332 8635207 8193578 8906953 9124333 9169434 8899528 8755912 8907743 9111047 9104620 8756085
15322 8756085 8117812 8580510 8857550 8488393 8492112 8432854 8877328 8913547 9005324 8597579
15312 8597579 8907979 8751787 8816692 8405792 8220947 8799163 8766033 8566083 8502274 8868196
15302 8868196 8709818 8946142 8740251 8829520 8646107 8315620 8638871 8484057 9044743 9565590
15292 9565590 9514697 9486234 9118841 8942324 8530433 8696300 8923140 8559364 8796670 8354042
15282 8354042 8677280 9022407 8563045 8791604 8399695 8569752 8657531 8811983 8633411 8875013
15272 8875013 9360297 9225228 9348458 9307368 9032813 9134109 8972121 9052337 8595763 8708624
15262 8708624 8763409 9121689 9142277 9143912 8812023 8580587 8443091 8635083 8497053 8562334
15252 8562334 8750735 9245568 9565387 9441412 9196939 9389073 9013712 8612733 8765402
15243 8765402 9015632 9073797 8758882 9130311 9272295 8990071 8768658 8441226 8795106 8813829
15233 8813829 8506069 8535633 9028587 9097347 9018352 8685315 8611326 8443493 8065925 9046844
15223 9046844 8819195 8476551 8516736 8545363 8923288 8485714 8544915 9339013 9068634 8941023
15213 8941023 8576435 8801905 8890543 8986946 8561311 8372871 8894425 9014888 8591999 8628787
15203 8628787 8698711 8927209 8815533 9092974 9156826 9241063 8882945 8269244 8898051 9271828
15193 9271828 8760623 8853038 9109401 9380286 9450133 9770657 9179277 9021877 8908322 9233214
15183 9233214 9359551 9322373 8677423 8860969 9449435 9695998 9279324 9251577 9048055 8680591
15173 8680591 8963545 8829962 8793278 9110589 9409694 9036553 8887722 8985390 8849088 9194911
15163 9194911 9678084 8947870 9016524 9174417 8984144 8990559 9219455 9232954 9269458 9281891
15153 9281891 9220341 9237520 9251302 9236252 8775233 8861163 9048841 8423354 9161651 9082564
15143 9082564 8194310 8753181 9428750 9074155 9187776 9395407 8832164 9096971 9292704
15134 9292704 9046166 9433915 9238238 8625996 8657050 8826209 8962748 9184900 9080263 9137901
15124 9137901 9473002 9161277 9257620 9229739 9446233 9046409 8440087 8757919 8789329 8874696
15114 8874696 8744506 8771202 8974895 9176945 8872998 8808588 8785539 9106030 9254417 9151728
15104 9151728 9045567 8890440 8737692 9085294 8792371 8932669 9235417 8970597 8839368
15095 8839368 9383304 9301659 9260618 9468724 9555953 9505055 9285625 9370924 9495952 8914113
15085 8914113 9037951 9223383 9165169 9214245 9186420 9257062 9129112 9211224 9109548 9626257
15075 9626257 9685189 9776847 9189192 8993427 9376294 9308994 8866685 8645251 9317733 9539234
15065 9539234 9485571 8771169 8635803 8327799 8812844 9365839 9181445 8912673 8644523 9221533
15055 9221533 8964789 8596072 8674485 8583785 8690803 9171111 8997395 8776895 8885081 9003559
15045 9003559 8872027 8652110 8339314 8361939 8970856 9211743 9798422 9709014 9301487 9068310
15035 9068310 9073007 8665719 8721136 8972738 9269188 8965596 8682657 9168480 9190105 8951064
15025 8951064 8661182 8598085 8537696 9161182 8674813 8695155 9195965 9542750 9550988 9435504
15015 9435504 9592198 9316771 8859295 8968200 8562707 9031054 9374067 9355078 8959760 9191145
15005 9191145 9470038 9833347 9333375 8941655 9185610 8900365 9268689 9109026 9234545
14996 9234545 8939268 8629301 9269189 9030474 9249392 9196311 8667082 9034442 9094870 9291016
14986 9291016 9412277 9501888 9429782 9190766 8902351 9223464 9071226 9286427 9267755 9219605
14976 9219605 9198193 9007840 8682307 8805408 9164050 9169514 9456725 9515260 9443997 9023719
14966 9023719 9243210 9191768 8855095 8928478 9349616 9158744 8819203 8570332 8851082 9221949
14956 9221949 9493295 9381015 9470505 9874854 9484598 9316277 9202990 9604445 9567835 9165465
14946 9165465 9242581 9081473 9163548 9341278 9570662 10174631 9511619 9502019 9478524 9548717
14936 9548717 9710314 9442518 9296408 9265964 9149794 9315612 9115491 8907150 8647382 9192756
14926 9192756 9483091 9209073 9002580 9004854 9313846 9501632 10281445 9517002 9199051 9355095
14916 9355095 9103392 9314283 9498565 9226286 9596594 9657455 9557897 9316327 9364031 9532588
14906 9532588 9138053 9173844 8983414 9133134 9174604 9078487 8971705 9251525 9544583 8963368
14896 8963368 8638985 8874012 9205671 9089025 10031810 9528473 9263796 9286409 9082277 9403377
14886 9403377 9364708 9188566 9120203 9364927 9059206 9190614 9743656 9337266 9270866 9367031
14876 9367031 9427821 9058197 9063466 9514464 9143004 9198441 9390757 9743051 9437304 8925017
14866 8925017 8927293 9184185 9343614 9822161 9818194 9898314 9720944 9281525 9316962 9582885
14856 9582885 9250019 8795659 9225065 9322352 8968682 9230256 9584971 9492048 9333027 9250649
14846 9250649 9070697 9003133 9144622 8912972 9080071 9492095 9593809 9196795 9109837 9640073
14836 9640073 9735127 9723175 9330400 9348316 9210110 9416553 9151373 8518138 8916043 9284032
14826 9284032 9420555 9226331 9420384 9465410 8950509 8982422 8895264 8837505 9331664 9234553
14816 9234553 8886363 9177818 9864326 10133711 10033139 9902365 9392873 9633900 9606002 9484841
14806 9484841 9423228 9660478 9834572 9620220 9555094 9441847 9502458 9790784 9598478 9260454
14796 9260454 9547998 9727348 9866004 9526088 9089970 9127839 9373267 9195884 9305400 9839846
14786 9839846 9566740 9296566 9222233 9639579 9823572 9403405 9527529 9484763 9220942 9623734
14776 9623734 10021626 9900751 9010779 9008040 9353152 9739872 9513781 9404351 9468550 9295949
14766 9295949 9092725 9305053 10067420 9964500 9973747 9853103 9836559 9455196 9230167 9131743
14756 9131743 9345450 9884439 9843272 9543788 9818772 9378665 9309543 9438782 9477188 9585206
14746 9585206 9265299 9235607 9141572 9093368 9267379 9146761 9440028 9455094 9579249 9290789
14736 9290789 9234911 9564720 9521319 9280294 9258138 9681437 9414296 8752682 9155700 9058547
14726 9058547 8821737 8987237 9069262 9278766 8786596 8457526 8827667 8976716 9393043 9091359
14716 9091359 9139581 9364885 9609477 9988219 9866155 9435262 9246737 9280051 8743923 8723393
14706 8723393 9526653 9849539 9795451 9628717 9854593 10460668 10026421 9737877 9609271 9136867
$$ [...]
##END NTUPLES=NMR SPECTRUM
##END=
