##TITLE=1H_EC-3328(1)
 CDCl3
 8 sc, 
 8.5.2024
##JCAMPDX= 6.0         $$ Bruker NMR JCAMP-DX V2.0
##DATA TYPE= NMR SPECTRUM
##DATA CLASS= NTUPLES
##ORIGIN= UXNMR, Bruker Analytische Messtechnik GmbH
##OWNER= root
$$ XWIN-NMR		Version 3.5
$$ Wed May  8 13:55:27 2024 Russian Standard Time (UT+4h)  she@DPX200
##.OBSERVE FREQUENCY= 200.1309
##.OBSERVE NUCLEUS= ^1H
##.ACQUISITION MODE= SIMULTANEOUS
##.ACQUISITION SCHEME= undefined
##.AVERAGES= 8
##.DIGITISER RES= 18
##SPECTROMETER/DATA SYSTEM= spect
##.PULSE SEQUENCE= zg30
##.SOLVENT NAME= CDCl3
##.SHIFT REFERENCE= (INTERNAL, CDCl3, 0, 16.5689)
##AUDIT TRAIL= $$ (NUMBER, WHEN, WHO, WHERE, WHAT)
$$ ##TITLE= Audit trail, XWIN-NMR		Version 3.5
$$ ##JCAMPDX= 5.01
$$ ##ORIGIN= Bruker BioSpin GmbH
$$ ##OWNER= she
$$ F:/spectra/data/she/nmr/H-F/1/pdata/1/auditp.txt
$$ ##AUDIT TRAIL=  $$ (NUMBER, WHEN, WHO, WHERE, WHAT)
(   1,<2024-05-08 13:54:20.65 +0400>,<she>,<DPX200>,
      <created by zg, POWCHK disabled, PULCHK disabled
       configuration hash MD5:
       00 E9 B6 7A A2 85 ED C7 34 08 36 98 17 FE 4E 26
       data hash MD5: 16K
       DB B3 14 2C C8 4B 50 17 56 9E 70 83 2C C4 82 66>)
(   2,<2024-05-08 13:54:22.90 +0400>,<she>,<DPX200>,
      <Start of raw data processing
       efp BC_mod = 2 LB = 0.24 FT_mod = 6 PKNL = 1 PHC0 = -25297.42 PHC1 = 10.38749 SI = 16K 
       data hash MD5: 16K
       DF AB 06 77 9F E5 A1 40 5E 70 0A 41 23 A4 19 64>)
(   3,<2024-05-08 13:54:42.51 +0400>,<she>,<DPX200>,
      <pk PHC0 = -157.6451 PHC1 = -0.3999998 
       data hash MD5: 16K
       7B C5 E1 01 4C C1 1F EA 25 BF C7 41 3D F4 2E 66>)
(   4,<2024-05-08 13:54:45.82 +0400>,<she>,<DPX200>,
      <abs ABSG = 5 
       data hash MD5: 16K
       D4 38 98 AE 41 90 90 AB B8 6B 6A CF DF 65 4C 01>)
$$ ##END=
$$ 
$$ hash MD5
$$ BA 47 66 74 6C E5 F6 AE 1F 86 39 18 C3 DA B1 25
##$RELAX= 
##$RELAX= 
##$RELAX= 
##$RELAX= 
##$RELAX= 
##$RELAX= 
$$ Bruker specific parameters
$$ --------------------------
##$DU= <F:/spectra>
##$EXPNO= 1
##$NAME= <H-F>
##$PROCNO= 1
##$TYPE= <nmr>
##$USER= <she>
##$AMP= (0..31)
100 100 100 100 100 100 100 100 100 100 100 100 100 100 100 100 100 100 
100 100 100 100 100 100 100 100 100 100 100 100 100 100 
##$AQSEQ= 0
##$AQ_mod= 1
##$AUNM= <au_zg>
##$AUTOPOS= <>
##$BF1= 200.13
##$BF2= 200.13
##$BF3= 200.13
##$BF4= 200.13
##$BF5= 200.13
##$BF6= 200.13
##$BF7= 200.13
##$BF8= 200.13
##$BYTORDA= 1
##$CFDGTYP= 0
##$CFRGTYP= 5
##$CHEMSTR= <none>
##$CNST= (0..31)
1 1 145 1 1 1 1 1 1 1 1 1 1 1 1 1 1 1 1 1 1 1 1 1 1 1 1 1 1 1 1 1 
##$CPDPRG= <>
##$CPDPRG1= <>
##$CPDPRG2= <>
##$CPDPRG3= <>
##$CPDPRG4= <mlev>
##$CPDPRG5= <mlev>
##$CPDPRG6= <mlev>
##$CPDPRG7= <mlev>
##$CPDPRG8= <mlev>
##$CPDPRGB= <>
##$CPDPRGT= <>
##$D= (0..31)
0 1.2 0 0 0 0 0 0 0 0.06 0 0.03 0 0 0 0 0.0002 0 0 0 0 0 0 0 0 0 0 0 0 
0 0 0 
##$DATE= 1715162060
##$DBL= (0..7)
120 120 120 120 120 120 120 120 
##$DBP= (0..7)
150 150 150 150 150 150 150 150 
##$DBP07= 0
##$DBPNAM0= <>
##$DBPNAM1= <>
##$DBPNAM2= <>
##$DBPNAM3= <>
##$DBPNAM4= <>
$$ [...]
##$SUBNAM3= <"">
##$SUBNAM4= <"">
##$SUBNAM5= <"">
##$SUBNAM6= <"">
##$SUBNAM7= <"">
##$SUBNAM8= <"">
##$SUBNAM9= <"">
##$SW= 18.0517689322627
##$SWIBOX= (0..15)
0 0 2 0 0 0 0 0 0 0 0 0 0 0 0 0 
##$SW_h= 3612.71676300578
##$TD= 16384
##$TD0= 1
##$TE= 0
##$TE2= 300
##$TE3= 300
##$TEG= 300
##$TL= (0..7)
0 120 120 120 120 120 120 120 
##$TP= (0..7)
150 150 150 150 150 150 150 150 
##$TP07= 0
##$TPNAME0= <>
##$TPNAME1= <>
##$TPNAME2= <>
##$TPNAME3= <>
##$TPNAME4= <>
##$TPNAME5= <>
##$TPNAME6= <>
##$TPNAME7= <>
##$TPOAL= (0..7)
0.5 0.5 0.5 0.5 0.5 0.5 0.5 0.5 
##$TPOFFS= (0..7)
0 0 0 0 0 0 0 0 
##$TUNHIN= 0
##$TUNHOUT= 0
##$TUNXOUT= 0
##$USERA1= <user>
##$USERA2= <user>
##$USERA3= <user>
##$USERA4= <user>
##$USERA5= <user>
##$V9= 5
##$VALIST= <valist>
##$VCLIST= <CCCCCCCCCCCCCCC>
##$VD= 0
##$VDLIST= <DDDDDDDDDDDDDDD>
##$VPLIST= <PPPPPPPPPPPPPPP>
##$VTLIST= <TTTTTTTTTTTTTTT>
##$WBST= 1024
##$WBSW= 4
##$XGAIN= (0..3)
0 0 0 0 
##$XL= 0
##$YL= 0
##$YMAX_a= 358115
##$YMIN_a= -202712
##$ZGOPTNS= <>
##$ZL1= 120
##$ZL2= 120
##$ZL3= 120
##$ZL4= 120
##$ABSF1= 16.56778
##$ABSF2= -1.484125
##$ABSG= 5
##$ABSL= 3
##$ALPHA= 0
##$AQORDER= 0
##$ASSFAC= 0
##$ASSFACI= 0
##$ASSFACX= 0
##$ASSWID= 0
##$AUNMP= <proc_1d>
##$AZFE= 0.1
##$AZFW= 0.1
##$BCFW= 0
##$BC_mod= 2
##$BYTORDP= 0
##$COROFFS= 0
##$CY= -3
##$DATMOD= 1
##$DC= 0
##$DFILT= <>
##$DTYPP= 0
##$F1P= 0
##$F2P= 0
##$FCOR= 1
##$FTSIZE= 16384
##$FT_mod= 6
##$GAMMA= 0
##$GB= 0
##$INTBC= 1
##$INTSCL= 3.70164e-10
##$ISEN= 128
##$LB= 0.24
##$LEV0= 0
##$LPBIN= 0
##$MAXI= 10000
##$MC2= 0
##$MEAN= 0
##$ME_mod= 0
##$MI= 1.114404
##$NCOEF= 0
##$NC_proc= -7
##$NLEV= 6
##$NOISF1= 3.799351
##$NOISF2= 2.8
##$NSP= 0
##$NTH_PI= 0
##$NZP= 0
##$OFFSET= 16.56888
##$PC= 1
##$PHC0= -25455.06
##$PHC1= 9.987491
##$PH_mod= 1
##$PKNL= yes
##$PPARMOD= 0
##$PSCAL= 0
##$PSIGN= 0
##$REVERSE= no
##$SF= 200.129390437989
##$SI= 16384
##$SIGF1= 3
##$SIGF2= 2
##$SINO= 5.538805
##$SIOLD= 16384
##$SREGLST= <1H.CDCl3>
##$SSB= 0
##$STSI= 16384
##$STSR= 0
##$SW_p= 3612.71676300577
##$SYMM= 0
##$S_DEV= 0
##$TDeff= 16384
##$TDoff= 0
##$TI= <>
##$TILT= no
##$TM1= 0
##$TM2= 0
##$TOPLEV= 0
##$USERP1= <user>
##$USERP2= <user>
##$USERP3= <user>
##$USERP4= <user>
##$USERP5= <user>
##$WDW= 1
##$XDIM= 16384
##$YMAX_p= 350730910
##$YMIN_p= -435109
$$ End of Bruker specific parameters
$$ ---------------------------------
##NTUPLES= NMR SPECTRUM
##VAR_NAME=  FREQUENCY,     SPECTRUM/REAL,   SPECTRUM/IMAG
##SYMBOL=    X,             R,               I
##VAR_TYPE=  INDEPENDENT,   DEPENDENT,       DEPENDENT
##VAR_FORM=  AFFN,          ASDF,            ASDF
##VAR_DIM=   16384,         16384,           16384
##UNITS=     HZ,            ARBITRARY UNITS, ARBITRARY UNITS
##FACTOR=    0.220516191357247, 1,           1
##FIRST=     3315.91987088604, 0,            0
##LAST=      -296.796892119728, 0,           0
##MIN=       -296.796892119728, -435109,     0
##MAX=       3315.91987088604, 350730910,    0
$$ Real data points
##PAGE= N=1
##DATA TABLE= (X++(R..R)), XYDATA
$$ [...]
7470I78112J4587j0954K369p2096l0979l3714M444J206P5471j05270J6007q3991
7458G55192k6733K2822n4600O1990O7542p2812l3436l3554n3471l2502m2444P4272
7446F32266q266r5197j7640j5432O9302k5035m3344j0014R120m9367m5553P7812
7434D78652J6897n4124L1614j26386p0093L2865M4524K1622k6101o7628J7102
7423B98944L3977j954o5680J4579k0905k6941m036J8561o272n5636L5857L1322
7411B51816J3336q6352j9138P521n8975O3422J7013J4600l3155k8049k554P4461
7399B13946J320n3851N8209k6020k8335l0456k0357k749N1507o1862M1148l5865
7387A06635j4303J1968K0367L6438r9705J333N7634J3187J5994J5502k9497J0356
$$ y = [978112, 992699, 981745, 984114, 912018, 881039, 847325, 851769, 852975, 928446, 823176, 839183, 755192, 728459, 751281, 696681, 758671, 826213, 753401, 719965, 686411, 632940, 600438, 557994, 632266, 624000, 528803, 511163, 495731, 565033, 539998, 496654, 486640, 495760, 446393, 400840, 478652, 495549, 441425, 473039, 346653, 276560, 309425, 353949, 375571, 349470, 281842, 298944, 332921, 330967, 265287, 279866, 258961, 232020, 227984, 246545, 240273, 184637, 220494, 251816, 265152, 178800, 159662, 167183, 108208, 171630, 188643, 203243, 170088, 142039, 139485, 213946, 215266, 161415, 219624, 193604, 165269, 134813, 114456, 111707, 163214, 101352, 142500, 106635, 92332, 104300, 124667, 161105, 61400, 62733, 120367, 133554, 149548, 165050, 135553, 145909]
7375A45909K4538M8554j5957j5944J2456k7427J9637L7341p5638l7560N8763l6165
7363A38507O765k2891k1034j521m1234L6117O9259L9312K9289m439P3598k7979
7351B73749m6549k3333L0658L4048r569M8683q7058j5785J5141K6524P9591q4605
7339B41495q0750P6546J2650J7479P852l1683J07812M3095k5095P3873R2069L5792
7327E71135R7568L1740R0972J1078r5976o2737r8934k4459j00530j21842O7416
7316C65431q7246p3021k6256L2799M1669j6112k1645q89p7865j7096j6959n1097
7304E1713L6545j1954j0049l8965M3215N4411q0770k9308K8811L2130j1220N1649
7292A16208J2450m9843M2186n2578q1889j4553N7570k3232j5543k3558n1498M0270
$$ y = [145909, 170447, 219001, 203044, 187100, 199556, 172129, 191766, 229107, 153469, 115909, 174672, 138507, 145272, 122381, 101347, 99826, 58592, 94709, 163968, 203280, 232569, 228130, 301728, 273749, 227200, 203867, 234525, 268573, 259004, 307687, 220629, 204844, 219985, 246509, 326100, 241495, 160745, 237291, 249941, 267420, 275272, 243589, 351401, 394496, 369401, 443274, 535343, 571135, 668703, 700443, 791415, 802493, 706517, 643780, 544846, 520387, 419857, 298015, 365431, 278185, 205164, 178908, 211707, 253376, 237264, 215619, 214730, 136865, 119769, 102810, 51713, 88258, 76304, 66255, 27290, 70505, 124916, 44146, 14838, 43649, 75779, 64559, 116208, 128658, 78815, 121001, 68423, -13466, -28019, 29551, 6319, -9224, -32782, -84280, -44010]
7280d4010Q7129Q1786J3402j9224j6623k3083J5518M1856J668j12227J9139j1204
7268C4127J646N7036J0659L9980j02634j7219m9706J1152R6394J0214L9362m6615
7256H4396l6689K2368L4017j2311L0716m602l9137j9493o2992O7835L8841j8511
7244H4438l1638K8291o1271n6587R9391l7413m4395P1963P2461p1936k7470J1879
7232C7713p624k2044j8832K6194R104P035P8275r1217l0922J4159J3768K0831
7220C6440l7423M5340k7874L4954J8256n3819O0781q671l9766K7794J9485j07409
7208c1912j2323J6741l6678M5678j927j1439j3953R850J4978k1884m1758j1689
7196i6316L9517N0433l1519l812O7716M9533m0079j318m291Q150K000p2541L0849
$$ y = [-44010, 43119, 124905, 138307, 119083, 102460, 79377, 94895, 136751, 138419, 26192, 45331, 34127, 35773, 92809, 103468, 143448, 40814, 23595, -26111, -14959, 81435, 91649, 131011, 84396, 47707, 70075, 104092, 91781, 122497, 117895, 78758, 59265, -3727, 64108, 102949, 84438, 52800, 81091, 19820, -36767, 62624, 25211, -19184, 52779, 125240, 53304, 25834, 37713, 30089, 8045, -10787, 15407, 24511, 31546, 109821, 18604, -12318, 1841, 15609, 36440, -983, 44357, 16483, 51437, 69693, 15874, 76655, 67984, 28218, 56012, 75497, -31912, -44235, -27494, -64172, -18494, -20421, -31860, -45813, -35963, -20985, -42869, -84627, -96316, -56799, -6366, -37885, -41697, 26019, 75552, 35473, 34155, 29864, 38014, 40014, -32527, -1678]
7183a678O5151J1794l7921L0395J01831N8114K7064P985j8117l3149j6940J5941
7171B10470m9754l2663k6915L0210l1804o6140k6174j4247K0108j7725L9561K2136
7159E7063K1345q8324o8986K1152j190J2885M5774L5837N9268r638k3915L7860
7147I9131K9443P7643o9292l8423M8711L0541L0704j05573k9930l7058l6445J4174
7135A3626O0317n4704n9454M0936k7925J9820L1091p0143j5007J05727n6316k5334
7123c7366m857o24m7455K5292J6136R8858Q2087K2781l1926o1076O0622l2697
7111H9775j248J10126l815p9652n1028J1037l5970n0677n091k4531P3827n485
7099B7268n6747l2531m3338q2577J10699n813R610M4195j294p814p4546p122K9173
$$ y = [-1678, 63473, 75267, 37346, 67741, 169572, 227686, 254750, 262735, 244618, 211469, 194529, 210470, 160716, 128053, 101138, 131348, 99544, 33404, 7230, -7017, 13091, -4634, 34927, 57063, 78408, -9916, -78902, -57750, -58940, -46055, -281, 35556, 94824, 85186, 61271, 99131, 128574, 206217, 136925, 98502, 147213, 177754, 208458, 102885, 72955, 35897, -548, 13626, 73943, 19239, -40215, 721, -27204, -7384, 23707, -46436, -61443, 44284, -12032, -37366, -42223, -42847, -90302, -65010, -48874, 49984, 132071, 154852, 122926, 61850, 122472, 89775, 88527, 198653, 194838, 115186, 64158, 75195, 39225, -11452, -16543, -41074, 32753, 27268, -29479, -62010, -105348, -187925, -77226, -83039, -73429, -29234, -30528, -38342, -112888, -120010, -90837]
7086i0837K8569O0681l878l0240K2612O093L7711L3811K8353p7016n1917j7085
7074e3143L2778m7875m6124P792j9713n3987N040j736M2375K6454K0297J5120
7062g2722j01352o9539N1294R506O0630j0333n5021j3976K1192O6955j7391K1803
7050a08954p4291M1101N1983r922j3905j5825k0476k954p402M6213p9731M3778
7038a50385O816o663n0534J0668N6416l6083K0671K9687n0202J3684M8282N17
7026a07126k3762l3183j4063n462k2465R512m1532M4137k5619j4056l8505k0501
7014b92625O0512J2542L642k0678L5697n7237P0402k9534o228K1595P803J1718
7002a82391j269o6190R356J8501L995N7926r5875l1719K0124N559L8389k1329
$$ y = [-90837, -62268, -1587, -5465, -35705, -13093, -7000, 30711, 64522, 92875, 15859, -36058, -53143, -20365, -68240, -114364, -106572, -126285, -180272, -175232, -176968, -134593, -108139, -87842, -72722, -174074, -243613, -192319, -182813, -122183, -132516, -187537, -201513, -180321, -113366, -130757, -108954, -183245, -142144, -90161, -100083, -113988, -129813, -150289, -153243, -160645, -114432, -194163, -150385, -143569, -150232, -200766, -190098, -133682, -169765, -149094, -119407, -169609, -155925, -107643, -107126, -130888, -164071, -178134, -183596, -206061, -196549, -238081, -193944, -219563, -233619, -272124, -292625, -232113, -219571, -215929, -236607, -200910, -258147, -187745, -217279, -223507, -201912, -194109, -182391, -183660, -249850, -240494, -221993, -217998, -160072, -255947, -287666, -267542, -261983, -223594, -244923]
6990b44923J08136k5396n5102Q1594j678j07818m0886m430M481Q7204L8267l8385
6978a98936q1523K0369j3932J8332P523j2272O5006m1698q176k1958R8352P96
6966a68117p1050l5768j5557J8669N3440M8981k2150o7129m9096j9342O9637K2977
6954b34505m7608k7403O5844Q705o4159k805N6746M1883M147K2055l8165j9324
6942b34589j9400k1483N8971K031n7442R250K9118J867M1710n6505M1200j5357
6930b20629M896O244J35j3402k3844K8669j7733m4169n075P9917Q413n026k2063
6917b23667m9567J2666K3760j7645P9363P876p9122m0969P9167k6781J2379L3430
6905a89110J1943k3592K3092K747j7258qJ4306l4224M0438q097j8949n4967R160
$$ y = [-244923, -136787, -162183, -217285, -135691, -137369, -245187, -286073, -290503, -286022, -198818, -160551, -198936, -280459, -260090, -274022, -255690, -248167, -260439, -195433, -237131, -245307, -267265, -168913, -168117, -239167, -274935, -290492, -271823, -218383, -169402, -191552, -258681, -307777, -327119, -257482, -234505, -282113, -309516, -243672, -234967, -299126, -301931, -245185, -203302, -199155, -177100, -215265, -234589, -253989, -275472, -216501, -214470, -271912, -262662, -233544, -231677, -189967, -246472, -205272, -220629, -215733, -209489, -209354, -222756, -246600, -217931, -235664, -279833, -284908, -204991, -196578, -201604, -223667, -273234, -260568, -236808, -254453, -175090, -167214, -246336, -287305, -208138, -234919, -222540, -189110, -177167, -200759, -177667, -174920, -192178, -192186, -177880, -212104, -171666, -179763, -198712, -253679, -244519]
6892b44519M3712o3730n3082J2314J07206l0154l347O955l5655o1729J5165P7765
6880b29099q5629l28Q6778m6302j431n684j3179L6105o124K7960Q5400o4171n7395
6867b73099m185J2016O6370L6076k6455n4061j3798O564l262l2189p5681o8567
6855d30271M9159P4460L7441l7154J6573O0191J4513K0001j4418o1434L025L8813
6843b29101L6944l215m3812r768M1537j413l3040l9518j7130N5003L0368r4271
6831c07416N2701J1839l8040k1087L4312k0027J659m046J1300m5110R673L8856
6819b75386O7832J295j3214j512k0817J7272J9897m5518n2169J4513J0475L5679
6807b41653j3634J1138J969K345k1273M2991l200j5680n1417M6136N2197j4911
$$ y = [-244519, -200807, -264537, -317619, -305305, -198099, -228253, -231600, -224645, -260300, -322029, -306864, -229099, -314728, -315056, -228278, -274580, -276011, -281695, -294874, -258769, -264893, -236933, -151533, -215704, -273099, -277284, -265268, -198898, -162822, -189277, -243338, -257136, -250572, -253834, -286023, -361704, -430271, -381112, -306652, -269211, -306365, -289792, -229601, -215088, -195087, -209505, -270939, -267914, -229101, -192157, -195372, -239184, -248952, -207415, -208828, -241868, -281386, -298516, -243513, -213145, -307416, -254715, -242876, -280916, -302003, -267691, -287718, -286059, -290105, -278805, -323915, -314242, -275386, -207554, -206259, -219473, -220985, -241802, -224530, -204633, -250151, -302320, -287807, -277332, -241653, -255287, -244149, -242180, -239835, -261108, -218117, -221317, -236997, -288414, -242278, -190081, -204992]
6795b04992n8980J0738Q621K6267k053J4505k5962m491m7335Q3135L0012j18369
6783b88904k7346N1103l1307O6690L3947n7507j759L8567K5382K7758r4876j3955
6771b72207k6621k9258O6735M2118j2819J2419l791m5825j2149k3372J8825M3498
6759b42447J6947l0895J9534J7389p658l9327m508l123M4782K6584m1920j6330
6747b60972J5190j0710l4907R0136q9737o1993P748j6042J02086k8484N16Q4836
6735b02333N1798k6161p2741n554L332k0027K1505P4580J8939n3606k446J3450
6723a99264o6987r850M9485K1815o178m7603N05j9941O8425k1389l7328L6599
6711b31711j1895o1462j8492M252J02154P7505l5153q1120O5504n3169k8686k7544
$$ y = [-204992, -263972, -253234, -244613, -218346, -220399, -205894, -231856, -236347, -283682, -200547, -170535, -288904, -316250, -265147, -296454, -229764, -195817, -253324, -255083, -216516, -191134, -163376, -258252, -272207, -298828, -328086, -261351, -219233, -232052, -219633, -223424, -269249, -281398, -304770, -285945, -242447, -225500, -256395, -236861, -219472, -227130, -266457, -270965, -274088, -229306, -202722, -244642, -260972, -245782, -256492, -291399, -201263, -291000, -352993, -345245, -361287, -259201, -287685, -287169, -202333, -150535, -176696, -249437, -254991, -251659, -271686, -250181, -175601, -156662, -210268, -212714, -199264, -266251, -276101, -226616, -204801, -210979, -258582, -258077, -278018, -209593, -230982, -268310, -231711, -243606, -305068, -323560, -319308, -217154, -139649, -174802, -255922, -190418, -243587, -272273, -299817]
6699b99817o3293K242J00654k3029O2426R7080j7780n5381Q929K2924j9223K5668
6687a58600j7696L0855l4819j0463l945j2768K0052k5538L1870P077R899j2400
6675a76476l3748l2286L5528l1007J8264L5528n7936L8095k3201L4856N0478p889
6663a49794p3223J8691Q5094n8023p1163K6552n7623K7564O0875k2879P0984Q97
6651a42048n4230N5846L388k6023j1288R886J4850M4856j7595m9048M988j3031
6639a79449n0892J8278r506L1064N9365j6065k1712L9938L4596J04280j9391l1862
6627d1356j8326p398r098m6582J1110M3209K9711k6168M4671q063n3527j9898
6615a01715j40l3895K4315N5840k8864k1403M6789o8201m0897M8087j01703l5648
$$ y = [-299817, -363110, -360868, -260214, -283243, -220817, -123737, -141517, -196898, -187969, -165045, -184268, -158600, -176296, -145441, -180260, -190723, -194668, -207436, -187384, -212922, -181052, -173975, -164076, -176476, -210224, -242510, -206982, -237989, -219725, -184197, -242133, -204038, -227239, -192383, -141905, -149794, -223017, -204326, -119232, -177255, -248418, -221866, -279489, -251925, -191050, -213929, -142945, -142048, -196278, -140432, -137044, -163067, -174355, -164469, -149619, -104763, -122358, -171406, -166418, -179449, -230341, -212063, -221569, -190505, -131140, -147205, -168917, -128979, -94383, 9897, -9494, -41356, -59682, -67080, -76178, -122760, -111650, -68441, -38730, -64898, -20227, -28290, -81817, -101715, -101855, -135750, -111435, -55595, -84459, -105862, -59073, -127274, -168171, -120084, -221787, -257435]
6603b57435p13J29263N2985k8683p2316p470K6415J3121J6753L2755r2027o7043
6591b54395N6265n2463L0379j5313j2768p556J0929M3198O457j7758l46N5250
6579a58121k2702k6180q805L195P0820K0004K0088q6123p4680M7235N0338o2025
6567b26956m5972L064M3603L9391l3748M1143k0836k268M0071k5769J4266j6820
6555a90831L2417j7955M8334J8946k3062p018K319L6525J2891j8307j14834p8396
6543b98971K5615L6908L2884K144n126N498Q003k1573q32R057j5104K0772l450
6530b04175L8778L4233l0018k7013k9866J2405j1669k2379j4787L3414L5158K923
6518a82996J3854k3079n610L418l7121J6342q5237K4705L8028O7742j3910l0572
$$ y = [-257435, -258148, -128885, -75900, -104583, -176899, -184369, -157954, -144833, -128080, -95325, -187352, -254395, -198130, -250593, -220214, -235527, -248295, -255851, -244922, -201724, -195267, -213025, -213371, -158121, -180823, -207003, -215808, -212613, -141793, -121789, -101701, -187824, -262504, -215269, -164931, -226956, -272928, -269864, -226261, -186870, -220618, -179475, -200311, -202579, -162508, -188277, -174011, -190831, -158414, -176369, -128035, -109089, -132151, -139169, -136850, -100325, -87434, -105741, -220575, -298971, -273356, -236448, -203564, -201420, -206546, -201048, -193045, -214618, -215450, -206393, -221497, -200725, -204175, -165397, -131164, -161182, -188195, -218061, -205656, -217325, -239704, -254491, -221077, -185919, -182996, -169142, -192221, -197831, -194413, -231534, -215192, -300429, -275724, -237696, -169954, -183864, -214436]
6506b14436P258l7752j2867N2796J0383m4592J8237M4876O1863l7096l5810M595
6494a82545K3781l5512O050P5278K4310k7347J4508l8998k1911n9651J2302P9667
6482a30068m7603Q518J8901K2462l1012j315j1451m0026O505O3488M9134p7812
6470a70279K610k0822l3411m7178J0137L4139O9373j5610K3387r505k4123P5202
6458a06080N703n2012q761r43n1279m1681R054N2942M7273l9141l0101j7472o474
6445b38972K0691L6730j0777J1559m0107j8144j4577M5026P0352j4163p7070M8779
6433a80673N929j1519o137l7939M5195P704m9585M496l065K8599J08957n7194
6421a45232n3036K0656K8815M3212m898J1936J6664L1029J0470q6168m0627n0868
$$ y = [-214436, -207178, -244930, -257797, -205001, -194618, -239210, -220973, -176097, -114234, -151330, -187140, -182545, -158764, -194276, -188226, -112948, -88638, -115985, -101477, -140475, -162386, -222037, -209735, -130068, -177671, -169153, -150252, -127790, -158802, -160117, -171568, -211594, -205089, -141601, -92467, -170279, -167669, -188491, -221902, -269080, -258943, -224804, -155431, -171041, -147654, -157159, -181282, -106080, -100377, -152389, -161150, -162093, -213372, -255053, -245999, -193057, -145784, -184925, -215026, -232498, -238972, -218281, -181551, -192328, -180769, -220876, -239020, -253597, -208571, -138219, -152382, -229452, -180673, -174744, -186263, -192400, -230339, -185144, -177440, -227025, -222529, -225594, -196995, -88038, -145232, -198268, -177612, -148797, -105585, -110483, -98547, -81883, -50854, -40384, -126552, -167179, -218047]
6409b18047M2105P6266j1636M315O762j1092l8838n8511K0168L4713O1238K5471
6397f7086n144K6576m712o4961j3595l0845N3790L2641L0257p6080m82L1602J5041
6384g2998K8231m2455J0997K5963k8516o2548M4741J1044o0014p680n4542J232
6372b06545L2725K5820m568K5701j1636J1214J3690k6611q724j7453l1751j7859
6360b15997Q2007m8322o1986o3202M3739l2612o332Q1428J4768r990k145R0389
6348a28255m2488o3273m7654J4551M2531J6855Q101n6571q203R0710O5274p7305
6336a85727k1275J7165R280O999N0170n3205M0980K9674J7787r146j0344M4509
6324f3133j15992M033Q8764M4430o8142L3758M5507M5527l462k9889k0111p428
$$ y = [-218047, -175942, -99676, -111312, -106997, -100235, -111327, -150165, -208676, -188508, -153795, -92557, -67086, -72230, -45654, -50366, -115327, -128922, -159767, -105977, -73336, -43079, -119159, -119641, -88039, -72998, -44767, -87222, -76225, -50262, -78778, -141326, -96585, -85541, -145555, -153235, -207777, -206545, -173820, -148000, -152568, -126867, -138503, -127289, -113599, -140210, -148934, -166387, -198138, -215997, -133990, -182312, -244298, -307500, -263761, -296373, -302705, -221277, -206509, -216499, -218644, -128255, -170743, -234016, -281670, -267119, -224588, -207733, -199632, -256203, -264406, -173696, -108422, -185727, -207002, -189837, -180557, -173558, -123388, -176593, -135613, -105939, -88152, -97298, -107642, -63133, -179125, -175092, -86328, -41898, -110040, -76282, -30775, 14752, 11290, -18599, -38710, -46138]
6312d6138n5447J7844o234l268m56R640n391k1171l0553m3874j7317L5336M0600
6299a26429J4803L0371m1880m8481m0545K8759N5661M994j9416R38R142l2711
6287a64794k7768N9508k5747R7976l8707j02009N9646R5522j6048q9831N6373
6276i5879n4736L1706M6434p9628L5648K5263P527N418k2244m1938P2991j3948
6264h3386J7380k4549q083r916J6454M0785k9543m7956L9804o58n6322L1963n849
6251a19876M2250L6410J2645l1222j6232N3377O566j2046q1523Q904O7398J9R050
6238b4280j0568j1052P084o7052j8742k495J4281k600m1895J6816j8188m320K478
6225a60533j3943K5793M6678o344p8625j0720m109K9040Q4778l2164j4483j857
$$ y = [-46138, -101585, -83741, -89975, -93243, -93699, -84059, -89450, -110621, -141174, -185048, -202365, -167029, -126429, -111626, -81255, -123135, -171616, -212161, -183402, -127741, -122747, -142163, -141225, -132083, -164794, -192562, -133054, -158801, -60825, -99532, -201541, -141895, -46373, -62421, -152252, -95879, -150615, -118909, -72475, -152103, -116455, -91192, -83665, -78247, -100491, -142429, -69438, -83386, -66006, -90555, -98638, -108554, -92100, -51315, -80858, -128814, -89010, -89668, -145990, -114027, -119876, -77626, -41216, -28571, -59793, -76025, -22648, -16082, -28128, -109651, -100747, -33349, -33330, -24280, -34848, -45900, -38816, -105868, -124610, -127105, -112824, -115424, -157319, -140503, -158691, -163011, -160533, -174476, -148683, -102005, -108349, -186974, -197694, -201803, -172763, -87985, -120149, -134632, -136489]
6213a36489K8094n8209o369Q8984k0002q748n1057k5419R9843o16n8855k3148
6201a71991k5290p30K7175j1378M3122k9598j1936k4813j5599M889m9979J5840
6189b50288M7184q316M3982R922K3753O291n0549Q704Q2702l9770n7535n8203
6177b42123K2323r382K6283l5777K8993O325L22L141p373N1195m5425j179j3143
6164b15820Q133j2753o701K3573j246q575N8489M594l6826l155P6056O71k8149
6151a41709p08M928o1164M0622K8210K2415q7820l4583Q6520j707m631K3168l1092
6138a57551P1237m3804r6838J1245L5018q125M9057j024n9508k0267O4958m1465
6126a97067l8762M5289J8824L6950m0232N0250q688n7247Q636j8579k7808K9863
$$ y = [-136489, -108395, -166604, -172973, -83989, -103991, -112739, -163796, -189215, -89372, -89988, -148843, -171991, -197281, -198011, -170836, -182214, -139092, -168690, -180626, -205439, -221038, -216149, -266128, -250288, -203104, -211420, -167438, -157516, -133763, -127472, -178021, -169317, -86615, -126385, -183920, -242123, -219800, -229182, -202899, -238676, -209683, -203358, -203036, -199895, -207268, -156073, -201498, -202677, -215820, -207687, -220440, -227141, -203568, -204814, -213389, -154900, -150306, -187132, -190287, -114231, -113560, -141709, -142417, -137489, -198653, -158031, -129821, -107406, -195226, -229809, -143289, -144996, -149627, -126459, -157551, -86314, -130118, -226956, -215711, -180693, -188818, -139761, -140785, -200293, -220560, -155602, -197067, -235829, -190540, -171716, -134766, -174998, -124748, -133436, -190683, -182047, -200626, -228434, -198571]
6114a98571N0471n9851m9878O9641l2988o2003P1638O4838M9583k754p5464m2219
6102b17557P0879P3512n6534j9657m0616M3157P2008j8610p9225J594L6864j5619
6090a49804j0997K2941l6371J0515M2929k9862k5443K5408L0745K0996k5262o9588
6078a93793N4382N496o3385K7359K0255j1747k7987k5019k5821J10108N5570l9140
6066a13722m2055l0627m0057L9657l219O5630J0764q009Q087J561m4266j7830
6054a74086L7784l9475L5588K4983M4761l7491q0792N0940L2807m49n8270L3994
6042a29706K7980m6056q847N9599L354n4430L7256l0808J0539L8025R715L099
6030h0280L5749J4350r931J7235K0393j996l2445l7153K258o52M8570M8771L4857
$$ y = [-198571, -148100, -207951, -257829, -188188, -221176, -283179, -211541, -146703, -97120, -99874, -175338, -217557, -146678, -73166, -129700, -149357, -189973, -146816, -74808, -93418, -172643, -171049, -134185, -149804, -160801, -137860, -174231, -163716, -120787, -150649, -176092, -150684, -119939, -98943, -124205, -193793, -139411, -133915, -197300, -169941, -149686, -161433, -189420, -214439, -240260, -130152, -74582, -113722, -155777, -186404, -226461, -186804, -190023, -124393, -113629, -121638, -113551, -111990, -156256, -174086, -136302, -175777, -140189, -115206, -70445, -107936, -188728, -137788, -104981, -105430, -163700, -129706, -101726, -147782, -156629, -97030, -93676, -148106, -110850, -141658, -131119, -93094, -83379, -80280, -44531, -30181, -40112, -22877, -2484, -4480, -36925, -74078, -71820, -72472, -23902, 24869, 59726]
6017E9726o5587l0591R13k8892l2678M7994J9258l6360L3047j7818P339N4650
6005A1001L0807K0449n3897k2813K1236J17701j343j12972j4726J10366p1293
5994C4516n1820N441R8700L0812J9238N732l9913N0525J631p9493J4763L4711
5982A24843k1248K7108L9733Q071k7588R27k2490L0866k1754L5745O6506p9899
5970A60820o9310L0865j8866n0575N1178M2141k5671O4656R4507l2113l9555J9723
5958B27800n314J9516m3425O3626M9786M7814k6149K663K9657N9366J12571P118
5946E45029N4444M1887j747j0212R416k8846M2555K5432R347k0118R5092j6918
5934G45361l1453j5185n5044M3932p675l899n9372k5444p7566m4441o1327l4559
$$ y = [59726, -5861, -36452, -35539, -64431, -97109, -49115, -29857, -66217, -33170, -50988, -43649, 11001, 41808, 62257, 8360, -14453, 6783, 124484, 123141, 10169, -4557, 105809, 34516, -17304, -11863, 86837, 117649, 136887, 142619, 102706, 153231, 154862, 75369, 90132, 124843, 103595, 130703, 170436, 178507, 150919, 151846, 129356, 160222, 138468, 174213, 240719, 160820, 91510, 122375, 103509, 52934, 104112, 146253, 120582, 185238, 279745, 247632, 208077, 227800, 222486, 242002, 198577, 262203, 311989, 359803, 333654, 336317, 365974, 425340, 537911, 545029, 599473, 641360, 639613, 629401, 638817, 609971, 652526, 677958, 687305, 667187, 762279, 745361, 713908, 698723, 643679, 687611, 679936, 676037, 616665, 591221, 513655, 469214, 407887, 373328]
5922C73328k693m8880Q472K3326k6601k2777l0145m3001q0007N0280q907l8966
5910A53429L311q6820J0252M3584n9854P5880m5442N50k4867m8057N6747N827
5898H4540m7832L1090K80j2482K5419k8167M4369K045J1600K2854j7521r061K1175
5885A28309L1536l686P059p004O9972l6136q4692l1711N4709P5379n40K9660R567
5872B42422L8699K9776q4017k4405N8373o388l3488l8646k116j5681k1568M7128
5860A90089L0969L042j4422J8637N8061n2559m0186q12l843l9991r827o498j4499
5847A18161Q919N123p9207m7132M4746O1540o9947J1891L104j9326K504p954m1876
5834i454J9261K7418m2893j1028k8315j3782M2733j1300k5598M6608J4742l5271
$$ y = [373328, 370635, 321755, 330227, 353553, 326952, 304175, 274030, 231029, 151022, 201302, 192395, 153429, 156740, 69920, 80172, 123756, 63902, 139782, 94340, 94890, 70023, 21966, 78713, 84540, 36708, 67798, 68078, 55596, 81015, 52848, 97217, 99262, 110862, 133716, 116195, 107134, 128309, 159845, 156159, 163218, 156214, 226186, 190050, 105358, 73647, 128356, 203735, 203195, 232855, 242422, 281121, 310897, 226880, 202475, 260848, 254460, 220972, 182326, 180210, 164529, 142961, 190089, 221058, 224100, 209678, 228315, 286376, 233817, 193631, 192819, 188976, 148985, 139158, 132660, 118161, 127080, 132203, 52996, 5864, 50610, 112150, 42203, 54094, 57198, 37872, 40376, 32422, -9454, 9807, 37225, -5668, -16696, -45011, -58793, -16060, -27360, -52958, -6350, 8392, -26879]
5822b6879l9335j4153N9513k9915m6424N5734M2894K8825m24q4758j0112k5368
5810i0402K2399n070K0432J8034o8610O4301N667l8296l651k612Q6410l6300J963
5797b5735K9210J4061n7077m1054R6238o528m5593L6326k7629p7754L3165l2435
5785a04805k486J2607K292r84L1076P3760m2796K525N0359k5268m0789n600l5353
5772h5462k787Q1057o129k4395k2491j0739L8215M425o152K4024q2762J5819L8499
5759c8878k4527r0677L9326M6665J7876l1615k6675N3022l1867k3648K7015J6725
5747f7258K7571m6330J1691L9193j3846J3393L3117M4845m6630k8957K1278L3934
5735B2001q2043o4553J955P6449O9993L2601r8210K0342l1858R340l7399m9926
$$ y = [-26879, -66214, -80367, -20854, -50769, -97193, -41459, 1435, 30260, 29836, -54922, -65034, -90402, -68003, -73073, -52641, -34607, -103217, -38916, -33249, -71545, -75196, -77808, 8602, -27698, -25735, 3475, 17536, -39541, -80595, 15643, 9115, -36478, -152, -27781, -105535, -72370, -104805, -107291, -94684, -92392, -93376, -62300, 11460, -31336, -28811, 21548, -3720, -44509, -50109, -85462, -88249, -7192, -13321, -37716, -60207, -70946, -32731, -28306, -34458, -10434, -93196, -77377, -38878, -63405, -154082, -114756, -68091, -50215, -81830, -108505, -55483, -87350, -110998, -83983, -67258, -39687, -86017, -74326, -35133, -48979, -35586, -2469, 42376, -4254, -33211, -11933, 22001, -60042, -124595, -122640, -46191, 23802, 56403, -41807, -21465, -53323, -43983, -81382, -131308]
5723a31308O3808j4937P6247l5146N232l3853o838p645l0565M7689P5987L992
5711A2663p6456l509J05325J715m270j4146k8127q05k9564L1332K4534L0522m670
5698D4544J5508l6031n2164O0119k2573p5381k7096O0877O6881k3503q9031L31
5686g7519K7588K5132L4224Q708k7690J4673j7674m5207k9058J15476N285k7846
5674F092K1301K0191l3653k5529k2840l0561j950J8926J2566J6432j9399q262
5662d6686K0860l7106M7502n5713j2622Q5834j999L2188K869l0875J6350K4796
5650D5398K7481l1833m9022L2917L4626K3539L1755R521Q978m5434N1440J0308
5638A49674K495k8824J1714K1332P602L8777k9073j2287K8629j1073n056Q8481
$$ y = [-131308, -67500, -82437, -6190, -41336, -36104, -69957, -76795, -84440, -115005, -67316, 8671, 12663, -63793, -67302, 38023, 39738, 35468, 21322, -6805, -7610, -37174, -5842, 18692, 49214, 44544, 60052, 24021, -28143, 31976, 9403, -65978, -93074, -32197, 34684, 11181, -77850, -77519, -49931, -24799, 9425, 18133, -9557, 5116, -12558, -57765, -86823, 28653, 33938, 6092, 27393, 47584, 13931, -11598, -34438, -64999, -66949, -48023, -35457, -19025, -38424, -46686, -25826, -62932, -15430, -71143, -83765, 2069, 70, 32258, 35127, 4252, 20602, 45398, 72879, 41046, -7976, 24941, 59567, 83106, 114861, 124382, 133360, 87926, 139366, 149674, 152169, 123345, 135059, 156391, 163993, 202770, 173697, 161410, 190039, 178966, 173910, 262391]
5626B62391M4478p4883L1039K371K8554l9123N9421J754m6782L8578K0055p963
5614C19890L5585N9155K36j1865p213k2777r417K8223j4107p1230J05433m931
5602D06982O3600M1864p8401L3595K7040K18M8604M8558P2414m8916j3127J8757
5590F21188L8278J8699o5662l9219Q9L6816k3051n4256m408J11465m5295j497
5578E93147l740O1792L0625Q124P3877K5817j0886l268k5119M9639m5386J1730
5566G66352L567k3327l9703m187K1179n236q6478j14111K575Q829j7084M7481
5554E59857J2341k7511j0197o454L8438N436p892R2930Q366n9378j9842J4530
5542F00624K3089P7099n6435O356J18053M90r295J2742j8341k5226K9636L9860
$$ y = [262391, 306869, 231986, 263025, 265396, 293950, 254827, 314248, 316002, 269220, 307798, 327853, 319890, 355475, 414630, 414866, 403001, 395788, 373011, 363594, 391817, 377710, 306480, 411913, 406982, 470582, 512446, 434045, 467640, 494680, 494898, 543502, 592060, 664474, 615558, 602431, 621188, 659466, 678165, 612503, 573284, 573373, 610189, 587138, 532882, 528474, 639939, 594644, 593147, 589407, 651199, 681824, 689948, 763825, 789642, 778756, 775488, 750369, 800008, 754622, 766352, 769919, 746592, 706889, 702702, 723881, 718645, 632167, 518056, 520631, 529460, 512376, 559857, 572198, 544687, 534490, 528036, 566474, 571910, 564018, 656948, 665314, 605936, 586094, 600624, 623713, 700812, 644377, 650733, 768786, 769276, 759981, 772723, 754382, 729156, 758792, 798652]
5530G98652L0399L8908K8104K897m1247j3713m1699p1103K4275l4111m4043M0933
5518G18252j5480r966L5217r1512p114O017M9978P817l8842Q984j2606R371l1449
5505F28667K2809r841k8743j22921L021P8242m1744n9134L8513R0131l1424N398
5493E72974M5527J6911L9155m3157j330K1459n2637O1604N7326L9025l284L3669
5481G87242j1689L8825m5175J03964L3357j02262L5705n6579J694R2984N0170
5470I28236K206J9038L8976M1148O0387K7149N8367J6888m201l480L6904K786
5458A224404l7479J5503J3434L421n3976j7690J2092k3278n1281q600j0390j2816
5446A053344L0027j7261J1133L0207K5037N270m9460j7259N8108J7194M3830j0450
$$ y = [798652, 829051, 867959, 896063, 898960, 857713, 844000, 802301, 731198, 755473, 721362, 677319, 718252, 702772, 692806, 728023, 636511, 629397, 635414, 685392, 693209, 654367, 663351, 650745, 660116, 628667, 651476, 641635, 612892, 489971, 492992, 571234, 529490, 470356, 508869, 599000, 567576, 572974, 618501, 635412, 674567, 631410, 630080, 651539, 598902, 660506, 717832, 756857, 753573, 787242, 775553, 814378, 769203, 873167, 906524, 804262, 839967, 783388, 785082, 878066, 928236, 930442, 949480, 988456, 1029604, 1089991, 1117140, 1175507, 1192395, 1188194, 1184714, 1221618, 1224404, 1186925, 1202428, 1215862, 1219283, 1165307, 1147617, 1159709, 1136431, 1085150, 1076550, 1066160, 1053344, 1083371, 1066110, 1077243, 1107450, 1132487, 1137757, 1088297, 1071038, 1129146, 1146340, 1190170, 1179720]
5434A179720r340Q2150k6049N9359J4828n5746L9170K3738n557N4058n767Q3202
5422A433766k0502m3811J6373K1621M0721m0870O1986K5999K3249l6967K2098
5411A503663N0470K9817L841L667N6633L7617m5753L0385M1388J8264J43308K9988
5399A903288k0193m8799J8402k6869L1818J4620j2853J5627N6775K5209k1102
5388A935923j6717N6526K2832O5012J9976J5279M4200L5184P0980P4692L2211
5377B356098R4910J57756K3184N4677Q0373K8356O5055R1742O5031J17600J01338
5366C236120J50495J05027R5610J34750J52742J73041J26345J50683J72801J35790
5356D633404K12406K13422K23627J98412K54367K07112K28437K85147K85024K90981
$$ y = [1179720, 1170380, 1252530, 1226481, 1285840, 1300668, 1244922, 1284092, 1307830, 1302273, 1356331, 1350564, 1433766, 1413264, 1369453, 1385826, 1407447, 1448168, 1407298, 1469284, 1495283, 1518532, 1481565, 1503663, 1554133, 1583950, 1587791, 1591458, 1648091, 1685708, 1639955, 1670340, 1711728, 1729992, 1873300, 1903288, 1883095, 1834296, 1852698, 1825829, 1857647, 1872267, 1859414, 1875041, 1931816, 1957025, 1935923, 1919206, 1975732, 1998564, 2063576, 2083552, 2098831, 2143031, 2178215, 2249195, 2323887, 2356098, 2451008, 2608764, 2631948, 2686625, 2766998, 2795354, 2860409, 2952151, 3017182, 3134782, 3236120, 3386615, 3491642, 3587252, 3722002, 3874744, 4047785, 4174130, 4324813, 4497614, 4633404, 4845810, 5059232, 5282859, 5481271, 5735638, 5942750, 6171187, 6456334, 6741358, 7032339]
5346G032339K94124K66789L99607L13906L50628N12593M39426M66223N50114O10997
5336A1236746N12190O48208N95968O66721P74679P17524Q24410Q88994Q31265
5327A7696705R42574J081482J064074J141811J254989J427873J530731J703776
5319B7844015J687708J789973J960892K065881K184418K248843K348628K248273
5311D4378631K013461J688764J108746O94929L89352K95457L38937M18084M74928
5302E1801289Q08155J119960J386440J688212K040803K354719K662353K941455
5294F6803386L292088L643620L851362M213080M332086M464800M260354M119678
5286I8980454L670326L093107K299743J078084n86652k155529l111619l419428
$$ y = [7032339, 7326463, 7593252, 7992859, 8306765, 8657393, 9169986, 9609412, 10075635, 10625749, 11236746, 11748936, 12397144, 12993112, 13659833, 14434512, 15152036, 15976446, 16865440, 17696705, 18639279, 19720761, 20784835, 21926646, 23181635, 24609508, 26140239, 27844015, 29531723, 31321696, 33282588, 35348469, 37532887, 39781730, 42130358, 44378631, 46392092, 48080856, 49189602, 49884531, 50273883, 50569340, 50908277, 51326361, 51801289, 52609444, 53729404, 55115844, 56804056, 58844859, 61199578, 63861931, 66803386, 70095474, 73739094, 77590456, 81803536, 86135622, 90600422, 94860776, 98980454, 102650780, 105743887, 108043630, 109121714, 108535062, 106379533, 103267914, 99848486]
5278I9848486l437951l239510k756218k138003j307940l83895L68968J029372
5270H7983309J647297K108523K297011K492567K816268L101787L158740L121465
5262A08726967K607397J534142K55996q87481j792791k668798l444503m372055
5254I9958874n080522n261965n189378m740897m238263l676335l069462k451808
5246F6250244j799087j266114q68191n42678k93124l5994N2120L3553N4602j53795
5236F1431536n58109j132109j783709k285291k526214k731324k759745k984458
5228D4670577k873773k713791k506581k260333j876715j740510j654937j464769
5220B7579168j348598j126120r94323r69522q58155p60412o61917o05177o12585
$$ y = [99848486, 96410535, 93171025, 90414807, 88276804, 86968864, 86584969, 86953937, 87983309, 89630606, 91739129, 94036140, 96528707, 99344975, 102446762, 105605502, 108726967, 111334364, 112868506, 113124502, 112237021, 110444230, 107775432, 104330929, 99958874, 94878352, 89616387, 84427009, 79686112, 75447849, 71771514, 68702052, 66250244, 64451157, 63185043, 62316852, 61774174, 61481050, 61445056, 61497176, 61530729, 61585331, 61431536, 60873427, 59741318, 57957609, 55672318, 53146104, 50414780, 47655035, 44670577, 41796804, 39083013, 36576432, 34316099, 32439384, 30698874, 29043937, 27579168, 26230570, 25104450, 24110127, 23140605, 22282450, 21522038, 20860121, 20254944, 19642359]
5211A9642359n91713n22885m31712m44624m38464l90676k92184k58332m32106
5202A5839663k96611k04163k66136l10330k90209k69424k86610k17455k78963
5193A3419762j02311j66997j79274j64953j72406j07791j13766l435n7087n1193
5183A2300549K9151O04Q5879R9725Q0936J37200J08063J14239K32662K09808J89788
5172A3588604K54079L14495L59736L62058L95207M67928N99535O69897P15720
5163A7727259P49772R02712R69215J063683J121954J203352J354449J350003J346719
5154B7789118J188544J099078P87340M26406O7385j80898n36061n65518n82178
5145B9493216o03688n51568l60639j19557P9138L88749O70486P46733J061895
$$ y = [19642359, 19050646, 18527761, 18096049, 17651425, 17212961, 16822285, 16530101, 16271769, 15839663, 15543052, 15338889, 15072753, 14762423, 14472214, 14202790, 13916180, 13698725, 13419762, 13317451, 13150454, 12971180, 12806227, 12633821, 12526030, 12412264, 12408829, 12351742, 12300549, 12329700, 12330304, 12416183, 12515908, 12596844, 12734044, 12842107, 12956346, 13189008, 13398816, 13588604, 13842683, 14157178, 14516914, 14878972, 15274179, 15742107, 16341642, 17011539, 17727259, 18477031, 19379743, 20348958, 21412641, 22534595, 23737947, 25092396, 26442399, 27789118, 28977662, 30076740, 30864080, 31290486, 31357871, 31176973, 30640912, 30075394, 29493216, 28889528, 28337960, 27977321, 27857764, 27936902, 28325651, 28996137, 29742870, 30804765]
5136C0804765J413441J517957J785247J970633K041368K123238K305102K376074
5128D6337825K338626J865778J157619K55400p39571j704896k219346k530095
5120D4761340k700554k710288k605208k367797j980036j672067j389426r82739
5112B8353225n96146l91530k13089R5181J77457L10265O14527N80751O51833O33495
5102C0215969O62032N53103P4899m08864q06178j183976j430518j633881j675974
5093B4366612j680801j630809j564986j488453j235612j132051r99717q88003
5085A3746180q07063o20801n40839n71326m03809l16473l72164l28502k36747
5076I548456k32069j94198k38827j80830k48279k22214j78111r9106j66669j44930
$$ y = [30804765, 32218206, 33736163, 35521410, 37492043, 39533411, 41656649, 43961751, 46337825, 48676451, 50542229, 51699848, 51955248, 51215677, 49510781, 47291435, 44761340, 42060786, 39350498, 36745290, 34377493, 32397457, 30725390, 29335964, 28353225, 27757079, 27365549, 27152460, 27247641, 27425098, 27735363, 28349890, 28930641, 29582474, 30215969, 30878001, 31431104, 31506003, 31097139, 30290961, 29106985, 27676467, 26042586, 24366612, 22685811, 21055002, 19490016, 18001563, 16765951, 15633900, 14634183, 13746180, 12939117, 12318316, 11777477, 11206151, 10802342, 10485869, 10113705, 9785203, 9548456, 9316387, 9122189, 8883362, 8702532, 8454253, 8232039, 8053928, 7954822, 7788153, 7643223]
5066G643223j76447j94949j18822j70817k01550j85671j29430j55092j62138q8317
5056F059990j05655j09055k13600j19765k429o7697j62214m3102k7002n5285r7880
5045E056306k885l9330m6038l2807j21411m923r941n0676o52l3052p7110L2702
5033D670183m7907J5193r1060j3078j30152j810O9626k9707l9238J0883K2032
5022D434965L6401M2550l0192j8045k3995m5757J589P5818J23958k9474L8897
5011D606715J43368k3350N4673N8752Q1020J8251O9365Q4980Q9544J20686J2564
5000E316568K7452j9488L8688J00952N7691J30107J60824J12041J39574J52569
4990F216978L4565R8247K14837N8074J44938K52686K44443J82992K11972K80991
$$ y = [7643223, 7466776, 7271827, 7153005, 6982188, 6780638, 6594967, 6465537, 6310445, 6148307, 6059990, 5954335, 5845280, 5631680, 5511915, 5509486, 5441789, 5279575, 5236473, 5209471, 5154186, 5056306, 5053421, 5014091, 4968053, 4935246, 4813835, 4808912, 4798971, 4748295, 4747643, 4714591, 4637481, 4670183, 4622276, 4637469, 4546409, 4533331, 4403179, 4401369, 4470995, 4441288, 4402050, 4412933, 4434965, 4471366, 4513916, 4483724, 4465679, 4441684, 4395927, 4397516, 4473334, 4597292, 4567818, 4606715, 4750083, 4726733, 4781406, 4840158, 4921178, 4939429, 5008794, 5093774, 5183318, 5304004, 5316568, 5344020, 5324532, 5363220, 5464172, 5521863, 5651970, 5812794, 5924835, 6064409, 6216978, 6251543, 6349790, 6564627, 6622701, 6767639, 7020325, 7264768, 7447760, 7659732, 7940723]
4980G940723K27667L47197L68389L80608L15721L47163L95976M06347M82676L75934
4970A1588401M24242N48297N13583O77390P48434R14080J043342J069750J253727
4961A8781246J345873J489007J682557J865383J909332J989197K045239K304551
4953C3412385K634969L097643L130630K251868R47864o1203l35689m45818n02658
4944D4129991n82768k74081K28723Q49602J577831J954283J687159J064532M69035
4935E1104307L37608Q30606J112584J306480J201466N39182l38454j171032j497739
4926E3425008j370405j268831r18149k46254l3524l32542r67737j129852r70169
4917D6187545q71895p05686n96408k41237L71480R85061J128725M87957j055041
$$ y = [7940723, 8168390, 8515587, 8883976, 9264584, 9580305, 9927468, 10323444, 10729791, 11212467, 11588401, 12012643, 12560940, 13074523, 13751913, 14500347, 15414427, 16457769, 17527519, 18781246, 20127119, 21616126, 23298683, 25164066, 27073398, 29062595, 31107834, 33412385, 36047354, 39144997, 42275627, 44527495, 45475359, 45414156, 45078467, 44632649, 44129991, 43547223, 43273142, 43501865, 44351467, 45929298, 47883581, 49570740, 50635272, 51104307, 51441915, 52272521, 53385105, 54691585, 55893051, 56432233, 56093779, 54922747, 53425008, 52054603, 50785772, 49867623, 49621369, 49587845, 49255303, 48287566, 47157714, 46187545, 45315650, 44609964, 44013556, 43772319, 44143799, 45128860, 46257585, 46745542, 45690501]
4908D5690501k407038k834778k973121l105446l244766l114224k580742k229596
4900B3200790j931934j687656j423801j137410j029755r36401p46646o74490o83706
4891A2948991m77603n46648m67497m03294l85329m29851m11733k54725k02494
4882I369817k31619k82990k11487l33284k09529j43068k16131j72975j45709j91616
4872G231409j84956j00284j62264j77065j70527j2454j31205j85089q7219p3960
4862E946386q5788n2004p9814o1273r0230q0257p3825o7279k7198n9661n3316
4851E215741m2826L6754L14m4349o9246N51N958k1181l5029j559o4147R965l6334
4838D954612L568M0422K2931n3099k330j0252M8868M0657K1684J630j266k0836
$$ y = [45690501, 43283463, 40448685, 37475564, 34370118, 31125352, 28011128, 25430386, 23200790, 21268856, 19581200, 18157399, 17019989, 15990234, 15053833, 14307187, 13632697, 12948991, 12471388, 11924740, 11457243, 11053949, 10668620, 10238769, 9827036, 9572311, 9369817, 9138198, 8855208, 8643721, 8310437, 8100908, 7957840, 7741709, 7568734, 7423025, 7231409, 7046453, 6946169, 6783905, 6606840, 6436313, 6423859, 6292654, 6107565, 6020346, 5946386, 5860598, 5808594, 5728780, 5667507, 5577277, 5497020, 5423195, 5355916, 5328718, 5269057, 5215741, 5172915, 5209669, 5209983, 5165634, 5096388, 5096939, 5102897, 5081716, 5046687, 5045128, 4980981, 4990946, 4954612, 4958180, 4998602, 5021533, 4968434, 4966104, 4955852, 5004720, 5045377, 5067061, 5068691, 5067425, 5046589]
4826E046589l8071k7593J6233L3872N0182N9288n15q104M711J03364j9317K1463
4814E242102m1628O4818L4575P015L0656L0081L5663J09142J2602O2955J09162
4803E697143O6924P273n7362M7884N3926N4199O2496L1988M4668R9590M5328J30048
4791F284105J17329J05482J17750J00398J19803J36447J47806J73608J85156J85933
4781G673817J38718J72118K25939K12865K58572K69339K91182L12334L22808K99561
4771A0177253L98327L84053M43890N26903N01969M50059M97113O18428N98548
4762A4596543O25123O77017P32562Q09427P73728Q06187Q30785P78226Q46411
4753B1476009Q52592R24574J001695J112819J172534J274409J447031J624507
$$ y = [5046589, 5008518, 4980925, 4997158, 5031030, 5081212, 5140500, 5139985, 5131881, 5136592, 5239956, 5220639, 5242102, 5200474, 5265292, 5299867, 5306882, 5337538, 5367619, 5403282, 5512424, 5525026, 5587981, 5697143, 5764067, 5771340, 5713978, 5761862, 5815788, 5869987, 5932483, 5964471, 6009139, 6108729, 6154057, 6284105, 6401434, 6506916, 6624666, 6725064, 6844867, 6981314, 7129120, 7302728, 7487884, 7673817, 7812535, 7984653, 8210592, 8423457, 8682029, 8951368, 9242550, 9554884, 9877692, 10177253, 10575580, 10959633, 11403523, 11930426, 12432395, 12882454, 13379567, 13997995, 14596543, 15221666, 15898683, 16631245, 17440672, 18214400, 19020587, 19851372, 20629598, 21476009, 22328601, 23253175, 24254870, 25367689, 26540223, 27814632, 29261663, 30886170]
4745C0886170J740336J862873K088732K179300K216927K345187K229326K210376
4737D7759227K328570K406270K520591K403228K127679J684602J212550Q20151
4729F3262868N78484N42366O09569Q43598J197338J607022K075554K574256K961428
4720G6252483L386538L707395L937397L769151L583119K993616K351495J680259
4712A01661453J104993O79483N04865N51469Q80610J042080P10560k65484j319903
4703A05550126j787213j895292j809052j541669r76680k94362N11835J235434
4695I8993127J928613K668440L103171K935078K228131R57597l60817j484838
4687A10968502j995416k529354l099753l814437m105974m019764l538845l126560
$$ y = [30886170, 32626506, 34489379, 36578111, 38757411, 40974338, 43319525, 45548851, 47759227, 50087797, 52494067, 55014658, 57417886, 59545565, 61230167, 62442717, 63262868, 63841352, 64383718, 64993287, 65836885, 67034223, 68641245, 70716799, 73291055, 76252483, 79639021, 83346416, 87283813, 91052964, 94636083, 97629699, 99981194, 101661453, 102766446, 103445929, 103950794, 104502263, 105382873, 106424953, 107135513, 106870029, 105550126, 103762913, 101867621, 100058569, 98516900, 97540220, 97245858, 97757693, 98993127, 100921740, 103590180, 106693351, 109628429, 111856560, 112814157, 112453340, 110968502, 108973086, 106443732, 103343979, 99529542, 95423568, 91403804, 87864959, 84738399]
4679H4738399k799661k700301k629162k674821k624042k397127j937418j694277
4671F5281590j320276r42590o74727k30159p0004j71251m64859r11409j373578
4662E9122737j742890k050152k198192k272127k329669k436680k369734k306053
4654D1417240k101442j933371j879616j683836j631332j441882j311553j175523
4646B8258685j028353r20286q79570q06745o67277o38154n74055n28739m37987
4637B1777519m15983m22168m86435l75075m12461l24894l38463l35992l23077
4628A8342971l34331k34657k20145k02789k06155j11529j39385k18134k04801
4619A6471045n5224j6843j47627j05924j28838j22588q8354q8594j49502o3464
$$ y = [84738399, 81938738, 79238437, 76609275, 73934454, 71310412, 68913285, 66975867, 65281590, 63961314, 63018724, 62343997, 62113838, 62043834, 61872583, 61407724, 60496315, 59122737, 57379847, 55329695, 53131503, 50859376, 48529707, 46093027, 43723293, 41417240, 39315798, 37382427, 35502811, 33818975, 32187643, 30745761, 29434208, 28258685, 27230332, 26310046, 25430476, 24623731, 23956454, 23318300, 22744245, 22215506, 21777519, 21361536, 20939368, 20452933, 20077858, 19665397, 19340503, 19002040, 18666048, 18342971, 18008640, 17773983, 17553838, 17351049, 17144894, 17033365, 16893980, 16675846, 16471045, 16415821, 16398978, 16251351, 16145427, 16016589, 15894001, 15805647, 15717053, 15567551, 15504087]
4609A5504087k08284j17008j17045j14220p7128r6835j15175j8773l6506l1220
4599A4571893j6422O7396J7233Q2149J21052J03943O6120J01109J55516J51935
4589A5421924J93163J67372K25781J25622R8146J58328J18461J44868J41607Q0503
4579A6875775K21212J59085K86519K30043M23283M71897M39381M77557N21982
4570B0106734O09025O82231P37320O50406O99620Q76051R05180J051462J224548
4561B7542577J329632J416006J499932J491705J696447J751163J774499J647916
4553D0149877J439558J351577J175821Q37054L44878n4661l56934n16462p92656
4544D3578052q99354q81186p36479o49512m53761j86791K8000K68296N77086Q47703
$$ y = [15504087, 15295803, 15178795, 15061750, 14947530, 14870402, 14773567, 14658392, 14639619, 14603113, 14571893, 14555471, 14622867, 14640100, 14722249, 14843301, 14947244, 15013364, 15114473, 15269989, 15421924, 15615087, 15782459, 16008240, 16133862, 16232008, 16390336, 16508797, 16653665, 16795272, 16875775, 17096987, 17256072, 17542591, 17772634, 18195917, 18667814, 19107195, 19584752, 20106734, 20715759, 21397990, 22135310, 22785716, 23485336, 24361387, 25266567, 26318029, 27542577, 28872209, 30288215, 31788147, 33279852, 34976299, 36727462, 38501961, 40149877, 41589435, 42941012, 44116833, 44953887, 45298765, 45244104, 44887170, 44370708, 43578052, 42678698, 41797512, 41061033, 40411521, 39957760, 39770969, 39798969, 40067265, 40644351, 41492054]
4534D1492054J192494J530671J776369J957215K202731K340989K682882K865353
4526E8040758K793878K392869J357120n1320j221030j895954k331790k659389
4518E6425142l089880l168814k980170k694767k215183j873310j508363j201721
4510C7692934q88589n83947l76271r3330J50348K63879L39487M63633O12787O73985
4500C8254916O85784O39140K64413j22829m03962p38945r66124j026887j149017
4491C5436489j101688j115837j033421p99936o07331n39429l42547k48963j15228
4482B9532109j3813M855J74147K15281K77331K42728L01801M07228M69198M54182
4472C2065047N08959O55388P35888P84566Q88934R94790J031984J060321J001033
$$ y = [41492054, 42684548, 44215219, 45991588, 47948803, 50151534, 52492523, 55175405, 58040758, 60834636, 63227505, 64584625, 64533305, 63312275, 61416321, 59084531, 56425142, 53335262, 50166448, 47186278, 44491511, 42276328, 40403018, 38894655, 37692934, 36804345, 36220398, 35844127, 35750797, 35901145, 36165024, 36504511, 36968144, 37580931, 38254916, 38940700, 39579840, 39844253, 39721424, 39317462, 38578517, 37612393, 36585506, 35436489, 34334801, 33218964, 32185543, 31385607, 30778276, 30238847, 29896300, 29647337, 29532109, 29518296, 29523151, 29697298, 29912579, 30189910, 30432638, 30734439, 31141667, 31610865, 32065047, 32574006, 33229394, 33965282, 34749848, 35638782, 36633572, 37665556, 38725877, 39726910]
4463C9726910J125965J038820J044677J193549J131369J216248J223553J288009
4455D8989100J240441J358567J477738J592621J782537J622160J751698J923046
4447F1737908K006874K163580K363020K550154K748197K809511L019085L066976
4439H2465305L039693K879756K667633K650099K637091K748435L160064L510497
4431A05758573M030416M650221N139094N491123N930116O440097O944600P689054
4423A52073294Q534032R532726J0605229J1673564J2953854J4313594J5569292
4416B35255585J7046130J8009725J8051146J7233087J5205439J1513228P351076
4409C39665416M673156L889181K503157k353249j1247808j9322076k2536059k3070554
$$ y = [39726910, 40852875, 41891695, 42936372, 44129921, 45261290, 46477538, 47701091, 48989100, 50229541, 51588108, 53065846, 54658467, 56441004, 58063164, 59814862, 61737908, 63744782, 65908362, 68271382, 70821536, 73569733, 76379244, 79398329, 82465305, 85504998, 88384754, 91052387, 93702486, 96339577, 99088012, 102248076, 105758573, 109788989, 114439210, 119578304, 125069427, 130999543, 137439640, 144384240, 152073294, 160607326, 170140052, 180745281, 192418845, 205372699, 219686293, 235255585, 252301715, 270311440, 288362586, 305595673, 320801112, 332314340, 339665416, 344338572, 348227753, 350730910, 348377661, 337129853, 317807777, 295271718, 272201164]
4401B72201164k2909480k1871732j9475742j6496412j3780369j1471204r490666
4394A56705559p682890o230181m752703l447012k272891j275437n09080M83O01860
4385A31137708J344237K116317J899627K74431j789830l000652l008399k659836
4377A26313603k539493k463479j929722j044239l01441M50151J259740J924260
4369A21669380K594992L009559L049171K675957J899297P76614O4553k40017o7694
4360A35431812L49765J065099K160817L550555N101766O606819Q174692R680378
4352A72121703J0879203J1620905J2581438J3939367J5604253J6292817J2848787
4345B65888473N370150l603190j0079217j2191999j3030157j4697305j6653411
$$ y = [272201164, 249291684, 227419952, 207944210, 191447798, 177667429, 166196225, 156705559, 149022669, 142792488, 138039785, 134592773, 132319882, 131044445, 130535365, 130535848, 131137708, 132481945, 134598262, 136497889, 136772320, 134982490, 131981838, 128973439, 126313603, 123774110, 121310631, 119380909, 118336670, 118035229, 118485380, 119745120, 121669380, 124264372, 127273931, 130323102, 132999059, 134898356, 135674970, 135739523, 135499506, 135431812, 135781577, 136846676, 139007493, 142558048, 147659814, 154266633, 162441325, 172121703, 183000906, 194621811, 207203249, 221142616, 236746869, 253039686, 265888473, 271258623, 267655433, 257576216, 245384217, 232354060, 217656755, 201003344]
4338B01003344j6976800j5120984j2293978r676383p460548n753391m230809k791689
4330A26698762j465344l52522K23476k5453q32431j278598j415214j334343j166575
4321A19051758j053833q24544p49695j156072j630465k036688k444868k751441
4313A06404152k653071k126105j468111q89662p05489n06035o84952j228444j773386
4304I4368897k137196k142953j956293j811903j984454k316760k548449k557175
4296G6913714k360848j989320j589716j451949j213100p80711l40277J25419K54017
4287F7567229j83973j123169k004903k322060k491747k636230k846121k943607
4279E1015419k769466k398489k084471j810435j474662j337485j115479j044341
$$ y = [201003344, 184026544, 168905560, 156611582, 146935199, 139474651, 133721260, 129490451, 126698762, 125233418, 124880896, 125104372, 125078919, 124246488, 122967890, 121552676, 120218333, 119051758, 117997925, 117173381, 116423686, 115267614, 113637149, 111600461, 109155593, 106404152, 103751081, 101624976, 100156865, 99267203, 98561714, 98055679, 97370727, 96142283, 94368897, 92231701, 90088748, 88132455, 86320552, 84336098, 82019338, 79470889, 76913714, 74552866, 72563546, 70973830, 69521881, 68308781, 67528070, 67187793, 67313212, 67567229, 67383256, 66260087, 64255184, 61933124, 59441377, 56805147, 53959026, 51015419, 48245953, 45847464, 43762993, 41952558, 40477896, 39140411, 38024932, 36980591]
4271C6980591q47524p98013p41892o32682o68524m93516l05414l84557m05049
4262C1703420m13526l61235l84591l12706k81026k60907k38048r6475m16o7427
4252B9287063N2684Q1880J17227K76611K70220M45468N41130O61069P18001O98446
4242C3149799Q53038R53000J113533J360061J643111J887297K189027K600108
4234D5748974L034822L325878L786815M317090M685770M871267N085400N474773
4226H0330789N685166N907022N801326M333441J684419j416832l777808m918262
4218I3629261n661615o340006o891736p113121o554954n721671m922336m135286
4210D6288536l479522k837084k373568j967477j570965j334579q88191p31645
$$ y = [36980591, 36133067, 35335054, 34593162, 33960480, 33291956, 32798440, 32493026, 32108469, 31703420, 31289894, 30928659, 30544068, 30231362, 29950336, 29689429, 29451381, 29354906, 29354490, 29287063, 29339747, 29421627, 29538854, 29815465, 30085685, 30531153, 31072283, 31733352, 32451353, 33149799, 34002837, 34955837, 36069370, 37429431, 39072542, 40959839, 43148866, 45748974, 48783796, 52109674, 55896489, 60213579, 64899349, 69770616, 74856016, 80330789, 86015955, 91922977, 97724303, 102057744, 103742163, 102325331, 98547523, 93629261, 87967646, 81627640, 74735904, 67622783, 61067829, 55346158, 50423822, 46288536, 42809014, 39971930, 37598362, 35630885, 34059920, 32725341, 31837150, 31105505]
4202C1105505p19446o37221n84300n05693l79090k80537l84665m39930q27401
4193B6347222j071580j150774j034900j064698j076769j046781r70017p31936
4185A8199767o55852n92219n83681m70612l21240k76923k04511o2946o8685k122
4175A4960976O4820O8763J23797K64459L19476L04363L02042K97992J49797K07395
4165A7063880M31636K16524M3321l30656p31339p62418q02033p58628q74924p98226
4155A2697137p37454n52536m86070l38164l77945l24368k01801j24115j28725
4146I425959n6574l0081j2835P5110L8722J11841J42905J41460J64853K43637
4136A0244997K28272J94154K18388R6409L95J891j56197k49460k88430l01772
$$ y = [31105505, 30386059, 29748838, 29164538, 28658845, 28279755, 27999218, 27614553, 27174623, 26347222, 25275642, 24124868, 23089968, 22025270, 20948501, 19901720, 18931703, 18199767, 17543915, 16951696, 16368015, 15897403, 15576163, 15299240, 15094729, 15031783, 14963098, 14960976, 15025796, 15094559, 15218356, 15482815, 15802291, 16106654, 16408696, 16706688, 16856485, 17063880, 17495516, 17712040, 17755361, 17424705, 16693366, 15930948, 15128915, 14370287, 13495363, 12697137, 11959683, 11407147, 10921077, 10582913, 10204968, 9880600, 9678799, 9554684, 9425959, 9369385, 9339304, 9326469, 9401579, 9440301, 9552142, 9695047, 9836507, 10001360, 10244997, 10473269, 10667423, 10885811, 10982220, 10982615, 10984506, 10828309, 10578849, 10290419, 9988647]
4126I988647k46416k56938k32475j51264k87333k81160k42157k13519j95155j51271
4116G730959j93471k16701j21007n2497J6997J8561J18230P8487R7486R7102J13051
4105G687197J20940P6529J69718J15839N556j04819p3776j48974j47372j58268
4095G542570k74312j59802k40180j62681j60205j95314q5392j52997j00081j93873
4085E817733r2042o9200k8820r020l9538l3967M8636j5464P81l3395L0949O4149
4073E640802J5659Q8223M0295J15042J07817m7592j7112J2201r4766j07379j20394
4062E632796r9463j58822j83528j82657k55693k02421r1751r2276m6319j36206
4052D183660j76393n2913o1548j02052o6961j2372K083o4000m5030n8873n9038
$$ y = [9988647, 9742231, 9485293, 9252818, 9101554, 8814221, 8533061, 8290904, 8077385, 7882230, 7730959, 7537488, 7320787, 7199780, 7147283, 7164280, 7182841, 7301071, 7379558, 7477044, 7574146, 7687197, 7808137, 7884666, 8054384, 8170223, 8175779, 8070960, 7997184, 7848210, 7700838, 7542570, 7268258, 7108456, 6868276, 6705595, 6545390, 6350076, 6264684, 6111687, 6011606, 5817733, 5725691, 5656491, 5627671, 5618651, 5579113, 5545146, 5593782, 5578318, 5579099, 5545704, 5576653, 5640802, 5656461, 5744684, 5784979, 5900021, 6007838, 5960246, 5943134, 5955335, 5860569, 5753190, 5632796, 5533333, 5374511, 5190983, 5008326, 4752633, 4550212, 4458461, 4366185, 4319866, 4183660, 4007267, 3954354, 3892806, 3790754, 3723793, 3711421, 3713504, 3649504, 3604474, 3545601, 3486563]
4041C486563K9644M9502L0917J2391k4724n966R695P528L6533K5157J2808P0967
4029C741015P0488o8793K3987j2744n9772Q774k8528k1989k4445m4072j6404r771
4017C557746l1104p4391m6487L4733O6986k8980o5004J6545Q051p6071Q7650O7444
4005C517118L2807k1242N5738Q1852l281Q5320P8259L9807P2424R1251N5330J24190
3993D209573M9414N1713J22395J54779J81827J99759K44031J37869p8872j47770
3983E124718q3317r0966p7092r8181j96519j01103m0086l9403p0176l6707l5353
3972D255815m5408j30384j74948j79075p9799j04598p5390j65602j60908j02961
3962C036742j31229l7135j3942o7076M516q0291l3128j3291q9346k2288m93n3966
$$ y = [3486563, 3516207, 3565709, 3596626, 3609017, 3584293, 3578327, 3588022, 3595550, 3632083, 3657240, 3670048, 3741015, 3811503, 3742710, 3766697, 3753953, 3694181, 3702955, 3674427, 3652438, 3627993, 3583921, 3567517, 3557746, 3526642, 3452251, 3405764, 3440497, 3507483, 3478503, 3413499, 3430044, 3438095, 3362024, 3449674, 3517118, 3549925, 3528683, 3584421, 3666273, 3662992, 3748312, 3826571, 3866378, 3938802, 4030053, 4085383, 4209573, 4258987, 4310700, 4433095, 4587874, 4769701, 4969460, 5213491, 5351360, 5272488, 5124718, 5041401, 4950435, 4873343, 4775162, 4578643, 4477540, 4437454, 4398051, 4327875, 4291168, 4255815, 4210407, 4080023, 3905075, 3726000, 3646201, 3541603, 3466213, 3300611, 3139703, 3036742, 2905513, 2868378, 2854436, 2787360, 2791876, 2711585, 2678457, 2665166, 2575820, 2553532, 2553039, 2499073]
3950B499073k3135L344P8409n2830n9566K8855N8318O0267p7081K9506K431K9960
3938B577551K4956M3011l6036L9130N3348j2105p367q125k1984l5620O0033J30400
3926B807192k5082k959R4921P0555j6316J21187O7342N9817M8986n1936R089l618
3914C179178p8729k9383J01995k0229M3605k0383N3368M3107M2602J15715k3349
3903C407497n875P6299N3607Q0175M4849J1874r6336k6239R953P4459J26005N6042
3891C812310n4455M8734J12443J06746J45830o976J0641N7890L7143Q6300N1509
3880D408115J62311R2668L1672N5839J37518K18455J41918J89349P8506J55897
3870E672248J12573O2341J55119K13471K53366L25495K47115K35690K52229L55490
$$ y = [2499073, 2475938, 2479282, 2557691, 2504861, 2445295, 2474150, 2532468, 2592735, 2515654, 2545160, 2547591, 2577551, 2602507, 2645518, 2609482, 2648612, 2701960, 2689855, 2682488, 2674363, 2652379, 2616759, 2676792, 2807192, 2782110, 2779151, 2874072, 2944627, 2928311, 3049498, 3116840, 3176657, 3225643, 3173707, 3182796, 3179178, 3100449, 3071066, 3173061, 3152832, 3196437, 3176054, 3229422, 3272529, 3315131, 3430846, 3407497, 3401622, 3477921, 3531528, 3611703, 3656552, 3668426, 3572090, 3545851, 3555804, 3630263, 3756268, 3812310, 3757855, 3806589, 3919032, 4025778, 4171608, 4164632, 4175273, 4233163, 4270306, 4356606, 4408115, 4570426, 4663094, 4694766, 4750605, 4888123, 5106578, 5248496, 5437845, 5516351, 5672248, 5784821, 5847162, 6002281, 6215752, 6469118, 6794613, 7041728, 7277418, 7529647, 7885137]
3860G885137M30306L72205M16642M56083M49694N03506M81445N31949N67391N78965
3850A2673323P17919P55106O92567P98690R07160Q83617R53177J014733J112915
3841B0509207J145252J307373J371201J438646J692378J843849K029287J829668
3833C3166861J686377J566596J405883J200550J178676J551998K015320K496095
3825D6268356L033269L513484L948376M574336N488166O201718P110993P907715
3817H8046413Q699216Q874681Q565740Q791455R699988J2976454J8526441K0895222
3809A85075610J2589095m306902j4942510j5164234j4083490j6194755j8104362
3802A14868452j6734698j3534128j0501970q410529o949987n883388m773311l984362
$$ y = [7885137, 8315443, 8687648, 9104290, 9560373, 10010067, 10513573, 10995018, 11526967, 12094358, 12673323, 13391242, 14146348, 14838915, 15637605, 16544765, 17428382, 18381559, 19396292, 20509207, 21654459, 22961832, 24333033, 25771679, 27464057, 29307906, 31337193, 33166861, 34853238, 36419834, 37825717, 39026267, 40204943, 41756941, 43772261, 46268356, 49301625, 52815109, 56763485, 61337821, 66825987, 73027705, 80138698, 88046413, 96745629, 105620310, 114186050, 122977505, 132677493, 145653947, 164180388, 185075610, 197664705, 193357803, 178415293, 163251059, 149167569, 132972814, 114868452, 98133754, 84599626, 74097656, 65687127, 58737140, 52853752, 48080441, 44096079]
3794D4096079l223601k689430k318547k019084j802170j649397j415408j297495
3786B7680947j206038j012474q57539p69039n67002n40253m38738k62769l07109
3777B1719986m56320m29597k65726k42064k36571k31696k16203j62092j05423
3768A9374294K3221J96039K53645L39607N99260O39493Q07461R36814J275523
3759B4445357J476134J244228P81894N36121L82619M60156O56085Q5416q58007
3750B9210003j639384j872906j621521j522277j739385j825042j675602j305954
3742A6007932j107244r90686p90559o31516n28487m48253l53728l46462l65864
3733A0445133l99606l89667m29900l58191m13426l92696k61139l03503l33000
$$ y = [44096079, 40872478, 38183048, 35864501, 33845417, 32043247, 30393850, 28978442, 27680947, 26474909, 25462435, 24604896, 23835857, 23268855, 22728602, 22289864, 22027095, 21719986, 21263666, 20834069, 20568343, 20326279, 20089708, 19858012, 19641809, 19479717, 19374294, 19397515, 19593554, 19847199, 20186806, 20786066, 21425559, 22233020, 23169834, 24445357, 25921491, 27165719, 27947613, 28483734, 28866353, 29326509, 29982594, 30068010, 29210003, 27570619, 25697713, 24076192, 22553915, 20814530, 18989488, 17313886, 16007932, 14900688, 13910002, 13119443, 12487927, 11959440, 11511187, 11157459, 10810997, 10445133, 10045527, 9655860, 9225960, 8867769, 8454343, 8061647, 7800508, 7497005, 7164005]
3724G164005j81875j45809j77319k00035j65372j87736j41535p6663j36003j16589
3714E635069j80296o0910j08554j13448q6784n4634j13236r1609k3392o1644k7401
3703D713161l7308M33K0253k4469j41165j33430l7159j71215q1360j19758r8761
3692C889222p0174k6918o2300m6381o9455j05674k0418q4796p1620N2232o9535
3681C314183q7351m0116O1448k3586j0583m2516q735l5690p3094r6123q1077q2510
3669B794250o6356o2436l2123l7506j04023n6473k936M7091o2261m6332p9645
3658B291250J1597n8529J029l2316n0722r0383n591n1055j2630j4964j8655p6469
3646A892562m2463k7034R736m173K059Q327O5484j2150p6590J5118L1734N9519
$$ y = [7164005, 6982130, 6836321, 6659002, 6458967, 6293595, 6105859, 5964324, 5887661, 5751658, 5635069, 5454773, 5393863, 5285309, 5171861, 5085077, 5030443, 4917207, 4825598, 4802206, 4740562, 4713161, 4675853, 4676286, 4696539, 4672070, 4530905, 4397475, 4360316, 4189101, 4107741, 3987983, 3889222, 3819048, 3792130, 3729830, 3683449, 3613994, 3508320, 3487902, 3403106, 3331486, 3383718, 3314183, 3226832, 3186716, 3248164, 3224578, 3213995, 3171479, 3162744, 3127054, 3053960, 2957837, 2876760, 2794250, 2727894, 2665458, 2633335, 2595829, 2491806, 2435333, 2432397, 2479488, 2417227, 2370895, 2291250, 2302847, 2244318, 2245347, 2213031, 2162309, 2071926, 2066335, 2015280, 2002650, 1987686, 1969031, 1892562, 1850099, 1823065, 1832801, 1828628, 1830687, 1839014, 1904498, 1892348, 1815758, 1830876, 1862610, 1922129]
3634A922129L0148L7124n8612k2750N9522K9076l7533q1190J31469Q1528k5303
3623B065608L7499l9792K5876K7368J4740J4165k7576l2383m6927o8028l4663
3612A935887O473K2452m8850j3774M4354k8622q9906O3918k1559q4535n6871k0104
3600A708863O5185M4301L7266n783o492L455L2854p0253M5642M2790k4549N4143
3588A927422M199K1576M3349L3620K5859J5188L9458N2879k2455K1552L4692O6295
3576B263634N9166M0943J22210J54796J59535K07184J39048K68617L29513L67580
3566D112226J76871K65622L66924M19064N84918N27074J99950j59458m41024m83558
3556E568609l85107m18436m81575m15583l48878l04138k88065j67362j36040k15383
$$ y = [1922129, 1952277, 1989401, 1930789, 1908039, 1967561, 1996637, 1959104, 1877914, 2009383, 2090911, 2065608, 2103107, 2063315, 2089191, 2116559, 2131299, 2145464, 2117888, 2085505, 2038578, 1970550, 1935887, 1942360, 1964812, 1915962, 1902188, 1946542, 1917920, 1828014, 1891932, 1870373, 1785838, 1728967, 1708863, 1774048, 1818349, 1855615, 1849832, 1843340, 1846795, 1879649, 1809396, 1855038, 1897828, 1873279, 1927422, 1931621, 1953197, 1996546, 2030166, 2056025, 2071213, 2110671, 2163550, 2141095, 2162647, 2197339, 2263634, 2322800, 2363743, 2485953, 2640749, 2800284, 3007468, 3146516, 3415133, 3744646, 4112226, 4289097, 4554719, 4921643, 5340707, 5925625, 6452699, 6652649, 6493191, 6052167, 5568609, 5183502, 4765066, 4283491, 3867908, 3519030, 3214892, 2926827, 2759465, 2623425, 2408042]
3546B408042j09726j04522p4906r6155m1648p9351n8970n3154n2704r263M629
3535A732272l9098o4694m7045o7766q7392L1980k5044q9685J016k773k5098n72
3523A316101J0664l2032M7887O0155k1023k9491k1698K4278K5075k8375j7061
3512A334480r24M4804J5373J320Q7112j0059n4248L7256l904q91K920N9815K4177
3499A537231J26R5890k6446Q5590N1512L2361J03944J04927L6321n3906q2908
3488A884642q0822k3904l7190q4538r246K7453j05756j74319N8555o4423p1288
3477A319164l136j2202l9277r4915r8612j0287m3243K6025k8442k4194K4864n1686
3465I64059J4564M1618K4049j7559N463k2445K0608J1849r6549q5839K3095J4999
$$ y = [2408042, 2298316, 2193794, 2118888, 2022733, 1981085, 1901734, 1842764, 1789610, 1736906, 1727643, 1732272, 1693174, 1628480, 1581435, 1513669, 1426277, 1458257, 1433213, 1343528, 1344544, 1341771, 1316673, 1316101, 1326765, 1294733, 1342620, 1402775, 1381752, 1352261, 1330563, 1354841, 1379916, 1351541, 1334480, 1333556, 1378360, 1393733, 1395053, 1482165, 1472106, 1417858, 1455114, 1451210, 1450319, 1453239, 1513054, 1537231, 1537357, 1633247, 1606801, 1692391, 1743903, 1776264, 1880208, 1985135, 2021456, 1967550, 1884642, 1803820, 1779916, 1742726, 1658188, 1648942, 1676395, 1570639, 1396320, 1454875, 1390452, 1319164, 1316028, 1303826, 1264549, 1169634, 1071022, 1060735, 1017492, 1043517, 1015075, 990881, 1015745, 964059, 978623, 1020241, 1044290, 1026731, 1032194, 1009749, 1030357, 1042206, 945657, 859818, 882913, 897912]
3453H97912K9315l5347l8199J9615N8264L9773J02168J9559j01042k1635j9910
3442I50473J7284P1855l1496k0346M5723o393J875l572l0753m9453p895J32222
3430A069524l3885J8872N569l4121k8973k6450N9715l676j00368P343L7028M1558
3418A012136j9542J2684m61N4878m878K474r382n8512K0684R2j5091K4329R0675
3405A110086p597J3176N987n863K7092M22k2826K8742K0379P914N21k128k5148
3392A150757n369M6166M3350N6461R170L378Q6189o1393J3834j3808K4823O7865
3380A421423J6510n374p4952k8789k0152k8716j6250n2959n5851k024K8436m6051
3368A135251o3092j5436P4431l9446j3579L4431L2784O1727n7760J3393m6687
$$ y = [897912, 927227, 891880, 853681, 873296, 931560, 971333, 1073501, 1093060, 992018, 970383, 950473, 967757, 1039612, 1008116, 987770, 1033493, 1027100, 1028975, 1025403, 994650, 945197, 937302, 1069524, 1035639, 1054511, 1060080, 1025959, 996986, 970536, 1030251, 1026575, 926207, 933550, 970578, 1012136, 992594, 1005278, 1004817, 1059695, 1054817, 1057291, 1047909, 989397, 1010081, 1010173, 995082, 1019411, 1110086, 1102489, 1115665, 1121652, 1115789, 1142881, 1143303, 1120477, 1149219, 1169598, 1177512, 1178033, 1175905, 1150757, 1145388, 1191554, 1234904, 1291365, 1300535, 1303913, 1390102, 1328709, 1342543, 1328735, 1353558, 1421423, 1437933, 1432559, 1357607, 1328818, 1308666, 1279950, 1263700, 1210741, 1154890, 1152866, 1181302, 1135251, 1072159, 1056723, 1131154, 1091708, 1078129, 1112560, 1145344, 1207071, 1149311, 1162704, 1116017]
3357A116017r617q508L8265q7049k3477O1113L8895k2763m6601N5019N246j8256
3345A098284M8300L066J3411j9120k2603l784p7214l9129L1978j0118p316P106
3333A022861k5823M6011P511p2747K3370k6880k911q755K7642O1753M0885o4297
3321A028620m066k637J133K6388r8366K7661m0093P5496M1123K428J8360j9059
3309A056988q673k4405l2338r3768O7291J01453k1261K7605M0801l4022k6174
3298A053497P0291m8724M3244o13m9793K5564o3067p8892L6928M8019j0429r9527
3286I26498k5021M2531m2548K2637M4030L4590P485m2516j4939j00748M5323l4403
3274H62919J0674p437K8143P8538m1576k8521o0075l8923K0932k6395j6844l3329
$$ y = [1116017, 1106400, 1097892, 1136157, 1049108, 1025631, 1086744, 1125639, 1102876, 1056275, 1111294, 1116540, 1098284, 1146584, 1149650, 1163061, 1143941, 1121338, 1117554, 1040340, 1001211, 1033189, 1023071, 1015755, 1022861, 997038, 1043049, 1050560, 977813, 1001183, 974303, 971392, 962637, 990279, 1052032, 1092917, 1028620, 1024554, 1021917, 1023050, 1049438, 951072, 978733, 938640, 1014136, 1055259, 1057687, 1076047, 1056988, 1048315, 1023910, 991572, 897804, 965095, 1066548, 1045287, 1072892, 1113693, 1079671, 1053497, 1123788, 1075064, 1118308, 1117695, 1067902, 1093466, 1030399, 951507, 988435, 1036454, 1026025, 926498, 901477, 944008, 901460, 924097, 968127, 1002717, 1010202, 967686, 952747, 851999, 897322, 862919, 873593, 866156, 894299, 972837, 931261, 902740, 842665, 803742, 824674, 798279, 781435, 748106]
3262G48106j916J0594p95n8530j148P5452O2091l2736k148k1187K6180o4866l3611
3249G05486J19286l9410J9239J02043j7008P9m6242n9594J1473M0433Q5520n8122
3237H63183L081m7246L0230K5367j8539O221L7072J4094l1880l925M2494k0869
3225H99283j810o927N0179m1366Q3897K3337N9592N8626j1965P8239p3062o0164
3213A057859O1041M0115P2152N0143N2512K9885R9888k3119M7881K3016K8703
3202A540076L4958k8757j3121M3L1634k990l5920N6250M0958P894l235J1317K5886
3189A664993Q0004M2321j4340P7407Q76R7926J289O0115R4263J9845P3634R2736
3177B291069m0136N061O3442Q5307J04173M7213N7277J2347J05014M4293K0305
$$ y = [748106, 746190, 756784, 755989, 697459, 696311, 771763, 833854, 801118, 798970, 777783, 803963, 739097, 705486, 824772, 785362, 804601, 906644, 889636, 889715, 843473, 783879, 795352, 835785, 921305, 863183, 866264, 819018, 849248, 874615, 856076, 862297, 899369, 913463, 881583, 877658, 920152, 899283, 897473, 890546, 940725, 899359, 983256, 1006593, 1066185, 1124811, 1112846, 1191085, 1118023, 1057859, 1118900, 1159015, 1231167, 1281310, 1333822, 1363707, 1463595, 1440476, 1488357, 1511373, 1540076, 1575034, 1546277, 1533156, 1533199, 1564833, 1561843, 1525923, 1582173, 1623131, 1631025, 1627790, 1639107, 1664993, 1744997, 1787318, 1772978, 1850385, 1851261, 1949187, 1950476, 2010591, 2104854, 2124699, 2198333, 2291069, 2250933, 2255994, 2319436, 2404743, 2508916, 2556129, 2613406, 2625753, 2730767, 2775060, 2795365]
3166B795365Q0791R0355J31711P3504Q5893J49306J62561N4433N3864Q7553Q8428
3155C853764N7086O2854Q7574N9854P6712Q7398O9402P1806R5350M3007j0646
3144D554161M1738p19Q0257k0579p067J8789L4752m0054n29j9351j5125O127k4172
3131D608228p6614q6014j05716J2038p7156j14354M62k0218j23898r9514l2530
3120C884714j00460k5442r4290j28337l2462m9981k713m706r1316q2222m6628
3109C226157j1455m6292m5487p5467m4023j8862M0986k9887n2222m5076l0232
3098B868140l8908n8080j5858R189n6222j0558q044j7065l7886L1936M8685m8521
3086B666808j9176J0105j6444j8757J02772M6824J416O7972j03737L2277P1957
$$ y = [2795365, 2876156, 2966511, 3098222, 3171726, 3257619, 3406925, 3569486, 3623919, 3677783, 3765336, 3853764, 3910850, 3973704, 4061278, 4121132, 4197844, 4285242, 4354644, 4426450, 4521800, 4564807, 4554161, 4595899, 4595180, 4675437, 4654858, 4647791, 4666580, 4701332, 4661278, 4660749, 4641398, 4626273, 4632400, 4608228, 4531614, 4445600, 4339884, 4351922, 4274766, 4160412, 4160874, 4140656, 4016758, 3917244, 3884714, 3784254, 3758812, 3664522, 3536185, 3503723, 3453742, 3451029, 3446323, 3355007, 3272785, 3226157, 3214702, 3168410, 3122923, 3047456, 3003433, 2984571, 3025557, 2995670, 2943448, 2898372, 2868140, 2829232, 2771152, 2755294, 2764483, 2708261, 2697703, 2689659, 2672594, 2634708, 2666644, 2715329, 2666808, 2647632, 2657737, 2641293, 2622536, 2725308, 2772132, 2773548, 2841520, 2737783, 2770060, 2842017]
3075B842017P2692R5293L1689j7609O686l5727j9983J2249m2649j0449j6417K3613
3063B941405k7815q609J4469p9260n6532l1877l8981l1721k1749M6270m0947K4163
3051B688816k4760m0862N5269j0605N3540O6193K972L5580K6733K1943N1091M4061
3039B969971j3539o942P9689M9330J053p374m4022N3521m4009q579L8460j7537
3027C050022O5723o314Q107L368J8132L0683N3237N8633n8269m601Q5024k3583
3015C280162o6718L3202L9589m4890n5837k7917K290k5957J1444J2004k5712J00481
3003C232141r096o8982K4558O3848j5756K2432K6794Q2197k1453j6727M1016l7448
2991C323524L5053N8442R3384P1428M2402r245P959K7011O2524K7304m018Q6091
$$ y = [2842017, 2914709, 3010002, 3041691, 3024082, 3030768, 2995041, 2975058, 2987307, 2944658, 2934209, 2917792, 2941405, 2913590, 2904981, 2919450, 2840190, 2783658, 2751781, 2712800, 2681079, 2659330, 2705600, 2664653, 2688816, 2664056, 2623194, 2678463, 2667858, 2721398, 2787591, 2790563, 2826143, 2852876, 2874819, 2925910, 2969971, 2956432, 2949490, 3029179, 3078509, 3079562, 3072188, 3028166, 3081687, 3037678, 3029099, 3067559, 3050022, 3115745, 3109431, 3117538, 3120906, 3139038, 3169721, 3222958, 3281591, 3223322, 3218721, 3303745, 3280162, 3213444, 3246646, 3286235, 3241345, 3185508, 3157591, 3159881, 3133924, 3145368, 3157372, 3131660, 3232141, 3223045, 3154063, 3178621, 3242469, 3226713, 3249145, 3275939, 3358136, 3336683, 3319956, 3360972, 3323524, 3358577, 3417019, 3510403, 3581831, 3624233, 3614988, 3622947, 3649958, 3712482, 3739786, 3735768, 3821859]
2979C821859R0187P2451Q0650K0546N7998k8410J10871O2417M4466q020K9591
2968D354606P2479n566N6528M469Q7954K7741M236R8505O1583L5667J6977L8510
2956D853689K6183J6881J9027L0594M7841O1201O0006O4730k626N669M0346M5434
2944E268975P7481k5710K00157N5795n7927K302o259m6884p0424l5995L8422L8473
2932E438406j9525n9167l1173K3124J7963l4483j0506j7734o1752j3474N8158
2921E289837n9323k3012r904o8079L2772l0131J2855k3416M927K4597k5686n2198
2909E073239j3958L9315m6455j1848k8126q4215L5009p72N5059k792l6363n9922
2897D918171K2105m2585l3770O6146K4536j13487n9256Q717Q684j8634n2789J4879
$$ y = [3821859, 3912046, 3984497, 4065147, 4085693, 4143691, 4115281, 4226152, 4288569, 4333035, 4325015, 4354606, 4427085, 4421519, 4478047, 4482516, 4570470, 4598211, 4602447, 4700952, 4762535, 4798202, 4815179, 4853689, 4879872, 4896753, 4915780, 4946374, 4994215, 5055416, 5115422, 5180152, 5177526, 5183195, 5223541, 5268975, 5346456, 5320746, 5520903, 5576698, 5518771, 5521073, 5514814, 5467930, 5397506, 5361511, 5399933, 5438406, 5418881, 5359714, 5328541, 5351665, 5369628, 5335145, 5324639, 5306905, 5245153, 5231679, 5289837, 5230514, 5207502, 5197598, 5129519, 5162291, 5132160, 5145015, 5121599, 5126526, 5151123, 5125437, 5073239, 5059281, 5098596, 5052141, 5040293, 5012167, 4927952, 4962961, 4962189, 5017248, 5014456, 4978093, 4918171, 4940276, 4897691, 4863921, 4930067, 4954603, 4841116, 4781860, 4790577, 4799261, 4780627, 4727838, 4742717]
2885D742717k0995j5175m6070l6946J4061k3591l0133n292J0641K3744P3238l3528
2873D652671l6713L0967q1749J1850n8618j355M6914j0953K4448M0534O942o5685
2861D559253k6962Q9878N5k858j3356l7911j4478J1867O0915m0140q2045J7489
2849D521707N7715K1314R6159p944j05655k5240R279J0808j6897J9983l547L440
2837D581122j2486q1327L1488J3960o5540j6744k2287k0398J4156L3129L0385
2826D485458l5902r5079l881m0225P1896j044o1297L1116m565N796k9595j0128
2814D312550P3310k0599k4761k3375J7828P0044l0912N203M2294k695q060j4407
2802D396420J0137M5348p253K1987q461K566l4045K8791j1365j1317P4773N5057
$$ y = [4742717, 4721722, 4706547, 4660477, 4623531, 4637592, 4614001, 4583868, 4578576, 4589217, 4612961, 4686199, 4652671, 4615958, 4646925, 4565176, 4577026, 4518408, 4517053, 4563967, 4553014, 4577462, 4617996, 4624938, 4559253, 4532291, 4622169, 4622224, 4619366, 4606010, 4568099, 4553621, 4565488, 4626403, 4586263, 4504218, 4521707, 4579422, 4600736, 4696895, 4688951, 4583296, 4558056, 4567335, 4578143, 4561246, 4581229, 4577682, 4581122, 4568636, 4487309, 4518797, 4532757, 4467217, 4450473, 4428186, 4407788, 4421944, 4455073, 4485458, 4449556, 4354477, 4350596, 4310371, 4382267, 4381223, 4319926, 4351042, 4346477, 4352273, 4322678, 4312550, 4385860, 4365261, 4340500, 4317125, 4334953, 4404997, 4374085, 4379288, 4421582, 4418887, 4410827, 4396420, 4406557, 4451905, 4444652, 4466639, 4458178, 4460744, 4426699, 4455490, 4444125, 4432808, 4507581, 4562638]
2790D562638R9156n166p9359j6039N3403J4595N2608J5587J5050N9166K3254Q5326
2778D880219p181K2307J11898r905M5153O8035K4320N57L5599M8637K4231k5168
2766E218702J2967J8971p235K3000R3424N1623o569N5530N843L6738M9813N8310
2754E611117l5707K730J17488M0439K3353K1761J00969P0321L4934N0728N7112
2743F095245Q8461P806J2606N0930L9060N3100Q5459M1169P7572P4271M9398j5037
2731F660040L2245O4241K1358k8372Q1898P6729j1490p8044O7190q158L3228j2206
2719F898659O3K2046J9347Q6655L3622l2978L931M8245n137N2262O1514k977N0004
2706G235256N2240o3430k5723Q0490P0902O4731O6010r443P7533N4812P3536O6454
$$ y = [4562638, 4661794, 4656628, 4577269, 4561230, 4614633, 4629228, 4681836, 4697423, 4712473, 4771639, 4794893, 4880219, 4873038, 4895345, 5007243, 4997338, 5042491, 5110526, 5134846, 5135403, 5171002, 5219639, 5243870, 5218702, 5231669, 5250640, 5243405, 5266405, 5359829, 5411452, 5404883, 5460413, 5466256, 5502994, 5552807, 5611117, 5575410, 5578140, 5695628, 5736067, 5759420, 5781181, 5882150, 5952471, 5987405, 6038133, 6095245, 6183706, 6191512, 6204118, 6255048, 6294108, 6347208, 6432667, 6473836, 6551408, 6625679, 6675077, 6660040, 6692285, 6756526, 6777884, 6749512, 6831410, 6908139, 6896649, 6818605, 6885795, 6877637, 6910865, 6898659, 6898722, 6920768, 6940115, 7026770, 7060392, 7027414, 7031345, 7079590, 7074453, 7126715, 7188229, 7185252, 7235256, 7287496, 7224066, 7198343, 7278833, 7349735, 7414466, 7480476, 7471033, 7548566, 7603378, 7676914, 7743368]
2694G743368L8389Q01o672K3683k3053j7158r04l0319Q425L659K3524o2595q2996
2681G618152j4928n5274K1363L5935m4584L0105k0599P4953O5906j0832L9168
2670G739365N5192l5358n991P2636L7369p496N1925Q2650m346M6691N6164p3966
2658H014835K7222N0981P6303O1590q2405r816N3314J2741o2589k6545J3697n0826
2646H078502K829J8717k9712j2146Q6776M6532k1054r618J2448L8431J32025K6134
2634H369864M0469O6721K7480j778J177M2006J04418K02051R2551P9846J47753
2623I172558J29568Q9197Q1366J32916J10481L0800J11956J56310Q0493Q2258
2613A0177903J18161M7725J82579J68692J22076J60486J12657J45586N0424Q0502
$$ y = [7743368, 7781757, 7782558, 7775886, 7799569, 7776516, 7759358, 7758454, 7728135, 7736560, 7740219, 7763743, 7701148, 7618152, 7603224, 7547950, 7569313, 7605248, 7560664, 7590769, 7570170, 7645123, 7711029, 7700197, 7739365, 7794557, 7759199, 7753208, 7825844, 7863213, 7855717, 7907642, 7990292, 7985946, 8032637, 8088801, 8014835, 8042057, 8093038, 8169341, 8230931, 8148526, 8138710, 8192024, 8204765, 8142176, 8115631, 8129328, 8078502, 8081331, 8100048, 8070336, 8058190, 8144966, 8191498, 8170444, 8160826, 8173274, 8211705, 8343730, 8369864, 8410333, 8477054, 8504534, 8502756, 8503933, 8545939, 8650357, 8852408, 8944959, 9024805, 9172558, 9302126, 9391323, 9472689, 9605605, 9716086, 9746886, 9858842, 10015152, 10095645, 10177903, 10296064, 10343789, 10526368, 10695060, 10817136, 10977622, 11090279, 11235865, 11286289, 11366791]
2603A1366791q239j00421q1499l7560j0764m014O2610Q2271L3662M6958J58497
2592A1508292J06811Q3173J24625J63982Q4206J22200J11051J21932Q8564J18910
2582A2633746J02210J82819J46210J26924J69376J66445J60846J16130J87411
2573A3992117K00456J40757K48027K59139J38616K50522K59544K29303K82003
2564A6000484K76560K84887K75290K53730L63588L37246L32922L41652L04510
2555A8770869L52653L64934L06379L76251L63941L98553M30016L86132L42709
2546B2092437M51639M48068L74095M21276M44455M90260M12921M69540M69123
2537B6073814N55682O12018O08916O42118O54832O71946N79381O70318P37349
$$ y = [11366791, 11358552, 11258131, 11176632, 11139072, 11128308, 11124294, 11186904, 11269175, 11302837, 11349795, 11508292, 11615103, 11698276, 11822901, 11986883, 12071089, 12193289, 12304340, 12426272, 12514836, 12633746, 12735956, 12918775, 13064985, 13191909, 13361285, 13527730, 13688576, 13804706, 13992117, 14192573, 14333330, 14581357, 14840496, 14979112, 15229634, 15489178, 15718481, 16000484, 16277044, 16561931, 16837221, 17090951, 17454539, 17791785, 18124707, 18466359, 18770869, 19123522, 19488456, 19794835, 20171086, 20535027, 20933580, 21363596, 21749728, 22092437, 22544076, 22992144, 23366239, 23787515, 24231970, 24722230, 25135151, 25604691, 26073814, 26629496, 27241514, 27850430, 28492548, 29147380, 29819326, 30398707, 31069025, 31806374]
2528C1806374P90753O96397P85457Q77181Q02987P89623Q45654Q18803R20937
2519C9134166R68768Q83828R69868J101897J108501R82662J084206J121956J284933
2510D8640785J212686J322782J375308J392850J444219J642058J587763J717246
2502F0335697J845878J969412K176010K333193K477433K651365K842381K957462
2494G9588831L207223L351888L410035L439625L550743L516341L521564L494663
2486A07080913L308060L116635L061177K746945K436281K034844J452265P65047
2478A26002167n5983r59124j997518k845654l593261m230157m503954m456223
2470A03360293m324422m031552l786515l518897l159187k904668k685537k487284
$$ y = [31806374, 32597127, 33293524, 34078981, 34956162, 35759149, 36548772, 37394426, 38213229, 39134166, 40102934, 40986762, 41956630, 43058527, 44167028, 45149690, 46233896, 47355852, 48640785, 49853471, 51176253, 52551561, 53944411, 55388630, 57030688, 58618451, 60335697, 62181575, 64150987, 66326997, 68660190, 71137623, 73788988, 76631369, 79588831, 82796054, 86147942, 89557977, 92997602, 96548345, 100064686, 103586250, 107080913, 110388973, 113505608, 116566785, 119313730, 121750011, 123784855, 125237120, 126002167, 125946184, 124987060, 122989542, 120143888, 116550627, 112320470, 107816516, 103360293, 99035871, 95004319, 91217804, 87698907, 84539720, 81635052, 78949515, 76462231]
2462G6462231k229259k203274k003337j883544j838090j720770j660997j626918
2454F1296042j580209j410302j436178j365310j359532j362462j260838j224533
2446E0296678j206040j214781j095875j137151j046214r86651r69653r88079q48903
2437D0803331q34111q20381p29921p32331o90113n92992o44806m94065m95437
2428C4769174n86379n23205n34372n42252m21267n46262n61343m98870m92559
2419C0062665k78766l16458m63345l59910l50299l50799k66207k82629k93446
2410B7100806l26658k60864k42568j82377r4888j61042j52874j82396j88028q6750
2400B5222361k4361m054j03150m2267n5446n9987j77687k45114k27832j20278
$$ y = [76462231, 74232972, 72029698, 70026361, 68142817, 66304727, 64583957, 62922960, 61296042, 59715833, 58305531, 56869353, 55504043, 54144511, 52782049, 51521211, 50296678, 49090638, 47875857, 46779982, 45642831, 44596617, 43609966, 42640313, 41652234, 40803331, 39969220, 39148839, 38418918, 37686587, 36996474, 36403482, 35758676, 35264611, 34769174, 34182795, 33659590, 33125218, 32582966, 32161699, 31615437, 31054094, 30555224, 30062665, 29783899, 29467441, 29004096, 28644186, 28293887, 27943088, 27676881, 27394252, 27100806, 26774148, 26513284, 26270716, 26088339, 25993451, 25832409, 25679535, 25497139, 25309111, 25222361, 25198000, 25193946, 25090796, 25048529, 24993083, 24933096, 24755409, 24510295, 24282463, 24162185]
2390B4162185j00535j84345j18402j00179m0609p971N9727J80006J59029J23838
2380B4132744J91734J92832L04420K32649L70607N13388M49566N09212M93812
2371B7390964M47171M20914N75806N78213M10551R2848m30530p07622o85236o56702
2361B7436377n98571o19333n65352o42448n61876l98464l01995k48889j48595
2352B3350854j1284J30790K32110K63410M34845N35389M89818O77925P52118Q28935
2342B7684910R99210J041677R51321Q36899P41874R47910J084229R12981J84295
2333C5385306q68196j343562j414143j646762j673609j617374j513700j229700
2325B4078260j038440q73833p02568o12279m67450l34192l32229j44522r8411
$$ y = [24162185, 24061650, 23877305, 23758903, 23658724, 23618115, 23610144, 23669871, 23849877, 24008906, 24132744, 24324478, 24517310, 24821730, 25054379, 25424986, 25938374, 26387940, 26897152, 27390964, 27838135, 28259049, 28834855, 29413068, 29823619, 29916467, 29485937, 28778315, 28093079, 27436377, 26837806, 26218473, 25653121, 25010673, 24448797, 24050333, 23748338, 23499449, 23350854, 23339570, 23470360, 23702470, 23965880, 24400725, 24936114, 25425932, 26103857, 26855975, 27684910, 28684120, 29725797, 30677118, 31514017, 32255891, 33203801, 34288030, 35201011, 35385306, 34517110, 33173548, 31759405, 30112643, 28439034, 26821660, 25307960, 24078260, 23039820, 22165987, 21463419, 20851140, 20383690, 20049498, 19717269, 19572747, 19474336]
2316A9474336j23462j5598N7210J37525J52507J90891L22696L49281L11836L18529
2306B1175751J49150K78964L05505K87164M6545l95058p83949r76523r05126r38078
2296A8244345q82343r05986p31365n53237l99272m31359m12612k62930k75685
2287A3389556l41563k55450k87580k21574j15594j69587j83447j15311j55973
2278A1543477j40415j00882q0209j27825j07396j23287o6817p3602j21769K0034
2268A0621309r3434r2695n6789o9602m6144p1317r5226q3889r5117o7041m1831
2257I808224K8767J963r2856r0403m2476J7321j846K315J9428M9525l8137L3402
2245I695227o691N146R4073R6203K4597K9797J25547N8666P3559J16519L4531
$$ y = [19474336, 19350874, 19335276, 19392486, 19530011, 19682518, 19873409, 20196105, 20545386, 20857222, 21175751, 21324901, 21603865, 21909370, 22196534, 22243079, 21848021, 21064072, 20087549, 19182423, 18244345, 17362002, 16456016, 15724651, 15171414, 14772142, 14340783, 13928171, 13665241, 13389556, 13047993, 12792543, 12504963, 12283389, 12167795, 11998208, 11814761, 11699450, 11543477, 11403062, 11302180, 11221971, 11094146, 10986750, 10863463, 10796646, 10723044, 10601275, 10621309, 10527875, 10435180, 10378391, 10308789, 10262645, 10191328, 10096102, 10012213, 9917096, 9850055, 9808224, 9836991, 9838954, 9746098, 9655695, 9613219, 9630540, 9628694, 9631009, 9650437, 9699962, 9661825, 9695227, 9688536, 9693682, 9787755, 9883958, 9908555, 9938352, 10063899, 10122565, 10196124, 10312643, 10347174]
2234A0347174Q2924P6703M8490R3884R7907o166o1896l0647N404K5223l4111J8725
2222A0663614R5279J9367J47090J12261J47986J61208O5582J10577J05797Q6423
2212A1715184R2722J50158J07908J84301R3094J79833J44442J84575K37501J46292
2202A3236010K46701K71089L10237K06657L26798L25317L49121L15105L03982
2193A5891017L12643L88018M34306L60285M14881N07005N47863N51650N72253
2184A9979921N62801M92452M72746N05469L84523L87362L61667L39157M82124
2175B3968222N00994M25992N67188N80904N35480N85270O13455N47431N38699
2166B8863635N25775O38564O60296O17464O80285Q33070Q20388Q47689R15667
$$ y = [10347174, 10430098, 10506801, 10555291, 10649175, 10747082, 10740916, 10679020, 10648373, 10653777, 10679000, 10644889, 10663614, 10758893, 10778260, 10925350, 11037611, 11185597, 11346805, 11412387, 11522964, 11628761, 11715184, 11807906, 11958064, 12065972, 12250273, 12343367, 12523200, 12667642, 12852217, 13089718, 13236010, 13482711, 13753800, 14064037, 14270694, 14597492, 14922809, 15271930, 15587035, 15891017, 16203660, 16591678, 17025984, 17386269, 17801150, 18308155, 18856018, 19407668, 19979921, 20542722, 21035174, 21507920, 22013389, 22397912, 22785274, 23146941, 23486098, 23968222, 24469216, 24895208, 25462396, 26043300, 26578780, 27164050, 27777505, 28324936, 28863635, 29389410, 30027974, 30688270, 31305734, 31986019, 32819089, 33639477, 34487166, 35402833]
2157C5402833R10524R76807J089415J097702J237289J264674J149625J041879
2149D4170748Q07485O46996N45434N22016M66228M18387M44818L10729K74837
2140D8607678J91799O5036k22911l87228m27887m69671l05910j73275p123k535
2130D6867973J56695K37000L28291L95270L55474L64792L16767L20803L90523
2121D9733588L59455L20311K25939J49965n0157l18013m56020o57588r08464r72504
2111D7426512r29760r67968r44695r67666j032725r83470q35911p74648p13435
2102C9276234o04772m97802n21841n56104m99965n15771n88904o10416n27444
2093C4353215p08483p29691p33338p71402p83120r33165q55707q93420r33805
$$ y = [35402833, 36313357, 37290164, 38379579, 39477281, 40714570, 41979244, 43128869, 44170748, 44978233, 45625229, 46170663, 46692679, 47158907, 47577294, 48022112, 48332841, 48607678, 48799477, 48864513, 48641602, 48254374, 47826487, 47356816, 47050906, 46877631, 46870508, 46867973, 47024668, 47261668, 47589959, 47985229, 48340703, 48705495, 49022262, 49343065, 49733588, 50093043, 50413354, 50639293, 50789258, 50739101, 50421088, 49965068, 49307480, 48399016, 47426512, 46496752, 45528784, 44584089, 43616423, 42583698, 41600228, 40764317, 39989669, 39276234, 38671462, 38173660, 37651819, 37095715, 36595750, 36079979, 35491075, 34880659, 34353215, 33644732, 32915041, 32181703, 31410301, 30627181, 29694016, 28838309, 27944889, 27011084]
2084B7011084r65291r69573q82918q59034q58200p11158o95128o33988o11814
2075A9823980n91642m62636m20521m85986m36412l58269l56796m10781l72259
2066A5928678l75797k98221m03920l78362l77250l66074k31997k81893l01215
2057A2913949k70036l24634l41431k44252k23488k55526k09629k28815k20641
2048A0595497k32771k10205j14401k34874j35355j26320k13880j97577j47781
2039H982333j13520j47659j82268j35869j20615o0597j42388j50336j31659p5803
2029G721619j00062j65397j18463r9063j81486j39174q6616j26813j34569p9596
2019F490380j38798j04136n4887j37199q9073j43636j65354q1612o8431n9783
$$ y = [27011084, 26045793, 25076220, 24193302, 23334268, 22476068, 21764910, 21069782, 20435794, 19823980, 19232338, 18769702, 18349181, 17863195, 17426783, 17068514, 16711718, 16300937, 15928678, 15552881, 15254660, 14850740, 14472378, 14095128, 13729054, 13497057, 13215164, 12913949, 12643913, 12319279, 11977848, 11733596, 11510108, 11254582, 11044953, 10816138, 10595497, 10362726, 10152521, 10038120, 9803246, 9667891, 9541571, 9327691, 9130114, 8982333, 8868813, 8721154, 8538886, 8403017, 8282402, 8221805, 8079417, 7929081, 7797422, 7721619, 7621557, 7456160, 7337697, 7238634, 7057148, 6917974, 6831358, 6704545, 6569976, 6490380, 6351582, 6247446, 6192559, 6055360, 5966287, 5822651, 5657297, 5575685, 5507254, 5447471]
2009E447471j01682k2226j14592j52051n2936l7883n6625o0155j40220q5315r7189
1998D526597o7836l0567p3429j37190j19123p4255m4452O000o0107q6734q7743
1987C751161k4616m2867j77305n1090m4396m5778l0996o7286j17919l4195k4372
1976C090341m4639q0052m320j3808q0824p8590p7383k9863L1172p1611j11071
1965B529352j6952k6030n5421l1254J1140l9859l6050k1272n5825j4471k7487
1954B215871p0129n1635P431M8132O4471Q63p1023l6629n2638k5439n2979R701
1942A985997j8473n8592n7322L9540K7712j6052j13857K4701N5295l8996k9810
1931A800143k7578Q068J13814j44056N9731o023J01m989n0974K077l3959k2448
$$ y = [5447471, 5345789, 5323563, 5208971, 5056920, 5003984, 4966101, 4909476, 4849321, 4709101, 4623786, 4526597, 4458761, 4428194, 4354765, 4217575, 4098452, 4024197, 3979745, 3985745, 3925638, 3838904, 3751161, 3726545, 3683678, 3506373, 3455283, 3410887, 3365109, 3334113, 3266827, 3148908, 3114713, 3090341, 3045702, 2965650, 2961330, 2947522, 2866698, 2788108, 2710725, 2680862, 2712034, 2640423, 2529352, 2512400, 2486370, 2430949, 2399695, 2410835, 2370976, 2334926, 2313654, 2257829, 2243358, 2215871, 2145742, 2094107, 2101538, 2149670, 2214141, 2215004, 2143981, 2107352, 2054714, 2029275, 1976296, 1985997, 1967524, 1908932, 1851610, 1891150, 1918862, 1902810, 1788953, 1813654, 1868949, 1829953, 1800143, 1772565, 1780633, 1894447, 1750391, 1810122, 1804099, 1804200, 1799211, 1748237, 1750314, 1716355, 1693907]
1919A693907r566m9833K6660J4628j0856m9794J6544M656O349K9580l3256J2850
1907A651869J5084k512K8783N2803m0989J8610M8361n2650j6065K3524l2041L8444
1895A733221J1169L8841m1018K9987q661j6142J1206M8714k2717k4776k3835k2499
1883A713490K0143k8148k5779l295k2716J0314L1974P6927J0438L427n4585K8119
1871A760309O439p5040N6102j868j0402K2539Q2281K17L3842R1839J9344L2560
1859B018162N3284p3036o4898m1153m9966N433m03K4489o1069p4648n0774n6834
1847A628587P4171q440n1896o6878M5989J6799m8290p192l244q185j3775K382
1835A560028m4602R8088J0466m4202M5748P3501n7608k512L5271l8463J73k5758
$$ y = [1693907, 1684341, 1634508, 1661168, 1675796, 1664940, 1615146, 1631690, 1636346, 1642695, 1672275, 1639019, 1651869, 1666953, 1664441, 1693224, 1746027, 1705038, 1723648, 1772009, 1719359, 1703294, 1726818, 1694777, 1733221, 1744390, 1783231, 1742213, 1772200, 1763539, 1747397, 1758603, 1807317, 1784600, 1759824, 1735989, 1713490, 1733633, 1705485, 1679706, 1676411, 1653695, 1664009, 1695983, 1772910, 1783348, 1786775, 1732190, 1760309, 1766748, 1691708, 1747810, 1745942, 1735540, 1758079, 1840360, 1840577, 1874419, 1966258, 1985602, 2018162, 2071446, 1998410, 1933512, 1892359, 1842393, 1847826, 1847423, 1871912, 1810843, 1736195, 1685421, 1628587, 1702758, 1694318, 1642422, 1575544, 1621533, 1638332, 1590042, 1582850, 1579606, 1571421, 1557646, 1560028, 1515426, 1613514, 1623980, 1579778, 1625526, 1699027, 1641419, 1638907, 1674178, 1635715, 1635888, 1610130]
1823A610130l9493o7319J8802l415m4181j5170k5661l2565r9006J7949l7560K0170
1811A302681m7319n8900o1021l7671J0915p6348L8521J3700j9107j2819m3561
1800A009071p742o1457m893l7252k5611K3977k4323R019J608M53l960M769l4960
1787H48699j5721J5773l4779K8006n4702j833L8615n4897q1205l9592K7412K2281
1775F98057m1695K5116m4079l8568k7306J01298R679o6750q118o6659J6413N7354
1763F14742q8668O047M6290k9701R269n7548L34L705k4171k196m6206m8886J8003
1750D01014J5958K9327j803j0788j8295M5256l9582p810K274n032l6427L766k8369
1737C49489l1038M7653R830p8256N0088j6780O5208n6854l413n9120n1729K687
$$ y = [1610130, 1570637, 1503318, 1522120, 1518705, 1474524, 1459354, 1433693, 1401128, 1302122, 1320071, 1282511, 1302681, 1255362, 1196462, 1135441, 1097770, 1108685, 1032337, 1070858, 1084558, 1065451, 1052632, 1009071, 1001329, 939872, 934979, 897727, 872116, 896093, 871770, 880789, 882397, 882850, 878890, 883659, 848699, 832978, 848751, 813972, 841978, 787276, 785443, 824058, 769161, 687956, 648364, 675776, 698057, 656362, 681478, 637399, 598831, 571525, 672823, 682502, 615752, 607634, 540975, 557388, 614742, 526074, 532121, 578411, 548710, 557979, 500431, 500765, 504470, 480299, 478103, 431897, 383011, 401014, 416972, 446299, 444496, 433708, 415413, 460669, 421087, 413277, 415551, 410519, 374092, 377858, 349489, 318451, 366104, 375934, 297678, 347766, 330986, 396194, 339340, 335927, 276807, 225078, 227765]
1725B27765M5883K9301k1359J838l8475L4099l6986Q4102m1626K6305K2140J4398
1713C47385q1612o8293N0477L2498m8230l0482j0041q665j710j2301N9197k8026
1701B00197m6283k4784O0862M244l8736N191J0911l3462k5771m0418N2610N1714
1689A76275N8646q5279O034P3064p2394j4365k2912m8175L2103j471l6805L984
1677F8705l776p473N3443K6949l1816J7499M6333n1412K5666k9752o2454P9195
1665A31107J9705l6550p5354M83k6758o98j923O3187M0429o4921k5862L7026M1798
1652A01669N8209k291o6707l9974L5995L5741p5636P1254j3052p781M2838p2065
1640F8200m72m758j6140J8085P8027m5825p6459r147O0392k3854j7170k2771L752
$$ y = [227765, 273648, 302949, 281590, 283428, 244953, 279052, 242066, 326168, 284542, 310847, 332987, 347385, 265773, 197480, 247957, 280455, 232225, 201743, 191702, 183037, 181327, 169026, 228223, 200197, 153914, 129130, 189992, 194236, 155500, 160691, 171602, 138140, 112369, 71951, 124561, 176275, 234921, 149642, 155676, 228740, 156346, 141981, 119069, 70894, 102997, 101526, 64721, 68705, 64929, 57456, 110899, 137848, 106032, 123531, 169864, 118452, 144118, 114366, 51912, 131107, 150812, 114262, 38908, 39391, 12633, 11935, 10012, 73199, 113628, 48707, 22845, 59871, 101669, 159878, 157587, 90880, 50906, 86901, 122642, 47006, 118260, 105208, 97427, 140265, 68200, 67728, 62970, 46830, 64915, 142942, 97117, 20658, 11511, 71903, 48049, 30879, 8108, 11860]
1627A1860N3590l7275J86n6097L5002Q5086n2096j1833P8251k7491m0214l280
1615C5689P620j62j05832Q0943L9432q1704K9567O1021l0768L9315q4838l4364
1603d4081l5865m822L0520Q3975J896J0112n985J660p4170k1406M7765k5596q79
1590c6876K0489L8027n2332L8037k4031L9192j5026j6563K8107J7930R317o2057
1578a5786p82j8896k4804j247N0025N9672k5508j0493j9755q5386J0474N3850
1566b8636n8488o7063K1654P6595L0960q523n3361j2733M8448j4445o325k6818
1554i8735l116O8479j3994r374O1725m9175p1504L427M7788K4548J165M3618m8925
1541d4073J4663j5604O0767l2315j6946k2008p69j1990O109R384M8581p0931K1136
$$ y = [11860, 65450, 28175, 28361, -27736, 7266, 92352, 40256, 28423, 106674, 79183, 38969, 35689, 43309, 43147, -62685, 18258, 57690, -24014, 5553, 66574, 35806, 75121, -9717, -44081, -79946, -84768, -54248, 29727, 31623, 41735, 35750, 37410, -36760, -58166, -10401, -35997, -36876, -16387, 21640, -30692, 7345, -16686, 22506, 7480, -9083, 19024, 36954, 46271, -15786, -16568, -35464, -60268, -61515, -11490, 48182, 22674, 12181, -7574, -92960, -82486, -28636, -87124, -154187, -132533, -55938, -24978, -33501, -86862, -99595, -51147, -65592, -71917, -98735, -101851, -33372, -47366, -56740, 4985, -44190, -115694, -112267, -64479, -39931, -38766, 4852, -44073, -29410, -45014, 15753, -16562, -33508, -55516, -56285, -68275, -62166, -52782, -4201, -75132, -53996]
1528e3996M806m0924M5584J1810N0980n708n8486l5814l2291L4507j0700k1510
1516a11742L9898l3543K6112j6607q086M7088M833K4153o5408q647N1990m7954
1504i7913k0829k3268J03804J9561K9271n7751o3806J8661j3851M9004P6294q3550
1492f4373l0357K6439M61n8825N5542O0922o8577M2721L0164q5034l1934N4980
1480f7871O0977p4893j5047K491O6952m7437l1821Q319O158o798K4640j387L6402
1467c9315J2895m0251K1227M073M2067m8652j5520m1927N9156j4670j03060J3456
1455a50521J02771n502Q873j7661o2153m1766O8104K1135l9979K1537O9081L7661
$$ y = [-53996, -49190, -90114, -44530, -32720, 18260, 12552, -45934, -81748, -114039, -79532, -90232, -111742, -71844, -105387, -79275, -95882, -103968, -56880, -52047, -27894, -93302, -101949, -49959, -97913, -118742, -142010, -38206, -18645, 10626, -47125, -110931, -92270, -106121, -57117, 19177, -64373, -94730, -68291, -67830, -126655, -71113, -10191, -78768, -36047, -5883, -90917, -122851, -67871, -6894, -81787, -96834, -94343, -27391, -74828, -106649, -98330, -92172, -98970, -74330, -75717, -39315, -26420, -66671, -45444, -41371, 696, -47956, -63476, -105403, -46247, -60917, -163977, -150521, -47750, -53252, -44379, -62040, -124193, -165959, -97855, -76720, -116699, -95162, -26081, 11580]
$$ [...]
##END NTUPLES=NMR SPECTRUM
##END=
