##TITLE=1H_EC-3327
 CDCl3
 8 sc, 
 2.5.2024
##JCAMPDX= 6.0         $$ Bruker NMR JCAMP-DX V2.0
##DATA TYPE= NMR SPECTRUM
##DATA CLASS= NTUPLES
##ORIGIN= UXNMR, Bruker Analytische Messtechnik GmbH
##OWNER= root
$$ XWIN-NMR		Version 3.5
$$ Thu May  2 13:45:14 2024 Russian Standard Time (UT+4h)  she@DPX200
##.OBSERVE FREQUENCY= 200.1309
##.OBSERVE NUCLEUS= ^1H
##.ACQUISITION MODE= SIMULTANEOUS
##.ACQUISITION SCHEME= undefined
##.AVERAGES= 8
##.DIGITISER RES= 18
##SPECTROMETER/DATA SYSTEM= spect
##.PULSE SEQUENCE= zg30
##.SOLVENT NAME= CDCl3
##.SHIFT REFERENCE= (INTERNAL, CDCl3, 0, 16.4234)
##AUDIT TRAIL= $$ (NUMBER, WHEN, WHO, WHERE, WHAT)
$$ ##TITLE= Audit trail, XWIN-NMR		Version 3.5
$$ ##JCAMPDX= 5.01
$$ ##ORIGIN= Bruker BioSpin GmbH
$$ ##OWNER= she
$$ F:/spectra/data/she/nmr/H-F/1/pdata/1/auditp.txt
$$ ##AUDIT TRAIL=  $$ (NUMBER, WHEN, WHO, WHERE, WHAT)
(   1,<2024-05-02 13:43:53.45 +0400>,<she>,<DPX200>,
      <created by zg, POWCHK disabled, PULCHK disabled
       configuration hash MD5:
       00 E9 B6 7A A2 85 ED C7 34 08 36 98 17 FE 4E 26
       data hash MD5: 16K
       61 B4 3B 6C 70 A6 90 2B 19 82 F8 50 24 E8 C0 F3>)
(   2,<2024-05-02 13:44:14.15 +0400>,<she>,<DPX200>,
      <Start of raw data processing
       efp BC_mod = 2 LB = 0.24 FT_mod = 6 PKNL = 1 PHC0 = -25306.86 PHC1 = 5.587311 SI = 16K 
       data hash MD5: 16K
       F6 DD 36 8F 39 41 FF 36 C9 9D 38 50 77 43 D4 A7>)
(   3,<2024-05-02 13:44:31.73 +0400>,<she>,<DPX200>,
      <pk PHC0 = 8.126733 PHC1 = 4 
       data hash MD5: 16K
       EB 83 4B 5B 15 90 41 A5 8F 2A 86 57 40 E4 8D DB>)
(   4,<2024-05-02 13:44:34.67 +0400>,<she>,<DPX200>,
      <abs ABSG = 5 
       data hash MD5: 16K
       86 DF C3 03 3F E7 CB 4D 0E A7 A9 3B BD A2 8B 62>)
$$ ##END=
$$ 
$$ hash MD5
$$ 9D 5F 32 FF D3 79 94 1B 0A FE 44 9F 3B 73 16 87
##$RELAX= 
##$RELAX= 
##$RELAX= 
##$RELAX= 
##$RELAX= 
##$RELAX= 
$$ Bruker specific parameters
$$ --------------------------
##$DU= <F:/spectra>
##$EXPNO= 1
##$NAME= <H-F>
##$PROCNO= 1
##$TYPE= <nmr>
##$USER= <she>
##$AMP= (0..31)
100 100 100 100 100 100 100 100 100 100 100 100 100 100 100 100 100 100 
100 100 100 100 100 100 100 100 100 100 100 100 100 100 
##$AQSEQ= 0
##$AQ_mod= 1
##$AUNM= <au_zg>
##$AUTOPOS= <>
##$BF1= 200.13
##$BF2= 200.13
##$BF3= 200.13
##$BF4= 200.13
##$BF5= 200.13
##$BF6= 200.13
##$BF7= 200.13
##$BF8= 200.13
##$BYTORDA= 1
##$CFDGTYP= 0
##$CFRGTYP= 5
##$CHEMSTR= <none>
##$CNST= (0..31)
1 1 145 1 1 1 1 1 1 1 1 1 1 1 1 1 1 1 1 1 1 1 1 1 1 1 1 1 1 1 1 1 
##$CPDPRG= <>
##$CPDPRG1= <>
##$CPDPRG2= <>
##$CPDPRG3= <>
##$CPDPRG4= <mlev>
##$CPDPRG5= <mlev>
##$CPDPRG6= <mlev>
##$CPDPRG7= <mlev>
##$CPDPRG8= <mlev>
##$CPDPRGB= <>
##$CPDPRGT= <>
##$D= (0..31)
0 1.2 0 0 0 0 0 0 0 0.06 0 0.03 0 0 0 0 0.0002 0 0 0 0 0 0 0 0 0 0 0 0 
0 0 0 
##$DATE= 1714643032
##$DBL= (0..7)
120 120 120 120 120 120 120 120 
##$DBP= (0..7)
150 150 150 150 150 150 150 150 
##$DBP07= 0
##$DBPNAM0= <>
##$DBPNAM1= <>
##$DBPNAM2= <>
##$DBPNAM3= <>
##$DBPNAM4= <>
##$DBPNAM5= <>
$$ [...]
##$SUBNAM3= <"">
##$SUBNAM4= <"">
##$SUBNAM5= <"">
##$SUBNAM6= <"">
##$SUBNAM7= <"">
##$SUBNAM8= <"">
##$SUBNAM9= <"">
##$SW= 18.0517689322627
##$SWIBOX= (0..15)
0 0 2 0 0 0 0 0 0 0 0 0 0 0 0 0 
##$SW_h= 3612.71676300578
##$TD= 16384
##$TD0= 1
##$TE= 0
##$TE2= 300
##$TE3= 300
##$TEG= 300
##$TL= (0..7)
0 120 120 120 120 120 120 120 
##$TP= (0..7)
150 150 150 150 150 150 150 150 
##$TP07= 0
##$TPNAME0= <>
##$TPNAME1= <>
##$TPNAME2= <>
##$TPNAME3= <>
##$TPNAME4= <>
##$TPNAME5= <>
##$TPNAME6= <>
##$TPNAME7= <>
##$TPOAL= (0..7)
0.5 0.5 0.5 0.5 0.5 0.5 0.5 0.5 
##$TPOFFS= (0..7)
0 0 0 0 0 0 0 0 
##$TUNHIN= 0
##$TUNHOUT= 0
##$TUNXOUT= 0
##$USERA1= <user>
##$USERA2= <user>
##$USERA3= <user>
##$USERA4= <user>
##$USERA5= <user>
##$V9= 5
##$VALIST= <valist>
##$VCLIST= <CCCCCCCCCCCCCCC>
##$VD= 0
##$VDLIST= <DDDDDDDDDDDDDDD>
##$VPLIST= <PPPPPPPPPPPPPPP>
##$VTLIST= <TTTTTTTTTTTTTTT>
##$WBST= 1024
##$WBSW= 4
##$XGAIN= (0..3)
0 0 0 0 
##$XL= 0
##$YL= 0
##$YMAX_a= 102932
##$YMIN_a= -217098
##$ZGOPTNS= <>
##$ZL1= 120
##$ZL2= 120
##$ZL3= 120
##$ZL4= 120
##$ABSF1= 14.0336
##$ABSF2= -4.018259
##$ABSG= 5
##$ABSL= 3
##$ALPHA= 0
##$AQORDER= 0
##$ASSFAC= 0
##$ASSFACI= 0
##$ASSFACX= 0
##$ASSWID= 0
##$AUNMP= <proc_1d>
##$AZFE= 0.1
##$AZFW= 0.1
##$BCFW= 0
##$BC_mod= 2
##$BYTORDP= 0
##$COROFFS= 0
##$CY= -3
##$DATMOD= 1
##$DC= 0
##$DFILT= <>
##$DTYPP= 0
##$F1P= 0
##$F2P= 0
##$FCOR= 1
##$FTSIZE= 16384
##$FT_mod= 6
##$GAMMA= 0
##$GB= 0
##$INTBC= 1
##$INTSCL= 3.70164e-10
##$ISEN= 128
##$LB= 0.24
##$LEV0= 0
##$LPBIN= 0
##$MAXI= 10000
##$MC2= 0
##$MEAN= 0
##$ME_mod= 0
##$MI= 1.114404
##$NCOEF= 0
##$NC_proc= -8
##$NLEV= 6
##$NOISF1= 3.799351
##$NOISF2= 2.8
##$NSP= 0
##$NTH_PI= 0
##$NZP= 0
##$OFFSET= 16.42344
##$PC= 1
##$PHC0= -25298.73
##$PHC1= 9.587311
##$PH_mod= 1
##$PKNL= yes
##$PPARMOD= 0
##$PSCAL= 0
##$PSIGN= 0
##$REVERSE= no
##$SF= 200.129419543727
##$SI= 16384
##$SIGF1= 3
##$SIGF2= 2
##$SINO= 5.538805
##$SIOLD= 16384
##$SREGLST= <1H.CDCl3>
##$SSB= 0
##$STSI= 16384
##$STSR= 0
##$SW_p= 3612.71676300577
##$SYMM= 0
##$S_DEV= 0
##$TDeff= 16384
##$TDoff= 0
##$TI= <>
##$TILT= no
##$TM1= 0
##$TM2= 0
##$TOPLEV= 0
##$USERP1= <user>
##$USERP2= <user>
##$USERP3= <user>
##$USERP4= <user>
##$USERP5= <user>
##$WDW= 1
##$XDIM= 16384
##$YMAX_p= 456485740
##$YMIN_p= -1081306
$$ End of Bruker specific parameters
$$ ---------------------------------
##NTUPLES= NMR SPECTRUM
##VAR_NAME=  FREQUENCY,     SPECTRUM/REAL,   SPECTRUM/IMAG
##SYMBOL=    X,             R,               I
##VAR_TYPE=  INDEPENDENT,   DEPENDENT,       DEPENDENT
##VAR_FORM=  AFFN,          ASDF,            ASDF
##VAR_DIM=   16384,         16384,           16384
##UNITS=     HZ,            ARBITRARY UNITS, ARBITRARY UNITS
##FACTOR=    0.220516191357247, 1,           1
##FIRST=     3286.81370087751, 0,            0
##LAST=      -325.903062128256, 0,           0
##MIN=       -325.903062128256, -1081306,    0
##MAX=       3286.81370087751, 456485740,    0
$$ Real data points
##PAGE= N=1
##DATA TABLE= (X++(R..R)), XYDATA
$$ [...]
5631A1327222K28810K5541K80715L87722P23316M29013L35871L86745L50314J51964
5621A4627233O58734N04170L51123j36434l1211P75336L94269P05764O51888N00690
5611A9001562O57241O19131P05823Q83330J057663P76520N97156J466683P01547
5602B6466656J168575J803569J620722J715852J954491J853718L172357K398124
5594D2154064L267307L927919M306040M980644M025425K990793J176390l77245
5586F6451337k098840l415372l608610l171975k845728j393986q72865p13373
5578D8330588R4457O32569J502993J866371K344472K994635L223411L897176M277210
5569F9163882M640640M945186N530487N687598O393960P745126P835819P462009
$$ y = [11327222, 11556032, 11581573, 11862288, 12250010, 12973326, 13402339, 13738210, 14124955, 14475269, 14627233, 15285967, 15790137, 16141260, 16004826, 15973615, 16748951, 17143220, 17848984, 18500872, 19001562, 19658803, 20277934, 20983757, 21867087, 22924750, 23701270, 24298426, 25765109, 26466656, 27635231, 29438800, 31059522, 32775374, 34729865, 36583583, 39755940, 42154064, 45421371, 49349290, 53655330, 58635974, 62661399, 65652192, 66828582, 66451337, 64352497, 60937125, 57328515, 54156540, 51310812, 49916826, 49043961, 48330588, 48425045, 49057614, 50560607, 52426978, 54771450, 57766085, 60989496, 64886672, 69163882, 73804522, 78749708, 84280195, 89967793, 96361753, 104106879, 111942698, 119404707]
5561A19404707N428236J037587l896898p256603j0320843j0879724q879468p680470
5553G6956524n928856m554051l370621k155520j275034m71458N61122J050181
5545F0812287J825812K075424K182773K680349L020798K342156J903600J452057
5537G8295256J179660J726343J355577O67122k75425j823734l605587m891907
5529G2627305o540559o160750n432767m832205m056607l050807l228399k367280
5521C6957931j727169j505327q31082n82086l33792k29674O1128J99993k90685
5512C1719237l50398p36417q96692j681500j832010j413453j561337j507712j447564
5503B0292154j043034o70595o65183p40687o69458p67121o48938l90615m65912
$$ y = [119404707, 124832943, 125870530, 121973632, 114717029, 104396186, 93516462, 84636994, 76956524, 71027668, 66473617, 63102996, 60947476, 59672442, 59200984, 59762106, 60812287, 62638099, 64713523, 66896296, 69576645, 72597443, 74939599, 76843199, 78295256, 79474916, 81201259, 82556836, 83223958, 82948533, 81124799, 77519212, 72627305, 66086746, 59925996, 54493229, 49661024, 45604417, 42553610, 39325211, 36957931, 35230762, 33725435, 32894353, 32312267, 31978475, 31748801, 31809929, 32009922, 31719237, 31368839, 30632422, 29735730, 28054230, 26222220, 24808767, 23247430, 21739718, 20292154, 19249120, 18578525, 17913342, 17172655, 16503197, 15736076, 15087138, 14696523, 14230611]
5494A4230611n70381n05515l61359R6464n1636m92227j93804n32488j58463L3513
5484A1494715j36105J38743l8779L0105K79391j0387l17570J83528j28793l44332
5474A1150516j34429N0962K8000J78406Q063m13263J45911N9366p3381j27420
5464A0872731J79497R4501l96610J90706L96372J76040J57810J09884J91837Q20910
5454A2793678k43532K38073K94660L01224N29177P97387J13197j8636J10836N28633
5444A5444697R61200O73309P20195J307964N31904J056842J187864J380316J289612
5435B4553903J946668K228693K468296K594909K754989K710368J449913O37108
5427D1344847n14266j819912j986391k265928k117964k109896j340651n76872
$$ y = [14230611, 13660230, 13154715, 12793356, 12889820, 12838184, 12345957, 12152153, 11619665, 11461202, 11494715, 11358610, 11497353, 11458574, 11488679, 11768070, 11757683, 11440113, 11623641, 11494848, 11150516, 11016087, 11067049, 11095049, 11273455, 11281518, 10868255, 11014166, 11073532, 11000151, 10872731, 11052228, 11146729, 10750119, 10940825, 11337197, 11513237, 11671047, 11780931, 11972768, 12793678, 12550146, 12788219, 13082879, 13384103, 13913280, 14710667, 14823864, 14805228, 14916064, 15444697, 16405897, 17079206, 17799401, 19107365, 19639269, 20696111, 21883975, 23264291, 24553903, 26500571, 28729264, 31197560, 33792469, 36547458, 39257826, 40707739, 41344847, 40830581, 39010669, 37024278, 34758350, 32640386, 30530490, 29189839, 28612967]
5419B8612967J22865o86310p8402P77123O19744J465419J208500J488572K049523
5410C5580001K526074K902928L428755M022320N788334O033665N978169M517435
5402G0777681K537626p72145l564419o069068o743812p122428n766361m487399
5394C8789675l547110k735260k615194j666352j497064r48720p74219o79865J66653
5385B4492544L73149O62050Q18434J637409J617146K123005K211271K691641K154932
5376C8781581J567485K69785j372601k732831l537203l573258l493485l394492
5368B2514981k228113k513867k155175j099543j072526j217108j358216q53191
5360A0017242n75775j034300m43672N5230m75799o45652o03173L55235k40704
$$ y = [28612967, 28735832, 28049522, 27971120, 28748243, 29367987, 30833406, 32041906, 33530478, 35580001, 38106075, 41009003, 44437758, 48460078, 54248412, 60282077, 66260246, 70777681, 73315307, 72543162, 68978743, 62909675, 56165863, 49043435, 43277074, 38789675, 35242565, 32507305, 29892111, 28225759, 26728695, 25779975, 25005756, 24325891, 24492544, 24865693, 25527743, 26346177, 27983586, 29600732, 31723737, 33935008, 36626649, 38781581, 40349066, 40618851, 39246250, 36513419, 32976216, 29402958, 25909473, 22514981, 20286868, 17773001, 15617826, 14518283, 13445757, 12228649, 10870433, 10017242, 9441467, 8407167, 7963495, 8018725, 7542926, 6897274, 6294101, 6649336, 6408632]
5351F408632l77004q23027j85162L53557L18670k54040m84892J85453k9783m61178
5341D651226J48041m45314k39290M1046O02507j58044n10680l08586M4623J01039
5331C926568J49752O0740m31775l80331k2659K90098q1122k13454K44256P1026
5321C613099j95497m6431m36142l3108P4762K2295j99999L03647k01614o9998
5311B831014O0175J94615k27996p8183N1032L99453k43530r1413Q0268j55524
5301B819911L2552l83831J71720P7350m186j39220o815O8903l86864j28588L90874
5290B511806O469m5096J96783J94962R2264j99033p5846m03092l08932K59274
5280B229559N89358o9328l42186K96062m855L82108k74618j44134l29698r4979
$$ y = [6408632, 6031628, 5208601, 5023439, 5376996, 5695666, 5441626, 4956734, 5142187, 5112404, 4651226, 4799267, 4353953, 4114663, 4155709, 4758216, 4600172, 4089492, 3780906, 3825529, 3926568, 4076320, 4137060, 3705285, 3324954, 3302295, 3592393, 3511271, 3297817, 3542073, 3613099, 3417602, 3371171, 2935029, 2901921, 2976683, 2998978, 2798979, 3102626, 2901012, 2831014, 2891189, 3085804, 2857808, 2779625, 2830657, 3230110, 2986580, 2895167, 2975435, 2819911, 2852463, 2468632, 2640352, 2717702, 2713516, 2574296, 2567481, 2636384, 2249520, 2120932, 2511806, 2518275, 2473179, 2669962, 2864924, 2957188, 2758155, 2682309, 2279217, 1970285, 2229559, 2818917, 2749589, 2407403, 2703465, 2698610, 3080718, 2806100, 2661966, 2332268, 2237289]
5270B237289L07787K48964J33082J73622j18205n02167j5143n4616n1936K01717
5260B560394k22482M9823L41973J61801m29588L5891K97905j6216N4792j47335
5250B686958J77139k5513J24268M06829l40948l67017O010j72843k17125o2953
5240B214805J77305J3367J64877M17765j78124k49294K69701M3184n8919m60341
5230B354326j76836p6751K29967N39660k20554k15468L82632K37047j40723J93068
5220C106368k24888j00372m17453J23725L27688J97617l65272n033k5888j40915
5210B475577K06610k4889q7246J23243J22471L17286K54281m25906k81049K35828
5200B916206K020j08743o2731J4135O4184L46409L1217j94631j07803J60539K64498
$$ y = [2237289, 2545076, 2794040, 2927122, 3100744, 2982539, 2480372, 2465229, 2410613, 2358677, 2560394, 2337912, 2387735, 2729708, 2891509, 2461921, 2497812, 2795717, 2779501, 2834293, 2686958, 2864097, 2838584, 2962852, 3369681, 3028733, 2661716, 2667726, 2494883, 2277758, 2214805, 2392110, 2405477, 2570354, 2988119, 2809995, 2560701, 2830402, 2873586, 2814667, 2354326, 2177490, 2100739, 2330706, 2870366, 2649812, 2434344, 2816976, 3054023, 2913300, 3106368, 2881480, 2781108, 2363655, 2487380, 2815068, 3012685, 2647413, 2642380, 2616492, 2475577, 2682187, 2657298, 2570052, 2693295, 2815766, 3133052, 3387333, 2961427, 2680378, 2916206, 2918226, 2809483, 2746752, 2760887, 2825071, 3171480, 3202697, 3008066, 2900263, 3060802, 3325300]
5189C325300J54234j90669j74775q6223K6046j52309q936K2971J62679L13869
5179C392187j72209J67319K37286K20564n94237q8173k1654j25266q4927K70125
5169C201015l09356p6251M5515J30767J63701N15345j30439N634j91565N9342
5159C413708K11628L44767J82335l30705N5988n8197O0860J04075J95404J71495
5149D351358m132L83857J5126k01824J65265J04364k85225K3815o6392J87436
5139D673648m46009k77429O81581L47770j65539p47322j76465M11437M90582M32148
5129E224402L48440K05614j24747j77319j63038M33741N683k4354N27412m18253
5119E837581l48239J56796j07271K92888k1351j94111J7294k78898J13273J44447
$$ y = [3325300, 3479534, 3288865, 3114090, 3027867, 3053913, 2901604, 2892668, 2915639, 3078318, 3392187, 3219978, 3387297, 3624583, 3845147, 3250910, 3162737, 3141083, 3015817, 2930890, 3201015, 2891659, 2815408, 2860923, 2991690, 3155391, 3670736, 3540297, 3545931, 3354366, 3413708, 3625336, 3970103, 4152438, 3821733, 3877721, 3819524, 3880384, 3984459, 4179863, 4351358, 4347226, 4731083, 4746209, 4544385, 4709650, 4814014, 4528789, 4552604, 4486212, 4673648, 4227639, 3950210, 4631791, 4979561, 4814022, 4066700, 3890235, 4301672, 4792254, 5224402, 5572842, 5778456, 5653709, 5476390, 5313352, 5747093, 5752776, 5728422, 6255834, 5837581, 5489342, 5646138, 5538867, 5831755, 5810404, 5616293, 5633587, 5354689, 5467962, 5612409]
5109E612409m30808j06060M85812J77698N70495J98197l15690J72884K80175k47724
5099F397388L51884J7392k11131L74243M66497K18341M5730J82548O9876K63800
5089H176568K1069j3512k18363n16581L31321L98073J23059j34684K32449K83320
5079H682719J24261n4040j43056J61094O92515J18688J4254j00396L19516M18181
5069A0233736K5567O72681N28892K14399K58730n4075O0019j079M71780k7549
5059A2383101K87984M49783p6343L49110N98668J75996O06406L89876K47332N98210
5049A6010123K43549N26320M71349Q0940R5323J03980K56775J71675P1946O75137
5039A8707117O07323N64630j26997L45678N40769P96480O08375N43715Q76332
$$ y = [5612409, 5181601, 5075541, 5561353, 5739051, 6309546, 6507743, 6192053, 6364937, 6645112, 6397388, 6749272, 6766664, 6555533, 6929776, 7396273, 7614614, 7660344, 7842892, 7912768, 8176568, 8197637, 8184125, 7965762, 7449181, 7780502, 8178575, 8301634, 8166950, 8399399, 8682719, 8806980, 8752940, 8609884, 8770978, 9463493, 9582181, 9596435, 9496039, 9815555, 10233736, 10259303, 10931984, 11460876, 11675275, 11934005, 11879930, 11939949, 11938870, 12410650, 12383101, 12671085, 13120868, 13044525, 13393635, 13992303, 14168299, 14774705, 15164581, 15411913, 16010123, 16253672, 16779992, 17251341, 17332281, 17427604, 17531584, 17788359, 17960034, 18031980, 18707117, 19314440, 19879070, 19752073, 20097751, 20638520, 21435000, 22043375, 22587090, 23463422]
5030B3463422O46670M73385O49318J076965J748542J353934J366311J118413J643420
5021C3540380K045206K061647L205712L050441L433959L778930M639292N144690
5013F0900257N020935M506377L379359J141646n97271k615183m201843m453820
5005F3080457l022658l313725k849568k048284j650594m95344j01572L45133O45411
4996E0589256J382907J935066K677793K850903L254940M500892M951727N207507
4988G7350991O788030Q901049R997478J0263010Q949921N709744J735757l327172
4980A26368808o992984q606948r313276q565899p969313p834046o641739n008509
4972F5436094l775282l254453k444575j869092j295063n55192k4753L02204J179515
$$ y = [23463422, 24110092, 24583477, 25232795, 26309760, 28058302, 29412236, 30778547, 31896960, 33540380, 35585586, 37647233, 40852945, 43903386, 47337345, 51116275, 55755567, 60900257, 65921192, 70427569, 73806928, 74948574, 74351303, 71736120, 67534277, 63080457, 60057799, 56744074, 53894506, 51846222, 50195628, 49700284, 49598712, 49943845, 50589256, 51972163, 53907229, 56585022, 59435925, 62690865, 67191757, 72143484, 77350991, 84139021, 93040070, 103037548, 113300558, 122250479, 127960223, 129695980, 126368808, 119375824, 110768876, 101455600, 92889701, 84920388, 77086342, 70444603, 65436094, 61660812, 58406359, 55961784, 54092692, 52797629, 52242437, 52217684, 52519888, 53699403]
4963E3699403J682854K029295J974452K752358L739374M148754M649959M548528
4955G9224977L906501K169741J83655j770747l200235m116895n223768n076417
4947F6096812n830480n583993n031271n038718l579926l366506k928527k077301
4939C2660090j222167j069976j376405o75218n89485l58320J78744l73107k97532
4930B6876624L52620O06892K36091L7081O59668N50649M77410q6587o7314q13278
4920B8829856j446951j807963j653358j565468j342840j115903q97343q74606
4912A8125424r38849m48988l58910J14981m04273k34890M23745n25212J5463Q5768
4902A5854259j35866J18893n86031k47659O9000n42343J5836j97394m70490Q0252
$$ y = [53699403, 55382257, 57411552, 59386004, 62138362, 65877736, 70026490, 74676449, 79224977, 83131478, 85301219, 85484874, 83714127, 80513892, 76396997, 71173229, 66096812, 60266332, 54682339, 49651068, 44612350, 41032424, 37665918, 34737391, 32660090, 31437923, 30367947, 28991542, 28316324, 27726839, 27368519, 27547263, 27174156, 26876624, 27229244, 27836136, 28072227, 28109308, 28768976, 29319625, 29797035, 29710448, 29643134, 28829856, 27382905, 25574942, 23921584, 22356116, 21013276, 19897373, 19000030, 18125424, 17186575, 16737587, 16378677, 16493658, 16089385, 15854495, 16278240, 15753028, 15768491, 15854259, 15718393, 15837286, 15251255, 15003596, 15072596, 14530253, 14546089, 14348695, 13878205, 13958457]
4892A3958457k64778J06227K65753J26903j23414k14741J06397q2804K24192L20752
4882A4422944R7356j98590l702L71735M6928k49419J08079J44261J78538j06832
4872A4811298J85173K32332J15366K97803R0350K14635m3845o6792M34055N29863
4862A6800238N73946j82088K90906N23941K37093M24360J41717O85419M73889
4853A9969421P41322O08387K62575N33586P23799L28384K49296M51141J005086
4844B4872997N94308Q08476K46344J365872J343819J129755J556861J897295J949433
4835C5765160K390516L201450L716260L431298L289244K920973J174817j057822
4827E4831896j982007k773805k971011k802023j919346j413825r39797j137994
$$ y = [13958457, 13693679, 13799906, 14065659, 14192562, 14069148, 13854407, 13960804, 13878000, 14102192, 14422944, 14520300, 14321710, 14318008, 14689743, 14736671, 14487252, 14595331, 14739592, 14918130, 14811298, 14996471, 15228803, 15344169, 15641972, 15732322, 15946957, 15903112, 15836320, 16270375, 16800238, 17374184, 17192096, 17483002, 18006943, 18244036, 18668396, 18810113, 19495532, 19969421, 20710743, 21319130, 21581705, 22115291, 22839090, 23167474, 23416770, 23867911, 24872997, 25467305, 26275781, 26522125, 27887997, 29231816, 30361571, 31918432, 33815727, 35765160, 38155676, 41357126, 45073386, 48504684, 51793928, 54714901, 55889718, 54831896, 52849889, 50076084, 47105073, 44303050, 42383704, 40969879, 40030082, 38892088]
4819C8892088p18240J30377J36425M86118N69155J202444J506433K108760K085979
4810D6399539L063724L478937M066509N017899O562961O808097N679216L155597
4802H4232479j157593m017684o531398p207659p405854n806452l866498m461990
4794D3777351l294803k339680k050567j388886j139389q55694M7920R2504N58363
4785C3407119R80429O8217N58078J768448J966929J835644K366403K567852J812186
4776D7331305O72914p83393k202296l005557l664840k841456k038110k455856
4768C1012711j659723j104774j326949r71954p24287m89084o2560n20797k57586
4759B3894997n40908J44503K55850k12873M19622M56485M49059K20476Q6307L44536
$$ y = [38892088, 38173848, 38304225, 38440650, 38926768, 39495923, 40698367, 42204800, 44313560, 46399539, 49463263, 52942200, 57008709, 62026608, 68589569, 75397666, 81076882, 84232479, 83074886, 79057202, 72525804, 65318145, 57912291, 52105839, 48239341, 43777351, 40482548, 38142868, 36092301, 34703415, 33564026, 32708332, 32756252, 32848756, 33407119, 34387548, 34455765, 35013843, 36782291, 38749220, 40584864, 42951267, 45519119, 47331305, 48004219, 47220826, 45018530, 42012973, 38348133, 35506677, 33468567, 31012711, 29352988, 28248214, 26921265, 25949311, 25225024, 24735940, 24673380, 24152583, 23894997, 23354089, 23498592, 23754442, 23541569, 23961191, 24417676, 24866735, 25087211, 25173518, 25518054]
4749B5518054M31315J37127K6815L28170K86225K86434J5530K13969L99331L90733
4739B8033703K40895O12019Q80402O30399L67007N08644K42702O38673P46469
4730C2900913j04369N98957R31595N18514J270683P01354J109322R46047P09191
4721C9582207N20482k2406j14075K43890J063307P78759M58451N87194Q37104
4712D3934913J141625R63064O19005J007212J166360J406472R37930J412126J560788
4703E4149495J311687J661146J533986K178776J668904J798901K153864K110699
4695F8567458J876190J975016K295780K116881J857296K006918K219602K509196
4687H5424337L028284L729694M301362L917337N009577N644407O752923Q145633
$$ y = [25518054, 25949369, 26086496, 26113311, 26441481, 26727706, 27014140, 27029670, 27243639, 27642970, 28033703, 28274598, 28886617, 29767019, 30397418, 30764425, 31273069, 31515771, 32154444, 32900913, 32796544, 33395501, 34327096, 34845610, 36116293, 36817647, 37926969, 38873016, 39582207, 40102689, 40080283, 39966208, 40210098, 41273405, 42052164, 42510615, 43097809, 43934913, 45076538, 46039602, 46658607, 47665819, 48832179, 50238651, 51176581, 52588707, 54149495, 55461182, 57122328, 58656314, 60835090, 62503994, 64302895, 66456759, 68567458, 70443648, 72418664, 74714444, 76831325, 78688621, 80695539, 82915141, 85424337, 88452621, 92182315, 96483677, 100401014, 105410591, 111054998, 117807921, 125953554]
4679A25953554Q333366P591852M945182K040707q1614j875889j497086n32370
4671A44877702P4827J393732K572818L624414N262598O346916Q280948R770746
4663A82204701J1720736J3198690J3744753J4803797J5027179J6147207J6667376
4656B83514439J6639105J5469375J2071954P250511J126702m778196r769705j4009659
4648C07514526j6366243j7463112j6865462j5628877j4074716j1845936r683442
4641B05586738o409653l533594j135373J013215M178516O600897P283168P286451
4633B20870365M936605K331522l24j817797j120127n35878j58284o49814j968695
4624B21887573l266101m219246n488450n214935m564659m339459m141035n437286
$$ y = [125953554, 134286920, 141878772, 146823954, 148864661, 148783047, 146907158, 145410072, 144877702, 144952529, 146346261, 148919079, 152543493, 157806091, 164153007, 172433955, 182204701, 193925437, 207124127, 220868880, 235672677, 250699856, 266847063, 283514439, 300153544, 315622919, 327694873, 334945384, 336072086, 331293890, 321524185, 307514526, 291148283, 273685171, 256819709, 241190832, 227116116, 215270180, 205586738, 199177085, 195643491, 194508118, 195521333, 199699849, 206300746, 213583914, 220870365, 225806970, 228138492, 228138168, 226320371, 225200244, 224664366, 224506082, 223856268, 221887573, 218621472, 214402226, 208913776, 203698841, 199134182, 194794723, 190653688, 185216402]
4616A85216402p833715q953091j0793524j1663484j0526973q883117p408840o126344
4608A13027314n617582l916262k628637j538712l38222P20740O45271J19316j191422
4599I9281804l149989m324156o813686o504254n601093m999308m998825m183399
4591E8707094l679286l286006k902812k299122j714115k502354j954089j616906
4583C8752404j676639r39651j321322r91480m54637p52981p00717o79338r6341
4574C1139298o68805p05920o74187j140156m76551m71573m87268n07257o86863
4565B5320718l79724K36825l08284M1336k64937l30106k45281K29008J26484m6280
4555B4379759L70494o0466K21665J48899j72985k33784j47517K88395K81084L87627
$$ y = [185216402, 177382687, 168429596, 157636072, 145972588, 135445615, 126562498, 119153658, 113027314, 107409732, 103493470, 100864833, 99326121, 98987899, 99708639, 100353910, 100473226, 99281804, 96131815, 91807659, 84993973, 78489719, 72888626, 67889318, 62890493, 58707094, 55027808, 51741802, 48838990, 46539868, 44825753, 42323399, 40369310, 38752404, 37075765, 36136114, 34814792, 33823312, 33368675, 32615694, 31914977, 31235639, 31139298, 30470493, 29764573, 29090386, 27950230, 27473679, 27002106, 26514838, 26007581, 25320718, 24940994, 25177819, 24869535, 24910871, 24645934, 24315828, 24070547, 24299555, 24426039, 24379759, 24750253, 24689787, 24911452, 25060351, 24887366, 24653582, 24506065, 24794460, 25075544, 25463171]
4545B5463171O52665N30101M28149Q76388R31522R05790P35631O18476M54915
4536C1596808P65541J72274j18665J81108K75954O92873K65288M02237O57340
4527C4890758N74542M28979P94852J355370R13859Q49466J393099K003087K464418
4518D5668430K503706K887306L339538M112483M417194N278374O247722P415928
4510H1870681R408650J2133839J4416029J5618237J3635407O133672k582119r562746
4502A41071650j5691277j6786931j4957894j2381439r672358p760863o015105
4495E7805783n485624m455926l454994k843743k486679k445448j570839j698503
4487C3364027j387008j792512k259839j641689j284654j149688j597657p69023
$$ y = [25463171, 26115836, 26645937, 27074086, 27950474, 28881996, 29787786, 30523417, 31141893, 31596808, 32362349, 32534623, 32415958, 32597066, 32873020, 33565893, 33831181, 34233418, 34890758, 35465300, 35894279, 36689131, 38044501, 38958360, 39807826, 41200925, 43204012, 45668430, 48172136, 51059442, 54398980, 58511463, 62928657, 68207031, 74454753, 81870681, 91279331, 103413170, 117829199, 133447436, 147082843, 153216515, 150634396, 141071650, 125380373, 108593442, 93635548, 81254109, 71581751, 63820888, 57805783, 52320159, 47864233, 44409239, 41565496, 39078817, 36633369, 35062530, 33364027, 31977019, 30184507, 27924668, 26282979, 24998325, 23848637, 22250980, 21481957]
4479B1481957p90604m69174q25479j84131l4481J16336n3796P3281K07974j45008
4469A9376875k22815L89276R32498J61177P39014Q44989N62194J56298O82374
4460B3621880J013544R54424R02460K52734J19201p41842j684308j695001k011864
4451B0731228j786445j878043j453319j019189q20828j082368n50161l70934l92309
4442A1377632k55395m89007K20820M62905o7466J89744j15340P3855N33414N4678
4432A1985840K56729R04229J013971P55374J267852J383893J552098J264076R17885
4423B1301947m10265j456694j508299j630444j525278j289735j480454q80120
4415A1120658j107728o23981p26017m66182M9146p89989j57959M4115j26896p6271
$$ y = [21481957, 20691353, 20222179, 19396700, 19212569, 19178088, 19294424, 19240628, 19313909, 19521883, 19376875, 19154060, 19543336, 20475834, 20637011, 21376025, 22221014, 22783208, 22939506, 23621880, 24635424, 25589848, 26492308, 26745042, 26864243, 26122401, 24438093, 22743092, 20731228, 18944783, 17066740, 15613421, 14594232, 13773404, 12691036, 12140875, 11769941, 11377632, 11122237, 10633230, 10854050, 11316955, 11249489, 11439233, 11323893, 11397748, 11931162, 11985840, 12242569, 13146798, 14160769, 14916143, 16183995, 17567888, 19119986, 20384062, 21301947, 20891682, 19434988, 17926689, 16296245, 14770967, 13481232, 12000778, 11120658, 10012930, 9388949, 8662932, 8196750, 8245896, 7455907, 7297948, 7342063, 7215167, 7138896]
4405G138896k7323k51960l034L1769j68469K10271J57727J9266R49433J79510
4395H236086J75060N82709L88882M54536k28607k97490m76219m77822k77725k67844
4385G811566j18729n92600n36543k86372j02649M04021P0763l28767k60974j12041
4375E947675K13905k48967J7943l51982j41670j39977m53453l95704l26107L68
4365D122031M16534J15939j26095J28625l1134L46424j29532k18322n5101J85947
4355D755316N73616k44390p8417M95947L8309N2712q4936K26295N34112K03971
4345F472535l21372p1512j5540J44359l90888k03577K90459k11785l58844k97962
4335E035873n57780j19940j27198K0148L2541m95238M94471j349M0052P7333M17761
$$ y = [7138896, 7111573, 6859613, 6856579, 6888348, 6719879, 6930150, 7087877, 7107143, 8056576, 8236086, 8411146, 8993855, 9382737, 9837273, 9608666, 9311176, 8834957, 8357135, 8079410, 7811566, 7692837, 7100237, 6563694, 6277322, 6174673, 6578694, 6649457, 6320690, 6059716, 5947675, 6161580, 5912613, 5930556, 5578574, 5436904, 5296927, 4843474, 4447770, 4121663, 4122031, 4538565, 4654504, 4528409, 4657034, 4625900, 4972324, 4842792, 4624470, 4569369, 4755316, 5328932, 5084542, 5006125, 5502072, 5540381, 5593093, 5508157, 5734452, 6268564, 6472535, 6151163, 6079651, 6064111, 6208470, 5817582, 5614005, 5904464, 5692679, 5333835, 5035873, 4478093, 4358153, 4230955, 4251103, 4283644, 3788406, 4282877, 4281528, 4321580, 4398913, 4816674]
4324D816674m12403l59868j0348P058K20844k57565J68698J55959Q0789J82106
4314D591944n0027k87937K86556L39321L75757j05012m41063o9303j7068J62475
4304D785643k63318m74973q7110J52955k06694o24829L82269L00773l05133m71133
4294C188450j54348L4025j73178o686j34864j47627J21824j34156j37686j43574
4284B312180M96170O398j88252K74943L70173J0890j92718K9431o53340K65497
4274B731372K02819l71440L21055O7637J36727o37521M8777m6560l44240O60327
4264B768953j33467l11219l4639R1164j96052l71358j29766J0234M0757L66369
4254B100976k3833J19865L77553k31899k48534L13475k894O6483p6933K4227J26584
$$ y = [4816674, 4404271, 4044403, 4034055, 4041113, 4261957, 4004392, 4173090, 4329049, 4409838, 4591944, 4541917, 4253980, 4540536, 4879857, 5255614, 5150602, 4709539, 4640236, 4623168, 4785643, 4522325, 4047352, 3960242, 4113197, 3906503, 3281674, 3663943, 3964716, 3659583, 3188450, 3034102, 3068127, 2894949, 2888263, 2753399, 2605772, 2727596, 2593440, 2455754, 2312180, 2808350, 2814748, 2626496, 2901439, 3271612, 3282502, 3089784, 3119215, 2465875, 2731372, 2934191, 2562751, 2883806, 2951443, 3088170, 2450649, 2499426, 2452866, 2108626, 2768953, 2635486, 2324267, 2289628, 2380792, 2184740, 1813382, 1683616, 1693850, 1734607, 2100976, 2077143, 2197008, 2574561, 2342662, 2094128, 2407603, 2404709, 2471192, 2394259, 2418486, 2545070]
4243B545070j62431R0226K58024k572n99232N327J86661j72260l16363L85351
4233B217801j11704o7886J01663q6290O3258n31691N05942J3610m47111K52003
4223A909595j74816J50632O5882J99810K21087K03118j42057k80220O0132j34255
4213B078908J52139j02412K28980J83522j42355j57048l39387J83908N52470k414
4203B636311m0833n26508j27692J33291l20497J54124r7929J4199p0645j9827
4193A733994K26181K13324j02477p2110j05297J84361k60397O8275L07365P7818
4183B271037j52674K35752J6112k64067j20547k79320l82725J55215O10257P5047
4173B164087J30298p66571L6088P06748J49614k83880o0346J85099m1250j00107
$$ y = [2545070, 2382639, 2472865, 2730889, 2728317, 2129085, 2134412, 2321073, 2148813, 1832450, 2217801, 2106097, 2038211, 2139874, 2053584, 2116842, 1585151, 2091093, 2104703, 1657592, 1909595, 1734779, 1885411, 1951293, 2151103, 2372190, 2575308, 2433251, 2153031, 2213163, 2078908, 2231047, 2128635, 2357615, 2541137, 2398782, 2241734, 1902347, 2086255, 2638725, 2636311, 2595478, 2068970, 1941278, 2074569, 1754072, 1908196, 1810267, 1824466, 1753821, 1733994, 1960175, 2173499, 2071022, 1998912, 1893615, 2077976, 1817579, 1885854, 2193219, 2271037, 2118363, 2354115, 2370227, 2106160, 1985613, 1706293, 1323568, 1478783, 2089040, 2164087, 2294385, 1527814, 1563902, 2270650, 2420264, 2136384, 2076038, 2261137, 2219887, 2119780]
4163B119780J38979p8405J26034J7416j9999j03477K05039k18584p2112K3923
4153B138594o0629l30266K25489Q5562R7225K76584m79883K21668K29648l1608
4143B372384l15236O32L41231j05329j18707j68479J69113O1240J11584J83504
4133B531937j77733K75364l362l84330j7948j28296L62932k7068J26043K92155
4123B849694k08754k38403N1779k090k5996O19593N12092k14132k31122l34555
4113B778106K69306L97350k47155j7873l7732K44223k10010K77906k9056R1072
4103C516137j8915J31422o3839R0807k751J55341m2447r8091Q2957l27764r2142
4092C330715M77518P2959r6989N7385M1360L81639K38797j93357j67993N43112
$$ y = [2119780, 2258759, 2180354, 2306388, 2323804, 2303805, 2200328, 2405367, 2186783, 2114671, 2138594, 2077965, 1747699, 1973188, 2058750, 2155975, 2432559, 1952676, 2174344, 2403992, 2372384, 2057148, 2057780, 2399011, 2293682, 2174975, 2006496, 2175609, 2236849, 2348433, 2531937, 2354204, 2629568, 2626206, 2241876, 2223928, 2095632, 2458564, 2431496, 2557539, 2849694, 2640940, 2402537, 2454316, 2452226, 2426230, 3045823, 3557915, 3343783, 3112661, 2778106, 3047412, 3444762, 3197607, 3179734, 3142002, 3386225, 3176215, 3454121, 3425065, 3516137, 3497222, 3628644, 3564805, 3655612, 3652861, 3808202, 3765755, 3667664, 3750621, 3422857, 3330715, 3808233, 3881192, 3784203, 3841588, 3882948, 4264587, 4503384, 4310027, 4142034, 4685146]
4082D685146J54627K03819l68219J33497K83956K88358J32923J6174K26775r4056
4072E663000P2301R8527k00595k3517M71034o9420J35864N42510j29355J19313
4062F679662M58453p1572K32567M53377L96754L38950M14040K5352R7931N5791
4052I081305M21414K88335P69260M38997J82297k48356L2892O70054J075548J227552
4042A3939298Q92785P40658R05424O45081J047869J355020N81417J689982K171213
4033B3968747K770865L921231M759344M593573L755462J122208j047022l827326
4025D0017082n434095m914389m264763l433757k692588k398715j638510j331332
4017A3908933r59667m51524o69768m51085m75236k60548l19916k33532k33410
$$ y = [4685146, 4839773, 5043592, 4675373, 4808870, 5092826, 5381184, 5514107, 5530281, 5757056, 5663000, 5735301, 5833828, 5633233, 5609716, 6080750, 6011330, 6147194, 6689704, 6560349, 6679662, 7138115, 7066543, 7299110, 7752487, 8149241, 8488191, 8902231, 8927583, 9025514, 9081305, 9502719, 9791054, 10560314, 10999311, 11181608, 10933252, 10966144, 11636198, 12711746, 13939298, 14832083, 15572741, 16478165, 17123246, 18171115, 19526135, 20107552, 21797534, 23968747, 26739612, 30660843, 35420187, 40013760, 43769222, 44891430, 43844408, 40017082, 34582987, 29668598, 25403835, 21970078, 19277490, 16878775, 15240265, 13908933, 12949266, 12497742, 11827974, 11376889, 10901653, 10641105, 10321189, 10087657, 9854247]
4008I854247n0677K46004n8897K69783l20185l44044N25598N2064J28790j58058
3998A0144625J68918M01922L89295l72984M61026N70226l69180K10883j15106
3989A1489625L81731K72459O61660J31293k16537M61758K35017K24104M07990
3980A4049100K68806M02357l9519N60756P26269L15524K35316K72164N18678k51811
3970A7057640M7571j1858k47286J71383j71095K79148K86440J67404m3270J75776
3960A7711853N52396P34657L74777L24398L98025O0116J002066N85232M20203
3951B2163723O63140J120838J258471J224986J230056J062739J444986K042267
3943C2211206J813973K228328K268613K140052J764519K209235L044426L201792
$$ y = [9854247, 9803570, 10049574, 9990677, 10260460, 9940275, 9596231, 10121829, 10173893, 10302683, 10144625, 10313543, 10715465, 11104760, 10731776, 11192802, 11763028, 11393848, 11604731, 11489625, 11871356, 12143815, 12805475, 12936768, 12720231, 13181989, 13417006, 13641110, 14049100, 14317906, 14720263, 14680744, 15241500, 15967769, 16283293, 16518609, 16790773, 17309451, 17057640, 17105211, 17093353, 16846067, 17017450, 16846355, 17125503, 17411943, 17579347, 17536077, 17711853, 18264249, 18998906, 19373683, 19698081, 20096106, 20156222, 21158288, 21743520, 22163723, 22826863, 23947701, 25206172, 26431158, 27661214, 28723953, 30168939, 32211206, 34025179, 36253507, 38522120, 40662172, 42426691, 44635926, 47680352, 50882144]
3935E0882144L704988L709109K779334J250159n2339j402329k728001m074612
3927E4068453l124112k706587k469139j604177m33257m55773m01962P80067J395785
3918D5049298J303576J458928K023105K858293L305723M239015M919861N204108
3910G0361907O062843N484138L857851J661709m63861l289988n702176p265468
3902G0706955p376012o139754n474026m562458l090927k902745k186334j517495
3894C7457204j520464r36390m50459j11992K93805R89593J049161J286916J976017
3885D0033391K461778K362875J601995M01728j390806k806991l850482l894871
3877C4918617l600071l651895l278415k132674k151172j989248j562178j525440
$$ y = [50882144, 54587132, 58296241, 61075575, 62325734, 62273395, 60871066, 58143065, 54068453, 50944341, 48237754, 45768615, 44164438, 43731181, 43275408, 42873446, 43653513, 45049298, 46352874, 47811802, 49834907, 52693200, 55998923, 60237938, 65157799, 70361907, 76424750, 81908888, 85766739, 87428448, 86964587, 83674599, 77972423, 70706955, 63330943, 57191189, 51717163, 47154705, 44063778, 41161033, 38974699, 37457204, 35936740, 35000350, 34549891, 34437899, 34731704, 35721297, 36770458, 38057374, 40033391, 42495169, 44858044, 46460039, 46861767, 45470961, 42663970, 38813488, 34918617, 31318546, 27666651, 24388236, 22255562, 20104390, 18115142, 16552964, 15027524]
3869A5027524q47703o43186q93416o37964l38350m06866m38345k09748l96826
3860A0215120k59367l21329j38464k09210j73830J60284k20663n99892j43744
3851H308905j03177j67725k44689r0638n4528q97701K29447J68311j06251p0615
3841F971339n3157l5101J74885M27805q2552q4028K32407j81922k29900L06118
3831G445894J43891L44822O59121l5263l83510J76109k10614l74436j78222l24974
3821G262818r6480l406J29126J05049l93974J9683L02942n6975k34326j66335
3811F868122L11224K34491L23276M6219L13620K28953J40400q0223j33600k36347
3801H016135l65484n68820m63891N486k40809k66099p9355M293l69430k89851
$$ y = [15027524, 14179821, 13536635, 12643219, 12005255, 11666905, 11260039, 10821694, 10611946, 10215120, 9955753, 9634424, 9495960, 9286750, 9112920, 9273204, 9052541, 8452649, 8308905, 8205728, 8038003, 7793314, 7702676, 7648148, 6750447, 6979894, 7148205, 7041954, 6971339, 6918182, 6883081, 7057966, 7485771, 7403219, 7319191, 7551598, 7369676, 7139776, 7445894, 7589785, 7934607, 8593728, 8558465, 8174955, 8351064, 8140450, 7766014, 7587792, 7262818, 7166338, 7162932, 7292058, 7397107, 7003133, 7022816, 7325758, 7268783, 7034457, 6868122, 7179346, 7413837, 7737113, 7783332, 8096952, 8325905, 8466305, 8386082, 8252482, 8016135, 7650651, 7081831, 6617940, 6623426, 6382617, 6116518, 6037163, 6041456, 5672026, 5382175]
3791E382175K02355n33317j62989M95583j21121M9169L17730J16382J00911P0194
3781E917072l52472j72923m1725q86602K08197N08934m55243n88745m11441j44550
3771C580502m78181p6540j75254K34597N6919J29599j0019j04895J3872l93786
3761B776814K767P3185L41171K28533J00184n5455k1350l12864p0215L42468j13764
3750C291474r0358l22116Q4821r1589k42536N1394j51146j54571l0023m18857
3740A926493N39170o7326m5515J48474L1325l52995l08332N9524K87764O7519
3730B286101J32134K71556J56474m18374j07452J7862j90974N86700K49778J38289
3720C122094j53140m17675j09817K39231j84328n3005K501o1974Q5391J26334
$$ y = [5382175, 5584530, 5051213, 4888224, 5383807, 5262686, 5311855, 5629585, 5745967, 5846878, 5917072, 5564600, 5391677, 5349952, 4463350, 4671547, 5180481, 4725238, 4136493, 3725052, 3580502, 3102321, 3025781, 2850527, 3085124, 3142043, 3271642, 3261623, 3156728, 3170600, 2776814, 2779581, 2852766, 3193937, 3422470, 3522654, 3467199, 3445849, 3132985, 3062770, 3405238, 3291474, 3201116, 2879000, 2963821, 2872232, 2629696, 2681090, 2529944, 2375373, 2345350, 1926493, 2465663, 2398337, 2352822, 2501296, 2532621, 2179626, 1871294, 1930818, 2218582, 2286101, 2418235, 2689791, 2846265, 2427891, 2320439, 2338301, 2147327, 2734027, 2983805, 3122094, 2968954, 2551279, 2441462, 2680693, 2496365, 2443360, 2445861, 2383887, 2469278, 2595612]
3710B595612j29324l02495K55043J62785l52187r2329L9031L94400P6479l7627
3700B609388J14306k29652m86895K41294J70856k50074K68306K79416q9757k59991
3690B367197l53068l99964J87977K67754M76498L14584k00283k33192m87362j6711
3680A923430K71633K75604l2541k45875O4238M31483J77619o60494J70213M93742
3670B869052j69232M77194l53300j13558j63664J88811j649L6063q7706k17459
3660B464552j4690M86371M15980l28954l22729k0114p6293l7584J64851k45122
3650B486268J10187n8400l34392O59146J95739k12886K43203q0199r3948n7362
3640B857356O1339O25470K07694k02813n7355m63867m8192p5481K85101k2553
$$ y = [2595612, 2466288, 2163793, 2418836, 2581621, 2229434, 2137105, 2176136, 2570536, 2647015, 2609388, 2723694, 2494042, 2007147, 2248441, 2419297, 2169223, 2437529, 2716945, 2627188, 2367197, 2014129, 1614165, 1802142, 2069896, 2546394, 2860978, 2660695, 2427503, 1940141, 1923430, 2195063, 2470667, 2438126, 2192251, 2256489, 2687972, 2865591, 2205097, 2375310, 2869052, 2699820, 3177014, 2823714, 2710156, 2546492, 2735303, 2733654, 2769717, 2682011, 2464552, 2449862, 2936233, 3352213, 3023259, 2700530, 2680416, 2604123, 2566539, 2731390, 2486268, 2596455, 2538055, 2203663, 2862809, 3058548, 2845662, 3088865, 3008666, 2914718, 2857356, 2918695, 3544165, 3751859, 3549046, 3491691, 3027824, 2979632, 2904151, 3189252, 3166699]
3630C166699k61198M11305K5831O6300k7878j06637J2289r3031l21239K86886
3620C159327J5668j88734L38110j89613j73372J68909L07844m35901M263J02337
3610C108838o3132L8825K40989k39537J88743M72826l07444J06486j77655k77493
3600C091446K09536j92808l094K38426J84767l24629m25078L26985K39465k16251
3590C128765L6479K46645j97481J85411r0512j05491K2387l52067K93430L39439
3580C507005J7147o30043m9009N05803m6016j88625O92603m8000k61901K12357
3570C711321q1865j07820j2982l8448p3311J13605l24884M9088M86065L00283
3560D021052n5981Q2353j32378K36495J2462l54965j84464j62340L26516m15239
$$ y = [3166699, 2905501, 3316806, 3342637, 3408937, 3381059, 3274422, 3286711, 3193680, 2872441, 3159327, 3174995, 2986261, 3324371, 3134758, 2961386, 3130295, 3438139, 3002238, 3006501, 3108838, 3045706, 3084531, 3325520, 3085983, 3274726, 3747552, 3440108, 3546594, 3368939, 3091446, 3300982, 3108174, 3105080, 3343506, 3528273, 3203644, 2778566, 3105551, 3345016, 3128765, 3165244, 3411889, 3214408, 3399819, 3309307, 3203816, 3226203, 2874136, 3167566, 3507005, 3524152, 2894109, 2845100, 3350903, 3304887, 3116262, 3808865, 3760865, 3498964, 3711321, 3629456, 3521636, 3508654, 3470206, 3396895, 3510500, 3185616, 3234704, 3720769, 4021052, 3965071, 4047424, 3915046, 4151541, 4164003, 3809038, 3624574, 3462234, 3788750, 3373511]
3550C373511J73325L14452M94907l09078o2870M17230m72092j33787M31576l2067
3540D195107k17465J04827L09033k95683L9466L68496j22703k4784K00975K23255
3530D780524j74656M89691j08856j85513M05524j64599j47966K53368J001j72284
3520D976234j54565r3200k68344P5393N38194L4516m20401K53131k25898L07063
3510E022123M08482J17500O7557k65197k31698Q7462O71466l54060j89706J99739
3500E533668J56569k26605L12187M71878P9582O9660o5782j61916n63878J70803
3490E776166L73472K99528L36318l0844j48974M30143k50425L05114j40233r9311
3480F850954j32618L12270M45611o2301j09517M5377K39704j00454O8882J68965
$$ y = [3373511, 3546836, 3861288, 4356195, 4047117, 3984247, 4401477, 3929385, 3795598, 4227174, 4195107, 3977642, 4082469, 4391502, 4095819, 4135285, 4503781, 4381078, 4356294, 4557269, 4780524, 4605868, 5095559, 4986703, 4801190, 5206714, 5042115, 4894149, 5147517, 5148518, 4976234, 4821669, 4728469, 4460125, 4535518, 5073712, 5108228, 4687827, 4940958, 4715060, 5022123, 5430605, 5548105, 5615662, 5350465, 5118767, 5206229, 5877695, 5523635, 5333929, 5533668, 5690237, 5463632, 5775819, 6247697, 6327279, 6396939, 6331157, 6169241, 5605363, 5776166, 6149638, 6449166, 6785484, 6754640, 6605666, 7035809, 6785384, 7090498, 6950265, 6850954, 6718336, 7030606, 7476217, 7413916, 7304399, 7349776, 7589480, 7489026, 7557908, 7726873]
3470G726873N6259M94069J56253n6554J1537N8199J25532l73294L44635Q4517
3460H628026l26311k92700M7665L15960O41884k06595L659L19633J73740Q7334
3450I392295N68895J61555j97437L26449J85987J61982N8357q354M22186Q5199
3440A1157114M4628K58901L35702L09267N34699j55274o1867O49209N71431j68947
3430A3474863L12930N39194k15094N29344M33664N78138J99979L47267l0752k27895
3420A5941638L63942Q35963K59875L43667J87422K84229M46596K69671K14450
3411A9147453L91500M50337K25593j69112K34192L28392L77340M84133L01921
3402B1771749O24985L36563L85815O13331M30752K66873J29794N76427N04693
$$ y = [7726873, 7783132, 8277201, 8433454, 8376900, 8388437, 8446636, 8572168, 8198874, 8543509, 8628026, 8301715, 8009015, 8056680, 8372640, 9014524, 8807929, 8811588, 9131221, 9304961, 9392295, 9961190, 10122745, 9925308, 10251757, 10437744, 10599726, 10658083, 10649729, 11071915, 11157114, 11201742, 11460643, 11796345, 12105612, 12640311, 12485037, 12423170, 13072379, 13643810, 13474863, 13787793, 14326987, 14111893, 14641237, 15074901, 15653039, 15853018, 16200285, 16169533, 15941638, 16305580, 17141543, 17401418, 17745085, 17932507, 18216736, 18663332, 18933003, 19147453, 19538953, 19989290, 20214883, 20045771, 20279963, 20608355, 20985695, 21469828, 21771749, 22396734, 22733297, 23119112, 23732443, 24163195, 24430068, 24559862, 25136289, 25640982]
3393B5640982L22760L21371J342316P36335M71148Q44130N48681J136636K42763
3384C1607122J022355J306275Q76662J166567J025318R45915J372185J832786
3376D1155185J745033J435096J716771J854067J782502K053247J930710K138326
3368E5810937J982031K037165K210307K355639K095429K159568K850400K204920
3360G3706396K648372L000757K248616K605970L058215K243771J894646K112036
3352I3518779K567413K058684J617031J668881J643114J601198J619255J176416
3344A07470771J117676M88443P06258O01298M79966L67105j19278p38860r22321
3335A09451058j040694j176336j249706j478964j817755j481908j538722k030186
$$ y = [25640982, 25963742, 26285113, 27627429, 28363764, 28834912, 29679042, 30227723, 31364359, 31607122, 32629477, 33935752, 34812414, 35978981, 37004299, 37950214, 39322399, 41155185, 42900218, 44335314, 46052085, 47906152, 49688654, 51741901, 53672611, 55810937, 57792968, 59830133, 62040440, 64396079, 66491508, 68651076, 71501476, 73706396, 76354768, 79355525, 81604141, 84210111, 87268326, 89512097, 91406743, 93518779, 96086192, 98144876, 99761907, 101430788, 103073902, 104675100, 106294355, 107470771, 108588447, 109076890, 109783148, 110384446, 110864412, 111231517, 111112239, 110373379, 109451058, 108410364, 107234028, 105984322, 104505358, 102687603, 101205695, 99666973, 97636787]
3327I7636787k042651k285457k183251k739584j830859k302285l357732k793949
3319G8101019k625473k687676k736634k561915k629901k153841k663543k510952
3311E7531084k226811k411959j833134k117044k247853j822755k245098j737229
3303D0889201j427730j358213j458728j562998q63654j291462j108124r99277
3295C0819015j308918p75814r53800m91567q48435o75976q05048o96940J40991
3286B4403508l82688m41093l33887j68715J33420m22865n44813j87969l97715
3277B1657183m12084p08715L61098J17137j90253l07039k02313o7962J21864K53673
3267B0622589m23342p33256O459j25443m24171k89852k2892m37003J719r420M6575
$$ y = [97636787, 95594136, 93308679, 91125428, 88385844, 86554985, 84252700, 80894968, 78101019, 75475546, 72787870, 70051236, 67489321, 64859420, 62705579, 60042036, 57531084, 55304273, 52892314, 51059180, 48942136, 46694283, 44871528, 42626430, 40889201, 39461471, 38103258, 36644530, 35081532, 34217878, 32926416, 31818292, 30819015, 29510097, 28734283, 27780483, 27288916, 26440481, 25764505, 24959457, 24262517, 24403508, 24020820, 23579727, 23245840, 23077125, 23210545, 22787680, 22242867, 22054898, 21657183, 21245099, 20536384, 20897482, 21014619, 20824366, 20517327, 20315014, 20247052, 20368916, 20622589, 20199247, 19465991, 19472450, 19347007, 18922836, 18632984, 18610092, 18173089, 18174808, 18165388, 18211963]
3256A8211963K07692n38653o56337j61961L10360j57127l55996J49119Q9770o83078
3246A6415752L4992m5787l57864k42399J45273M47728l60418l39163j36845j92948
3236A5368321M24430Q6810k21343L45784n9516j62829k30637J7234j69431K30999
3226A5629822l09894M73102N11580l45086j3178o7613J6890j27572l49807k04316
3216A5213928K65703K98645O237k03211N202l2262k14744J84433k0246j89918
3206A5313767K2969J81446k57695m4662J94510m8716N3042K77336Q0961p6888
3196A5696070j25950J05457N05908l32478R6461j62611q5353K0861K82666J25744
3186A6126775j6663L22741m95791J1631J47470K76096k06014N5567N7862L97043
$$ y = [18211963, 18419655, 17881002, 17224665, 17062704, 17373064, 17215937, 16859941, 17009060, 17098830, 16415752, 16450744, 16404957, 16047093, 15804694, 15949967, 16397695, 16037277, 15698114, 15561269, 15368321, 15792751, 15879561, 15658218, 16004002, 15944486, 15781657, 15551020, 15568254, 15398823, 15629822, 15319928, 15793030, 16304610, 15959524, 15946346, 15878733, 15895623, 15768051, 15418244, 15213928, 15479631, 15778276, 15784513, 15581302, 15586504, 15554242, 15339498, 15523931, 15503685, 15313767, 15336736, 15518182, 15260487, 15215825, 15410335, 15361619, 15414661, 15691997, 15772958, 15696070, 15570120, 15675577, 16181485, 15849007, 15945468, 15782857, 15697504, 15718365, 16001031, 16126775, 16110112, 16432853, 15937062, 15948693, 16096163, 16372259, 16166245, 16221812, 16279674, 16676717]
3176A6676717K13303j16240K32174k6242J93335K38908J25082M14183M2991m43051
3166A7551160L05581N984M61863L00617L54823R5934j8588l5242L75243o355Q8271
3155A9479291L01125K52809J12629n48935m6426L37278L53918N335N03471P13200
3145B1463695M3902N64064q05L46881O94093n6799K3168O02409N93342Q13780
3135B5087730K49637M01359L94556k20260J60964J44517M11858n3050M7957K13549
3125B6838817n073L16942K54729O69508M93195k27334k77764K72989J35590L1238
3115B8502837p9883K99743K66177j42434O5666k03591p1740K18731L79712J95353
3105B9430571J90708M83316K42988L8911P8772o3370N05274M77739J37961K33130
$$ y = [16676717, 16890020, 16773780, 17005954, 16979712, 17173047, 17411955, 17537037, 17951220, 17994211, 17551160, 17856741, 17862725, 18324588, 18625205, 18980028, 19075962, 19057374, 19022132, 19397375, 19391020, 19479291, 19780416, 20033225, 20145854, 19596919, 19550493, 19887771, 20241689, 20247024, 20750495, 21463695, 21507597, 22071661, 22070856, 22417737, 23111830, 23055031, 23078199, 23680608, 24273950, 25087730, 25337367, 25738726, 26133282, 25913022, 26073986, 26218503, 26630361, 26577311, 26625268, 26838817, 26833744, 27150686, 27405415, 28074923, 28568118, 28340784, 28063020, 28336009, 28471599, 28502837, 28422954, 28722697, 28988874, 28846440, 28912106, 28708515, 28636775, 28855506, 29235218, 29430571, 29621279, 30104595, 30347583, 30386494, 30465266, 30401896, 30907170, 31384909, 31522870, 31756000]
3095C1756000M04059J21047J88886L63620k25723K97461R49483O55783P4778J72348
3085C4757742M03480K34464P55403L78620M6K90811N56352L49781j08787K82232
3075C7900144M73374L10424M67742m7842L08564M75767K63406M38778J16409P34284
3065D1441050J75510L60901L50900M31501L48883j04639O79388O19180M16242
3056D4718916Q0630O48969P86843N79337J93151M14480O19499O48684N94882J074274
3046E0359665Q75843J071891J252638N72497P29693J429910J417646J444696J394131
3037F0548610J326177J946739J807633J774776K054228J250752J670459J921613
3029G4300987J062738J580633J336882J414022R38129J114898Q73870J094115
$$ y = [31756000, 32160059, 32281106, 32469992, 32833612, 32607889, 32905350, 33854833, 34510616, 34585394, 34757742, 35161222, 35395686, 36151089, 36529709, 36529755, 36820566, 37376918, 37726699, 37617912, 37900144, 38373518, 38683942, 39151684, 39103842, 39412406, 39888173, 40151579, 40590357, 40706766, 41441050, 41616560, 41977461, 42328361, 42759862, 43108745, 43004106, 43683494, 44302674, 44718916, 44799546, 45448515, 46235358, 46814695, 47007846, 47422326, 48041825, 48690509, 49285391, 50359665, 51235508, 52307399, 53560037, 54132534, 54862227, 56292137, 57709783, 59154479, 60548610, 61874787, 63821526, 65629159, 67403935, 69458163, 70708915, 72379374, 74300987, 75363725, 76944358, 78281240, 79695262, 80633391, 81748289, 82622159, 83716274]
3021H3716274J470673J153325J317465Q42467J488943P77443k8996N31577K95684
3012I1564855J68381K55886k66524N24880k45933j8083K89211O25675R18047M31032
3002I4247427N54136M25681M77793M74732Q89025J107640O88713Q50678J547745
2993A01263570J725320J417171J373381K072606J923380K420825K816220L124869
2985A18137342L114852L380497L702170L708564M227420M159340M551884M614495
2977A49596564M659208M801032N029365M974151M948807N026298M768289M963080
2969A88766794N089929M962075N209181N232366N024144N602140N188113M833894
2961B29908636M968834N357707M710216M456631M885794M904594N165837N647923
$$ y = [83716274, 85186947, 86340272, 87657737, 88500204, 89989147, 90766590, 90737594, 91269171, 91564855, 91733236, 91989122, 91722598, 92247478, 92001545, 91983462, 92272673, 92898348, 93816395, 94247427, 94801563, 95227244, 95705037, 96179769, 97068794, 98176434, 98865147, 99715825, 101263570, 102988890, 104406061, 105779442, 107852048, 109775428, 112196253, 115012473, 118137342, 121252194, 124632691, 128334861, 132043425, 136270845, 140430185, 144982069, 149596564, 154255772, 159056804, 164086169, 169060320, 174009127, 179035425, 183803714, 188766794, 193856723, 198818798, 204027979, 209260345, 214284489, 219886629, 225074742, 229908636, 234877470, 240235177, 244945393, 249402024, 254287818, 259192412, 264358249, 270006172]
2953B70006172O518061O503397P226837P041907Q090533P959560P798205Q418377
2945C29563049R313739J0304287J1405508J3210084J3458496J4521753J4282264
2938D16059180J3181759J1160847Q718119N414983J950852j220685l977406n780823
2930D45506826p241423q102641p779442p409304p380498o690080o728886p849179
2922C86325373r444527j1435815j4012299j6791052j8722567k0114876k0602918
2915B75201319k0750529j9669652j8714621j6799194j4410567j3286352j1616637
2908A59953767j0225016r140489p679114o619347o090684n503227m292374l635911
2900A06767605l355101k973941k740566k812531k217484j575812j748964j807342
$$ y = [270006172, 276524233, 283027630, 290254467, 297296374, 305386907, 313346467, 321144672, 329563049, 338876788, 349181075, 360586583, 373796667, 387255163, 401776916, 416059180, 429240939, 440401786, 449119905, 454534888, 456485740, 455265055, 451287649, 445506826, 438265403, 430162762, 422383320, 414974016, 407593518, 400903438, 394174552, 386325373, 376880846, 365445031, 351432732, 334641680, 315919113, 295804237, 275201319, 254450790, 234781138, 216066517, 199267323, 184856756, 171570404, 159953767, 149728751, 140588262, 132909148, 126289801, 120199117, 114695890, 110403516, 106767605, 103412504, 100438563, 97697997, 94885466, 92667982, 91092170, 89343206, 87535864]
2892H7535864j787809j655975j527589j803186j525575j805425j285241j645705
2884G4499359j155870j252703r09278p18482j277072q91081q54652j122378j668220
2875F4649623j198136j617075j629899j753832j576873j538328j210055j582651
2867E2542774r79450j512076j443473j304976j010962j318027j545511j287200
2859D2141099j555341j095465r14111j011140j048251j278958j395921p08140
2851C3133772o53171p07978j175690n49985r59298q19419q01477o69347n13260
2842B6284147J06542j60438n28007p86202l70346j55596j30412m10583l19646
2833B3529459o29451q8313l30345n61120J17471o73349k71716j65016m57377r8916
$$ y = [87535864, 85748055, 84092080, 82564491, 80761305, 79235730, 77430305, 76145064, 74499359, 73343489, 72090786, 71181508, 70463026, 69185954, 68294873, 67440221, 66317843, 64649623, 63451487, 61834412, 60204513, 58450681, 56873808, 55335480, 54125425, 52542774, 51563324, 50051248, 48607775, 47302799, 46291837, 44973810, 43428299, 42141099, 40585758, 39490293, 38576182, 37565042, 36516791, 35237833, 33841912, 33133772, 32480601, 31772623, 30596933, 30046948, 29087650, 28268231, 27466754, 26797407, 26284147, 26390689, 26230251, 25702244, 24916042, 24545696, 24390100, 24259688, 23849105, 23529459, 22900008, 22811695, 22481350, 21920230, 22037701, 21364352, 21092636, 20927620, 20470243, 20371327]
2823B0371327Q9350n43564Q8163k09838k41399m62188L2505K5354k750k53845
2813A8893115k69988j91138j96713k99404o803j43246k75492K48145j01390l33692
2803A7323394M1400K60486P7952l35172m13916j45876M0799p16123P095N94271
2793A6734310j95432m75022J4147n1233L2040l52570l4958k30728K2167L26716
2783A5789437j54580M28480k53100q7652K2893K24565M43960l49215J93119J10229
2773A6368136K66153Q298J74039K09627p5238j25336o8856J60768J08216J00927
2763A7126734J96257j25117J79704j09403l17642J51075K74392j7009K2015L88741
2753A7769747L64175J95617j16154M0399K83018M15724J8932K24864M59330R09559
$$ y = [20371327, 20460677, 19917113, 20005276, 19795438, 19554039, 19091851, 19124356, 19149710, 19146960, 18893115, 18623127, 18431989, 18235276, 17935872, 17929069, 17785823, 17510331, 17758476, 17657086, 17323394, 17364794, 17625280, 17703232, 17368060, 16954144, 16808268, 16849067, 16132944, 16140039, 16734310, 16538878, 16063856, 16078003, 16026770, 16058810, 15706240, 15671282, 15440554, 15462721, 15789437, 15634857, 16063337, 15810237, 15722585, 15745478, 15970043, 16414003, 16064788, 16257907, 16368136, 16634289, 16642587, 16816626, 17026253, 16951015, 16825679, 16756823, 16917591, 17025807, 17126734, 17322991, 17197874, 17377578, 17268175, 16950533, 17101608, 17376000, 17358991, 17381006, 17769747, 18133922, 18329539, 18213385, 18253784, 18536802, 18952526, 18971458, 19196322, 19655652, 20565211]
2743B0565211m0058O1911k00805L46927J91413L08969n3179K28204M04584j09460
2733B1703717N88221O61276M76597M53492j40937K44716K42364Q25008Q72344
2724B5926798M26024J252161Q89760J085669Q16338Q95381R47145J552261J638837
2715C5430374Q49122J217554O66777P35772J280897M89481N14013K4793k85748
2706D0923035K07210k3971j56697j6315P32226m2155l7011k08480m02283m75485
2696D0500074n70344m93793n19701j032528o18804o82067n62834l13442p00155
2687C5006406m2074j032339N83195K17372j80911k5833L00391M89299L37610N2005
2677C5705121P603L69899N11114M19684m5175N97561M27131Q20145N97331k8769
$$ y = [20565211, 20525153, 20587064, 20386259, 20733186, 20924599, 21233568, 21180389, 21408593, 21813177, 21703717, 22291938, 22953214, 23429811, 23883303, 23742366, 23987082, 24229446, 25054454, 25926798, 26352822, 27604983, 28494743, 29580412, 30396750, 31292131, 32239276, 33791537, 35430374, 36279496, 37497050, 38163827, 38899599, 40180496, 40669977, 41183990, 41208783, 40923035, 41130245, 41106274, 40949577, 40933262, 41665488, 41623333, 41586322, 41377842, 40975559, 40500074, 39929730, 39435937, 38916236, 37883708, 37264904, 36582837, 36020003, 35706561, 35006406, 34964332, 33931993, 34515188, 34732560, 34551649, 34525816, 34826207, 35315506, 35653116, 35705121, 35712724, 36082623, 36593737, 37013421, 36968246, 37565807, 37992938, 38813083, 39410414, 39381645]
2667C9381645K18853J79694J015883O33783L59546L24314M19884Q73320O67844
2658D4074766R06596L06217J035172P61319O68684P86174Q80467N24564N41177
2649E0485136J158693J166161J097587J003808R08897Q46555J487958J855918
2641F0010713J019032J079409J194436J593956J185355J738860J746248J614760
2633G1182769K321629K627327K778986K785038L226917L307948L894129L544868
2625I5669611M121692M078806M496613M562328M029404L620831L201378K693426
2617A26474089K376758N54000p85801j714948l584533m211614m621153m221187
2609A10265611m918716l944714l053432l345115k548054k091962q68008l50059
$$ y = [39381645, 39600498, 39780192, 40796075, 41429858, 41789404, 42113718, 42533602, 43406922, 44074766, 44981362, 45287579, 46322751, 47084070, 47752754, 48538928, 49419395, 49943959, 50485136, 51643829, 52809990, 53907577, 54911385, 55820282, 56666837, 58154795, 60010713, 61029745, 62109154, 63303590, 64897546, 66082901, 67821761, 69568009, 71182769, 73504398, 76131725, 78910711, 81695749, 84922666, 88230614, 92124743, 95669611, 99791303, 103870109, 108366722, 112929050, 116958454, 120579285, 123780663, 126474089, 128850847, 129404847, 128619046, 126904098, 123319565, 119107951, 114486798, 110265611, 105346895, 101402181, 98348749, 95003634, 92455580, 90363618, 89495610, 89145551]
2601H9145551j87574k29477r49121j968723j876108k566892k212246k230218k222530
2592G4702662j270911j412568j795751j693038j337853j470039p02489q38848
2584F4181165r4372N03594L84422J235221P46820Q4722j86209p11057j097023
2575F5047283j180680o89373m12870J019581J851783K924551K708000J709643
2567G2977918J064883j041474k156208l159242l828863l437674k558852k437665
2559E5422823l122929k095981j365755j017249r29611l64690J84517N12671J32185
2550D7355981r81283j270358j545082j316634q67723p25537l63869k39029k52418
2541C9794048K62142P96685R59568J145897J573628J420487J100537L08704j23589
$$ y = [89145551, 88957977, 88728500, 87779379, 85810656, 83934548, 81367656, 79155410, 76925192, 74702662, 73431751, 72019183, 70223432, 68530394, 67192541, 65722502, 65020013, 64181165, 64086793, 64590387, 64974809, 66210030, 66956850, 67041572, 66855363, 66144306, 65047283, 63866603, 63177230, 62764360, 63783941, 65635724, 68560275, 71268275, 72977918, 74042801, 73001327, 70845119, 67685877, 63857014, 60419340, 57860488, 55422823, 52299894, 50203913, 48838158, 47820909, 46891298, 46526608, 46711125, 47223796, 47355981, 46374698, 45104340, 43559258, 42242624, 41374901, 40649364, 40285495, 40046466, 39794048, 40056190, 40852875, 41812443, 42958340, 44531968, 45952455, 47052992, 47361696, 47238107]
2532D7238107j154595j021266j043361j034984n98985j50328J21238J052674J120325
2523D4528825K169948K628652M231964M477996L664419R19466j499366m257854
2515E6864050n514342n365590m370077k984558k625759j312825j382353j082407
2507C2226139o59706k76007n58730j01263k24021k13067M18896J147211P37615
2498C2497067J213548J413062J636217K632498L303003L981177M683616K811435
2490E4171623k36406k445574m468193n494758m809483l887548l078465k338883
2482B7412313j974152j484066p94067j118856j437887r25421l02260n51194k0279
2473A8804131n59678j88673n74027l22019O7915k14548j72968k01611Q688l19563
$$ y = [47238107, 46083512, 45062246, 44018885, 42983901, 42384916, 42234588, 42355826, 43408500, 44528825, 46698773, 49327425, 53559389, 58037385, 61701804, 62621270, 61121904, 56864050, 51349708, 45984118, 41614041, 38629483, 36003724, 34690899, 33308546, 32226139, 31566433, 31290426, 30731696, 30630433, 30406412, 30193345, 30612241, 31759452, 32497067, 33710615, 35123677, 36759894, 39392392, 42695395, 46676572, 51360188, 54171623, 53935217, 51489643, 47021450, 41526692, 36717209, 32829661, 29751196, 27412313, 25438161, 23954095, 23160028, 22041172, 20603285, 19677864, 19375604, 18824410, 18804131, 18244453, 18055780, 17481753, 17159734, 17227649, 17013101, 16840133, 16638522, 16647210, 16327647]
2463A6327647k98650l68832l12450k54322j80576L43495m88719j90907L43900
2454A4920586m25987j86039n32042j94092q6616J80031J16089q0122j4407O2373
2444A3759774k46014m04630M24167l19548k96490l19622n51360j75319O28016
2435A2498974K834J18604l41739j92447j36090l97384J88456R9613o6586P8779
2425A1853014J64897J42359k23672j78645K6241L8581P9641l29812k62980K68272
2415A1577896K59063l07983j66398j43062L1560J91916k33058k14612k36392m59529
2405A0299401M11806K18526O8814K62659j80720n0823o709n32976K48965l0338
2395A0708605k25896M2924j28242P2388J82218M3679J21155M29258j02566j54398
$$ y = [16327647, 16028997, 15660165, 15347715, 15093393, 14912817, 15256312, 14767593, 14576686, 14920586, 14494599, 14308560, 13776518, 13582426, 13495810, 13675841, 13791930, 13711808, 13697401, 13759774, 13513760, 13109130, 13533297, 13213749, 12917259, 12597637, 12046277, 11870958, 12498974, 12501808, 12620412, 12278673, 12086226, 11950136, 11552752, 11741208, 11840821, 11774235, 11853014, 12017911, 12160270, 11936598, 11757953, 11784194, 11822775, 11902416, 11572604, 11309624, 11577896, 11836959, 11528976, 11362578, 11219516, 11251076, 11442992, 11209934, 10995322, 10758930, 10299401, 10711207, 10929733, 10998547, 11261206, 11080486, 11029663, 11022954, 10489978, 10738943, 10708605, 10482709, 10525633, 10397391, 10469779, 10651997, 10695676, 10816831, 11246089, 11143523, 10989125]
2385A0989125j9600K12635j73640p8854j48362L0806J072272J25870k2362l56717
2375A1631173P4733j82743L90295N12592K98925l22799L06647M08359j31133M52841
2365A3438890N61055r912K53425J15861J16424J90195K38200K75077l300r3004
2355A5082911r3301k79429k8386N91438K29706J70023J90425k860L1210j31677
2345A5760060L61623L12773n26796j18053L10113K44383L22265O53199M33560
2336A7753127J38564L05913K90023m78750M62831N73746O73496P29225Q48332
2327B1296507Q44842M62249N7726K0342m5528K11718K59797J85875L22854M2886
2317B3659268O60185M83147P17849N87398J150k9701K67272j30583K53616M30676
$$ y = [10989125, 10969525, 11182160, 11008520, 10929666, 10781304, 10812110, 11884382, 12010252, 11987890, 11631173, 11705906, 11523163, 11913458, 12426050, 12724975, 12402176, 12708823, 13117182, 12986049, 13438890, 13999945, 13990033, 14243458, 14359319, 14475743, 14665938, 14904138, 15179215, 15175915, 15082911, 14989610, 14710181, 14681795, 15273233, 15502939, 15672962, 15863387, 15860527, 15891737, 15760060, 16121683, 16434456, 15907660, 15789607, 16099720, 16344103, 16666368, 17319567, 17753127, 17891691, 18197604, 18487627, 18008877, 18471708, 19045454, 19718950, 20448175, 21296507, 22141349, 22603598, 22661324, 22681666, 22636138, 22847856, 23107653, 23293528, 23616382, 23659268, 24319453, 24802600, 25520449, 26107847, 26108997, 26079296, 26346568, 26215985, 26469601, 26900277]
2307B6900277L41617L51455K69571L23346M23459O68707j69880L2796N26192M65270
2297C0132810M53864O04968N95342J13136R5465N51517M69675N74939J106109
2288C4697825N83755O26514P73582P82446J012629J070761J043602J463169J268859
2279D3323142P30031Q94902Q00182N95912m04365r16928r09661q49320j404305
2270D1859590r58489r79346q41912l68035o34559m93598j95388N6241L83729P65974
2260C8594207Q40570N64810Q86731J169544L37501N12561J104950P88801L22023
2251D5121698M61595M31857k63880j81888n64430p95294j133911j451115j345041
2242D0279591j363131j705150j609764n65061j268891j302346n18244n03682m39746
$$ y = [26900277, 27241894, 27593349, 27862920, 28186266, 28609725, 29278432, 29108552, 29141348, 29667540, 30132810, 30586674, 31191642, 31786984, 31900120, 31995585, 32547102, 33016777, 33591716, 34697825, 35281580, 35908094, 36681676, 37464122, 38476751, 39547512, 40591114, 42054283, 43323142, 44053173, 44948075, 45748257, 46344169, 45939804, 45022876, 44113215, 43263895, 41859590, 40901101, 39921755, 39079843, 38711808, 38077249, 37583651, 37388263, 37444504, 37828233, 38594207, 39434777, 39999587, 40886318, 42055862, 42393363, 42905924, 44010874, 44799675, 45121698, 45583293, 46015150, 45751270, 45569382, 45004952, 44209658, 43075747, 41624632, 40279591, 38916460, 37211310, 35601546, 35036485, 33767594, 32465248, 31947004, 31443322, 31003576]
2233C1003576k92218J92788m2957J43044K30407K13228m09624l18948n93564n29792
2223B9595940o33156j079104l31341j082901j054384n67464j173317j518276j296287
2214B0859710p46741j154571q75548n11604n16835p85982m16807r2935k88129
2205A5470558p76570n84598o05928j01008q1854Q8481n20887k75464l49749o9696
2195A2193285j57673l59298p74665m5465J13028q26440q1556m44030l42134k27212
2185I047840k67775o51804P4922j71584k57677m82733n7518J67718n38555m06579
2175F456255K41156L5171k48846l80142j05348J43678M82681l06227k85728M05931
2165F438581l19855n93281Q6205J24349Q2313n11579k92442o5988n6187N42583
$$ y = [31003576, 30711358, 30904146, 30861189, 31004233, 31234640, 31447868, 31038244, 30719296, 30125732, 29595940, 28962784, 27883680, 27552339, 26469438, 25415054, 24847590, 23674273, 22155997, 20859710, 20112969, 18958398, 18082850, 17571246, 17054411, 16268429, 15851622, 15758687, 15470558, 14693988, 14109390, 13503462, 13402454, 13320600, 13409081, 12888194, 12612730, 12262981, 12193285, 12035612, 11676314, 10901649, 10856184, 10969212, 10142772, 10061216, 9617186, 9275052, 9047840, 8780065, 8128261, 8203183, 8031599, 7773922, 7291189, 7233671, 7401389, 6862834, 6456255, 6697411, 6732582, 6483736, 6103594, 5998246, 6141924, 6624605, 6318378, 6032650, 6438581, 6118726, 5525445, 5611650, 5735999, 5818312, 5306733, 5014291, 4948303, 4892116, 5434699]
2155E434699k13638q44674P8422J203R7432J10545N6230l81781J16844K8050p1585
2144D411747m69994P7969j73693m48826o2157K71721J26703q4978k79384L16154
2134C685262r947n4368r1829m08532J02370J50307R8213l19063k49033j83164
2124B720216N2245k1692K83717k01067l03921L31345l68312k73499J23547j44595
2114B197984k86488L88270M899p1518J07654k34736J04400k0832o8822P1694j12733
2103B079772j53108J55235j07293K51573m06184o609l0432J28002K2704k20870
2093A712790j18253k93304j44398M99879j46996k0304p6678j27689J0722K6028
2083A321797k53491M15082J68051p2141J25131o8949j33245J32356Q9122m08874
$$ y = [5434699, 5221061, 4376387, 4454809, 4456012, 4553444, 4663989, 4720219, 4338438, 4455282, 4483332, 4411747, 3941753, 4019722, 3846029, 3397203, 3335046, 3606767, 3733470, 3648492, 3369108, 3685262, 3675315, 3620947, 3529118, 3120586, 3222956, 3373263, 3471476, 3152413, 2903380, 2720216, 2772461, 2750769, 3034486, 2833419, 2529498, 2860843, 2492531, 2219032, 2342579, 2197984, 1911496, 2299766, 2304665, 2233147, 2340801, 2106065, 2210465, 2189633, 2120811, 2192505, 2079772, 1926664, 2081899, 1974606, 2226179, 1819995, 1813386, 1782954, 1910956, 1933660, 1712790, 1594537, 1301233, 1156835, 1656714, 1509718, 1489414, 1412736, 1285047, 1295769, 1321797, 1068306, 1483388, 1651439, 1579298, 1704429, 1635480, 1502235, 1634591, 1723713, 1314839]
2073A314839k57088j06718K14699L38901J19264n8753Q1966q3091J94569K8307
2063A786895j22642j52595l64945J85089L6805J56125m3355K35000k09681n20503
2053I86193m3092r8210J92268k0202J58612K31300m93359q0253J26466J40488
2043A100211J45234k46413m6700k74514L40576J83355o5608M6163K47125l56514
2033A072915k52343J04139R0319k8844M04031l07234J0806K62208j52007j17455
2023A086535q2408K58984j04708L0604m380Q4905j37589k84839q5809J13807J29302
2012A004404j58466J36775j12842k99238K47631M26940k2174m13379n8610j36829
2002F14212J80241r9931P4147l72841j9387M58980k5870J20146k34583o8432K38383
$$ y = [1314839, 1057751, 951033, 1165732, 1504633, 1623897, 1565144, 1647110, 1564019, 1758588, 1786895, 1664253, 1511658, 1146713, 1331802, 1368607, 1524732, 1481377, 1716377, 1506696, 986193, 943101, 844891, 1037159, 1016957, 1175569, 1406869, 913510, 833257, 959723, 1100211, 1245445, 999032, 952332, 677818, 1018394, 1201749, 1136141, 1182304, 1429429, 1072915, 820572, 924711, 1015030, 986186, 1390217, 1082983, 1093789, 1355997, 1203990, 1086535, 1004127, 1263111, 1158403, 1189007, 1184627, 1269532, 1131943, 847104, 761295, 875102, 1004404, 845938, 982713, 869871, 570633, 818264, 1245204, 1223030, 809651, 751041, 614212, 794453, 694522, 768669, 395828, 376441, 835421, 809551, 929697, 695114, 626682, 865065]
1991H65065J93929j3767k17789k9977O2236P8809p0977p5829r4809K66188l65809
1980E97270j11303j45554J27163K28241J55262l12434j28091M32963K48106l6714
1970A054909j24511o0468J78966j20622k98825o2400L41175R7668j18122N9373
1960I47143K43679K06273m74200o1202l57243k13566N4140M42265Q199l31351
1950D64137m8810M08854J78169L29814p16815J0023P5661m56571p3201M54449
1940F25710L37692J20273l39099k239r1597k23714m9028L33403M0309j73761J3318
1929E91267j18799L39029k27683k57554K65536R7697l8115R293L97366k2278l88836
1918F46923j40958k68243J32427O6177j51857n0307J82917m312q7679L6210J8159
$$ y = [865065, 1058994, 1045227, 827438, 797461, 859697, 938506, 867529, 791700, 696891, 963079, 597270, 485967, 340413, 467576, 695817, 851079, 538645, 410554, 843517, 1091623, 1054909, 930398, 869930, 1048896, 928274, 629449, 567049, 908224, 1005892, 887770, 947143, 1190822, 1397095, 922895, 861693, 504450, 290884, 345024, 787289, 795488, 464137, 415327, 824181, 1002350, 1332164, 615349, 625372, 701033, 244462, 171261, 625710, 963402, 1083675, 744576, 742337, 650740, 427026, 377998, 711401, 751710, 577949, 591267, 472468, 811497, 583814, 326260, 591796, 689493, 651378, 660671, 1058037, 1035759, 646923, 505965, 237722, 370149, 436326, 284469, 234162, 417079, 412767, 325088, 361298, 379457]
1907C79457J73575q7586k35061m0954L0506J68052L56216K19650l07032j09345
1897E47478L1101j21304j07298l90723L64051r583l84749K38064K52579J28654
1887E48270n8964p347l16502J56469K24144J02053J6181j99231k40034q9928L35880
1876D70991r8846j80211J14201l38297L87622k4571n32805J79726K76918j70431
1866H4297K42898l13186j6659N5196J53488M9035P338J27092l32539n2774k64685
1855b60499K16622J93289L00371O8260M1320J92659n75328l79043K33369J13967
1845A44987J7648L4431q2353J4288K9574K72591j69304J5700j74798q7446M40882
1834D56200l52247j37031l3469p8460K52890j36850j3253K08049j88644k09681
$$ y = [379457, 553032, 465446, 230385, 189431, 219937, 387989, 744205, 963855, 656823, 547478, 578579, 457275, 349977, -40746, 323305, 313722, -71027, 167037, 419616, 548270, 489306, 481959, 165457, 321926, 546070, 648123, 664304, 465073, 225039, 135111, 470991, 372145, 191934, 306135, -32162, 355460, 330889, -201916, -22190, 254728, 84297, 327195, 14009, -2650, 52546, 206034, 255069, 262407, 389499, 56960, 4186, -260499, -43877, 149412, 449783, 518043, 559363, 752022, 176694, -202349, 31020, 144987, 162635, 197066, 114713, 129001, 158575, 431166, 261862, 277562, 102764, 15318, 456200, 103953, -33078, -66547, -145007, 107883, -28967, -42220, 165829, -22815, -232496]
1824b32496K40754K87150k30840N24850N7229n79986K57112L1562k37055J93487
1814C11767q1243m31293K15624P3389K4064K15701m55219M07697J03140m02529
1804a8902K3436k06015J4869K32927N13135n04685j03452M76483K17205l51335
1794B93666J85807L7905j33803L11954l8444j42663j69950N4164K46433J42991
1784G88060l90815J05765L53054l18499M4179K20471n79091k19226q6402O256
1774g6248n9555j42735O9312K05707L53503L0913k14118l30668L21526L32528
1764D90165J86921k06564j39289K54705k91531J22913k362J45710q904l78700
1754A73064J92689j97052K6949L28548K06294J60283j04641J99639M1235j3654
$$ y = [-232496, 8258, 295408, 64568, 589418, 646647, 66661, 323773, 355335, 118280, 311767, 230524, -200769, 14855, 88244, 112308, 328009, -127210, 280487, 383627, -18902, 4534, -201481, -186612, 46315, 559450, 54765, -48687, 427796, 645001, 293666, 479473, 517378, 383575, 695529, 657085, 514422, 344472, 398636, 645069, 788060, 397245, 503010, 856064, 537565, 581744, 802215, 223124, 3898, -82504, -76248, -135803, -278538, -209226, -3519, 349984, 380897, 166779, -163889, 157637, 490165, 677086, 470522, 331233, 585938, 294407, 417320, 414958, 560668, 551764, 173064, 365753, 168701, 195650, 524198, 730492, 890775, 786134, 985773, 1027008, 1013354]
1744A013354k62743l8076j8263j26053l54517L2127K84916k48291M7929k33186
1734I7197j85241M73241N06547K00977j12386k92586j97186K44611M88645o33116
1724E90703l49095j4077j60278M3178M05764o3446R679P3166k19150O239j53710
1713A68973l43277m4743O94966k77205J20761l6667j07246J45277K97098j20317
1703D97620j91045m06075Q3736J24142k82361L00046l9682K46064o0349L16404
1693E88500q9504k43109N81649l1471n32242J11049M73694n60939J97232j65483
1683C29376J4385k88679J08897L64858l64174R8873K07929J57739k66196J91625
1673E54633o81407l06225Q45506j03652m6352Q9759N5898N7688j72516K31144
$$ y = [1013354, 750611, 712535, 694272, 568219, 213702, 245829, 530745, 282454, 330383, 97197, -88044, 385197, 891744, 1092721, 980335, 687749, 490563, 735174, 1223819, 590703, 241608, 227531, 67253, 110431, 516195, 452749, 462428, 535594, 316444, 322683, 168973, -174304, -219047, 475919, 198714, 319475, 282808, 175562, 320839, 617937, 497620, 306575, -99500, -15764, 108378, -173983, 126063, 86381, 332445, 272096, 588500, 498996, 255887, 837536, 806065, 273823, 384872, 858566, 297627, 494859, 329376, 343761, 55082, 163979, 528837, 164663, 263536, 471465, 629204, 363008, 554633, -126774, -432999, 412507, 308855, 262503, 352262, 408160, 465848, 293332, 524476]
1663E24476M53608J68403l86592R9764M4233n69897L19426q4342j34691J97648
1653F32036O666L82297l12133p2807J86514N6157j35860k74551O8648j86803p3718
1642B76446L93616j81860j70877L46960j98180R7939L83414K80646K82591r39471
1632E71224J2857J51392o895j6182j00883O5514k1148Q9323K02711k69238j95273
1621D83402j6024k8224M11016P6687m33327k23074q4989M17711m3193K16197J89746
1610I65928K9579j74152O9886P7596n38364L43425r224k86326L36427j3280L02631
1599A104126J765l32504P1287M8587J95555J07615k295R7240K94398l67022j92794
1588A025958j50742N65217J37951q5765K76377O3343j21456j60761m6446J33893
$$ y = [524476, 978084, 1146487, 759895, 859659, 903892, 333995, 653421, 569079, 434388, 632036, 638702, 1020999, 708866, 636059, 822573, 878730, 742870, 468319, 536967, 350164, 276446, 670062, 488202, 317325, 664285, 466105, 564044, 947458, 1228104, 1510695, 571224, 584081, 735473, 728578, 712396, 611513, 677027, 655879, 745202, 947913, 678675, 483402, 467378, 439154, 850170, 926857, 493530, 270456, 185467, 603178, 559985, 776182, 965928, 995507, 821355, 891241, 968837, 430473, 773898, 764674, 478348, 814775, 801495, 1104126, 1105891, 773387, 844674, 893261, 1088816, 1196431, 1194136, 1291376, 1585774, 1218752, 1025958, 875216, 1440433, 1578384, 1492619, 1768996, 1832339, 1710883, 1550122, 1503676, 1637569]
1578A637569J53278M35809M56459k19278J35794k68694j13732K4480J58210J86307
1568B586202J8016o6788J88713L80569L77512k36956k08209J55699M2565p2377
1558C164946L01321K13550j9678J69682p6812j0594L50030J91691k75423J61659
1548D170372L52868j83734K7897J95832k20193M40467L1498M70510N62934j94080
1538E654371L7372k04948q4401M62975L6254N16141j68427k95221K83895O75470
1528F913481K29596q39020M46326N49652j99208M16828j41885N23544l1248j7088
1518G850978L51413O63042M25350K00907J89148P76469K40704k16006K73531L14037
1508A1069573O23374L70127O75029M80445O41386L35484L09683O54849J223384
$$ y = [1637569, 1790847, 2226656, 2683115, 2463837, 2599631, 2330937, 2217205, 2241685, 2399895, 2586202, 2604218, 2537430, 2726143, 3106712, 3484224, 3247268, 3039059, 3194758, 3237323, 3164946, 3466267, 3679817, 3660139, 3829821, 3753009, 3742415, 4092445, 4284136, 4008713, 4170372, 4523240, 4339506, 4367403, 4563235, 4343042, 4783509, 4815007, 5285517, 5848451, 5654371, 5691743, 5486795, 5402394, 5865369, 5901623, 6417764, 6249337, 5954116, 6238011, 6913481, 7143077, 6304057, 6750383, 7300035, 7100827, 7517655, 7375770, 7899314, 7868066, 7850978, 8202391, 8865433, 9290783, 9491690, 9680838, 10457307, 10698011, 10482005, 10755536, 11069573, 11692947, 12063074, 12738103, 13218548, 13859934, 14195418, 14505101, 15159950, 16383334]
1499A6383334P16407M87658J184029J467929J410005J687116K007551J890785
1491B7234814J582498K139599J970294K559040L125045M100344N019003N428037
1483E3158674O874653Q586335J2789922J7684289J8091927J4533501L136121o672058
1475A28183364j6497683k2289094j7351965j4115145j0566627p625984o559841
1468C3177025n126411l615956j855472j987757j979047j353954j429193j110394
1460A4718841j123734j223967j627829m95437q78320n55236q67688n03814j40131
1451G302685n41978n83942k08313j14781l46688m7225o30712l37099J04937o07312
1441C989572l98377J92256L5399P7611m53153j60464J30677J00809k88666j26532
$$ y = [16383334, 17099741, 17587399, 18771428, 20239357, 21649362, 23336478, 25344029, 27234814, 28817312, 30956911, 32927205, 35486245, 38611290, 42711634, 47730637, 53158674, 60033327, 68619662, 81409584, 99093873, 117185800, 131719301, 134855422, 128183364, 111685681, 89396587, 72044622, 57929477, 47362850, 39736866, 33177025, 28050614, 24434658, 22579186, 20591429, 18612382, 17258428, 15829235, 14718841, 13595107, 12371140, 10743311, 10247874, 9369554, 8814318, 7946630, 7442816, 7302685, 6760707, 6176765, 5968452, 5853671, 5506983, 5459758, 4829046, 4491947, 4596884, 3989572, 3591195, 3783451, 3818850, 3896461, 3443308, 3282844, 3413521, 3514330, 3225664, 3099132]
1431C099132O1706k47973n12980j8247k12622j13943K82446Q0510j49449L33140
1421B601720m98913N2445R6828m89434N0662k19121K4681k90856m48287P9057
1411I58782K46392p5861R1070K8490k4525m9828J8259n58049p3070J95345p3565
1400F83440J5672r1219Q339K75928k67184k80871J6708j94571J59644j4965J08597
1389D19518j81146M77184J91017j11243r5264j80148L53456R9407k20738J59081
1379I11124k33865j52279J06904m55165L80938K01504j82501n632j54305j46341
1369B70382R9491l5522J06959j30676j45233M30074l54362J4193L8316K71614
1359E65236j59573m01634j6120K73024k08078k66035M49153P3774J04427j83024
$$ y = [3099132, 3160838, 2912865, 2399885, 2381638, 2169016, 2055073, 2337519, 2418029, 2268580, 2601720, 2102807, 2155252, 2252080, 1762646, 1813308, 1594187, 1618868, 1328012, 879725, 958782, 1205174, 1129313, 1220383, 1248873, 1224348, 1174520, 1192779, 634730, 561660, 757005, 683440, 699112, 607893, 616232, 892160, 624976, 344105, 360813, 166242, 325886, 310921, 419518, 238372, 715556, 906573, 795330, 700066, 519918, 873374, 972781, 752043, 911124, 677259, 524980, 631884, 176719, 557657, 759161, 576660, 571028, 416723, 270382, 369873, 334351, 441310, 310634, 165401, 595475, 241113, 255306, 293622, 565236, 405663, 4029, -12091, 260933, 52855, -213180, 235973, 309747, 414174, 231150]
1349B31150j95339m35612J18893K23523k98307J99323J22570r5000M47279m64213
1339a45733P2709l8489J69379L05398k49596k7093J87634k06785k3597j73311
1329a29484n6052J79630j05884R6499Q274j25802l88117K22264J95474J71651
1319F8453K90278j56421k59252j8234J05697O2253k02641Q184O7502o47951N0914
1308f31218M60868M15813m32179P8013K04693K44520m0598n26307J30319p6621
1298a72697l2686l74661J5160N58542M10433j22439k92794l29166L33358j98968
1288b05918R4961R7966p5524P6714m533K09214j45385j28992L66708n5628p4679
1277A54904J573m41744K6266K60778m1733M8983n0487K74145k69902j26299P3523
$$ y = [231150, 35811, -399801, -280908, -57385, -355692, -156369, -33799, -128799, 318480, -145733, -73024, -111513, 57866, 363264, 113668, 86575, 274209, 67424, 43827, -129484, -185536, -5906, -111790, -15291, -7017, -132819, -520936, -298672, -103198, 68453, 358731, 202310, -56942, -75176, 30521, 92774, -109867, -101683, -34181, -682132, -631218, -170350, 245463, -186716, -108703, 95990, 340510, 299912, -226395, -96076, -172697, -205383, -580044, -564884, -6342, 404091, 281652, -11142, -340308, -6950, -205918, -110957, -12991, -88515, -11801, -16334, 192880, 47495, -81497, 285211, 229583, 154904, 156477, -285267, -259001, 1777, -39956, 9027, -41460, 232685, -37217, -163516, -89993]
1266h9993K58644J81947j9306m10628J6526j13028j75472N02783l32639j31065
1256c12231j00342j78905L79684J19251j17358L91351m08295p9960r878M47036
1246A30353N7271J5092J4182k30164l0461l48649p2177J72299M20641K30130k17917
1235A40600l06637K26715k7850N29297j94807k53218k4932o8045P2643L59666
1225D53432j88361o28165q6195L14657K88197m04992K15763M9603q1773R3003
1215B5169J64780Q313Q3232o3241l49938M11839J00964m8706j28257J93816K62122
1204F60093n59271J44167m06655j29492M57686M7644j21594k23018m88347L91890
1194b26897Q6370l2780M1226J72545O4878J0116M2876l15845j91002K88281M07316
$$ y = [-89993, 168651, 350598, 331292, -79336, -62810, -175838, -351310, 151473, -181166, -312231, -412573, -591478, -211794, -92543, -209901, 181450, -226845, -306805, -316683, 130353, 187624, 202716, 216898, -13266, -43727, -392376, -464553, -292254, 128387, 358517, 140600, -166037, 60678, 32828, 562125, 367318, 114100, 89168, 21123, 93766, 453432, 265071, -363094, -449289, -134632, 153565, -251427, -35664, 13939, -67834, 25169, 189949, 198262, 281494, 218253, -131685, 280154, 381118, 332412, 204155, 397971, 660093, 100822, 244989, -161666, -291158, 166528, 214172, 92578, -130440, -618787, -226897, -140527, -173307, -132081, 40464, 105342, 115458, 158334, -157511, -348513, -60232, 347084]
1183C47084R424j95494k44779j15275k14916p0766K50139L28576m51624j5188
1173c72819L397j64830O2259k73372L278M37978K84904J79671q519k80729P2376
1162e6406N8410j73338n8506K50701j76120N223J30782j30482R2048N8138l59125
1151c58675K48258M08070k73422j36457l6341o9940j48702J45743K95828J98674
1141B73036k37313k17519K17779q0848o9917O49665L36121k74124j18429m11853
1131F6598k39688J04320j8435K01116Q8944k98168J80455k56830j15374N63409
1121B76347j57720K7847O3696P8111n61250J72927O2262J8677O3278m16922j19518
1110d92265n2929L67841k47944r0067K22860l4879L87309l73732j5801K39903
$$ y = [347084, 356508, 161014, -83765, -199040, -413956, -484722, -234583, 93993, -357631, -372819, -369422, -534252, -471993, -745365, -742087, -304109, -19205, 160466, 151947, -128782, -56406, 2004, -171334, -229840, 20861, -155259, -150036, -19254, -149736, -57688, 450, -358675, -110417, 297653, 24231, -112226, -148567, -218507, -367209, -221466, 74362, 273036, 35723, -181796, 35983, -44865, -114782, 534883, 871004, 596880, 478451, 66598, -173090, -68770, -87205, 113911, 202855, -95313, 85142, -171688, -287062, 276347, 118627, 146474, 210170, 288281, -272969, -100042, -37780, -19103, 44175, -372747, -492265, -545194, -177353, -425297, -515364, -292504, -327383, 59926, -313806, -329607, -89704]
1100h9704K13183m77425K9023J16974J68956J33211k88095J14655J57359J45690
1090B23827K753l71709L0976j1401O5522k65460l19086J15681J14666J74278K9615
1079b10338Q4325j12962q1844K79355r3434o173K11804J23323L10628o22528K02654
1068H4810k11646j21933K69710R2473J01236M9613K70830J94254j46354k67157
1058C15836m31470L5410k55957J23265j4613J77868L07097r4946L8479K43390
1048D44359m59869m98105L14097M53172K65338k83834j18384j7220k39876k43136
1038c83458J66953j76951N5305L0594K51269J63122l0769K07157K52207l73550
1028A61879l99793n13441K69853J89315K3097P08677l73750l37592K35075M27731
$$ y = [-89704, 123479, -353946, -324923, -207949, -38993, 94218, -193877, -79222, 78137, 223827, 226580, -145129, -114153, -125554, -60032, -325492, -644578, -528897, -414231, -239953, -210338, -126013, -238975, -320819, -41464, -134898, -141071, 70733, 194056, 504684, -117844, 84810, -126836, -248769, 20941, 113414, 214650, 264263, 535093, 729347, 582993, 315836, -115634, -80224, -336181, -212916, -227529, -49661, 257436, 162490, 200969, 444359, -15510, -513615, -199518, 253654, 518992, 235158, 116774, 99554, -140322, -383458, -216505, -393456, -338151, -307557, -56288, 106834, 76065, 283222, 535429, 161879, -237914, -751355, -481502, -292187, -269090, 439587, 65837, -271755, -36680, 391051]
1018C91051j87105j88495o29116N31901L36877J72108k24433p21649M4313L59495
1008a15053j01660J83335R9785J04029j72600k09718l34395j31265M11145P33977
998D67580j65230k54556N9744j50573l38066J63370K94726n56903J8028J50991
988c10889J01612r087K49399m73374M5537L77026P1619j18758J50733k23234J15467
977b3949P9676L95622l04787p20948L8969N32904L2445k09333J52908N2265M1570
966F7342O2796M0269M9882K39566j70073l53650K64060J15061j60810k7059j56232
955b8848J85112j77533K44030m3595m94438K4598r7757M60333q1066j38544j83883
944c31591J51178m03928j06797L38538n9469n5068J81302j2382L01829J98177
$$ y = [391051, 203946, 15451, -613665, -81764, 255113, 427221, 202788, -518861, -474548, -115053, -216713, -33378, 66407, 170436, -2164, -211882, -546277, -677542, -266397, 467580, 302350, 47794, 107538, -43035, -381101, -217731, 76995, -479908, -461880, -310889, -209277, -218364, 31035, -442339, -396802, -19776, 51843, -66915, 83818, -139416, -23949, 55727, 451349, 146562, -574386, -535417, -2513, 29932, -179401, -26493, 25772, 67342, 130138, 170407, 220289, 459855, 289782, -63868, 200192, 315253, 154443, 127384, -28848, 156264, -21269, 222761, 179166, -315272, -290674, -388431, 71902, -9164, -147708, -331591, -180413, -584341, -691138, -352600, -412069, -467137, -285835, -298217, 3612, 201789]
934B01789k14264k40549j16740L57690m9508j4493j73437K09391K80960J732j48501
923I4070k83452J36355n3741J57544J5508j42058J39378J31525n630m07083K25426
912G842J73382m13882m1582k24927k033J49963J59398j06088P2872J86730n6822
901i5147K1957K74717j21463j41175J66466Q3240M3064o40245J08099N07015k22397
890a5869k57345M53496j75027k31418j37836j7278J86662K19909K36188k29782
880C1700m51599M33188O4994K88666O1265m59908k52041L94478k02935M9012J40120
869I6940N944k53016J80774L0370k42864K33472l36206n2603j54439K55052J56722
858g9854J59790l22702k04798K34773o6661L7990L9958o2052j88861k92283L2261
$$ y = [201789, -12475, -253024, -369764, -12074, -61582, -76075, -249512, -40121, 240839, 242571, 94070, -189382, -53027, -106768, 50776, 66284, -75774, 63604, 195129, 189499, -217584, 7842, 181224, -232658, -274240, -499167, -501200, -351237, -191839, -297927, -225055, -38325, -95147, -73190, 201527, 80064, -61111, 105355, 188595, 231659, -408586, -300487, 206528, -15869, -273214, 180282, 5255, -226163, -363999, -381277, -194615, 25294, 261482, 31700, -419899, 13289, 78283, 366949, 428214, -31694, -283735, 110743, -92192, -43180, 96940, 102884, -150132, 30642, 61012, -181852, 51620, -284586, -337189, -491628, -236576, -79854, 79936, -242766, -447564, -212791, -279452, -241462, -201504, -263556, -452417, -744700, -712439]
847g12439O3801L34655L85387K5299p8912K17679m6286l45169J31212j784l24093
836c50650J94118L11422m21912k41882L77718M2990k42384l60691K24950O04775
826A38454q8591J78354R6896k96010J59311j51864l17615L87n5869O0435J06636
815a69476j41361K81502j1372j22605R4617R8483m43009J78185L33844r6339p2508
804g0039P6829k09474J39795O1683J58092K02503n98356k07178J66937j61842
794d41050n719O21708k52453l16884j12163Q3040N2437L16850M70482p6970o61894
783c22616m84702J72036O67167k13180q6341l9830L56771l76942P5265r7824J84293
772a65903M53093l2737K74139M3235o7902l7224m58105j98614L9555N89334j83123
$$ y = [-712439, -648638, -313983, 71404, 96703, 17791, 235470, 189184, -155985, -24773, -26557, -350650, -156532, 154890, -267022, -508904, -131186, -88196, -330580, -691271, -466321, 138454, 49863, 228217, 325113, 29103, 188414, 36550, -281065, -280678, -336547, -276112, -169476, -310837, -29335, -40707, -163312, -68695, 29788, -413221, -235036, 98808, 2469, -70039, 6790, -202684, -62889, -1206, 156886, 359389, -238967, -446145, -279208, -441050, -446769, 174939, -77514, -394398, -506561, -423521, -371084, -54234, 416248, 339278, -322616, -807318, -635282, 31885, -181295, -267636, -307466, 49305, -327637, -252372, -350196, -165903, 287190, 254453, 528592, 571827, 503925, 466701, 8596, -190018, -150463, 438871, 255748]
761B55748O109K33010k20252j8353j80598m14112K1648M38284l94504K91352J62109
750A80441l48880J06118J67466l30655M5240m01703L92390M32205J45698l74940
740A3380j59227J09484J04493m56639J71800M60591j05654k36053k21865L49353
730B9663k04142k48694L77609j23193L39060j50442m19762J74665L20199j66930
720g1967J44457m63712P5533m87009J73437J51429K05012J18065J44824m51773
710d61704L96310M47017l68277j56369l09600K30427j06607J53118j4271O5468
700a24488Q234K82008l83584k6456L62806o5788O0569L33279n34407m34243O6337
689d55733L4733K65799L25643m11932j20286L75573m36520J31668K44683j6620
$$ y = [255748, 261857, 494867, 274615, 256262, 75664, -338448, -316800, 121484, -273020, 18332, 180441, -168439, -62321, 105145, -225510, -180270, -581973, -189583, 242622, 388320, 13380, -145847, -36363, 68130, -388509, -216709, 243882, 138228, -97825, -319690, 29663, -174479, -423173, -45564, -168757, 170303, 19861, -399901, -225236, 94963, -71967, 72490, -391222, -315689, -802698, -629261, -477832, -272820, -154755, -9931, -461704, -65394, 381623, 13346, -143023, -452623, -222196, -328803, -175685, -189956, -124488, -116254, 165754, -217830, -244286, 118520, 52732, 113301, 446580, -87827, -522070, -455733, -421000, -155201, 170442, -241490, -361776, 13797, -422723, -291055, -46372, -62992]
679f2992K01733M4816n14126k53469N35946J25636N0563m64214J24678m1165J88209
668f4385J81480j4842j21210O6865K8428j11794o00630L14115J65683L44682J15476
657C03868p694k89850K43399k1057l87793J11865j30693J49707j60105k3614K52522
646D0555L14167L60891O2037l53709q0917o2992j66585J88589j60882o03102j06828
635e68776J49074R6183p8428J35754j10896J87575J34843l29932k38240Q6015
625e36828j0676L66462J63545j32343Q6656J51489k62412J17322J76339j85371
615f5817J46009J77377l11132k44254M65080k33479j23908j02348K48786m6687
605i0373J2645k84882N5463K9311L23381N696m94308O1785J73277N59810P2373
$$ y = [-62992, 138741, 183557, -330569, -584038, -48092, 77544, 128107, -336107, -211429, -252594, -64385, 117095, 102253, -18957, 47908, 76336, -35458, -636088, -321973, -156290, 188392, 303868, 296174, 6324, 249723, 228666, -159127, -47262, -177955, -28248, -188353, -211967, 40555, 354722, 715613, 777650, 423941, 343024, 280032, 113447, 302036, 141154, -461948, -568776, -419702, -323519, -401947, -266193, -377089, -189514, -54671, -384603, -622843, -536828, -547504, -181042, -17497, -149840, -63184, 88305, -174107, -56785, 119554, -65817, 80192, 257569, -53563, -297817, 167263, -66216, -190124, -292472, -43686, -90373, -77728, -362610, -307147, -277836, 45545, 51241, -443067, -381282, -208005, 351805, 424178]
594D24178m46642K33082l2534J43693m1844j5384j37200k77508L32891K13777
584C96509n9591o5155l15652o0273k8101P9417l37938n61567L74210N28187K13390
573A63436n7606m588r6258k5547k27797L97576L9172m0183M1514n8985j44848
562a4114j82757J4149l39796J15384K37104J03765J13894o12511L47956J57230
552e9696j30133o03138J10552L0620N12575n4252j81250j19653M32172K69610
542B07407l17951k94017J08591K52970J74807K92246o9115k78337L09221j69746
532B16076l78949M72467Q9371j85122j40858k23780L98591j31928J3068m03909
522b74973K12961k59942j11157K32024O7863J95052o1672o4647N47861m4040n34576
$$ y = [424178, -22464, 210618, 178084, 321777, 279933, 264549, 127349, -150159, 182732, 396509, 336918, 271763, -43889, -104162, -132263, -52846, -390784, -952351, -578141, -49954, 163436, 105830, 101242, 4984, -20563, -248360, 149216, 188388, 148205, 189719, 130734, -14114, -196871, -182722, -522518, -407134, -170030, -66265, 47629, -564882, -216926, -59696, -189829, -792967, -682415, -651795, -139220, -193472, -374722, -494375, -62203, 207407, -110544, -404561, -295970, -43000, 131807, 424053, 354938, 76601, 385822, 216076, -162873, 309594, 398965, 213843, 72985, -150795, 247796, 115868, 128936, -274973, -62012, -321954, -433111, -201087, -133224, 61828, 156, -64491, 483370, 439330, -95246]
511i5246k16296o6752r3517q9316q5429J11734O76907l63361J11089k50598k00360
500e61145L50571j34233K18456N83946l95849l33669K63072J26700k86601J56435
490a2317k53814K52876M62399k50037j42401N24985k21912k28887n0075k38966
480a58149P298N25845l58436l12194L56091K62675j29542m95188n1391M13006
470F0015J86497K24876P1688n6502k81554K23350p9725k21046j45467L00110l34769
459e2527m81598K32981K86130q4147L45005p7927K07374r8414K2082m36553j69882
448c07476J53135J09128J36850P8933J33856l34116k65369K42280j78025N4354
438a76450P0277l1353L40293l27734k22621P3679M08598J61796m25561M0436J50731
$$ y = [-95246, -311542, -378294, -471811, -561127, -646556, -534822, 142085, -221276, -110187, -360785, -561145, -210574, -344807, -126351, 457595, 61746, -271923, -8851, 117849, -168752, -12317, -266131, -13255, 449144, 199107, 56706, 581691, 359779, 130892, 80817, -158149, -150851, 374994, 16558, -295636, 60455, 323130, 193588, -301600, -352991, 60015, 246512, 471388, 543076, 486574, 205020, 428370, 348645, 127599, -17868, 282242, -52527, -534125, -301144, -15014, -99161, 245844, 167917, 375291, 276877, 298959, -137594, -307476, -154341, -45213, 91637, 170570, 304426, -29690, -295059, -52779, -230804, -176450, -106173, -137526, 202767, -124967, -347588, -273909, 134689, 296485, -129076, -88640, 62091]
427F2091L69701o4331m1011l02435j45505Q52795o9046n9538l22363j16427K83081
416D47012p7268k02622j61400k61020K14379k28890J71583J01077L62380P06k58301
405A07636L2421o011J64885l776k36842P2504r7159m4263j16385L3893l56657
394d49754Q0262O51812l45438o01422L76722K76532j37389K02356j39312l01510
384c87141J95577N6084M5606J73989m8402J6153L69593l19532L1616K37341P4277
373D45161j11668k82238J80992M34247n01690k47265M28275j53007J65390k27884
363A30313l47522k02844J97699K91568k6248q152N0742K87318L14792m31858l21852
352f6044K70549L1138j59138m27273J11659J79893K00157r726n8357L1218K85588
$$ y = [62091, 431792, 367461, 326450, 24015, -121490, 731305, 662259, 602721, 280358, 163931, 447012, 369744, 167122, 5722, -255298, -40919, -269809, -98226, 2851, 365231, 365937, 107636, 140057, 134046, 298931, 295155, 58313, 130817, 33658, -10605, -126990, -93097, -449754, -369492, 282320, -63118, -664540, -287818, -11286, -148675, 53681, -85631, -387141, -191564, -135480, -89874, 84115, 35713, 51866, 421459, 101927, 133543, 370884, 445161, 333493, 51255, 232247, 666494, 164804, -82461, 345814, 192807, 358197, 130313, -217209, -420053, -222354, 69214, 42966, 34814, 85556, 372874, 687666, 255808, -66044, 204505, 235643, 76505, -350768, -239109, -59216, 140941, 131215, 72858, 104076, 389664]
341C89664l42713p1869K42741o8218j81453L2920L14847j99766k70385L86337
331B32105k10125j9780o8210j49825O8115Q822O0197K27594Q5740K95191K10587
320G40411l05395J26707l58777j44211J24265k18364M02801J20020m19651J33692
310B01498L4674J7607L63159L8352m29810n40537P9528p2880L15150k70630L70478
299A06589J81226q5479l3002j22588j16476K40405L33861o70311J29103j32611
289a69283l9854k11850o9295N9601N90894r3474l79077M00734L75872l68657M0101
278A35712j2046K22228k28589j71685k74149l67590J08026M29101J4478M37860
268B93346l6977j65501L7693J52636k7512J96324J64778K91418m77911j48984
$$ y = [389664, 46951, -24918, 217823, 149605, -31848, 1072, 315919, 116153, -154232, 232105, 21980, 2200, -66010, -215835, -147720, -138898, -78701, 148893, 234633, 529824, 740411, 435016, 561723, 202946, 58735, 183000, -35364, 367437, 487457, 67806, 201498, 236172, 253779, 616938, 655290, 225480, -315057, -235529, -308409, 6741, -263889, 106589, 287815, 202336, 169334, 46746, -69730, 170675, 504536, -165775, -36672, -169283, -209137, -420987, -490282, -430681, 160213, 66739, -312338, 88396, 464268, 95611, 135712, 123666, 345894, 117305, -54380, -328529, -696119, -588093, -158992, -144514, 293346, 256369, 90868, 128561, 281197, 253685, 450009, 614787, 906205, 428294, 279310]
258B79310l8885J12139L4817k2725j96110j97385L26410K67139l31798k78868
248d5956J03544j08265l8885L6024j23411l00370L86178L48432J36682l16739
238G7234j68850K70752r9321L36054m84354k441P4061l88278J72072j68510K48200
227a33381m9564M5423j52670N63090J06390j2010J6236l1201R4913j19856q6373
216B40997j98221K8855m066j92181J30131K08454j53545O61j40836K63730K5021
205B09000j97508p5722j04884K74765J40044j60739j85093J71518j07925J8915
195a7629K54275J91935j91682j37774r7786L84229k87994J06757L04488L52586
185H61405m45729m31878J23831J98834J23207n02802m38290K02078L06076J34148
$$ y = [279310, 240425, 352564, 387381, 364656, 168546, -28839, 297571, 564710, 232912, -45956, 57588, -50677, -89562, -53538, -176949, -477319, -91141, 257291, 393973, 77234, -91616, 179136, 79815, 415869, -68485, -70926, 3135, -385143, -213071, -381581, -133381, -182945, -137522, -290192, 272898, 379288, 367278, 383514, 352313, 447226, 327370, 240997, 42776, 71631, 67565, -124616, 5515, 213969, 60424, 61085, -79751, 183979, 209000, 11492, -64230, -169114, 105651, 245695, 84956, -100137, 71381, -36544, -17629, 236646, 428581, 236899, 99125, 1339, 385568, 97574, 204331, 508819, 861405, 415676, -16202, 107629, 306463, 429670, -73132, -511422, -309344, -3268, 130880]
175A30880K5011J51720n021L2752K54675l18167l04617M4763l6282j28065j57467
164c09818L16058K78389p8551m26244O1864N9207M32518K04008r8653J26634K3846
153E89258j10684J30142l11867k76835p5115K38049K84469k07812k93790J8832
143a5353L45653J30146j73268j19326q2569J55297k4179N474j70233j83766L04664
132A72540K08422J00239Q0631j96697p7636K06463k1756K7592k31914J95180J23933
121E86997k29827J36621L7594m94807l21808J21329J8922j08580L44166J58550
111B49157J01677l98481j652r1292p5645j88907M45435P5929Q5709j05793l75324
100b79187K34481n7751j41255J30634J23619L78732n23814n9559p3406R0684L63541
$$ y = [130880, 155891, 307611, 302590, 335342, 590017, 271850, -32767, 11996, -24286, -152351, -309818, 6240, 284629, 206078, -220166, -158302, -99095, 333423, 537431, 438778, 565412, 589258, 478574, 608716, 296849, 20014, -55101, 182948, 467417, 259605, -34185, -15353, 330300, 460446, 287178, 167852, 85283, 240580, 216401, 221875, 51642, -132124, 172540, 380962, 481201, 561832, 365135, 287499, 493962, 472206, 499798, 267884, 463064, 586997, 357170, 493791, 531385, 36578, -285230, -163901, -144979, -253559, 90607, 249157, 350834, -47647, -49299, -140591, -216236, -405143, 40292, 116221, 201930, 96137, -279187, -44706, -102457, -243712, -113078, 10541, 389273, -134541, -194100, -267506, -176822, 186719]
89A86719J31654k18739J59218k4942j5471j63224o8732J50084O9015K03923l4185
78C75320L81393k0469m14874m23785L40955K05172J3992k01520K7742k35983J10508
67A58451J96418j21697N4308J02817n217k13558m5831o7703k36450m8801K69865
56D2602J79998K71670n9562j92056k54986J44965Q4075J03130R4129n5880l17422
45D0663J13688j33600p562J75703m1146k1686R7953K67970k07680j11694J73898
34C46507j46285k56290K18109l16873r059K54097K9912N8999N2520r1643J28278
23B68272j46571L4505r5913J07786K87112p2577k14998p4440M0481K2099k28446
$$ y = [186719, 318373, 99634, 258852, 233910, 218439, 55215, -13517, 136567, 205582, 409505, 375320, 756713, 736244, 321370, -102415, 238540, 443712, 457704, 256184, 283926, 47943, 158451, 354869, 233172, 287480, 390297, 385080, 171522, 125691, 57988, -178462, -227263, 42602, 222600, 494270, 434708, 242652, -12334, 132631, 216706, 319836, 413965, 358085, 40663, 154351, 20751, 13189, 188892, 147746, 126060, 224013, 491983, 284303, 172609, 346507, 200222, -56068, 162041, -154832, -163891, 90206, 120118, 179117, 231637, 139994, 268272, 121701, 156206, 60293, 168079, 455191, 382614, 167616, 93176, 133657, 155756, -72690]
$$ [...]
##END NTUPLES=NMR SPECTRUM
##END=
