##TITLE=1H_EC-3327(II-22)
 CDCl3
 8 sc, 
 31.5.2024
##JCAMPDX= 6.0         $$ Bruker NMR JCAMP-DX V2.0
##DATA TYPE= NMR SPECTRUM
##DATA CLASS= NTUPLES
##ORIGIN= UXNMR, Bruker Analytische Messtechnik GmbH
##OWNER= root
$$ XWIN-NMR		Version 3.5
$$ Fri May 31 13:52:26 2024 Russian Standard Time (UT+4h)  she@DPX200
##.OBSERVE FREQUENCY= 200.1309
##.OBSERVE NUCLEUS= ^1H
##.ACQUISITION MODE= SIMULTANEOUS
##.ACQUISITION SCHEME= undefined
##.AVERAGES= 8
##.DIGITISER RES= 18
##SPECTROMETER/DATA SYSTEM= spect
##.PULSE SEQUENCE= zg30
##.SOLVENT NAME= CDCl3
##.SHIFT REFERENCE= (INTERNAL, CDCl3, 0, 15.8384)
##AUDIT TRAIL= $$ (NUMBER, WHEN, WHO, WHERE, WHAT)
$$ ##TITLE= Audit trail, XWIN-NMR		Version 3.5
$$ ##JCAMPDX= 5.01
$$ ##ORIGIN= Bruker BioSpin GmbH
$$ ##OWNER= she
$$ F:/spectra/data/she/nmr/H-F/1/pdata/1/auditp.txt
$$ ##AUDIT TRAIL=  $$ (NUMBER, WHEN, WHO, WHERE, WHAT)
(   1,<2024-05-31 13:51:18.32 +0400>,<she>,<DPX200>,
      <created by zg, POWCHK disabled, PULCHK disabled
       configuration hash MD5:
       00 E9 B6 7A A2 85 ED C7 34 08 36 98 17 FE 4E 26
       data hash MD5: 16K
       57 E6 EA 43 C9 F2 9A 58 BC F6 CB 73 74 74 C7 41>)
(   2,<2024-05-31 13:51:21.68 +0400>,<she>,<DPX200>,
      <Start of raw data processing
       efp BC_mod = 2 LB = 0.24 FT_mod = 6 PKNL = 1 PHC0 = -25312.47 PHC1 = 10.58748 SI = 16K 
       data hash MD5: 16K
       E2 25 FE 09 0E E9 1C C4 35 00 A0 91 C6 73 61 A8>)
(   3,<2024-05-31 13:51:40.65 +0400>,<she>,<DPX200>,
      <pk PHC0 = 1.792262 PHC1 = -1.2 
       data hash MD5: 16K
       ED 37 98 12 FE 70 D1 A0 2C 9D 58 AA F2 2A 54 A4>)
(   4,<2024-05-31 13:51:44.01 +0400>,<she>,<DPX200>,
      <abs ABSG = 5 
       data hash MD5: 16K
       77 6C EB 50 19 2F 21 4D 67 66 09 70 20 CE E6 56>)
$$ ##END=
$$ 
$$ hash MD5
$$ F1 AB 9F 98 1D 52 94 94 AF 15 05 93 10 25 71 33
##$RELAX= 
##$RELAX= 
##$RELAX= 
##$RELAX= 
##$RELAX= 
##$RELAX= 
$$ Bruker specific parameters
$$ --------------------------
##$DU= <F:/spectra>
##$EXPNO= 1
##$NAME= <H-F>
##$PROCNO= 1
##$TYPE= <nmr>
##$USER= <she>
##$AMP= (0..31)
100 100 100 100 100 100 100 100 100 100 100 100 100 100 100 100 100 100 
100 100 100 100 100 100 100 100 100 100 100 100 100 100 
##$AQSEQ= 0
##$AQ_mod= 1
##$AUNM= <au_zg>
##$AUTOPOS= <>
##$BF1= 200.13
##$BF2= 200.13
##$BF3= 200.13
##$BF4= 200.13
##$BF5= 200.13
##$BF6= 200.13
##$BF7= 200.13
##$BF8= 200.13
##$BYTORDA= 1
##$CFDGTYP= 0
##$CFRGTYP= 5
##$CHEMSTR= <none>
##$CNST= (0..31)
1 1 145 1 1 1 1 1 1 1 1 1 1 1 1 1 1 1 1 1 1 1 1 1 1 1 1 1 1 1 1 1 
##$CPDPRG= <>
##$CPDPRG1= <>
##$CPDPRG2= <>
##$CPDPRG3= <>
##$CPDPRG4= <mlev>
##$CPDPRG5= <mlev>
##$CPDPRG6= <mlev>
##$CPDPRG7= <mlev>
##$CPDPRG8= <mlev>
##$CPDPRGB= <>
##$CPDPRGT= <>
##$D= (0..31)
0 1.2 0 0 0 0 0 0 0 0.06 0 0.03 0 0 0 0 0.0002 0 0 0 0 0 0 0 0 0 0 0 0 
0 0 0 
##$DATE= 1717149077
##$DBL= (0..7)
120 120 120 120 120 120 120 120 
##$DBP= (0..7)
150 150 150 150 150 150 150 150 
##$DBP07= 0
##$DBPNAM0= <>
##$DBPNAM1= <>
##$DBPNAM2= <>
##$DBPNAM3= <>
##$DBPNAM4= <>
$$ [...]
##$SUBNAM3= <"">
##$SUBNAM4= <"">
##$SUBNAM5= <"">
##$SUBNAM6= <"">
##$SUBNAM7= <"">
##$SUBNAM8= <"">
##$SUBNAM9= <"">
##$SW= 18.0517689322627
##$SWIBOX= (0..15)
0 0 2 0 0 0 0 0 0 0 0 0 0 0 0 0 
##$SW_h= 3612.71676300578
##$TD= 16384
##$TD0= 1
##$TE= 0
##$TE2= 300
##$TE3= 300
##$TEG= 300
##$TL= (0..7)
0 120 120 120 120 120 120 120 
##$TP= (0..7)
150 150 150 150 150 150 150 150 
##$TP07= 0
##$TPNAME0= <>
##$TPNAME1= <>
##$TPNAME2= <>
##$TPNAME3= <>
##$TPNAME4= <>
##$TPNAME5= <>
##$TPNAME6= <>
##$TPNAME7= <>
##$TPOAL= (0..7)
0.5 0.5 0.5 0.5 0.5 0.5 0.5 0.5 
##$TPOFFS= (0..7)
0 0 0 0 0 0 0 0 
##$TUNHIN= 0
##$TUNHOUT= 0
##$TUNXOUT= 0
##$USERA1= <user>
##$USERA2= <user>
##$USERA3= <user>
##$USERA4= <user>
##$USERA5= <user>
##$V9= 5
##$VALIST= <valist>
##$VCLIST= <CCCCCCCCCCCCCCC>
##$VD= 0
##$VDLIST= <DDDDDDDDDDDDDDD>
##$VPLIST= <PPPPPPPPPPPPPPP>
##$VTLIST= <TTTTTTTTTTTTTTT>
##$WBST= 1024
##$WBSW= 4
##$XGAIN= (0..3)
0 0 0 0 
##$XL= 0
##$YL= 0
##$YMAX_a= 389718
##$YMIN_a= -535023
##$ZGOPTNS= <>
##$ZL1= 120
##$ZL2= 120
##$ZL3= 120
##$ZL4= 120
##$ABSF1= 15.84719
##$ABSF2= -2.204701
##$ABSG= 5
##$ABSL= 3
##$ALPHA= 0
##$AQORDER= 0
##$ASSFAC= 0
##$ASSFACI= 0
##$ASSFACX= 0
##$ASSWID= 0
##$AUNMP= <proc_1d>
##$AZFE= 0.1
##$AZFW= 0.1
##$BCFW= 0
##$BC_mod= 2
##$BYTORDP= 0
##$COROFFS= 0
##$CY= -3
##$DATMOD= 1
##$DC= 0
##$DFILT= <>
##$DTYPP= 0
##$F1P= 0
##$F2P= 0
##$FCOR= 1
##$FTSIZE= 16384
##$FT_mod= 6
##$GAMMA= 0
##$GB= 0
##$INTBC= 1
##$INTSCL= 3.70164e-10
##$ISEN= 128
##$LB= 0.24
##$LEV0= 0
##$LPBIN= 0
##$MAXI= 10000
##$MC2= 0
##$MEAN= 0
##$ME_mod= 0
##$MI= 1.114404
##$NCOEF= 0
##$NC_proc= -6
##$NLEV= 6
##$NOISF1= 3.799351
##$NOISF2= 2.8
##$NSP= 0
##$NTH_PI= 0
##$NZP= 0
##$OFFSET= 15.83838
##$PC= 1
##$PHC0= -25310.68
##$PHC1= 9.38748
##$PH_mod= 1
##$PKNL= yes
##$PPARMOD= 0
##$PSCAL= 0
##$PSIGN= 0
##$REVERSE= no
##$SF= 200.12953663105
##$SI= 16384
##$SIGF1= 3
##$SIGF2= 2
##$SINO= 5.538805
##$SIOLD= 16384
##$SREGLST= <1H.CDCl3>
##$SSB= 0
##$STSI= 16384
##$STSR= 0
##$SW_p= 3612.71676300577
##$SYMM= 0
##$S_DEV= 0
##$TDeff= 16384
##$TDoff= 0
##$TI= <>
##$TILT= no
##$TM1= 0
##$TM2= 0
##$TOPLEV= 0
##$USERP1= <user>
##$USERP2= <user>
##$USERP3= <user>
##$USERP4= <user>
##$USERP5= <user>
##$WDW= 1
##$XDIM= 16384
##$YMAX_p= 398531054
##$YMIN_p= -461913
$$ End of Bruker specific parameters
$$ ---------------------------------
##NTUPLES= NMR SPECTRUM
##VAR_NAME=  FREQUENCY,     SPECTRUM/REAL,   SPECTRUM/IMAG
##SYMBOL=    X,             R,               I
##VAR_TYPE=  INDEPENDENT,   DEPENDENT,       DEPENDENT
##VAR_FORM=  AFFN,          ASDF,            ASDF
##VAR_DIM=   16384,         16384,           16384
##UNITS=     HZ,            ARBITRARY UNITS, ARBITRARY UNITS
##FACTOR=    0.220516191357247, 1,           1
##FIRST=     3169.72762235321, 0,            0
##LAST=      -442.989140652562, 0,           0
##MIN=       -442.989140652562, -461913,     0
##MAX=       3169.72762235321, 398531054,    0
$$ Real data points
##PAGE= N=1
##DATA TABLE= (X++(R..R)), XYDATA
$$ [...]
$$ plain form
6329 372185 446843 471757 516802 554763 581565 600940 401194 369803 430362 507237 464024
6318 464024 499590 405981 353648 431111 466393 469523 541597 542623 599713 534468 517993 522169
6306 522169 438267 573248 633016 586631 542231 557702 552336 614310 614980 564654 552704 614446
6294 614446 566835 632392 581601 493504 562122 681957 757458 708029 561999 503334 560039
6283 560039 588302 710639 824033 777424 756837 785672 708244 692954 685832 634667 738026
6272 738026 773655 759781 777086 815659 759719 778480 719976 638722 703501 773712 794464 830263
6260 830263 865599 877945 956464 943421 980052 1015016 969222 928204 881716 1006847 995996
6249 995996 998069 1009757 979800 965524 907674 1016255 1033571 1102663 1054562 1038659 1121451 1248792
$$ packed form
6329C72185P4658K4914M5045L7961K6802J9375j99746l1391O0559P6875m3213
6318D64024L5566r3609n2333P7463L5282L130P2074J026N7090o5245j6475M176
6306E22169q3902J34981N9768m6385m4400J5471n366O1974O70n0326j1950O1742
6294F14446m7611O5557n0791q8097O8618J19835P5501m9429j46030n8665N6705
6283E60039K8263J22337J13394m6609k0587K8835p7428j5290p122n1165J03359
6272G38026L5629j3874J7305L8573n5940J8761n8504q1254O4779P0211K0752L5799
6260H30263L5336J2346P8519j3043L6631L4964m5794m1018m6488J25131j0851
6249I95996K073J1688k9957j4276n7850J08581J7316O9092m8101j5903Q2792J27341
$$ plain form
6237 1248792 1333913 1304654 1209411 1325540 1455554 1374660 1398559 1404524 1439919 1416223 1373935
6226 1373935 1497016 1463908 1467452 1402203 1400005 1404258 1432279 1453972 1495802 1394090 1391647 1473365
6214 1473365 1630235 1601080 1575739 1526192 1535502 1517422 1548043 1632382 1608676 1629196 1673066
6203 1673066 1663553 1663378 1740798 1738132 1761411 1834055 1921323 2019667 2087091 2164911 2266365 2207262
6191 2207262 2235733 2217388 2216059 2356213 2394863 2376364 2466592 2561251 2654087 2635200 2792934
6180 2792934 2799658 2865000 3002497 3207021 3202881 3238415 3318579 3475128 3564670 3416792 3512128
6169 3512128 3636634 3710630 3926121 4190690 4393595 4483987 4585584 4720610 4765682 4828115
6159 4828115 5009363 5235815 5466034 5578415 5808735 5998710 6146416 6335830 6454035 6601416
$$ packed form
6237A248792Q5121k9259r5243J16129J30014q0894K3899N965L5395k3696m2288
6226A373935J23081l3108L544o5249k198M253K8021K1693M1830j01712k443Q1718
6214A473365J56870k9155k5341m9547R310j8080L0621Q4339k3706K0520M3870
6203A673066r513j75P7420k666K3279P2644Q7268R8344O7424P7820J01454n9103
6191B207262K8471j8345j329J40154L8650j8499R0228R4659R2836j8887J57734
6180B792934O724O5342J37497K04524m140L5534Q0164J56549Q9542j47878R5336
6169C512128J24506P3996K15491K64569K02905R0392J01597J35026M5072O2433
6159D828115J81248K26452K30219J12381K30320J89975J47706J89414J18205J47381
$$ plain form
6149 6601416 6771306 6841495 6985877 7344226 7642879 7796656 8037827 8293090 8558097 8869442
6139 8869442 9096902 9367998 9619611 9858149 10222037 10584619 11007080 11514382 11955986 12655098
6129 12655098 13255167 13770408 14369193 15124011 15990330 16900001 17889646 19018150 20222298
6120 20222298 21561158 23037457 24754178 26618706 28702381 31203063 33969854 37082910
6112 37082910 40420855 44101959 47292342 49193535 49292969 47774792 45168656 42260585
6104 42260585 39657917 37546797 35856877 34600013 33894047 33540450 33615857 33977628 34764357
6095 34764357 36020577 37568445 39373965 41589871 44276416 47251345 50611299 54528888
6087 54528888 59065280 64240888 70099106 76630503 83725864 90515613 95373580 96036203
$$ packed form
6149F601416J69890P0189J44382L58349K98653J53777K41171K55263K65007L11345
6139H869442K27460K71096K51613K38538L63888L62582M22461N07302M41604O99112
6129A2655098O00069N15241N98785P54818Q66319R09671R89645J128504J204148
6120B0222298J338860J476299J716721J864528K083675K500682K766791L113056
6112C7082910L337945L681104L190383J901193R9434j518177k606136k908071
6104D2260585k602668k111120j689920j256864p05966l53597P5407L61771P86729
6095C4764357J256220J547868J805520K215906K686545K974929L359954L917589
6087E4528888M536392N175608N858218O531397P095361O789749M857967O62623
$$ plain form
6079 96036203 91386383 83295091 74197082 65795287 58940750 53333543 48851416 45369926
6071 45369926 42587286 40191596 38554997 37536441 36950263 36831486 37031242 37733103 38614978
6062 38614978 39683784 40863991 42381615 43993045 45784417 47805084 50254731 52872553
6054 52872553 55349648 56755308 55915831 52919089 48523364 43627133 38976270 34861976
6046 34861976 31323695 28409330 26014501 23865877 22011807 20490188 19273076 18247707
6038 18247707 17467862 16711113 16002036 15438618 14928418 14327173 13696261 12964191 12343055
6029 12343055 11818272 11084493 10514942 9913171 9318892 8896284 8694546 8379965 8014185
6020 8014185 7742759 7392660 7200836 6896007 6706166 6503989 6314511 6068694 5793915 5595563
$$ packed form
6079I6036203m649820q091292r098009q401795o854537n607207m482127l481490
6071D5369926k782640k395690j636599j018556n86178j18777J99756P01861Q81875
6062C8614978J068806J180207J517624J611430J791372K020667K449647K617822
6054E2872553K477095J405660q39477k996742m395725m896231m650863m114294
6046C4861976l538281k914365k394829k148624j854070j521619j217112j025369
6038A8247707p79845p56749p09077n63418n10200o01245o30912p32070o21136
6029A2343055n24783p33779n69551o01771n94279m22608k01738l14581l65780
6020H014185k71426l50099j91824l04829j89841k02177j89478k45817k74779j98352
$$ plain form
6010 5595563 5401437 5270891 5192899 5035474 4964640 4857537 4704108 4668090 4620341 4539491
6000 4539491 4361981 4335517 4291106 4179399 4053198 4096523 4135269 4056282 3959780 3957152 3867209
5989 3867209 3754801 3699659 3752685 3622363 3636427 3605531 3459374 3456372 3390836 3288921 3262919
5978 3262919 3281385 3324634 3352625 3377507 3394791 3433276 3479074 3482069 3436862 3508162 3521283 3555297
5966 3555297 3627813 3652808 3736412 3829787 3899609 4068843 4043332 4108312 4329255 4441555 4622178
5955 4622178 4905975 5134025 5438571 5836160 6116551 6471398 6858225 7383945 7918019 8208842
5945 8208842 8235513 8099940 7927527 7507243 6982848 6685031 6518347 6327580 6161375 6098236
5935 6098236 6112036 6132750 6271994 6349104 6593631 6825793 7091839 7542767 7970402 8489481
$$ packed form
6010E595563j94126j30546p7992j57425p0834j07103j53429l6018m7749q0850
6000D539491j77510k6464m4411j11707j26201M3325L8746p8987r6502k628q9943
5989C867209j12408n5142N3026j30322J4064l0896j46157l002o5536j01915k6002
5978C262919J8466M3249K7991K4882J7284L8485M5798K995m5207P1300J3121L4014
5966C555297P2516K4995Q3604R3375O9822J69234k5511O4980K20943J12300J80623
5955D622178K83797K28050L04546L97589K80391L54847L86827N25720N34074K90823
5945H208842K6671j35573j72413m20284n24395k97817j66684j90767j66205o3139
5935F098236J3800K0714J39244P7110K44527K32162K66046M50928M27635N19079
$$ plain form
5925 8489481 9115690 9962463 10856828 11821185 12622332 13483824 14112443 14140957 13543397 12406700
5915 12406700 11181162 9999493 8874948 8056896 7422684 7037966 6738891 6469575 6153967
5906 6153967 5886449 5839813 5781085 5773794 5782692 5873264 6054852 6297558 6467785 6715716 7148356
5895 7148356 7615153 7953405 8181246 8097147 7716591 7323585 6728387 6120929 5700850 5145145
5885 5145145 4666964 4267249 3912517 3564085 3252510 3077515 2880651 2621257 2520560 2429955
5875 2429955 2276597 2200272 2045517 1971546 2031571 1961391 2003732 1953231 1739905 1744357 1698184
5864 1698184 1703505 1580315 1394953 1390655 1398426 1391541 1419588 1385771 1390790 1417458 1464458 1398332
5852 1398332 1298052 1371266 1451900 1342895 1405180 1514398 1425898 1294105 1228546 1091316
$$ packed form
5925H489481O26209Q46773Q94365R64357Q01147Q61492O28619K8514n97560j136697
5915A2406700j225538j181669j124545q18052o34212l84718k99075k69316l15608
5906F153967k67518m6636n8728p291Q898R0572J81588K42706J70227K47931M32640
5895G148356M66797L38252K27841q4099l80556l93006n95198o07458m20079n55705
5885E145145m78181l99715l54732l48432l11575j74995j96864k59394j00697r0605
5875B429955j53358p6325j54755p3971O0025p0180M2341n0501k13326M452m6173
5864A698184N321j23190j85362m298P771o885K8047l3817N019K6668M7000o6126
5852A398332j00280P3214Q0634j09005O2285J09218q8500j31793o5559j37230
$$ plain form
5842 1091316 1203466 1242884 1203309 1294060 1274544 1175901 1202226 1190386 1159200 1160769 1107528
5831 1107528 1088152 1167751 1143128 1110613 1151648 1173448 1186245 1201876 1253335 1274362 1317177
5820 1317177 1202670 1179612 1210141 1208981 1147478 1076640 1042989 982692 1015175 1022386 1083621 1096551
5808 1096551 1000876 964978 994356 980482 1073250 1145002 1058193 974930 960269 1102507 1014689
5797 1014689 1021064 1068415 1105327 1083812 1020270 1061375 1118575 1192398 1078269 976012 960696
5786 960696 1081010 1036971 924742 947586 956396 908836 955098 971062 1004739 1066674 1076373 1129974
5774 1129974 1145761 1063855 1051320 1090000 1087182 1143365 1173473 1122432 1086378 1136169 1229445 1188919
5762 1188919 951321 977226 966264 958793 934600 1010937 945913 947794 980629 943830 981880 1002320
$$ packed form
5842A091316J12150L9418l9575R0751j9516r8643K6325j1840l1186J569n3241
5831A107528j9376P9599k4623l2515M1035K1800J2797J5631N1459K1027M2815
5820A317177j14507k3058L0529j160o1503p0838l3651o0297L2483P211O1235J2930
5808A096551r5675l5898K9378j3874R2768P1752q6809q3263j4661J42238q7818
5797A014689O375M7351L6912k1515o3542M1105N7200P3823j14129j02257j5316
5786I60696J20314m4039j12229K2844Q810m7560M6262J5964L3677O1935R699N3601
5774A129974J5787q1906j2535L8680k818N6183L0108n1041l6054M9791R3276m0526
5762A188919k37598K5905j0962p471k4193P6337o5024J881L2835l6799L8050K0440
$$ plain form
5750 1002320 1000061 983207 1036634 1091094 1104616 1048737 960574 921905 918563 1002568 995240 1043930
5738 1043930 1008712 998565 969475 943481 1095167 1019881 985706 1051181 1113605 1013829 1003904
5727 1003904 973225 978975 1035483 961410 846713 881387 937298 931542 918226 969058 950292 853687
5715 853687 935402 933495 921271 861080 834681 862296 872158 900036 959073 972093 1015944 1090627
5703 1090627 1006330 1021558 1036879 940854 1010316 992383 1061495 1064587 1106785 1078722 1152158 1131884
5691 1131884 1058061 1058009 1068871 1092296 1019356 1079929 1094646 1118571 1280505 1355290 1235650 1242493
5679 1242493 1202320 1185299 1093972 1061239 1046551 1150265 1246726 1286029 1261347 1228123 1269201
5668 1269201 1331218 1348228 1381514 1343838 1338386 1288688 1285381 1346705 1291665 1375353 1402938 1472176
$$ packed form
5750A002320k259j6854N3427N4460J3522n5879q8163l8669l342Q4005p328M8690
5738A043930l5218j0147k9090k5994J51686p5286l4175O5475O2424r9776r925
5727A003904l0679N750N6508p4073j14697L4674N5911n756j3316N0832j8766r6605
5715H53687Q1715j907j2224o0191k6399K7615R862K7878N9037J3020M3851P4683
5703A090627q4297J5228J5321r6025O9462j7933O9112L092M2198k8063P3436k0274
5691A131884p3823n2J0862K3425p2940O0573J4717K3925J61934P4785j19640O843
5679A242493m0173j7021r1327l2733j4688J03714R6461L9303k4682l3224M1078
5668A269201O2017J7010L3286l7676n452m9698l307O1324n5040Q3688K7585O9238
$$ plain form
5656 1472176 1501904 1500322 1481323 1521490 1477154 1537906 1582824 1544370 1588972 1580634 1647045 1666532
5644 1666532 1661711 1699885 1637611 1633962 1736912 1791435 1767103 1716377 1877163 1988329 1975333
5633 1975333 1958846 1975067 1886656 1879401 1969592 2001614 1965595 2052205 2035628 2166256 2203129
5622 2203129 2176866 2281411 2284984 2340663 2410801 2438014 2516308 2619897 2671384 2664266 2725340
5611 2725340 2770565 2870546 2917781 2967248 2987001 3106541 3194924 3193131 3325098 3421007 3493440
5600 3493440 3524534 3570550 3645494 3697017 3751209 3812380 3875056 4008315 4088825 4191509 4254497
5589 4254497 4362961 4437931 4514605 4708726 4944277 5111678 5175773 5366860 5542029 5795122
5579 5795122 5956099 6077589 6280594 6494063 6597531 6839437 7098606 7277546 7454341 7711501
$$ packed form
5656A472176K9728j582j8999M0167m4336O0752M4918l8454M4602q338O6411J9487
5644A666532m821L8174o2274l649J02950N4523k4332n0726J60786J11166j2996
5633A975333j6487J6221q8411p255R0191L2022l6019Q6610j6577J30628L6873
5622B203129k6263J04545L573N5679P0138K7213P8294J03589N1487p118O1074
5611B725340M5225R9981M7235M9467J9753J19540Q8383j793J31967R5909P2433
5600C493440L1094M6016P4944N1523N4192O1171O2676J33259Q0510J02684O2988
5589D254497J08464P4970P6674J94121K35551J67401O4095J91087J75169K53093
5579E795122J60977J21490K03005K13469J03468K41906K59169J78940J76795K57160
$$ plain form
5569 7711501 7868255 7932618 8156269 8346444 8536474 8711322 8976276 9339047 9557415 9794487
5559 9794487 10110373 10515779 10916310 11132606 11524138 11886287 12313242 12718026 13232243 13802430
5549 13802430 14443237 15105481 15858512 16777050 17688316 18759766 19988302 21234547 22640561
5540 22640561 24307037 26138806 28092311 30316346 32870653 35872392 39240772 43004946
5532 43004946 46977373 51336456 55342310 58001190 57967349 55682946 52024357 48163344
5524 48163344 44726519 41709366 39345898 37653640 36427683 35654676 35421611 35461318 35967540
5515 35967540 36866270 38174162 39875231 41920538 44288180 47204938 50604360 54742873
5507 54742873 59496908 64896146 71264783 78679785 87151490 95312802 99897240 98370332
$$ packed form
5569G711501J56754O4363K23651J90175J90030J74848K64954L62771K18368K37072
5559I794487L15886M05406M00531K16296L91532L62149M26955M04784N14217N70187
5549A3802430O40807O62244P53031R18538R11266J071450J228536J246245J406014
5540B2640561J666476J831769J953505K224035K554307L001739L368380L764174
5532D3004946L972427M359083M005854K658880l3841k284403l658589l861013
5524D8163344l436825l017153k363468j692258j225957p73007k33065L9707N06222
5515C5967540Q98730J307892J701069K045307K367642K916758L399422M138513
5507E4742873M754035N399238O368637P415002Q471705Q161312M584438j526908
$$ plain form
5499 98370332 91681685 82874155 73850515 65807910 59048246 53400409 48783023 45055961
5491 45055961 42019299 39619420 37926461 36503163 35405299 34652066 34292571 34285686 34475416
5482 34475416 35015460 35896645 37087857 38618561 40427379 42675066 45244546 47964794
5474 47964794 50590257 52151275 51778344 49385860 45543034 41407366 37464072 34077898
5466 34077898 31097058 28633895 26616307 24721039 23120855 21356645 19846033 18430782
5458 18430782 17317796 16362139 15575314 14771965 14102558 13568254 13179594 12978778 12661227
5449 12661227 12342040 12027571 11818122 11613417 11202709 11026583 10854605 10647080 10566787 10449088
5439 10449088 10186153 9924242 9635664 9284715 8865244 8460000 8183382 7967106 7769781
$$ packed form
5499I8370332o688647q807530r023640q042605o759664n647837m617386l727062
5491D5055961l036662k399879j692959j423298j097864p53233l59495o885J89730
5482C4475416N40044Q81185J191212J530704J808818K247687K569480K720248
5474D7964794K625463J561018l72931k392484l842826m135668l943294l386174
5466C4077898k980840k463163k017588j895268j600184j764210j510612j415251
5458A8430782j112986r55657p86825q03349o69407n34304l88660k00816l17551
5449A2661227l19187l14469k09449k04705m10708j76126j71978k07525q0293j17699
5439A0449088k62935k61911k88578l50949m19471m05244k76618k16276j97325
$$ plain form
5430 7769781 7486523 7305578 7116667 6880817 6708018 6707767 6582126 6376016 6313154 6238842
5420 6238842 6166443 6160306 6024199 5946132 5840417 5892234 5798759 5748779 5669166 5603548 5567283
5409 5567283 5618001 5627420 5590033 5630251 5632510 5662923 5517701 5358574 5312291 5308279 5244967 5204260
5397 5204260 5179453 5176965 5189477 5297505 5274743 5403328 5354364 5401968 5425705 5456484 5555138
5386 5555138 5736511 5861431 5865702 5864864 5829180 5811410 5746446 5684810 5687600 5785128 5725240 5798794
5374 5798794 5811582 5678484 5733741 5903503 6022877 5946862 5857739 5944623 5984091 6080960 6221270
5363 6221270 6336573 6518586 6718807 6964196 7131116 7385933 7650404 7994225 8389380 8598866
5353 8598866 8842480 9186719 9477680 9996178 10562962 11128722 11705021 12154630 12591219 12715209
$$ packed form
5430G769781k83258j80945j88911k35850j72799k51j25641k06110o2862p4312
5420F238842p2399o137j36107p8067j05715N1817r3475m9980p9613o5618l6265
5409E567283N0718R419l7387M0218K259L0413j45222j59127m6283m012o3312m0707
5397E204260k4807k488J2512J08028k2762J28585m8964M7604K3737L0779R8654
5386E555138J81373J24920M271q38l5684j7770o4964o1636K790R7528n9888P3554
5374E798794J2788j33098N5257J69762J19374p6015q9123Q6884L9468R6869J40310
5363F221270J15303J82013K00221K45389J66920K54817K64471L43821L95155K09486
5353H598866K43614L44239K90961N18498N66784N65760N76299M49609M36589J23990
$$ plain form
5343 12715209 12472447 12053201 11573630 11092199 10753314 10556774 10391532 10351197 10310451 10487046
5333 10487046 10649632 10851702 11126315 11402694 11823184 12113926 12614435 13235667 13932661
5324 13932661 14805808 15745142 16760323 17868465 19044370 19927969 20095410 19700972 18676244
5315 18676244 17334087 16066452 14963043 14089805 13366738 12685287 12326481 11945605 11735754
5306 11735754 11513255 11490394 11572949 11679021 11843405 12040576 12235119 12447974 12674903 12812634
5296 12812634 13068260 13309772 13814379 14276516 14581367 14629960 14337331 13810360 13170657 12584537
5286 12584537 12010546 11705697 11341847 11219488 10928097 10625559 10646209 10695404 10719920 10766515
5276 10766515 10707720 10664324 10735209 10775828 10802725 11033626 11172689 11205612 11442181 11514851 11673556
$$ packed form
5343A2715209k42762m19246m79571m81431l38885j96540j65242m0335m0746J76595
5333A0487046J62586K02070K74613K76379M20490K90742N00509O21232O96994
5324A3932661Q73147R39334J015181J108142J175905Q83599J67441l94438j024728
5315A8676244j342157j267635j103409q73238p23067o81451l58806l80876k09851
5306A1735754k22499k2861Q2555J06072J64384J97171J94543K12855K26929J37731
5296A2812634K55626K41512N04607M62137L04851M8593k92629n26971o39703n86120
5286A2584537n73991l04849l63850j22359k91391l02538K0650M9195K4516M6595
5276A0766515n8795m3396P0885M0619K6897K30901J39063L2923K36569P2670J58705
$$ plain form
5265 11673556 11958486 12217648 12409578 12674232 12874060 12968714 13096576 13417725 13646383 13918495
5255 13918495 14017650 14289940 14744402 15096022 15463081 15793189 16156047 16480591 16762910 17107314
5245 17107314 17406229 17660020 17995863 18510148 18914950 19311993 19877497 20278108 20779864
5236 20779864 21341089 21953274 22477983 23055551 23726277 24415719 25055874 25901691 26682250
5227 26682250 27503755 28569788 29476666 30620896 31862825 33061067 34223241 35398910
5219 35398910 36422055 37461014 38468404 39582752 40830113 42089527 43323512 44519537
5211 44519537 45865363 47368111 48930377 50865148 53038071 55333988 57691502 60131423
5203 60131423 62406512 64895439 67775480 70501601 72937491 75327959 78090073 81503565
$$ packed form
5265A1673556K84930K59162J91930K64654J99828R4654J27862L21149K28658K72112
5255A3918495R9155K72290M54462L51620L67059L30108L62858L24544K82319L44404
5245A7107314K98915K53791L35843N14285M04802L97043N65504M00611N01756
5236B0779864N61225O12185N24709N77568O70726O89442O40155Q45817P80559
5227B6682250Q21505J066033R06878J144230J241929J198242J162174J175669
5219C5398910J023145J038959J007390J114348J247361J259414J233985J196025
5211D4519537J345826J502748J562266J934771K172923K295917K357514K439921
5203F0131423K275089K488927K880041K726121K435890K390468K762114L413492
$$ plain form
5195 81503565 85478689 89102973 92293811 95549459 99402591 104188428 110251279 117469294
5187 117469294 126132415 136166396 147541079 160353561 174254343 189368756 204996587
5180 204996587 220122054 234929698 250083670 264943563 277002882 284270818 286197621
5173 286197621 282248778 272961066 260210531 245798675 229982367 212848443 195542758
5166 195542758 179221496 164617621 152130806 141815082 133666845 127448891 123265622
5159 123265622 120757305 119766349 119712832 119733978 119147171 118113590 117180363 116986510 118029175
5150 118029175 120458235 124204762 128644607 132204234 133086722 131142224 126984790 120905958
5142 120905958 112858822 104092385 95915691 88760559 82799847 77889806 74028030 70860292
$$ packed form
5195H1503565L975124L624284L190838L255648L853132M785837O062851P218015
5187A17469294Q663121J0033981J1374683J2812482J3900782J5114413J5627831
5180B04996587J5125467J4807644J5153972J4859893J2059319P267936J926803
5173B86197621l948843r287712j2750535j4411856j5816308j7133924j7305685
5166A95542758j6321262j4603875j2486815j0315724q148237o217954m183269
5159A23265622k508317r90956n3517K1146n86807j033581r33227j93853J042665
5150A18029175K429060L746527M439845L559627Q82488j944498m157434o078832
5142A20905958q047136q766437q176694p155132n960712m910041l861776l167738
$$ plain form
5134 70860292 68355622 66270359 64443657 63072834 62106746 61565700 61447244 61731979 62476740
5125 62476740 63663317 65245314 67225666 68952561 69359764 67510073 63437029 58197555
5117 58197555 52939144 48219514 44105640 40562154 37447144 34638237 32300034 30269609
5109 30269609 28572483 27018885 25606353 24454344 23408048 22473388 21588171 20694267 19813106
5100 19813106 18969373 18199636 17462239 16862907 16316551 15861784 15317463 14748087 14335818
5091 14335818 13968248 13514809 13169295 12782405 12422444 12110682 11838936 11554848 11239009
5082 11239009 11044205 10843043 10650804 10524139 10346788 10166191 9957148 9978028 9894064 9740731
5072 9740731 9684380 9582916 9455917 9393924 9273905 9196835 9413162 9466164 9373349 9217893
$$ packed form
5134G0860292k504670k085263j826702j370823r66088n41046j18456K84735P44761
5125F2476740J186577J581997J980352J726895M07203j849691m073044n239474
5117E8197555n258411m719630m113874l543486l115010k808907k338203k030425
5109C0269609j697126j553598j412532j152009j046296r34660q85217q93904q81161
5100A9813106q43733p69737p37397n99332n46356m54767n44321n69376m12269
5091A4335818l67570m53439l45514l86890l59961l11762k71746k84088l15839
5082A1239009j94804k01162j92239j26665j77351j80597k09043K0880q3964j53333
5072I740731n6351j01464j26999o1993j20019p7070K16327N3002r2815j55456
$$ plain form
5062 9217893 9268256 9414906 9426199 9315865 9152201 9019512 8938891 8883162 8858099 8810362 8794417
5051 8794417 8776329 8907223 8956685 9091147 9309131 9392322 9501411 9470966 9359223 9349661 9438380
5040 9438380 9517037 9812070 10015917 10261299 10644599 11144207 11656836 12222196 12883402 13734934
5030 13734934 14584396 15639162 16924648 18380308 19818236 21530881 23442546 25853273
5022 25853273 28533890 30686359 31092920 29256984 26321660 23061238 20257434 17859921
5014 17859921 16059691 14666380 13494950 12405772 11674778 11103625 10712110 10322403 9806474
5005 9806474 9308253 8915035 8475990 8021848 7681655 7356262 7090616 6821972 6628088 6550008
4995 6550008 6428343 6476563 6461780 6221059 6108095 6034544 5982916 5975949 5936216 5981027 5966007
$$ packed form
5062I217893N0363J46650J1293j10334j63664j32689q0621n5729k5063m7737j5945
5051H794417j8088J30894M9462J34462K17984Q3191J09089l0445j11743r562Q8719
5040I438380P8657K95033K03847K45382L83300M99608N12629N65360O61206Q51532
5030A3734934Q49462J054766J285486J455660J437928J712645J911665K410727
5022B5853273K680617K152469M06561j835936k935324l260422k803804k397513
5014A7859921j800230j393311j171430j089178p30994n71153l91515l89707n15929
5005I806474m98221l93218m39045m54142l40193l25393k65646k68644j93884p8080
4995F550008j21665M8220j4783k40721j12964p3551n1628o967l9733M4811j5020
$$ plain form
4984 5966007 6042610 6081678 6214513 6338592 6485814 6741414 7085263 7514372 8021038 8389758
4974 8389758 8465356 8172544 7540346 6966814 6275929 5775625 5411447 5059435 4786404 4622349
4964 4622349 4437747 4189731 4122083 4100659 4068948 3916436 3984619 3977814 3921482 3961645 3963443
4953 3963443 4121330 4374485 4333588 4520116 4743396 4952284 5254781 5506341 5977660 6647432
4943 6647432 7186534 7297946 7102682 6560123 5908614 5256568 4852327 4495889 4067927 3732580
4933 3732580 3502243 3324702 3246470 3030594 2923588 2999457 2859992 2761383 2714941 2585380
4923 2585380 2513737 2514317 2656690 2680485 2705154 2713837 2714462 2881977 2971935 3001816 3172712 3282331
4911 3282331 3465653 3635212 3646379 3468870 3159093 3022306 2838732 2638417 2538442 2511976
$$ packed form
4984E966007P6603L9068J32835J24079J47222K55600L43849M29109N06666L68720
4974H389758P5598k92812o32198n73532o90885n00304l64178l52012k73031j64055
4964D622349j84602k48016o7648k1424l1711j52512O8183o805n6332M0163J798
4953C963443J57887K53155m0897J86528K23280K08888L02497K51560M71319O69772
4943F647432N39102J11412j95264n42559o51509o52046m04241l56438m27962l35347
4933C732580k30337j77541p8232k15876j07006P5869j39465r8609m6442j29561
4923B585380p1643N80J42373K3795K4669Q683O25J67515Q9958K9881J70896J09619
4911C282331J83322J69559J1167j77509l09777j36787j83574k00315r9975k6466
$$ plain form
4901 2511976 2444630 2418609 2361640 2342692 2148103 2037637 2105852 2184616 2102979 1929643 1974872
4890 1974872 1949043 1874393 1905091 1926298 1940779 1914761 1846176 1758101 1740572 1800923 1882987
4879 1882987 2053203 1939520 1847230 1846919 1949952 2087089 2110056 2118588 2083812 2269616 2326809
4868 2326809 2294321 2236777 2295170 2520841 2673213 2705141 2563061 2537330 2421366 2351039 2274633
4857 2274633 2197231 2127809 2126610 2147029 2149727 2110475 2127197 2189108 2089287 1927119 2001649 1980213
4845 1980213 2102134 2137604 2000068 1923969 1883878 1899483 1914076 1947605 1958512 1884729 1796595
4834 1796595 1912988 1916987 1960689 1955053 1985185 2051506 2052630 1994027 1999529 1969572 1779687 1841062
4822 1841062 1870076 1805885 1641534 1620485 1467201 1451450 1418123 1410961 1402559 1271258 1311919
$$ packed form
4901B511976o7346k6021n6969j8948j94589j10466O8215P8764q1637j73336M5229
4890A974872k5829p4650L0698K1207J4481k6018o8585q8075j7529O0351Q2064
4879A882987J70216j13683r2290l11J03033J37137K2967Q532l4776J85804N7193
4868B326809l2488n7544N8393K25671J52372L1928j42080k5731j15964p0327p6406
4857B274633p7402o9422j199K0419K698l9252J6722O1911r9821j62168P4530k1436
4845A980213J21921L5470j37536p6099m0091J5605J4593L3529J0907p3783q8134
4834A796595J16393L999M3702n636L0132O6321J124n8603N502k9957j89885O1375
4822A841062K9014o4191j64351k1049j53284j5751l3327p162q402j31301M0661
$$ plain form
4811 1311919 1262826 1234530 1352353 1337991 1260781 1264001 1084237 1161157 1261219 1329434 1300141
4800 1300141 1267165 1303611 1275200 1241923 1158346 1233971 1167356 1159123 1038089 1028199 1039256 1062853
4788 1062853 1022207 974320 887570 804482 974126 998114 1087144 969034 901540 954650 1028420
4777 1028420 995046 1059192 1149992 1163142 1168546 1139936 1105581 1199689 1148546 1130337 1068328 1072076
4765 1072076 1173045 1139585 1079612 1224758 1277996 1200057 1126206 1161855 1285391 1370526 1416438
4754 1416438 1365120 1229468 1187239 1158552 998086 969434 1003798 980378 1002124 1050953 1076012
4743 1076012 1145348 1177925 1227009 1188341 1140605 1116303 1076845 1172003 1253926 1375930 1290225
4732 1290225 1458270 1511724 1477138 1363706 1333287 1310827 1202196 1072248 1048497 966170 858719
$$ packed form
4811A311919m9093k8296J17823j4362p7210L220j79764P6920J00062O8215k9293
4800A300141l2976L6446k8411l3277q3577P5625o6615q233j21034r890J1057K3597
4788A062853m0646m7887q6750q3088J69644K3988Q9030j18110o7494N3110P3770
4777A028420l3374O4146R0800J3150N404k8610l4355R4108n1143j8209o2009L748
4765A072076J00969l3460n9973J45146N3238p7939p3851L5649J23536Q5135M5912
4754A416438n1318j35652m2229k8687j60466k8652L4364k3420K1746M8829K5059
4743A076012O9336L2577M9084l8668m7736k4302l9458R5158Q1923J22004q5705
4732A290225J68045N3454l4586j13432l0419k2460j08631j29948k3751q2327j07451
$$ plain form
4721 858719 963291 963485 1056520 1030078 924303 863402 833451 758820 770891 805053 849359 931161
4709 931161 1011251 884142 894233 915212 886891 831741 824010 775917 884793 974435 821215
4698 821215 852066 895433 915485 908609 859101 782401 730692 796187 867546 892023 985420 938571
4686 938571 827163 877640 862850 813129 891869 923630 779234 761518 760996 866810 813901
4675 813901 845826 942481 868563 892589 963433 919209 914686 889425 839201 868970 778018 860735
4663 860735 880531 922363 826967 842483 940469 991017 916720 867016 889068 896642 941512 914778
4651 914778 972974 922608 918217 948462 913157 901191 996139 926646 963770 966665 859218 972517
4639 972517 1041504 1052816 1128193 1203165 1158187 1067581 1124723 1168591 1152371 1027133 1107969
$$ packed form
4721H58719J04572J94R3035k6442j05775o0901k9951p4631J2071L4162M4306Q1802
4709I31161Q0090j27109J0091K0979k8321n5150p731m8093J08876Q9642j53220
4698H21215L0851M3367K0052o876m9508p6700n1709O5495P1359K4477R3397m6849
4686I38571j11408N0477j4790m9721P8740L1761j44396j7716n22J05814n2909
4675H13901L1925R6655p3918K4026P0844m4224m523k5261n0224K9769r0952Q2717
4663H60735J9796M1832r5396J5516R7986N0548p4297m9704K2052P574M4870k6734
4651I14778N8196n0366m391L0245l5305j1966R4948o9493L7124K895j07447J13299
4639I72517O8987J1312P5377P4972m4978r0606N7142M3868j6220j25238Q0836
$$ plain form
4628 1107969 1132326 1095116 1084817 1147621 1183759 1231199 1207574 1253035 1261703 1314096 1286236 1268091
4616 1268091 1371183 1355288 1350904 1463078 1459707 1405435 1414332 1393506 1523705 1466886 1507396
4605 1507396 1555686 1634767 1611933 1567423 1584401 1653814 1635401 1659497 1750203 1769417 1817494
4594 1817494 1931687 1937153 2009846 2089285 2081021 2127978 2218372 2306662 2261067 2299535 2312456 2401247
4582 2401247 2392093 2446179 2574553 2663454 2765357 3046588 3074112 3108784 3199684 3277808 3388521
4571 3388521 3487697 3532832 3548431 3629109 3827947 3918147 4037393 4208008 4398091 4610488
4561 4610488 4944165 5373753 5574436 5741813 6027150 6419454 6719786 7181041 7805042 8590876
4551 8590876 9435412 10238495 11320743 12940927 14787862 16373228 16419365 15240661 13241387
$$ packed form
4628A107969K4357l7210j0299O2804L6138M7440k3625M5461Q668N2393k7860j8145
4616A268091J03092j5895m384J12174l371n4272Q897k0826J30199n6819M0510
4605A507396M8290P9081k2834m4510J6978O9413j8413K4096R0706J9214M8077
4594A817494J14193N466P2693P9439q264M6957R0394Q8290m5595L8468J2921Q8791
4582B401247r154N4086J28374Q8901J01903K81231K7524L4672R0900P8124J10713
4571C388521R9176M5135J5599Q0678J98838R0200J19246J70615J90083K12397
4561D610488L33677M29588K00683J67377K85337L92304L00332M61255O24001P85834
4551H590876Q44536Q03083J082248J620184J846935J585366M6137j178704j999274
$$ plain form
4542 13241387 11389728 9940085 8768337 7942768 7388400 6846264 6537952 6334367 6206457
4533 6206457 6039283 5877441 5832219 5725784 5801267 5795192 5790037 5842979 5932442 5952762 5982964
4522 5982964 5974202 6031844 6147429 6199599 6193195 6342929 6351940 6346028 6526275 6613644 6728043
4511 6728043 6886210 7011274 7178115 7351528 7546054 7748271 7893290 8112747 8153446 8273082
4501 8273082 8450609 8560500 8677502 8878862 9108976 9213761 9137921 9308205 9523181 9681292
4491 9681292 9865353 10174984 10396937 10681290 11028036 11346741 11742066 12062124 12382994 12731457
4481 12731457 13312822 13769185 14307170 14816084 15447727 16144568 16827503 17633369 18562542
4472 18562542 19615212 20636067 21795277 23058105 24453713 26034947 27787436 29841090
$$ packed form
4542A3241387j851659j449643j171748q25569n54368n42136l08312k03585j27910
4533F206457j67174j61842m5222j06435P5483o075n155N2942Q9463K0320L0202
4522E982964q762N7642J15585N2170o404J49734R011n912J80247Q7369J14399
4511F728043J58167J25064J66841J73413J94526K02217J45019K19457M0699J19636
4501H273082J77527J09891J17002K01360K30114J04785p5840J70284K14976J58111
4491I681292J84061L09631K21953K84353L46746L18705L95325L20058L20870L48463
4481A2731457N81365M56363N37985N08914O31643O96841O82935Q05866R29173
4472A8562542J052670J020855J159210J262828J395608J581234J752489K053654
$$ plain form
4464 29841090 32068829 34682311 37646894 40873858 44427380 48286927 51850170 54303942
4456 54303942 54803990 53295457 50478111 47382054 44602023 42423201 40966682 39950135
4448 39950135 39427817 39359385 39757817 40681563 41866369 43142205 44627366 46667465 49168208
4439 49168208 51964357 55693330 60042844 64840807 70068849 75060127 78869458 80929933
4431 80929933 80498924 77074614 71487363 64943002 58688846 53224401 48747437 45238503
4423 45238503 42433495 40251709 38621505 37305502 36011156 35109638 34523241 34237077 34462483
4414 34462483 35004800 35919485 37288129 39040098 40882607 43048646 44719607 45272966 44024682
4405 44024682 40939640 37111720 33201877 29605227 26506128 23852593 21683411 19711760
$$ packed form
4464B9841090K227739K613482K964583L226964L553522L859547L563243K453772
4456E4303942N00048j508533k817346l096057k780031k178822j456519j016547
4448C9950135n22318o8432L98432R23746J184806J275836J485161K040099K500743
4439D9168208K796149L728973M349514M797963N228042M991278L809331K060475
4431H0929933m31009l424310n587251o544361o254156n464445m476964l508934
4423D5238503k805008k181786j630204j316003j294346r01518n86397k86164K25406
4414C4462483N42317R14685J368644J751969J842509K166039J670961N53359j248284
4405D4024682l085042l827920l909843l596650l099099k653535k169182j971651
$$ plain form
4397 19711760 18100740 16687354 15413633 14296877 13356138 12565755 11848750 11236189 10632991
4388 10632991 10121542 9662979 9228680 8853816 8603776 8260408 7875163 7563076 7297665
4379 7297665 7044444 6784646 6644798 6417035 6251054 6070411 5824371 5645155 5549357 5502400
4369 5502400 5405629 5293514 5175437 5019696 4749598 4614526 4486126 4393483 4447484 4480072
4359 4480072 4324145 4257786 4270628 4263939 4210057 4196631 4252715 4244408 4251937 4345481 4320560 4284261
4347 4284261 4346958 4439591 4522166 4611527 4574256 4493485 4366844 4152880 4053637 3974861 4006958
4336 4006958 3865983 3802474 3769676 3700309 3819808 3903671 3870847 3894969 3935077 4014003 4103951
4325 4103951 4151794 4237917 4318149 4386643 4318486 4235257 4243370 4192471 3985827 3878771 3727278
$$ packed form
4397A9711760j611020j413386j273721j116756r40739p90383p17005o12561o03198
4388A0632991n11449m58563m34299l74864k50040l43368l85245l12087k65411
4379G297665k53221k59798j39848k27763j65981j80643k46040j79216r5798m6957
4369E502400r6771j12115j18077j55741k70098j35072j28400r2643N4001L2588
4359D480072j55927o6359J2842o689n3882j3426N6084q307P529R3544k4921l6299
4347D284261O2697R2633Q2575Q9361l7271q0771j26641k13964r9243p8776L2097
4336D006958j40975o3509l2798o9367J19499Q3863l2824K4122M0108P8926Q9948
4325D103951M7843Q6123Q0232O8494o8157q3229Q113n0899k06644j07056j51493
$$ plain form
4314 3727278 3544092 3370402 3190932 2975416 2960090 2962108 2844394 2806023 2821087 2785186 2690173
4303 2690173 2690082 2664861 2690690 2766175 2839057 2832300 2820556 2713853 2644195 2627216 2492650 2319355
4291 2319355 2213824 2052203 1927389 1896171 1702713 1771908 1663599 1696288 1716145 1731243
4281 1731243 1623143 1612586 1573287 1565331 1559885 1408189 1447196 1445407 1365449 1346836 1283368 1266716
4269 1266716 1231958 1220180 1187911 1091864 1068961 1041446 1118117 1177446 1139085 1179102 1174480 1143719
4257 1143719 1038479 980667 1021549 1058999 1059794 1081217 1045854 1030840 993117 1092621 1213695
4246 1213695 1073967 972152 967476 987740 917789 891951 960778 1036507 1023436 969536 968337
4235 968337 1032634 907423 976484 1020993 996184 989244 977474 948571 947601 904561 941636 891430
$$ packed form
4314C727278j83186j73690j79470k15516j5326K018j17714l8371J5064l5901r5013
4303B690173r1k5221K5829P5485P2882o757j1744j06703o9658j6979j34566j73295
4291B319355j05531j61621j24814l1218j93458O9195j08309L2689J9857J5098
4281A731243j08100j0557l9299p956n446j51696L9007j789p9958j8613o3468j6652
4269A266716l4758j1778l2269r6047k2903k7515P6671N9329l8361M0017m622l0761
4257A143719j05240n7812M0882L7450P95K1423l5363j5014l7723R9504J21074
4246A213695j39728j01815m676K0264o9951k5838O8827P5729j3071n3900j199
4235I68337O4297j25211O9061M4509k4809o940j1770k8903r70m3040L7075n0206
$$ plain form
4223 891430 958797 1005197 935664 913296 1044309 1303790 1098776 987830 988172 972508 993082
4212 993082 879769 963516 1018393 1068366 1102940 1161663 1001546 990676 981140 981281 1067786 1140238
4200 1140238 1116337 1175944 1158023 1174153 1150432 1074631 1171104 1144031 1129491 1226282 1145298
4189 1145298 1153797 1190173 1178868 1216465 1404925 1392567 1239571 1246624 1442281 1429583 1344137
4178 1344137 1229304 1201491 1288386 1387513 1337796 1329408 1417217 1463104 1527129 1446309 1458236
4167 1458236 1396437 1419138 1464401 1609313 1638080 1502713 1461054 1501703 1453650 1506197 1642831
4156 1642831 1733890 1582232 1618448 1626785 1640425 1558680 1584267 1518677 1570615 1512040 1338956
4145 1338956 1453662 1450869 1480487 1454216 1419445 1521482 1571447 1517375 1583716 1441281 1336216
$$ packed form
4223H91430O7367M6400o9533k2368J31013K59481k05014j10946L42j5664K0574
4212I93082j13313Q3747N4877M9973L4574N8723j60117j0870r536J41Q6505P2452
4200A140238k3901N9607j7921J6130k3721p5801R6473k7073j4540R6791q0984
4189A145298Q499L6376j1305L7597J88460j2358j52996P053J95657j2698q5446
4178A344137j14833k7813Q6895R9127m9717q388Q7809M5887O4025q0820J1927
4167A458236o1799K2701M5263J44912K8767j35367m1659M0649m8053N2547J36634
4156A642831R1059j51658L6216Q337J3640q1745K5587o5590N1938n8575j73084
4145A338956J14706k793K9618k6271l4771J02037M9965n4072O6341j42435j05065
$$ plain form
4134 1336216 1389197 1338247 1423533 1573372 1578691 1640144 1531601 1423441 1398868 1447520 1485497
4123 1485497 1410847 1468802 1363867 1342337 1331956 1325675 1367072 1466915 1358514 1279485 1335904
4112 1335904 1310634 1402892 1374624 1331061 1428028 1384738 1395699 1484682 1539283 1467430 1422824
4101 1422824 1365525 1210298 1254728 1354889 1332544 1283615 1316599 1397515 1405077 1408068 1399528 1363382
4089 1363382 1400566 1371666 1369341 1407714 1418101 1397870 1304174 1248776 1333915 1419873 1366403 1355839
4077 1355839 1302672 1260517 1329231 1368815 1441257 1518677 1467238 1510955 1528056 1547148 1505147
4066 1505147 1490594 1389471 1400661 1553009 1555658 1558518 1577842 1459006 1492401 1522049 1526122
4055 1526122 1618109 1670636 1555738 1693485 1716568 1659759 1665164 1687983 1785642 1781412 1805517
$$ packed form
4134A336216N2981n0950Q5286J49839N319O1453j08543j08160k4573M8652L7977
4123A485497p4650N7955j04935k1530j0381o281M1397R9843j08401p9029N6419
4112A335904k5270R2258k8268m3563R6967m3290J0961Q8983N4601p1853m4606
4101A422824n7299j55227M4430J00161k2345m8929L2984Q0916P562K991q540l6146
4089A363382L7184k8900k325L8373J0387k0231r3696n5398Q5139Q5958n3470j0564
4077A355839n3167m2155O8714L9584P2442P7420n1439M3717J7101J9092m2001
4066A505147j4553j01123J1190J52348K649K860J9324j18836L3395K9648M073
4055A526122R1987N2527j14898J37747K3083n6809N405K2819R7659m230K4105
$$ plain form
4044 1805517 1780020 1859228 1899939 1915419 1893093 1940915 1906231 1896720 1872244 1947224 1960352 1961581
4032 1961581 1867390 1864834 1879507 1915950 1965934 1909033 2006535 2106924 2046783 2024653 1997753
4021 1997753 2078788 2058502 2088602 2147627 2189624 2229519 2302560 2378356 2365185 2401919 2393719 2394474
4009 2394474 2438536 2516953 2522673 2461548 2613963 2667616 2660169 2669956 2652057 2679181 2893416 2896558
3997 2896558 2944531 3106002 3136888 3063894 3152529 3162641 3155650 3237794 3309311 3314615 3341868 3435397
3985 3435397 3490909 3543482 3598635 3653101 3616330 3699569 3843464 3967098 4036729 4197444 4262136
3974 4262136 4256068 4389090 4552929 4643272 4743893 4865963 5080070 5235632 5358416 5512442
3964 5512442 5731728 5800553 5979795 6192704 6286888 6454494 6554871 6594703 6767786 7052586
$$ packed form
4044A805517k5497P9208M0711J5480k2326M7822l4684r511k4476P4980J3128J229
4032A961581r4191k556J4673L6443M9984n6901R7502J00389o0141k2130k6900
4021A997753Q1035k0286L0100N9025M1997L9895P3041P5796j3171L6734q200P55
4009B394474M4062P8417N720o1125J52415N3653p447R787j7899K7124K14235L142
3997B896558M7973J61471L0886p2994Q8635J0112o991Q2144P1517N304K7253R3529
3985C435397N5512N2573N5153N4466l6771Q3239J43895J23634O9631J60715O4692
3974D262136o068J33022J63839R0343J00621J22070K14107J55562J22784J54026
3964E512442K19286O8825J79242K12909R4184J67606J00377L9832J73083K84800
$$ plain form
3954 7052586 7302361 7472576 7701681 7909468 8153048 8391821 8568637 8752199 8934663 9188386
3944 9188386 9477870 9724072 10010530 10221395 10388691 10729743 11141629 11225169 11442593 11775237
3934 11775237 12123920 12515050 12838764 13137517 13485095 13862139 14219787 14735564 15198715
3925 15198715 15568590 16028655 16526304 17090674 17727920 18300332 18891452 19590907 20312030
3916 20312030 21021752 21866399 22742893 23602864 24596690 25622013 26731279 27975413 29331896
3907 29331896 30563319 32002729 33549272 35065532 36681830 38459438 40304472 42216007
3899 42216007 44166298 46201317 48319640 50421651 52556001 54821736 57244236 59553927
3891 59553927 61948618 64387538 66855680 69328910 71866382 74398670 76840761 79332932
$$ packed form
3954G052586K49775J70215K29105K07787K43580K38773J76816J83562J82464K53723
3944I188386K89484K46202K86458K10865J67296L41052M11886Q3540K17424L32644
3934A1775237L48683L91130L23714K98753L47578L77044L57648N15777M63151
3925A5198715L69875M60065M97649N64370O37246N72412N91120O99455P21123
3916B0312030P09722Q44647Q76494Q59971R93826J025323J109266J244134J356483
3907B9331896J231423J439410J546543J516260J616298J777608J845034J911535
3899D2216007J950291K035019K118323K102011K134350K265735K422500K309691
3891E9553927K394691K438920K468142K473230K537472K532288K442091K492171
$$ plain form
3883 79332932 81626689 83831417 85905483 87817103 89662501 91298078 92944031 94360473
3875 94360473 95647611 96934006 98153575 99158936 100122230 100781152 101207742 101478771 101302852
3866 101302852 100760377 100019544 99157712 98095875 96976872 95769642 94444580 92888988
3858 92888988 91180080 89603434 87978394 85898549 83688853 81421435 78869635 76348312
3850 76348312 73677450 70980538 68347336 65697880 62969126 60461011 58086674 55666773
3842 55666773 53321075 51083485 48670613 46399288 44170575 41979725 39841826 37916493
3834 37916493 35938054 33949013 32256119 30562585 28983080 27524782 26176141 24954178
3826 24954178 23824038 22757208 21723184 20764532 19843122 18973933 18220769 17456953 16962918
$$ packed form
3883G9332932K293757K204728K074066J911620J845398J635577J645953J416442
3875I4360473J287138J286395J219569J005361R63294O58922M26590K71029j75919
3866A01302852n42475p40833q61832j061837j119003j207230j325062j555592
3858I2888988j708908j576646j625040k079845k209696k267418k551800k521323
3850G6348312k670862k696912k633202k649456k728754k508115k374337k419901
3842E5666773k345698k237590k412872k271325k228713k190850k137899j925333
3834C7916493j978439j989041j692894j693534j579505j458298j348641j221963
3826B4954178j130140j066830j034024r58652r21410q69189p53164p63816m94035
$$ plain form
3817 16962918 16350208 15801791 15311668 14888136 14609892 14139728 13707330 13448705 13134241
3808 13134241 12925934 12697827 12513062 12346112 12147630 11976161 11817815 11594578 11350914
3799 11350914 11223753 11216259 11041665 10883494 10755788 10632707 10385978 10244898 10193189 10090120
3789 10090120 10038586 9829133 9638640 9490646 9408392 9286901 9288855 9202238 8909500 8779233
3779 8779233 8587226 8519404 8482740 8374619 8128635 8006913 7794982 7845518 7776425 7633499
3769 7633499 7676113 7528587 7505237 7440016 7262215 7184694 7156622 7051852 6957127 6906355 6917098
3758 6917098 6900469 6980553 6824151 6722902 6648058 6642455 6659387 6754332 6733295 6660716 6684032
3747 6684032 6726983 6677262 6767967 6724107 6565749 6462273 6350012 6497535 6541301 6419934
$$ packed form
3817A6962918o12710n48417m90123m23532k78244m70164m32398k58625l14464
3808A3134241k08307k28107j84765j66950j98482j71469j58346k23237k43664
3799A1350914j27161p494j74594j58171j27706j23081k46729j41080n1709j03069
3789A0090120n1534k09453j90493j47994q2254j21491J954q6617k92738j30267
3779H779233j92007o7822l6664j08121k45984j21722k11931N0536o9093j42926
3769G633499M2614j47526k3350o5221j77801p7521k8072j04770r4725n0772J0743
3758F917098j6629Q0084j56402j01249p4844n603J6932R4945k1037p2579K3316
3747F684032M2951m9721R0705m3860j58358j03476j12261J47523M3766j21367
$$ plain form
3737 6419934 6346999 6330806 6361361 6196006 6097680 6111451 5977286 5953030 5827961 5726838 5702701
3726 5702701 5619073 5601314 5410113 5410230 5488635 5353194 5143886 5127772 5152802 5117876 4985192
3715 4985192 4910233 4962323 4980643 4959601 4782912 4839500 4932735 4908663 4909271 4874218 4898903 4928676
3703 4928676 4872584 4845492 4837639 4805908 4867793 4926885 4908760 4906759 4954750 4998317 4988336 5055798
3691 5055798 5141398 5101348 5101471 5085772 5047183 5113147 5101976 5110032 5076633 4981361 5153796 5300361
3679 5300361 5227652 5159388 5259788 5317060 5261735 5221647 5241272 5376712 5348816 5460608 5477034
3668 5477034 5535198 5647677 5688775 5660666 5661434 5678662 5728094 5701077 5690514 5867498 5998347
3657 5998347 6083655 6051759 6129164 6171879 6182276 6328092 6342629 6434351 6503429 6517132 6663770
$$ packed form
3737F419934p2935j6193L0555j65355r8326J3771j34165k4256j25069j01123k4137
3726E702701q3628j7759j91201J17P8405j35441k09308j6114K5030l4926j32684
3715D985192p4959N2090J8320k1042j76689N6588R3235k4072O08l5053K4685K9773
3703D928676n6092k7092p853l1731O1885N9092j8125k001M7991M3567r981O7462
3691E055798Q5600m0050J23j5699l8589O5964j1171Q056l3399r5272J72435J46565
3679E300361p2709o8264J00400N7272n5325m0088J9625J35440k7896J11792J6426
3668E477034N8164J12479M1098k8109P68J7228M9432k7017j0563J76984J30849
3657E998347Q5308l1896P7405M2715J0397J45816J4537R1722O9078J3703J46638
$$ plain form
3646 6663770 6576777 6713448 6768170 6776926 6942788 7025227 7149510 7182497 7083824 7277970 7378469
3635 7378469 7473297 7533498 7512923 7552668 7571071 7700515 7796877 7961238 8057420 8158382 8237387
3624 8237387 8457998 8613414 8693099 8689816 8806343 8962908 9108768 9220870 9333647 9532423
3614 9532423 9844355 10000220 10167903 10265688 10403636 10583434 10707404 10942800 11079715 11293815
3604 11293815 11465238 11719948 11950890 12132011 12342432 12563122 12834538 13050295 13249414
3595 13249414 13550995 13822016 14032983 14283089 14586632 14918106 15237929 15575615 16014046
3586 16014046 16313186 16755065 17184201 17520656 17921955 18442860 19126031 19616134 20193196
3577 20193196 20859203 21443405 22207223 22949113 23686447 24426035 25352157 26320857 27366723
$$ packed form
3646F663770q6993J36671N4722Q756J65862Q2439J24283L2987r8673J94146J00499
3635G378469R4828O0201k0575L9745J8403J29444R6362J64361R6182J00962P9005
3624H237387K20611J55416P9685l283J16527J56565J45860J12102J12777J98776
3614I532423L11932J55865J67683R7785J37948J79798J23970K35396J36915K14100
3604A1293815J71423K54710K30942J81121K10421K20690K71416K15757J99119
3595A3249414L01581K71021K10967K50106L03543L31474L19823L37686M38431
3586A6014046K99140M41879M29136L36455M01299N20905O83171M90103N77062
3577B0193196O66007N84202P63818P41890P37334P39588R26122R68700J045866
$$ plain form
3568 27366723 28487551 29620229 30711151 31920033 33222609 34393197 35589746 36664683
3560 36664683 37911945 39229431 40407636 41538901 42732285 43890751 45097982 46224865
3552 46224865 47343248 48522225 49607340 50779161 51894930 52804410 53557869 54117852 54554722
3543 54554722 54788203 55061741 55279122 55665734 55936303 56348535 56912749 57340403 57852873
3534 57852873 58402884 59022570 59502165 60057023 60682261 61306598 61935053 62601775 63596386
3525 63596386 64618282 65741715 67181004 68759727 70580889 72643721 74849957 77370817
3517 77370817 80147356 83171465 86416849 89805046 93605859 97431167 101646497 106014317
3509 106014317 110595310 115358395 120107972 124956499 129959886 134817210 139658672 144621584
$$ packed form
3568B7366723J120828J132678J090922J208882J302576J170588J196549J074937
3560C6664683J247262J317486J178205J131265J193384J158466J207231J126883
3552D6224865J118383J178977J085115J171821J115769R09480P53459N59983M36870
3543E4554722K33481K73538K17381L86612K70569M12232N64214M27654N12470
3534E7852873N50011O19686M79595N54858O25238O24337O28455O66722R94611
3525F3596386J021896J123433J439289J578723J821162K062832K206236K520860
3517G7370817K776539L024109L245384L388197L800813L825308M215330M367820
3509A06014317M580993M763085M749577M848527N003387M857324M841462M962912
$$ plain form
3501 144621584 149533311 154465763 159501307 164504194 169522310 174511719 179448127 184305524
3493 184305524 188990207 193391099 197582188 201489843 205085346 208489596 211841093 215169094
3485 215169094 218512490 221894019 225427057 229147011 232889632 236618357 240259099 243974375
3477 243974375 247708757 251570653 255506674 260050140 265147965 271016660 277834209 285478930
3469 285478930 293879848 303468099 313952480 325335254 337493154 349892209 362179092
3462 362179092 373579470 383629287 391424694 396416957 398531054 397723283 394502584 389605771
3454 389605771 383723415 377639021 371857053 366405629 361358001 356462608 351113173 345078219
3446 345078219 337582151 327963876 315761053 301122069 284365064 266166762 247656367
$$ packed form
3501A44621584M911727M932452N035544N002887N018116M989409M936408M857397
3493A84305524M684683M400892M191089L907655L595503L404250L351497L328001
3485B15169094L343396L381529L533038L719954L742621L728725L640742L715276
3477B43974375L734382L861896L936021M543466N097825N868695O817549P644721
3469B85478930Q400918R588251J0484381J1382774J2157900J2399055J2286883
3462C62179092J1400378J0049817P795407M992263K114097q07771l220699m896813
3454C89605771n882356o084394n781968n451424n047628m895393n349435o034954
3446C45078219p496068r618275j2202823j4638984j6757005j8198302j8510395
$$ plain form
3439 247656367 229351908 211955627 195944635 181755193 169237619 158251530 148786666
3432 148786666 140332057 132945692 126380618 120527817 115459205 110985313 106946133 103513956
3424 103513956 100396514 97512391 94880974 92480024 90327993 88351170 86383912 84508884
3416 84508884 82756100 81054394 79270594 77514845 75804830 74170861 72589606 70845440
3408 70845440 69278924 67700450 66042955 64417091 62769094 61094243 59439085 57684716
3400 57684716 56109859 54616230 53223266 51790268 50423956 49158168 47891117 46573790
3392 46573790 45282534 44027214 42809722 41426299 40114658 38972558 37697789 36605939
3384 36605939 35551878 34659079 33720633 32886044 32046362 31176770 30539940 29944503 29373328
$$ packed form
3439B47656367j8304459j7396281j6010992j4189442j2517574j0986089r464864
3432A48786666q454609p386365o565074n852801n068612m473892m039180l432177
3424A03513956l117442k884123k631417k400950k152031j976823j967258j875028
3416H4508884j752784j701706j783800j755749j710015j633969j581255j744166
3408G0845440j566516j578474j657495j625864j647997j674851j655158j754369
3400E7684716j574857j493629j392964j432998j366312j265788j267051j317327
3392D6573790j291256j255320j217492j383423j311641j142100j274769j091850
3384C6605939j054061q92799r38446q34589q39682q69592o36830n95437n71175
$$ plain form
3375 29373328 28734355 28227508 27751215 27313437 26936467 26506463 26209177 25945763 25723866
3366 25723866 25416132 25071809 24843728 24490683 24422540 24227977 23942037 23819009 23595580 23289769
3356 23289769 23061228 23033425 22953068 22715816 22529042 22458042 22262964 22063226 21897699 21829555
3346 21829555 21750931 21450871 21263591 21108978 20922377 20785222 20698730 20655894 20505152 20259487
3336 20259487 20110879 19954845 19883885 19845082 19684237 19623659 19427481 19248025 19022246 18965940
3326 18965940 18787428 18620817 18561811 18504511 18463043 18355396 18265544 18130090 17973800 17917587
3316 17917587 17832099 17672752 17597251 17486035 17271611 17059188 17024877 16957047 16829554 16668814
3306 16668814 16568563 16500857 16423308 16266226 16149269 16026738 15957226 15898603 15780752 15744716
$$ packed form
3375B9373328o38973n06847m76293m37778l76970m30004k97286k63414k21897
3366B5723866l07734l44323k28081l53045o8143j94563k85940j23028k23429l05811
3356B3289769k28541k7803q0357k37252j86774p1000j95078j99738j65527o8144
3346B1829555p8624l00060j87280j54613j86601j37155q6492m2836j50742k45665
3336B0259487j48608j56034p0960l8803j60845o0578j96178j79456k25779n6306
3326A8965940j78512j66611n9006n7300m1468j07647q9852j35454j56290n6213
3316A7917587q5488j59347p5501j11216k14424k12423l4311o7830j27493j60740
3306A6668814j00251o7706p7549j57082j16957j22531o9512n8623j17851l6036
$$ plain form
3296 15744716 15565874 15508021 15451652 15370425 15173915 15024613 14889824 14804899 14810627 14604585
3286 14604585 14447542 14333013 14239859 14212039 14091851 14021807 13919041 13811447 13672496 13628020
3276 13628020 13563885 13472121 13391482 13375193 13209758 13117147 12976852 12900331 12971122 12892733 12783285
3265 12783285 12584333 12503286 12567974 12572480 12585738 12500624 12394347 12414553 12406829 12383909 12218811
3254 12218811 12315100 12307128 12332459 12376585 12567699 12636781 12688487 12942122 13106739 13201191 13486233
3243 13486233 13698729 14010556 14459334 14849509 15251726 15839310 16283632 16678263 17087959
3234 17087959 17462857 17842186 18126632 18226236 18230658 18152355 18073586 17916424 17697235 17694819 17668917
3223 17668917 17604712 17512936 17349833 17210125 17068275 16813145 16459859 15955888 15450974 14963370
$$ packed form
3296A5744716j78842n7853n6369q1227j96510j49302j34789q4925N728k06042
3286A4604585j57043j14529r3154k7820j20188p0044j02766j07594j38951m4476
3276A3628020o4135r1764q0639j6289j65435r2611j40295p6521P0791p8389j09448
3265A2783285j98952q1047O4688M506J3258q5114j06277K0206p724k2920j65098
3254A2218811R6289p972K5331M4126J91114O9082N1706K53635J64617R4452K85042
3243A3486233K12496L11827M48778L90175M02217N87584M44322L94631M09696
3234A7087959L74898L79329K84446R9604M422p8303p8769j57162k19189k416k5902
3223A7668917o4205r1776j63103j39708j41850k55130l53286n03971n04914m87604
$$ plain form
3213 14963370 14361282 13831292 13417976 13049590 12638173 12196120 11809229 11554960 11360818
3204 11360818 11152164 11042071 10942142 10784027 10702557 10713708 10619077 10505682 10431682 10410159
3194 10410159 10404027 10406539 10270110 10165295 10266982 10289494 10130694 10138859 10130510 10171276 10188540
3183 10188540 10251545 10228519 10289815 10412061 10517929 10564916 10731197 10912544 11054354 11029350
3173 11029350 11164631 11339392 11414982 11592052 11732733 11979457 12110043 12172298 12285727 12473248
3163 12473248 12675574 12771542 12980365 13245824 13368001 13558373 13896578 14265801 14668022 14973753
3153 14973753 15095007 15320239 15548861 15799536 16075491 16076116 16087314 15870024 15703485 15571004
3143 15571004 15154018 14682610 14370505 14138987 13881928 13569706 13412392 13234891 12997999
$$ packed form
3213A4963370o02088n29990m13316l68386m11417m42053l86891k54269j94142
3204A1360818k08654j10093r9929j58115q1470J1151r4631j13395p4000k1523
3194A0410159o132K512j36429j04815J01687K2512j58800Q165q349M0766J7264
3183A0188540O3005k3026O1296J22246J05868M6987J66281J81347J41810k5004
3173A1029350J35281J74761P5590J77070J40681K46724J30586O2255J13429J87521
3163A2473248K02326R5968K08823K65459J22177J90372L38205L69223M02221L05731
3153A4973753J21254K25232K28622K50675K75955O25J1198k17290j66539j32481
3143A5571004m16986m71408l12105k31518k57059l12222j57314j77501k36892
$$ plain form
3134 12997999 12788791 12572562 12501131 12418645 12279265 12258457 12269477 12247744 12531004 12767388
3124 12767388 13198507 13732157 14291162 14778028 14777591 14294745 13663815 13115213 12595391 12141183
3114 12141183 11826344 11478324 11259479 11005483 10850978 10727993 10720954 10643120 10415746 10226122
3104 10226122 10140263 10023298 10030002 10160133 10260775 10386204 10442588 10598846 10966613 11569028
3094 11569028 12118250 12667079 13424617 14333213 15589565 16652555 17147224 16531948 15479262
3085 15479262 14336680 13260296 12292197 11410093 10672045 10025479 9535167 9096181 8798699
3076 8798699 8573636 8335879 8045961 7901130 7795210 7740106 7610770 7601547 7709517 7700162
3066 7700162 7702532 7871320 8113776 8359162 8626847 9079769 9433290 9829983 10530791 11280155
$$ packed form
3134A2997999k09208k16229p1431q2486j39380k0808J1020k1733K83260K36384
3124A2767388M31119N33650N59005M86866m37m82846o30930n48602n19822m54208
3114A2141183l14839l48020k18845k53996j54505j22985p039p7834k27374j89624
3104A0226122q5859j16965O704J30131J00642J25429N6384J56258L67767O02415
3094A1569028N49222N48829P57538R08596J256352J062990M94669o15276j052686
3085A5479262j142582j076384r68099q82104p38048o46566m90312m38986k97482
3076H798699k25063k37757k89918j44831j05920n5104j29336r223J07970r355
3066G700162K370J68788K42456K45386K67685M52922L53521L96693P00808P49364
$$ plain form
3056 11280155 11664007 11786582 11789463 11501894 11166564 11068838 11318844 11556393 10969205 9866436
3046 9866436 8963100 8153177 7532189 6997037 6557844 6247646 5907925 5789792 5691852 5551734
3036 5551734 5415948 5408181 5489001 5640921 5559197 5560234 5603461 5707255 5913227 6115888 6332635
3025 6332635 6605620 6956030 7506837 8199081 8629683 8143884 7154847 6404683 5764023 5145590
3015 5145590 4882715 4658202 4463864 4306087 4087363 3832692 3770450 3620499 3498580 3432107
3005 3432107 3224013 3154628 3061325 3105635 3021240 3008211 2899458 2915522 2868579 2900579 2942271
2994 2942271 2740153 2577570 2643445 2596397 2608887 2611457 2458426 2391543 2462058 2443152 2436579
2983 2436579 2381768 2340900 2339768 2341511 2252757 2112223 2181271 2107448 2131727 2120594 2178331 2141748
$$ packed form
3056A1280155L83852J22575K881k87569l35330r7726K50006K37549n87188j102769
3046I866436r03336q09923o20988n35152m39193l10198l39721j18133r7940j40118
3036E551734j35786p767Q0820J51920q1724J037M3227J03794K05972K02661K16747
3025F332635K72985L50410N50807O92244M30602m85799r89037p50164o40660o18433
3015E145590k62875k24513j94338j57777k18724k54671o2242j49951j21919o6473
3005C432107k08094o9385r3303M4310q4395j3029j08753J6064m6943L2000M1692
2994B942271k02118j62583O5875m7048J2490K570j53031o6883P0515j8906o573
2983B436579n4811m0868j132J743q8754j40534O9048p3823K4279j1133N7737l6583
$$ plain form
2971 2141748 2160952 2182286 2032035 2054355 2068363 1956617 1924759 1966402 2014802 2039581 1985122
2960 1985122 1895780 1739669 1767000 1823754 1853077 1781526 1821647 1797005 1815586 1837876 1783051
2949 1783051 1741256 1748187 1728236 1634921 1654749 1696926 1752727 1768413 1681406 1694005 1758385 1661835
2937 1661835 1612031 1592466 1572426 1547779 1590645 1583864 1696185 1606552 1461089 1450811 1562567
2926 1562567 1545208 1597229 1625228 1538759 1610213 1705121 1612959 1623931 1648645 1590750 1701307
2915 1701307 1776710 1726012 1551193 1492224 1582027 1520061 1593029 1658909 1585342 1686100 1830074
2904 1830074 1932746 1820684 1754758 1815354 1927717 1941080 1856566 1780002 1795059 1851006 1938973
2893 1938973 1961223 2043140 2160792 2122154 2388393 2423132 2291788 2374379 2324338 2290833 2189311
$$ packed form
2971B141748J9204K1334j50251K2320J4008j11746l1858M1643M8400K4779n4459
2960A985122q9342j56111K7331N6754K9323p1551M0121k4642J8581K2290n4825
2949A783051m1795O931j9951r3315J9828M2177N5801J5686q7007J2599O4380r6550
2937A661835m9804j9565k0040k4647M2866o781J12321q9633j45463j0278J11756
2926A562567j7359N2021K7999q6469P1454R4908r2162J0972K4714n7895J10557
2915A701307P5403n0698j74819n8969Q9803o1966P2968O5880p3567J00758J43974
2904A830074J02672j12062o5926O0596J12363J3363q4514p6564J5057N5947Q7967
2893A938973K2250Q1917J17652l8638K66239L4739j31344Q2591n0041l3505j01522
$$ plain form
2882 2189311 2212767 2185744 2197085 2234142 2232789 2275942 2332684 2273926 2401404 2471140 2427959
2871 2427959 2302666 2374831 2472810 2450243 2534254 2513122 2496187 2559884 2563694 2600896 2784642
2860 2784642 2796600 2935754 3056279 3166620 3290752 3375387 3411168 3480556 3274854 3273583 3248440
2849 3248440 3209117 3280044 3368320 3519342 3469781 3595632 3689475 3731653 3802970 3806417 3794104
2838 3794104 3720600 3691762 3594112 3567533 3664981 3704725 3744600 3682518 3612252 3670668 3824682
2827 3824682 3854079 3907689 3891910 3971603 4011656 4041648 4058491 4155569 4193130 4176778 4249660
2816 4249660 4369010 4545426 4604755 4760993 4778229 4835363 4963240 5081527 5159353 5039595
2806 5039595 5010135 4875463 4651204 4551826 4506896 4434827 4278683 4157258 4234658 4190297 4091647
$$ packed form
2882B189311K3456k7023J1341L7057j353M3153N6742n8758J27478O9736m3181
2871B427959j25293P2165R7979k2567Q4011k1132j6935O3697L810L7202J83746
2860B784642J1958J39154J20525J10341J24132Q4635L5781O9388k05702j271k5143
2849C248440l9323P0927Q8276J51022m9561J25851R3843M2178P1317L447j2313
2838C794104p3504k8838r7650k6579R7448L9744L9875o2082p0266N8416J54014
2827C824682K9397N3610j5779P9693M0053K9992J6843R7078L7561j6352P2882
2816D249660J19350J76416N9329J56238J7236N7134J27877J18287P7826j19758
2806E039595k9460j34672k24259r9378m4930p2069j56144j21425P7400m4361r8650
$$ plain form
2795 4091647 4097388 4236810 4356729 4227751 4192847 4274135 4396471 4435899 4463863 4430609 4572513
2784 4572513 4653755 4476326 4513619 4551142 4544226 4435062 4338784 4267898 4173636 4005274 3843093
2773 3843093 3746145 3686901 3594395 3476635 3377440 3328435 3415800 3423719 3410429 3332416 3250403
2762 3250403 3237909 3304533 3342879 3230424 3140776 3154755 3107036 3048190 2924598 2765714 2677171
2751 2677171 2650453 2600812 2442610 2374496 2332173 2320323 2207480 2062575 1938149 1964996 1971758
2740 1971758 1828415 1771065 1739785 1810201 1692687 1480026 1437289 1371387 1321000 1324953 1340241
2729 1340241 1305901 1174453 1130381 1131407 1120783 1139087 1178880 1171711 1187917 1121236 1064490 1090033
2717 1090033 1086801 1059188 1050901 1057733 971479 869533 891362 799476 885257 877014 828028 789022
$$ packed form
2795D091647N741J39422J19919j28978l4904Q1288J22336L9428K7964l3254J41904
2784D572513Q1242j77429L7293L7523o916j09164r6278p0886r4262j68362j62181
2773C843093r6948n9244r2506j17760r9195m9005Q7365P919j3290p8013q2013
2762C250403j2494O6624L8346j12455q9648J3979m7719n8846j23592j58884q8543
2751B677171k6718m9641j58202o8114m2323j1850j12843j44905j24426K6847O762
2740A971758j43343n7350l1280P0416j17514k12661m2737o5902n0387L953J5288
2729A340241l4340j31448m4072J026j0624J8304L9793p169J6206o6681n6746K5543
2717A090033l232k7613q287O832q6254j01946K1829r1886Q5781q243m8986l9006
$$ plain form
2705 789022 735489 678926 837883 872186 747769 690926 746005 731069 708356 664896 640262
2694 640262 647941 765716 657912 543847 509727 448940 579896 657064 591919 424458 465574
2683 465574 498404 477699 522237 642880 690955 622395 453228 549242 537222 519573 468378
2672 468378 485519 496739 452988 381968 410325 428507 387355 333661 242108 297274 290050 301773
2660 301773 275860 295011 296398 192179 230053 225910 293517 315196 302184 269721 294441 343619
2648 343619 300959 316927 348381 231870 197919 234472 165917 148767 210176 196880 186140
2637 186140 194221 128594 157339 198672 77769 113895 280718 317378 177729 290778 251367
2626 251367 274612 272046 301887 340186 397947 311145 135488 100190 119286 227029 226016 140955
$$ packed form
2705G89022n3533n6563J58957L4303j24417n6843N5079j4936k2713m3460k4634
2694F40262P679J17775j07804j14065l4120o0787J30956P7168o5145j67461M1116
2683D65574L2830k0705M4538J20643M8075o8560j69167R6014j2020j7649n1195
2672D68378J7141J1220m3751p1020K8357J8182m1152n3694r1553N5166p224J1723
2660C01773k5913J9151J387j04219L7874m143O7607K1679j3012l2463K4720M9178
2648C43619m2660J5968L1454j16511l3951L6553o8555j7150O1409j3296j0740
2637A86140Q081o5627K8745M1333j20903L6126J66823L6660j39649J13049l9411
2626B51367K3245k566K9841L8299N7761q6802j75657l5298J9096J07743j013q5061
$$ plain form
2614 140955 30543 80691 132939 213634 147383 134962 241899 235540 197522 219486 236541
2603 236541 92516 75640 119671 204586 311105 186478 222907 267263 136721 35119 112712
2592 112712 101231 154917 105632 89386 73052 161563 128765 166483 206418 91313 126767
2581 126767 -18363 19441 72559 35009 9159 103955 167662 48617 133169 158964 187135
2570 187135 126325 183546 175340 175253 228032 115492 80663 88086 119440 85815 105806 180338
2558 180338 137135 119724 118427 116131 22346 43355 78362 78162 140853 88708 204983 270011
2546 270011 211100 146685 5684 -21436 6365 2753 35576 37333 96910 164257 173503 80778
2534 80778 140315 157473 103366 77860 72139 36607 34414 29085 40454 46317 81578 121838 135084
$$ packed form
2614A40955j10412N0148N2248Q0695o6251j2421J06937o359l8018K1964J7055
2603B36541j44025j6876M4031Q4915J06519j24627L6429M4356j30542j01602P7593
2592A12712j1481N3686m9285j6246j6334Q8511l2798L7718L9935j15105L5454
2581A26767j45130L7804N3118l7550k5850R4796O3707j19045Q4552K5795K8171
2570A87135o0810N7221q206q7N2779j12540l4829P423L1354l3625J9991P4532
2558A80338m3203j7411j297k296r3785K1009L5007k00O2691n2145J16275O5028
2546B70011n8911o4415j41001k7120K7801l612L2823J757N9577O7347R246r2725
2534H0778N9537J7158n4107k5506n721l5532k193n329J1369N863L5261M0260J3246
$$ plain form
2521 135084 48428 106142 63523 30636 74887 35343 106850 38126 104854 163236 88589 -56582
2509 -56582 -54971 -6942 -40688 -20542 6542 95752 32639 50198 65045 98216 104020 33897
2497 33897 67678 71157 86130 173279 274969 174793 69445 -38999 57805 39912 89401
2486 89401 75863 20581 12664 40244 28272 81271 31428 69457 23623 33467 65832 87778
2474 87778 31014 21720 11094 49038 17097 111582 72254 11394 47895 42495 50749 13498
2462 13498 108713 132050 183043 22535 -127738 -114578 389 27851 28097 -10 21636 -57900
2450 -57900 -51899 -96041 -48789 -84428 4956 30598 103416 100105 -19753 -2757 58604 -32471
2438 -32471 -148202 -90109 -53551 -23324 -43509 -57980 89253 69473 110855 92131 -59842
$$ packed form
2521A35084q6656N7714m2619l2887M4251l9544P1507o8724O6728N8382p4647j45171
2509e6582J611M8029l3746K0146K7084Q9210o3113J7559J4847L3171N804p0123
2497C3897L3781L479J4973Q7149J01690j00176j05348j08444R6804j7893M9489
2486H9401j3538n5282p917K7580j1972N2999m9843L8029m5834R844L2365K1946
2474H7778n6764r294j0626L7944l1941R4485l9328o0860L6501n400Q254l7251
2462A3498R5215K3337N0993j60508j50273J3160J14967K7462K46k8107K1646p9536
2450e7900O001m4142M7252l5639Q9384K5642P2818l311j19858J6996O1361r1075
2438c2471j15731N8093L6558L0227k0185j4471J47233j9780M1382j8724j51973
$$ plain form
2427 -59842 -54762 -63895 -184482 -133624 -165434 -223430 -93184 -26094 -176215 -91304 55696
2416 55696 64012 43000 -15048 -54575 -32365 -15212 -16560 -56039 -32137 -10218 -20884 -75463
2404 -75463 -18411 73007 53674 -30673 -64119 -59551 -56450 20527 33001 15408 -28036 41656
2392 41656 131667 138551 -40506 -139853 -69624 -100315 -189075 -83154 85462 17337 -83129
2381 -83129 -12281 3615 -53813 -43381 22818 151123 193765 53161 -11158 -56040 -65845 -27691
2369 -27691 -30508 88370 112748 23309 31317 -61671 -53769 -48552 154611 151845 -29591 37593
2357 37593 53950 31400 -47329 -79698 -200762 -166607 -93959 -120570 74160 109818 108465 -28410
2345 -28410 -13130 28928 28118 -35554 118537 37745 -113316 -22375 49634 10368 -79633 -40309
$$ packed form
2427e9842N080r133j20587N0858l1810n7996J30246O7090j50121Q4911J47000
2416E5696Q316k1012n8048l9527K2210J7153j348l9479K3902K1919j0666n4579
2404g5463N7052R1418j9333q4347l3446M568L101P6977J2474j7593m3444O9692
2392D1656R0011O884j79057r9347P0229l0691q8760J05921J68616o8125j00466
2381h3129P0848J5896n7428J0432O6199J28305M2642j40604o4319m4882r805L8154
2369b7691k817J18878K4378q9439Q008r2988P902N217K03163k766j81436O7184
2357C7593J6357k2550p8729l2369j21064L4155P2648k6611J94730L5658j353j36875
2345b8410J5280M2058q10o3672J54091q0792j51061R0941P2009l9266r0001L9324
$$ plain form
2333 -40309 14367 780 -64366 -54421 -127101 -4364 15282 -7476 10907 40403 110385 129546
2321 129546 53368 82522 86058 40906 23510 38504 -18264 538 -37903 4393 -7338 7348
2309 7348 28684 -47250 -55145 -92056 -103925 -84931 48362 30481 -47962 47161 66784 -12504
2297 -12504 -9035 31440 73118 22701 43657 59007 97486 117669 79782 50963 29712 -2907
2285 -2907 1052 -1207 -303 19850 31706 44426 78956 124698 206023 203662 96764 169377 235182
2272 235182 67268 94545 53354 53697 19889 -6078 31739 136411 150849 92991 159703 22838
2260 22838 21447 85562 -67261 -102929 39004 29184 -96433 -25884 55781 -53834 -203740
2249 -203740 -120938 -15422 -51105 -101883 -21718 17506 -14206 -105021 -122768 -179214 -75074
$$ packed form
2333d0309N4676j3587o5146R945p2680J22737J9646k2758J8383K9496O9982J9161
2321A29546p6178K9154L536m5152j7396J4994n6768J8802l8441M2296j1731J4686
2309G348K1336p5934p895l6911j1869J8994J33293j7881p8443R5123J9623p9288
2297a2504L469M0475M1678n0417K0956J5350L8479K0183l7887k8819k1251l2619
2285b907L959k259R04K0153J1856J2720L4530M5742Q1325k361j06898P2613O5805
2272B35182j67914K7277m1191L43l3808k5967L7817J04672J4438n7858O6712j36865
2260B2838j391O4115j52823l5668J41933r820j25617P0549Q1665j09615j49906
2249b03740Q2802J05516l5683n0778Q0165L9224l1712r0815j7747n6446J04140
$$ plain form
2238 -75074 43947 53082 54314 -23429 -46440 -87636 -71325 36721 -5092 -5983 20491 -20936
2226 -20936 -70449 -51300 -9312 50661 87906 60330 59265 9758 95863 49896 60861 3157
2214 3157 29107 -19580 -99469 -24064 43590 -13313 -19277 98041 82091 72490 98408 -17561
2202 -17561 -2628 -140666 -88007 62767 120897 95353 63591 -102222 -116138 -67138 -96563
2191 -96563 -49637 -115848 -91072 -90255 -131287 23338 110371 123262 39958 103073 -10072 -60710
2179 -60710 35853 69265 27653 4144 66184 42014 15369 6140 62423 32549 101631 69759
2167 69759 40654 10051 9407 108261 54891 -10087 3579 120607 99806 63610 138480 92141
2155 92141 22820 104726 107253 116386 137097 170460 135826 195582 199624 193949 83077 168588
$$ packed form
2238g5074J19021R135J232p7743k3011m1196J6311J08046m1813q91K6474m1427
2226b0936m9513J9149M1988N9973L7245k7576j065m9507Q6105m5967J0965n7704
2214C157K5950m8687p9889P5405O7654n6903n964J17318j5950r601K5918j15969
2202a7561J4933j38038N2659J50774N8130k5544l1762j65813j3916M9000k9425
2191i6563M6926o6211K4776Q17m1032J54625Q7033J2891q3304O3115j13145n0638
2179f0710R6563L3412m1612k3509O2040k4170k6645r229N6283k9874O9082l1872
2167F9759k9105l0603o44R8854n3370o4978J3666J17028k0801l6196P4870m6339
2155I2141o9321Q1906K527R133K0711L3363l4634N9756M042n675j10872Q5511
$$ plain form
2143 168588 192843 88475 121638 121966 91040 78320 81592 109863 132499 57697 93975 109248
2131 109248 157886 227177 186084 138263 152548 162313 156456 112615 230363 294886 332959 243801
2119 243801 114433 102569 54551 75432 207572 161525 233010 184203 252858 232583 312591
2108 312591 177756 104318 213522 246606 239529 379119 331603 349318 299925 328398 375805
2097 375805 330199 423303 414295 389076 326553 291238 447154 495279 548720 559774 538200 621415
2085 621415 592529 589801 587039 617666 768270 837519 810244 770754 777764 709173 618747 717967
2073 717967 751153 805699 881337 911954 849278 856386 962570 974427 1086519 1182858 1208221
2062 1208221 1201327 1259409 1301175 1375828 1465167 1458871 1522889 1551715 1501506 1494128 1499084 1533708
$$ packed form
2143A68588K4255j04368L3163L28l0926j2720L272K8271K2636p4802L6278J5273
2131A09248M8638O9291m1093m7821J4285R765n857m3841J17748O4523L8073q9158
2119B43801j29368j1864m8018K0881J32140m6047P1485m8807O8655k0275Q0008
2108C12591j34835p3438J09204L3084p077J39590m7516J7715m9393K8473M7407
2097C75805m5606R3104r008k5219o2523l5315J55916M8125N3441J1054k1574Q3215
2085F21415k8886k728k762L0627J50604O9249k7275l9490P010o8591r0426R9220
2073G17967L3186N4546P5638L0617o2676P108J06184J1857J12092R6339K5363
2062A208221o894N8082M1766P4653Q9339o296O4018K8826n0209p378M956L4624
$$ plain form
2050 1533708 1635149 1734394 1751313 1707105 1850128 1889189 1973336 2144150 2220760 2263015 2319632
2039 2319632 2443519 2530081 2593882 2677848 2857042 2995414 3242247 3406908 3603409 3828557
2029 3828557 4113868 4506852 4913241 5466494 5928130 6362593 6715937 7170197 7949058 8798989
2019 8798989 9699004 10739790 12027674 13783931 15776200 17908519 20791576 24824631
2011 24824631 30730434 32626914 27292674 21610679 17356005 14402856 12133784 10591079
2003 10591079 9301207 8084422 7103315 6393735 5770480 5215317 4802839 4740430 4543147
1994 4543147 4046427 3620320 3337754 2988220 2805188 2707778 2515230 2352855 2236226 2067625
1984 2067625 1837598 1720844 1669148 1644030 1635735 1568461 1460365 1325197 1201444 1093963
$$ packed form
2050A533708J01441R9245J6919m4208J43023L9061Q4147J70814P6610M2255N6617
2039B319632J23887Q6562O3801Q3966J79194J38372K46833J64661J96501K25148
2029C828557K85311L92984M06389N53253M61636M34463L53344M54260P78861Q49931
2019H798989R00015J040786J287884J756257J992269K132319K883057M033055
2011B4824631N905803J896480n334240n681995m254674k953149k269072j542705
2003A0591079j289872j216785r81107p09580o23255n55163m12478o2409j97283
1994D543147m96720m26107k82566l49534j83032r7410j92548j62375j16629j68601
1984B067625k30027j16754n1696k5118q295o7274j08096j35168j23753j07481
$$ plain form
1974 1093963 1024084 1109365 1007322 973939 1011241 825996 750583 726357 682439 775677 773924
1963 773924 821597 770814 682127 570117 601381 629833 612935 584140 615092 520793 535280
1952 535280 576037 513135 468816 393827 376954 417125 448598 444015 507850 375095 385657 420462
1940 420462 225234 246863 364786 388778 380064 431293 374279 365902 308563 291063 244288 206114
1928 206114 233020 214998 138200 110656 148504 180321 77775 71247 96781 186612 157044 164834
1916 164834 95511 76531 192989 301094 188591 185195 156243 -6341 8418 42262 9322
1905 9322 78747 26281 108929 132008 157552 223188 65786 73527 114991 257256 228247 120569
1893 120569 156191 106017 119500 218778 129488 -29284 69863 192685 132396 105097 120643
$$ packed form
1974A093963o9879Q5281j02043l3383L7302j85245p5413k4226m3918R3238j753
1963G73924M7673n0783q8687j12010L1264K8452j6898k8795L0952r4299J4487
1952E35280M0757o2902m4319p4989j6873M0171L1473m583O3835j32755J0562L4805
1940D20462j95228K1629J17923K3992q714N1229n7014q377n7339j7500m6775l8174
1928B06114K6906j8022p6798k7544L7848L1817j02546o528K5534Q9831k9568P790
1916A64834o9323j8980J16458J08105j12503l396k8952j62584J4759L3844l2940
1905I322O9425n2466Q2648K3079K5544O5636j57402P741M1464J42265k9009j07678
1893A20569L5622n0174J3483R9278q9290j58772R9147J22822o0289k7299J5546
$$ plain form
1882 120643 22712 -28621 20160 81 -8070 -31207 61534 107709 60752 57029 28645 -12856
1870 -12856 -19764 -66244 -17027 -30097 -171675 -78887 -16024 -85274 -84181 -84247 -63573 -156605 -134701
1857 -134701 -21613 39246 137554 79202 25844 7473 26487 1659 9744 76944 -1289 -82853
1845 -82853 -5576 18566 82227 22483 -7493 14872 8856 85109 48132 61508 55901 54781
1833 54781 118123 103294 26914 7234 43019 101776 24299 24555 -22634 -101878 -17222 -100604
1821 -100604 -227306 -258323 -100232 -4121 -34720 158232 116854 41296 28336 46464 -23224
1810 -23224 -15275 -35902 -29202 5987 42425 -100473 -7586 55970 18742 -1774 -57934 -116874
1798 -116874 -57189 79452 5459 -39612 103876 51328 10655 -30937 -136010 -50381 -9195
$$ packed form
1882A20643r7931n1333M8781k0079q151k3137R2741M6175m6957l723k8384m1501
1870a2856o908m6480M9217j3070j41578R2788O2863o9250J093o6K0674r3032K1904
1857a34701J13088O0859R8308n8352n3358j8371J9014k4828Q085O7200p8233q1564
1845h2853P7277K4142O3661n9744k9976K2365o016P6253l6977J3376n607j120
1833E4781O3342j4829p6380j9680L5785N8757p7477K56m7189p9244Q4656q3382
1821a00604j26702l1017J58091R6111l0599J92952m1378p5558j2960J8128o9688
1810b3224P949k0627O700L5189L6438j42898R2887O3556l7228k0516n6160n8940
1798a16874N9685J36641p3993m5071J43488n2548m0673m1592j05073Q5629M1186
$$ plain form
1787 -9195 -79857 -71582 -125138 -100206 -8537 -41750 -51043 -145564 -126612 -103484 -34692 -23690
1775 -23690 15717 -44174 -34211 1513 -48131 19846 -18517 -129018 -56796 -79815 -85435 -17206
1763 -17206 1758 -6386 -4823 58169 -44 12276 10595 -37554 -7227 6386 -24126 -10583
1751 -10583 -86579 -74358 -37521 -77652 -56847 1467 141924 106000 25964 43431 27233 43873
1739 43873 99827 83688 185986 150818 -10231 -68 -39980 -20731 19154 -8525 -39948
1728 -39948 -36999 -10728 -79913 -113884 -80712 -21827 -102370 -146755 -121321 -71945 17199 32775
1716 32775 -61836 -58143 -52972 -111918 -102444 -106970 -28155 -57801 46792 25970 1179 5913 -70654
1703 -70654 -79699 -66758 16236 -51828 -36947 -74562 -152806 -109919 -78004 -124813 51000 59902
$$ packed form
1787i195p0662Q275n3556K4932R1669l3213r293r4521J8952K3128O8792J1002
1775b3690L9407n9891R963L5724m9644O7977l8363j10501P2222k3019n620O8229
1763a7206J8964q144J563O2992n8213J2320j681m8149L0327J3613l0512J3543
1751a0583p5996J2221L6837m0131K0805N8314J40457l5924q0036J7467j6198J6640
1739D3873N5954j6139J02298l5168j61049J0163l9912J9249L9885k7679l1423
1728c9948K949K6271o9185l3971L3172N8885q0543m4385K5434M9376Q9144J5576
1716C2775r4611L693N171n8946R474m526P8815k9646J04593k0822k4791M734p6567
1703g0654r045J2941Q2994o8064J4881l7615p8244M2887L1915m6809J75813Q902
$$ plain form
1691 59902 70678 18711 -142661 -152260 -178064 -164461 -39545 -97371 22510 78915 68269
1680 68269 76582 -71233 -67786 -95097 -85856 40325 18836 -7439 -23504 -124604 -147146 11278
1668 11278 54147 -53362 -25853 -43644 -40627 -24501 32659 27948 -50610 -69342 -64706 -40406
1656 -40406 -54826 -104654 -108839 -55858 66200 119008 -4603 -81224 -37711 80951 -61517
1645 -61517 -102368 -140950 -146405 -198505 -196893 -121353 -52507 -44591 -50135 -73433 -181479 -216586
1633 -216586 -249708 -176797 -204584 -104143 -60943 -4019 -36343 -92644 -84874 -106476 -137805 -186836
1621 -186836 -47206 66862 76337 -4123 -162411 -70798 -152928 -114595 -125892 -202491 -180034
1610 -180034 -176893 -86821 -111611 -145630 -107561 -98640 40308 26719 -51499 -158235 -122470 -38354
$$ packed form
1691E9902J0776n1967j61372r599k5804J3603J24916n7826J19881N6405j0646
1680F8269Q313j47815L447k7311R241J26181k1489k6275j6065j01100k2542J58424
1668A1278M2869j07509K7509j7791L017J6126N7160m711p8558j8732M636K4300
1656d0406j4420m9828m185N2981J22058N2808j23611p6621M3513J18662j42468
1645f1517m0851l8582n455n2100J612P5540O8846P916n544k3298j08046l5107
1633b16586l3122P2911k7787J00441M3200N6924l2324n6301P770k1602l1329m9031
1621a86836J39630J14068R475q0460j58288R1613q2130L8333j1297p6599K2457
1610a80034L141R0072k4790l4019L8069Q921J38948j3589p8218j06736L5765Q4116
$$ plain form
1598 -38354 -2287 -46715 -10821 -91291 -54805 -28357 -15046 -1901 10790 92020 -10518 -15393
1586 -15393 76750 10149 -89167 -98514 -103029 -125114 -140452 -113657 -58419 -44062 -61449 -98289
1574 -98289 -79783 -90725 -73737 79747 52521 -29013 -71358 -166085 -161422 -116477 -104886 -48882
1562 -48882 -19854 -39282 -84052 -46804 -22407 -34544 -76743 -85075 -86859 -57051 -67861 -48867
1550 -48867 -100083 -90811 -52258 -45425 -88811 -173374 -214327 -208563 -115463 -71302 -134308 -62362
1538 -62362 -53585 -38800 -37040 -68615 9947 -33612 -64242 33139 74111 109249 -87046 -104882
1526 -104882 -41595 -65421 -162465 -162982 -148858 -182657 -137067 -77387 -109510 -70115 -76787 -29938
1514 -29938 -61205 23147 -56400 29949 42023 -33466 2889 -71920 -72924 -80562 -141032 -123681
$$ packed form
1598c8354L6067m4428L5894q0470L6486K6448J3311J3145J2691Q1230j02538m875
1586a5393R2143o6601r9316r347m515k2085j5338K6795N5238J4357j7387l6840
1574i8289J8506j0942J6988J53484k7226q1534m2345r4727M663M4945J1591N6004
1562d8882K9028j9428m4770L7248K4397j2137m2199q332j784K9808j0810J8994
1550d8867n1216R272L8553O833m3386q4563m0953N764R3100M4161o3006P1946
1538f2362Q777J4785J760l1575P8562m3559l0630R7381M0972L5138j96295j7836
1526a04882O3287k3826r7044n17J4124l3799M5590N9680l2123L9395o672M6849
1514b9938l1267Q4352p9547Q6349J2074p5489L6355p4809j004p638o0470J7351
$$ plain form
1502 -123681 -91111 -39152 5394 -160209 -169854 -208017 -130566 -97771 -136803 -129999 -30037 -116555
1490 -116555 -96646 -16864 -53139 -60414 86175 33515 -23733 -16905 -26113 -41101 8899 -117667
1478 -117667 39605 38325 43715 22298 -1704 -26155 4448 42042 -25545 -23495 -24125 -38344
1466 -38344 -125110 -107187 -92022 -64059 -39950 -79220 -209883 -154872 -99605 62963 54016 56649
1454 56649 68987 -2828 41710 66619 99454 44873 -30096 82997 53327 4639 22840 -7577
1442 -7577 -63488 -90324 -123658 -76302 -72682 -62918 19075 -59539 -62480 -30974 -64052 -30709 -177151
1429 -177151 -119341 -3788 -73678 6131 12452 5835 -3340 19251 21378 -17718 -24809 -166693
1417 -166693 -53192 15077 22369 -40639 -177980 -157347 -118563 -127562 -17080 -71764 -187631
$$ packed form
1502a23681L2570N1959M4546j65603r645l8163P7451L2795l9032O804R9962q6518
1490a16555J9909P9782l6275p275J46589n2660n7248O828r208j4988N0000j26566
1478a17667J57272j280N390k1417k4002k4451L0603L7594o7587K050o30j4219
1466c8344q6766J7923J5165K7963K4109l9270j30663N5011N5267J62568q947K633
1454E6649J2338p1815M4538K4909L2835n4581p4969J13093k9670m8688J8201l0417
1442g577n5911k6836l3334M7356L620R764Q1993p8614k941L1506l3078L3343j46442
1429a77151N7810J15553o9890P9809O321o617r175K2591K127l9096p091j41884
1417a66693J13501O8269P292o3008j37341K0633L8784q999J10482n4684j15867
$$ plain form
1406 -187631 -39457 -125774 -65240 66 -43487 -77443 23432 27091 -10275 -9352 -62865 -85643
1394 -85643 -124082 -87068 -95273 -130499 -143488 -12577 -15500 -85464 -43906 -24223 -514 6274
1382 6274 66777 48375 -136358 -185596 -236412 -220492 -18712 -67761 -70840 -38203 -83973 -122260
1370 -122260 -2533 66612 -3081 -10653 -56475 -31323 -22212 -121857 -174268 -117007 -35941 -63115
1358 -63115 -165124 -55380 27395 -20466 -10403 -104954 -141199 -66724 -81043 -89223 -65594 -37711
1346 -37711 43537 41840 54547 57131 3287 -50354 -5831 -33559 -131485 -170519 -66235 -71401
1334 -71401 -62466 -68043 -47306 -63877 -123335 -65235 -47805 -33990 -72728 -17619 -46353 21573
1322 21573 -70402 -80680 -90568 -38910 -30822 -70976 -99238 -11522 98568 56290 -154200 -143246
$$ packed form
1406a87631J48174q6317O0534O5306m3553l3956J00875L659l7366R23n3513k2778
1394h5643l8439L7014q205l5226j2989J30911k923o9964M1558J9683K3709O788
1382F274O0503j8402j84733m9238n0816J5920K01780m9049l079L2637m5770l8287
1370a22260J19727O9145o9693p572m5822K5152R111r9645n2411N7261Q1066k7174
1358f3115j02009J09744Q2775m7861J0063r4551l6245P4475j4319q180K3629K7883
1346c7711Q1248j697J2707K584n3844n3641M4523k7728r7926l9034J04284n166
1334g1401Q935n577K0737j6571n9458N8100J7430J3815l8738N5109k8734O7926
1322B1573r1975j0278r888N1658Q088m0154k8262Q7716J10090m2278k10490J0954
$$ plain form
1310 -143246 -80279 101759 111063 70348 83213 8408 88872 75779 -10569 -89543 7236 -13841
1298 -13841 -56223 -126344 -137882 -200839 -110404 13969 -2602 29892 -61790 -59060 48583 -39548
1286 -39548 -36371 -57662 -161688 -135222 -75141 -102553 -91744 -14998 -4588 27967 18028 -72536
1274 -72536 -94340 -154162 -65590 7540 -68422 -100223 -151948 -244179 -219164 -202125 -204436 -243607
1262 -243607 -147677 -10502 8054 -3717 61588 -56325 -36338 -139543 -102274 46830 31292
1251 31292 17132 -26771 -19863 -29111 -63602 -47147 -44217 -69758 -68833 -23020 -61293 -109013 -56374
1238 -56374 -179915 -75770 -24868 -147637 -133532 -32367 -18429 87108 73836 24941 36574
1227 36574 -27048 -97478 -73339 -66829 -105044 -132117 36040 82695 -58458 -71101 -135123 -115541
$$ packed form
1310a43246O2967J82038R304m0715J2865p4805Q0464j3093q6348p8974R6779k1077
1298a3841m2382p0121j1538o2957R0435J24373j6571L2494r1682K730J07643q8131
1286c9548L177k1291j04026K6466O0081k7412J0809P6746J0410L2555r939r0564
1274g2536k1804n9822Q8572P3130p5962l1801n1725r2231K5015J7039k311l9171
1262b43607R5930J37175J8556j1771O5305j17913J9987j03205L7269J49104j5538
1251C1292j4160m3903O908r248l4491J6455K930k5541R25M5813l8273m7720N2639
1238e6374j23541J04145N0902j22769J4105J01165J3938J05537j3272m8895J1633
1227C6574o3622p0430K4139O510l8215k7073J68157M6655j41153j2643o4022J9582
$$ plain form
1215 -115541 -108024 1339 -40115 -125194 -21617 70075 17016 -34434 -65030 -29620 39021
1204 39021 48150 36207 -36253 -15765 -30579 37167 -66501 -54541 -91622 -36025 6285 -69196
1192 -69196 -160719 -137838 -69063 -25002 -29202 -35544 -99401 -71714 -43779 -52521 -115367 -29702
1180 -29702 54894 24043 91200 42238 51083 75414 4375 -91301 27348 -26712 -130845 -52180
1168 -52180 -1085 31140 -37942 -91912 -46041 -44948 -18071 44845 30111 21721 -5704 43291
1156 43291 103098 -41485 -56023 -43727 9879 -36856 -15108 -61865 37073 19242 -66590 -83268
1144 -83268 -94635 -32978 -49075 -13945 -54171 -75329 -52614 -36883 89433 57718 123099 44466
1132 44466 -51640 -148940 -127899 -67092 -55752 -38323 -17019 -41249 -78370 -21999 -6983 -26456
$$ packed form
1215a15541P517J09363m1454q5079J03577R1692n3059n1450l0596L5410O8641
1204C9021R129j1943p2460K0488j4814O7746j03668J1960l7081N5597M2310p5481
1192f9196r1523K2881O8775M4061m200o342o3857K7687K7935q742o2846Q5665
1180b9702Q4596l0851O7157m8962Q845K4331p1039r5676J18649n4060j04133P8665
1168e2180N1095L2225o9082n3970M5871J093K6877O2916j4734q390k7425M8995
1156D3291N9807j44583j4538J2296N3606m6735K1748m6757R8938j7831q5832j6678
1144h3268j1367O1657j6097L5130m0226k1158K2715J5731J26316l1715O5381p8633
1132D4466r6106r7300K1041O0807J1340J7429K1304k4230l7121N6371J5016j9473
$$ plain form
1120 -26456 -140974 -14244 -8840 -5567 -23331 -50109 6389 -15377 -45993 -14083 61198 11483
1108 11483 -44370 71382 83628 48414 13266 23573 42242 -44387 -88319 -95333 -157733 -42211
1096 -42211 -16846 -45589 -4794 27136 3598 42870 62428 378 -39660 -68444 17395 -71774
1084 -71774 -109701 -1999 -17003 -87581 -104098 39766 61474 98553 129536 75664 53904
1073 53904 -8590 28740 31710 -2922 -20028 -27476 -37944 -53353 -6456 -11919 -49005 3166
1061 3166 34709 -82364 6212 37443 85899 47382 6956 27617 8047 -52722 -21313 -38214
1049 -38214 -22621 26581 51454 98744 -54164 -79801 -14612 73462 -21666 -53889 -1509 7637
1037 7637 85252 71445 71919 110836 86546 20250 -20838 25624 -31000 -96340 23904 -55614
$$ packed form
1120b6456j14518J26730N404L273j7764k6778N6498k1766l0616L1910P5281m9715
1108A1483n5853J15752J2246l5214l5148J0307J8669q6629m3932p014o2400J15522
1096d2211K5365k8743M0795L1930k3538L9272J9558o2050m0038k8784Q5839q9169
1084g1774l7927J07702j5004p0578j6517J43864K1708L7079L0983n3872k1760
1073E3904o2494L7330K970l4632j7106p448j0468j5409M6897n463l7086N2171
1061C166L1543j17073Q8576L1231M8456l8517m0426K0661j9570o0769L1409j6901
1049c8214J5593M9202K4873M7290j52908k5637O5189Q8074r5128l2223N2380R146
1037G637P7615j3807M74L8917k4290o6296m1088M6462n6624o5340J20244p9518
$$ plain form
1025 -55614 -84466 31281 6780 -42374 -40555 13791 -68086 -11553 43552 59674 -33553 -53831
1013 -53831 -61349 -8605 664 -33331 -8910 90872 101824 21069 -84084 -32650 73304 22661
1001 22661 71876 63231 -100971 -79744 -79432 -142150 -183500 -122092 -83486 -58725 -35152 -95305
989 -95305 -86380 24705 94768 25032 -30788 -17470 -28259 -69777 65433 38811 -47835 -44204
977 -44204 13275 48031 -39246 9403 6126 13250 891 -51741 53058 206373 125277 13403
965 13403 67966 23982 -11765 22613 60668 55938 87000 64842 -37403 -20469 90204 23320
953 23320 15068 9353 -39409 -122403 -54589 -156515 -89658 28683 9067 9634 22397 -31049
941 -31049 -76119 -43018 -74609 -63764 -89698 -63146 -1289 18672 -36459 -63582 -39671 -21008
$$ packed form
1025e5614k8852J15747k4501m9154J819N4346q1877N6533N5105J6122r3227k0278
1013e3831p518N2744R269l3995K4421R9782J0952q0755j05153N1434J05954n0643
1001B2661M9215q645j64202K1227L12o2718m1350O1408L8606K4761K3573o0153
989i5305Q925J11085P0063o9736n5820J3318j0789m1518J35210k6622q6646L631
977d4204N7479L4756q7277M8649l277P124j2359n2632J04799J53315q1096j11874
965A3403N4563m3984l5747L4378L8055m730L1062k2158j02245J6934J10673o6884
953B3320q252n715m8762q2994O7814j01926O6857J18341j9616N67J2763n3446
941c1049m5070L3101l1591J0845k5934K6552O1857J9961n5131k7123K3911J8663
$$ plain form
929 -21008 -90333 -64166 -10288 41645 -29753 8386 -91317 23674 124676 98023 54844 -70331
917 -70331 -8468 -65888 -114676 -74152 -67913 -62388 62038 32778 53701 -24587 32832 12500
905 12500 -59811 -44057 -87673 44193 110097 18551 37591 -32835 -108723 34857 -6362 -140729
893 -140729 -83412 -23905 -26380 -125902 -53292 -26537 59125 -4014 -83166 -28999 35024 -54948
881 -54948 -58897 -6694 -75925 -99575 -105115 -39518 -23423 -39181 6845 -19199 49754 58691 -132084
868 -132084 -25586 -1690 -31096 -48000 5120 -38788 -78270 -122886 -8262 58771 71278
857 71278 170629 210090 104927 35332 4518 51803 15134 -26313 -508 -28438 -41355 -19279
845 -19279 -132013 -141849 47019 114502 -22708 -95948 -3857 21778 -50853 -92645 -103551 36335
$$ packed form
929b1008o9325K6167N3878N1933p1398L8139r9703J14991J01002k6653m3179j25175
917g0331O1863n7420m8788M0524O239N525J24426k9260K0923p8288N7419k0332
905A2500p2311J5754m3616J31866O5904r1546J9040p0426p5888J43580m1219j34367
893a40729N7317N9507k475r9522P2610K6755Q5662o3139p9152N4167O4023q9972
881e4948l949N2203o9231k3650n540O5597J6095j5758M6026k6044O8953Q937j90775
868a32084J06498K3896k9406j6904N3120m3908l9482m4616J14624O7033J2507
857G1278R9351L9461j05163o9595l0814M7285l6669m1447K5805k7930j2917K2076
845a9279j12734r836J88868O7483j37210p3240R2091K5635p2631m1792j0906J39886
$$ plain form
833 36335 -29764 -12486 82928 20591 -7466 -17395 23214 -7863 8589 -19009 23382 -16403
821 -16403 33195 98830 75477 163385 77220 42011 24705 47821 44504 -50997 -142117 -56395
809 -56395 -25006 -108057 4776 -31663 28289 146361 33155 7977 -41662 -34053 51153 -57536
797 -57536 -12862 71081 -5744 -42911 27926 -35179 28700 -12128 54387 -17036 -106582 -191582
785 -191582 -790 74610 14885 7959 -25422 -81696 -52264 29905 226491 125298 -60491
774 -60491 -17949 -42452 33861 58394 80226 94709 92744 113890 135569 89708 125765 246
762 246 -25227 -103093 86179 130519 84498 2774 46067 -16384 -69492 -82190 -73735 -5938
750 -5938 -42604 -21321 4451 -45478 -28968 -1964 -56313 8588 -6051 49736 52661 -4108
$$ packed form
833C6335o6099J7278R5414o2337k8057r929M0609l1077J6452k7598M2391l9785
821a6403M9598O5635k3353Q7908q6165l5209j7306K3116l317r5501r1120Q5722
809e6395L1389q3051J12833l6439N9952J18072j13206k5178m9639P609Q5206j08689
797e7536M4674Q3943p6825l7167P0837o3105O3879m0828O6515p1423q9546q5000
785a91582J90792P5400n9725o926l3381n6274K9432Q2169J96586j01193j85789
774f0491M2542k4503P6313K4533K1832J4483j965K1146K1679m5861L6057j25519
762B46k5473p7866J89272M4340m6021q1724M3293o2451n3108j2698Q455O7797
750e938l6666K1283K5772m9929J6510K7004n4349O4901j4639N5787K925n6769
$$ plain form
738 -4108 -36933 1322 110764 14780 -53015 -32347 22155 102101 5656 -53045 -5255 -36441
726 -36441 28907 -36672 34054 -80105 -101121 -51219 -90650 -27344 -81077 -109693 -77470 -10570
714 -10570 53497 136194 121606 99099 67429 54946 18243 107653 10001 -11932 -60047 16686
702 16686 -12307 -34229 -30397 -47415 -5590 34696 34616 -7805 -15635 25892 71003 -50680 -79465
689 -79465 30266 18672 -36162 13503 100500 120425 10253 41260 102471 40973 48359 110538
677 110538 78131 83061 15569 18624 59187 -11079 -12268 -35356 75827 -15186 -43916 -44997
665 -44997 -47564 1550 29662 -38215 -63321 43602 19152 25988 35029 -3555 13043 2268
653 2268 3727 150595 154321 52704 54405 -101 -83627 -4933 94922 70243 69352 135813 112167
$$ packed form
738d108l2825L8255J09442r5984o7795K0668N4502P9946r6445n8701M7790l1186
726c6441O5348o5579P0726j14159k1016M9902l9431O3306n3733k8616L2223O6900
714a0570O4067Q2697j4588k2507l1670j2483l6703Q9410r7652k1933m8115P6733
702A6686k8993k1922L832j7018M1825M0286q0m2421p830M1527M5111j21683k8785
689g9465J09731j1594n4834M9665Q6997J9925j10172L1007O1211o1498P386O2179
677A10538l2407M930o7492L055M0563p0266j189k3088J11183r1013k8730j081
665d4997k567M9114K8112o7877k5106J06923k4450O836R041l8584J6598j0775
653B268J459J46868L726j01617J701n4506q3526P8694R9855k4679q91O6461k3646
$$ plain form
640 112167 148950 73590 11271 41282 143415 91691 132988 200975 133899 159227 131366 56508
628 56508 10968 4523 17281 -6497 -29573 -60896 -6104 60808 -25392 24035 54719 -61545
616 -61545 -19656 67315 -12124 -21790 -87169 -82637 14692 53213 124871 60541 12347 -73855
604 -73855 -62938 -91541 -21220 -54902 -22302 -79288 -111309 -83829 -84596 140488 59489 91282
592 91282 79516 52115 174541 127786 59870 76141 117942 62925 -20884 14083 47579 1068
580 1068 -11514 62375 22544 -2118 11902 -59076 -48828 -49734 -8867 25980 58027 80359 64712
567 64712 93157 -26447 -51911 8223 70535 136971 207056 116479 -25431 -123963 -91678 -45132
555 -45132 71297 59128 33712 -26912 -16348 22422 -82248 -81969 -47941 52891 8592 -3238
$$ packed form
640A12167L6783p5360o2319L0011J02133n1724M1297O7987o7076K5328k7861p4858
628E6508m5540o445J2758k3778k3076l1323N4792O6912q6200M9427L0684j16264
616f1545M1889Q6971p9439r666o5379M532R7329L8521P1658o4330m8194q6202
604g3855J0917k8603P0321l3682L2600n6986l2021K7480p67K25084q0999L1793
592I1282j1766k7401J22426m6755o7916J6271M1801n5017q3809L4967L3496m6511
580A068j2582P3889l9831k4662J4020p0978J0248r06M0867L4847L2047K2332j5647
567F4712K8445j19604k5464O0134O2312O6436P0085r0577j41910r8532L2285M6546
555d5132J16429j2169k5416o0624J0564L8770j04670K79L4028J00832m4299j1830
$$ plain form
543 -3238 -74966 -50718 -13811 76863 73654 127709 131503 412 110212 107127 -72145 -55832
531 -55832 -17691 -47963 42183 105599 149199 125233 20652 27066 -18372 87226 91748 -42903
519 -42903 -80683 -89552 10497 100772 85853 69490 147148 65530 14425 39903 108842 -7326
507 -7326 -30364 -48428 57198 130309 129490 79665 63768 82405 106237 118516 1257 11745
495 11745 142695 97736 76734 -2405 -86853 -59565 -74903 67555 12459 19005 58411 82575
483 82575 46536 67183 95577 -11501 -77361 -6082 -76575 34520 84459 35319 42479 25166
471 25166 51907 109553 120336 111247 76649 56894 -48267 68494 88093 22724 136889 115851
459 115851 59776 37150 82280 82681 78332 33580 86189 104020 -11510 -14548 113311 70953
$$ packed form
543c238p1728K4248L6907R0674l209N4055L794j31091J09800l085j79272J6313
531e5832L8141l0272R0146O3416M3600k3966j04581O414m5438J05598M522j34651
519d2903l7780q869J00049R0275j4919j6363P7658q1618n1105K5478O8939j16168
507g326k3038j8064J05626P3111q19m9825j5897J8637K3832J2279j17259J0488
495A1745J30950m4959k1002p9139q4448K7288j5338J42458n5096O546L9406K4164
483H2575l6039K0647K8394j07078o5860P1279p0493J11095M9939m9140P160j7313
471B5166K6741N7646J0783r089l4598j9755j05161J16761J9599o5369J14165k1038
459A15851n6075k2626M5130M01m349m4752N2609J7831j15530l038J27859m2358
$$ plain form
447 70953 41859 64124 80074 58832 11263 102601 134658 127588 150283 98417 67141 -14422
435 -14422 -45296 32260 166318 271924 183062 113172 6946 -43150 27873 54412 89183
424 89183 40611 69669 127746 187096 109317 58579 -14382 35790 138288 181467 152360 56977
412 56977 68141 27441 50613 107291 91349 78131 -27549 86559 113057 112414 124825 134493
400 134493 166090 102937 94907 286506 195027 105870 190678 134309 84679 63504 98861 88106
388 88106 66740 98279 63882 44898 -773 48647 156049 90848 136722 117515 57788 113761
376 113761 14718 -65074 38509 11990 12832 129224 152585 103985 135675 84434 -9292 -18767
364 -18767 27984 -20144 195326 191596 192693 256681 210399 185663 122002 113390 65764 123788
$$ packed form
447G0953k9094K2265J5950k1242m7569R1338L2057p070K2695n1866l1276q1563
435a4422l0874P7556J34058J05606q8862o9890j06226n0096P1023K6539L4771
424H9183m8572K9058N8077N9350p7779n0738p2961N0172J02498M3179k9107r5383
412E6977J1164m0700K3172N6678j5942j3218j05680J14108K6498o43J2411R668
400A34493L1597o3153q030J91599r1479q9157Q4808n6369m9630k1175L5357j0755
388H8106k1366L1539l4397j8984m5671M9420J07402o5201M5874j9207n9727N5973
376A13761r9043p9792J03583k6519Q42J16392K3361m8600L1690n1241r3726r475
364a8767M6751m8128K15470l730J097O3988m6282k4736o3661q612m7626N8024
$$ plain form
352 123788 237409 161662 123360 93311 56443 208542 154503 130942 121305 54929 45319 45421
340 45421 16288 -38621 85000 140794 110603 225052 218437 284364 235818 90304 26248 75637
328 75637 12543 52494 68324 -20635 114842 143807 100679 37834 60669 -48360 -17032 33598
316 33598 88875 135848 235353 168059 239669 204732 127041 153284 134021 180543 211916 125575
304 125575 46825 92776 95400 44373 137644 73842 25185 49447 64074 160284 168948 98060
292 98060 64834 72543 278416 263631 15619 -93573 -90927 87988 115556 43215 10204 -2527
280 -2527 58019 190670 109517 72343 99180 102644 66719 90317 67928 172872 279315 270882
268 270882 207223 101525 120694 70393 79424 130907 53735 79818 22551 35649 132772 133533
$$ packed form
352A23788J13621p5747l8302l0049l6868J52099n4039k3561r637o6376r610J02
340D5421k9133n4909J23621N5794l0191J14449o615O5927m8546j45514o4056M9389
328G5637o3094L9951J5830q8959J35477K8965m3128o2845K2835j09029L1328N0630
316C3598N5277M6973R9505o7294P1610l4937p7691K6243j9263M6522L1373q6341
304A25575p8750M5951K624n1027R3271o3802m8657K4262J4627R6210Q664p0888
292I8060l3226P709K05873j4785k48012j09192K646J78915K7568p2341l3011j2731
280b527O0546J32651q1153l7174K6837L464l5925K3598k2389J04944J06443q433
268B70882o3659j05698J9169n0301R031N1483p7172K6083n7267J3098R7123P61
$$ plain form
256 133533 212392 183626 205971 143011 38086 73117 60807 159570 251041 251400 229940 206427
244 206427 123078 117462 39080 92807 116098 175138 121812 151560 116448 68377 109502 77334
232 77334 133943 92152 114722 152057 180132 48422 47387 158710 81205 129211 35347 89767
220 89767 12182 52165 102926 138104 81403 45457 61003 1343 164807 191416 94504 67469
208 67469 123945 241620 133141 64303 129615 154785 179432 83071 109646 145086 196099 161978
$$ packed form
256A33533P8859k8766K2345o2960j04925L5031j2310R8763R1471L59k1460k3513
244B06427q3349n616p8382N3727K3291N9040n3326K9748l5112m8071M1125l2168
232G7334N6609m1791K2570L7335K8075j31710j035J11323p7505M8006r3864N4420
220H9767p7585L9983N0761L5178n6701l5946J5546n9660J63464K6609r6912k7035
208F7469N6476J17675j08479o8838O5312K5170K4647r6361K6575L5440N1013l4121
$$ [...]
##END NTUPLES=NMR SPECTRUM
##END=
