##TITLE=1H_EC-3327(II-2)
 CDCl3
 8 sc, 
 30.5.2024
##JCAMPDX= 6.0         $$ Bruker NMR JCAMP-DX V2.0
##DATA TYPE= NMR SPECTRUM
##DATA CLASS= NTUPLES
##ORIGIN= UXNMR, Bruker Analytische Messtechnik GmbH
##OWNER= root
$$ XWIN-NMR		Version 3.5
$$ Thu May 30 13:47:02 2024 Russian Standard Time (UT+4h)  she@DPX200
##.OBSERVE FREQUENCY= 200.1309
##.OBSERVE NUCLEUS= ^1H
##.ACQUISITION MODE= SIMULTANEOUS
##.ACQUISITION SCHEME= undefined
##.AVERAGES= 8
##.DIGITISER RES= 18
##SPECTROMETER/DATA SYSTEM= spect
##.PULSE SEQUENCE= zg30
##.SOLVENT NAME= CDCl3
##.SHIFT REFERENCE= (INTERNAL, CDCl3, 0, 15.8042)
##AUDIT TRAIL= $$ (NUMBER, WHEN, WHO, WHERE, WHAT)
$$ ##TITLE= Audit trail, XWIN-NMR		Version 3.5
$$ ##JCAMPDX= 5.01
$$ ##ORIGIN= Bruker BioSpin GmbH
$$ ##OWNER= she
$$ F:/spectra/data/she/nmr/H-F/1/pdata/1/auditp.txt
$$ ##AUDIT TRAIL=  $$ (NUMBER, WHEN, WHO, WHERE, WHAT)
(   1,<2024-05-30 13:45:50.50 +0400>,<she>,<DPX200>,
      <created by zg, POWCHK disabled, PULCHK disabled
       configuration hash MD5:
       00 E9 B6 7A A2 85 ED C7 34 08 36 98 17 FE 4E 26
       data hash MD5: 16K
       A9 F4 11 E3 0E A0 87 3B D3 71 8B 0A 28 BB ED DD>)
(   2,<2024-05-30 13:45:53.21 +0400>,<she>,<DPX200>,
      <Start of raw data processing
       efp BC_mod = 2 LB = 0.24 FT_mod = 6 PKNL = 1 PHC0 = -25307.71 PHC1 = 7.18748 SI = 16K 
       data hash MD5: 16K
       D2 FE 12 D3 6B 0C 76 5C 47 A4 F3 27 E5 1E 4C 00>)
(   3,<2024-05-30 13:46:12.96 +0400>,<she>,<DPX200>,
      <pk PHC0 = -1.242024 PHC1 = 1.4 
       data hash MD5: 16K
       17 A2 4B A3 3A 53 8C 2C FB 3C 84 8B EC 5B CC 54>)
(   4,<2024-05-30 13:46:16.57 +0400>,<she>,<DPX200>,
      <abs ABSG = 5 
       data hash MD5: 16K
       D9 05 26 51 7A B3 DE F8 9C 23 E3 CC F5 97 9C 33>)
$$ ##END=
$$ 
$$ hash MD5
$$ 72 51 BC DB FF 22 99 3E 93 5D D5 4B 02 1D AB B8
##$RELAX= 
##$RELAX= 
##$RELAX= 
##$RELAX= 
##$RELAX= 
##$RELAX= 
$$ Bruker specific parameters
$$ --------------------------
##$DU= <F:/spectra>
##$EXPNO= 1
##$NAME= <H-F>
##$PROCNO= 1
##$TYPE= <nmr>
##$USER= <she>
##$AMP= (0..31)
100 100 100 100 100 100 100 100 100 100 100 100 100 100 100 100 100 100 
100 100 100 100 100 100 100 100 100 100 100 100 100 100 
##$AQSEQ= 0
##$AQ_mod= 1
##$AUNM= <au_zg>
##$AUTOPOS= <>
##$BF1= 200.13
##$BF2= 200.13
##$BF3= 200.13
##$BF4= 200.13
##$BF5= 200.13
##$BF6= 200.13
##$BF7= 200.13
##$BF8= 200.13
##$BYTORDA= 1
##$CFDGTYP= 0
##$CFRGTYP= 5
##$CHEMSTR= <none>
##$CNST= (0..31)
1 1 145 1 1 1 1 1 1 1 1 1 1 1 1 1 1 1 1 1 1 1 1 1 1 1 1 1 1 1 1 1 
##$CPDPRG= <>
##$CPDPRG1= <>
##$CPDPRG2= <>
##$CPDPRG3= <>
##$CPDPRG4= <mlev>
##$CPDPRG5= <mlev>
##$CPDPRG6= <mlev>
##$CPDPRG7= <mlev>
##$CPDPRG8= <mlev>
##$CPDPRGB= <>
##$CPDPRGT= <>
##$D= (0..31)
0 1.2 0 0 0 0 0 0 0 0.06 0 0.03 0 0 0 0 0.0002 0 0 0 0 0 0 0 0 0 0 0 0 
0 0 0 
##$DATE= 1717062350
##$DBL= (0..7)
120 120 120 120 120 120 120 120 
##$DBP= (0..7)
150 150 150 150 150 150 150 150 
##$DBP07= 0
##$DBPNAM0= <>
##$DBPNAM1= <>
##$DBPNAM2= <>
##$DBPNAM3= <>
##$DBPNAM4= <>
$$ [...]
##$SUBNAM3= <"">
##$SUBNAM4= <"">
##$SUBNAM5= <"">
##$SUBNAM6= <"">
##$SUBNAM7= <"">
##$SUBNAM8= <"">
##$SUBNAM9= <"">
##$SW= 18.0517689322627
##$SWIBOX= (0..15)
0 0 2 0 0 0 0 0 0 0 0 0 0 0 0 0 
##$SW_h= 3612.71676300578
##$TD= 16384
##$TD0= 1
##$TE= 0
##$TE2= 300
##$TE3= 300
##$TEG= 300
##$TL= (0..7)
0 120 120 120 120 120 120 120 
##$TP= (0..7)
150 150 150 150 150 150 150 150 
##$TP07= 0
##$TPNAME0= <>
##$TPNAME1= <>
##$TPNAME2= <>
##$TPNAME3= <>
##$TPNAME4= <>
##$TPNAME5= <>
##$TPNAME6= <>
##$TPNAME7= <>
##$TPOAL= (0..7)
0.5 0.5 0.5 0.5 0.5 0.5 0.5 0.5 
##$TPOFFS= (0..7)
0 0 0 0 0 0 0 0 
##$TUNHIN= 0
##$TUNHOUT= 0
##$TUNXOUT= 0
##$USERA1= <user>
##$USERA2= <user>
##$USERA3= <user>
##$USERA4= <user>
##$USERA5= <user>
##$V9= 5
##$VALIST= <valist>
##$VCLIST= <CCCCCCCCCCCCCCC>
##$VD= 0
##$VDLIST= <DDDDDDDDDDDDDDD>
##$VPLIST= <PPPPPPPPPPPPPPP>
##$VTLIST= <TTTTTTTTTTTTTTT>
##$WBST= 1024
##$WBSW= 4
##$XGAIN= (0..3)
0 0 0 0 
##$XL= 0
##$YL= 0
##$YMAX_a= 496453
##$YMIN_a= -631164
##$ZGOPTNS= <>
##$ZL1= 120
##$ZL2= 120
##$ZL3= 120
##$ZL4= 120
##$ABSF1= 15.80642
##$ABSF2= -2.245471
##$ABSG= 5
##$ABSL= 3
##$ALPHA= 0
##$AQORDER= 0
##$ASSFAC= 0
##$ASSFACI= 0
##$ASSFACX= 0
##$ASSWID= 0
##$AUNMP= <proc_1d>
##$AZFE= 0.1
##$AZFW= 0.1
##$BCFW= 0
##$BC_mod= 2
##$BYTORDP= 0
##$COROFFS= 0
##$CY= -3
##$DATMOD= 1
##$DC= 0
##$DFILT= <>
##$DTYPP= 0
##$F1P= 0
##$F2P= 0
##$FCOR= 1
##$FTSIZE= 16384
##$FT_mod= 6
##$GAMMA= 0
##$GB= 0
##$INTBC= 1
##$INTSCL= 3.70164e-10
##$ISEN= 128
##$LB= 0.24
##$LEV0= 0
##$LPBIN= 0
##$MAXI= 10000
##$MC2= 0
##$MEAN= 0
##$ME_mod= 0
##$MI= 1.114404
##$NCOEF= 0
##$NC_proc= -6
##$NLEV= 6
##$NOISF1= 3.799351
##$NOISF2= 2.8
##$NSP= 0
##$NTH_PI= 0
##$NZP= 0
##$OFFSET= 15.80422
##$PC= 1
##$PHC0= -25308.95
##$PHC1= 8.58748
##$PH_mod= 1
##$PKNL= yes
##$PPARMOD= 0
##$PSCAL= 0
##$PSIGN= 0
##$REVERSE= no
##$SF= 200.12954346743
##$SI= 16384
##$SIGF1= 3
##$SIGF2= 2
##$SINO= 5.538805
##$SIOLD= 16384
##$SREGLST= <1H.CDCl3>
##$SSB= 0
##$STSI= 16384
##$STSR= 0
##$SW_p= 3612.71676300577
##$SYMM= 0
##$S_DEV= 0
##$TDeff= 16384
##$TDoff= 0
##$TI= <>
##$TILT= no
##$TM1= 0
##$TM2= 0
##$TOPLEV= 0
##$USERP1= <user>
##$USERP2= <user>
##$USERP3= <user>
##$USERP4= <user>
##$USERP5= <user>
##$WDW= 1
##$XDIM= 16384
##$YMAX_p= 463209153
##$YMIN_p= -276708
$$ End of Bruker specific parameters
$$ ---------------------------------
##NTUPLES= NMR SPECTRUM
##VAR_NAME=  FREQUENCY,     SPECTRUM/REAL,   SPECTRUM/IMAG
##SYMBOL=    X,             R,               I
##VAR_TYPE=  INDEPENDENT,   DEPENDENT,       DEPENDENT
##VAR_FORM=  AFFN,          ASDF,            ASDF
##VAR_DIM=   16384,         16384,           16384
##UNITS=     HZ,            ARBITRARY UNITS, ARBITRARY UNITS
##FACTOR=    0.220516191357247, 1,           1
##FIRST=     3162.89137340167, 0,            0
##LAST=      -449.825389604096, 0,           0
##MIN=       -449.825389604096, -276708,     0
##MAX=       3162.89137340167, 463209153,    0
$$ Real data points
##PAGE= N=1
##DATA TABLE= (X++(R..R)), XYDATA
$$ [...]
6385B06924l6450p2353P551J59682N272N383J5987J74028j39273N6465N0146o3179
6373C70183J0293j12925L540M0058p076n5151J55356P5443j54202r1563J06522
6362C40478L0070L5457o718o9482M112M8735K1497J4979k630o6140J9893J0651
6350C80902o6271M6120J29747n8721p0250n2248O97M3075Q6559J32323l2125K4017
6338E63825r4209j51764M1570j1969J1353J4845J5654N3627K1875R381J3561M234
6326D91983L623J9904o6123j5742K5875J2145J05366M8750R8504m3779K2954r1252
6314F12208j20957m0941k9055N8936O9787O6678J00898q8741r564L4255k0258
6303F33246J8294P5680J6314R000M2945o7879M720m980J1223r4411P3595j5232
$$ y = [206924, 170474, 98121, 105672, 265354, 270626, 276009, 291996, 466024, 326751, 383216, 433362, 370183, 380476, 267551, 271091, 311149, 304073, 248922, 404278, 479721, 325519, 233956, 340478, 370548, 406005, 399287, 329805, 333917, 382652, 404149, 419128, 416498, 350358, 370251, 380902, 314631, 360751, 490498, 431777, 361527, 309279, 309976, 353051, 439610, 571933, 539808, 563825, 469616, 317852, 359422, 347453, 358806, 373651, 389305, 442932, 464807, 474188, 487749, 491983, 495606, 515510, 449387, 433645, 459520, 471665, 577031, 625781, 724285, 680506, 703460, 612208, 491251, 450310, 421255, 480191, 549978, 616656, 717554, 628813, 619249, 653504, 633246, 651540, 727220, 743534, 752534, 795479, 727600, 732320, 727340, 738563, 644152, 717747, 702515]
6291G02515o846L810J88160L4344n8474k0243K2716o3006N9395N2145K549K7865
6279I44930J07488j2080K7078j0522m955p3070L6343M0593m2796k8427Q0902Q6976
6267A152460m1468O5017n7063N6410p5963j42129O3214J22235p951k9882K931
6256A107811L0390j01951K9726Q6819K8652Q0849l3787n3570N0155O0401L4705
6245A320200J6404J17405m0208M7974m541l8075J42797n8971l5907P2001K2469
6234A561548m3061O9512L6026J18816N4638O4838M1446K847J17832L5888R976
6223B070306O0702J14939R078m9851J46794O7607J713L9919J59710O5914q6102
6212B600729J21790R4033l0517Q6295P7205J17262O2905J41891J97204J4872J05875
$$ y = [702515, 695669, 699479, 887639, 921983, 863509, 843266, 865982, 802976, 862371, 914516, 917065, 944930, 1052418, 1040338, 1067416, 1056894, 1051939, 978869, 1015212, 1055805, 1013009, 984582, 1065484, 1152460, 1110992, 1176009, 1118946, 1175356, 1099393, 957264, 1020478, 1142713, 1134762, 1104880, 1107811, 1138201, 1036250, 1065976, 1152795, 1181447, 1262296, 1228509, 1174939, 1225094, 1285495, 1320200, 1336604, 1454009, 1413801, 1461775, 1457234, 1419159, 1561956, 1502985, 1467078, 1539079, 1561548, 1518487, 1587999, 1624025, 1742841, 1797479, 1862317, 1903763, 1906610, 2024442, 2060330, 2070306, 2131008, 2245947, 2255025, 2205174, 2351968, 2419575, 2421288, 2461207, 2620917, 2686831, 2600729, 2722519, 2816552, 2786035, 2872330, 2949535, 3066797, 3129702, 3271593, 3468797, 3483669, 3589544]
6201C589544N8058l3203J64040J27704J54824K16180l4527R0928J94868J30563
6191D658979k4021K67498J81518Q7288J23764N7457J04269J86244J76096J34935
6181E954027J75725K12102N3556J89183K25324K73776K77099K44415R1763K80089
6171G977059M44348L84101L56122M27277L67823M37003P40181O68464O83755P60392
6161A3246525Q30154P84725R68288J194983J261461J492572J600321J674072K010290
6152B5063391K222137K156295J629341R69816l88247j454298j785018j821292
6144B6592125j675468j269559q05765n37990l99733k02713K44607M58101O13755
6135B3017360Q31307J116486J338929J606591J713933J965131K295913K559948
$$ y = [3589544, 3647602, 3614399, 3778439, 3906143, 4060967, 4277147, 4242620, 4333548, 4528416, 4658979, 4634958, 4902456, 5083974, 5171262, 5295026, 5352483, 5456752, 5642996, 5819092, 5954027, 6129752, 6341854, 6395410, 6584593, 6809917, 7083693, 7360792, 7605207, 7696970, 7977059, 8421407, 8805508, 9161630, 9588907, 9956730, 10393733, 11133914, 11802378, 12486133, 13246525, 14076679, 14861404, 15829692, 17024675, 18286136, 19778708, 21379029, 23053101, 25063391, 27285528, 29441823, 31071164, 32040980, 31652733, 30198435, 28413417, 26592125, 24916657, 23647098, 22841333, 22303343, 21903610, 21700897, 21945504, 22403605, 23017360, 23848667, 24965153, 26304082, 27910673, 29624606, 31589737, 33885650, 36445598]
6127C6445598K981640L389454L576955M030061M392962L885951K117635r02201
6119E9918055m006697n611039n759004n015565m050521l151836k555688k158222
6111B7609483j650504j152389q61763n71266j04710J23979L81270M33419O14294
6102B4821813P60867P52768Q95317J042469J153644J385103J410075J575727J332746
6093C5130529M27896j064867k269584l044427l017199k684785k489261k127282
6085A8861020j759538j674939j121621j017616r31312p73571n39583l48986m12240
6076A0281614m18222m53157l36587m37752l35536m53312m44323k86998l13785
6067F801942l30533k55994k56808j73852k21779j99901j99082k50541q1967j14056
$$ y = [36445598, 39427238, 42816692, 46393647, 50423708, 54816670, 58702621, 60820256, 59918055, 55911358, 50300319, 44541315, 39525750, 35475229, 32323393, 29767705, 27609483, 25958979, 24806590, 23944827, 23373561, 23268851, 23392830, 23774100, 24207519, 24821813, 25582680, 26335448, 27230765, 28273234, 29426878, 30811981, 32222056, 33797783, 35130529, 35558425, 34493558, 32223974, 29179547, 26162348, 23477563, 20988302, 18861020, 17101482, 15426543, 14304922, 13287306, 12355994, 11582423, 11042840, 10693854, 10281614, 9863392, 9410235, 9073648, 8635896, 8300360, 7847048, 7402725, 7115727, 6801942, 6471409, 6215415, 5958607, 5784755, 5562976, 5363075, 5163993, 4913452, 4831485, 4717429]
6057D717429k74940k03998j51366o0043j29582p6747j61983j01594k1116r0428
6047C445632o7053j43248k8903R878n2288q8680k043N0818o2544r4923l9851k7337
6035B899458o3441L0348M4135M0355r8067J9007j13408l5856M1302p1801j48559
6024B543473o9492O7771j3756O031k466n8489J2730P6971J2047P6549Q7656M6031
6012B785056J04457J00056j0350o8272J2608M5690M2801J21614j2956j4853J30880
6001C236731K15474R8170J61192O0191J86719L43597J85447L76444K37228L51914
5991E453107K99194M00089M83873M14990M14441P2461k36039m64346k99155l21638
5981F216977l33989j66385j63548j55491j3034J49614Q861J16093J22180J45563
$$ y = [4717429, 4442489, 4238491, 4087125, 4027082, 3897500, 3820753, 3658770, 3557176, 3536060, 3445632, 3378579, 3235331, 3206428, 3216306, 3164018, 3075338, 3073295, 3124113, 3061569, 2966646, 2926795, 2899458, 2836017, 2866365, 2910500, 2950855, 2852788, 2871795, 2758387, 2722531, 2763833, 2692032, 2543473, 2473981, 2541752, 2527996, 2534027, 2531561, 2473072, 2485802, 2562773, 2574820, 2651369, 2739025, 2785056, 2889513, 2989569, 2979219, 2910947, 2923555, 2969245, 3012046, 3133660, 3120704, 3105851, 3236731, 3452205, 3550375, 3711567, 3771758, 3958477, 4302074, 4487521, 4863965, 5101193, 5453107, 5752301, 6152390, 6636263, 7051253, 7465694, 7538155, 7302116, 6837770, 6538615, 6216977, 5882988, 5716603, 5553055, 5397564, 5384530, 5534144, 5543005, 5659098, 5781278, 5926841]
5971E926841M08035K47859K76657M11961N11997O61323O71713Q09780P94548R05437
5961A1626151Q74255L85383k37290q03632j093771j044233j039251q32054o47601
5952G187957n28963m89067m11409j43559k55396k37102j29894N0053M9942R4512
5942E187074L7630M1252J53247K65873L10350M25974L51211M27265J49497M1185
5932G390558k87394o70740o51906n49199n87526m75817l06842k87831l54621m04663
5922B814019k58736j91817p7296j74543o3880o210p5307k54257m6919M3747j27489
5911A581312m4244K2476q0019n5789K1877l0448j63442j07249m109p8728L1211
5900A092848J889m3544Q3732J5844k3091n06o6627k6713L0004n9554o7368j09642
$$ y = [5926841, 6334876, 6582735, 6859392, 7271353, 7783350, 8444673, 9116386, 9926166, 10720714, 11626151, 12500406, 12885789, 12648499, 11844867, 10751096, 9706863, 8667612, 7835558, 7187957, 6658994, 6169927, 5758518, 5614959, 5359563, 5122461, 4992567, 5042620, 5092562, 5187074, 5224704, 5265956, 5419203, 5685076, 5995426, 6421400, 6772611, 7199876, 7349373, 7390558, 7103164, 6432424, 5780518, 5231319, 4643793, 4167976, 3861134, 3573303, 3218682, 2814019, 2555283, 2363466, 2286170, 2111627, 2047747, 2041537, 1966230, 1711973, 1665054, 1708801, 1581312, 1537068, 1559544, 1479525, 1423736, 1445613, 1415165, 1251723, 1144474, 1140365, 1061637, 1092848, 1094737, 1051193, 1134925, 1150769, 1127678, 1127172, 1060545, 1033832, 1063836, 1004282, 936914, 827272]
5888H27272O7240J77900m4574L6777l6042Q0189k0537m2001j28756j25751J22541
5877I14258k4468q1740Q3685l1152j64247j4026L4646M659N4985J07858q1863
5866H02595p9149L4585J14583o551j9192L7318Q8434l861k9833q1630m6592L6579
5854H47286O9265j07723k8348o3192M1101m4053J3836K0772o5027N0513N5112
5843G89542r6416P621J0316N2J7124j5283J58801l5024n8055q5478N7279J37850
5831H88329m7099l5294m6194K9172K8257j14293J9498N850J01003P0150O617j05881
5819H00115l3220l9584m6948Q9081M2078m4863l9876n3194N6846J70169j1121
5808H89483o1267k7074M7436o1531J0134k8816m7696p1454k9487J8190m35P0239
$$ y = [827272, 894512, 1072412, 1027838, 1064615, 1028573, 1108762, 1088225, 1046224, 917468, 791717, 914258, 889790, 808050, 891735, 860583, 696336, 682310, 716956, 721615, 776600, 884458, 802595, 723446, 758031, 872614, 866063, 846871, 884189, 972623, 968762, 938929, 857299, 810707, 847286, 916551, 808828, 780480, 717288, 758389, 714336, 728172, 748944, 683917, 734430, 789542, 693126, 700747, 711063, 711115, 728239, 712956, 871757, 836733, 778678, 693200, 750479, 888329, 841230, 805936, 759742, 788914, 817171, 702878, 722376, 728226, 829229, 899379, 905996, 800115, 766895, 727311, 680363, 769444, 811522, 766659, 726783, 673589, 730435, 900604, 889483, 828216, 801142, 848578, 787047, 797181, 768365, 720669, 649215, 619728, 637918, 637483, 707722]
5796G07722p0719K0666K2953P8413J276m937k3954j3969Q3359K753k9275J2507
5784G86795J09679L23j1245J6786j3461r0949j30875N9059R9917j43671L4080
5773G16438k8504O9953K8230N6225j17565m2076J8469K8542L3272J8545M3883
5762H25412J9728N3871n9865J35146o3229J8510Q636r8467q2170N3267O923k2053
5750G95709k0540P3054l4178N0859n1036O9819J52976j44713l3681K0429j07188
5739G71510Q1016P484j04264J0093L02713J186N6313n8158Q9259l5717J06888
5728A228323M7289o1337J16126J32123N7585o3282M2098p8529r9423L9927k0387
5717A340513n2197N7270j19556N837P2866N4531J9569k8820K1619Q5056k2820
$$ y = [707722, 637003, 657669, 680622, 759035, 760311, 755374, 731420, 717451, 800810, 803563, 774288, 786795, 896474, 896797, 885552, 902338, 888877, 797928, 667053, 726112, 826029, 682358, 716438, 687934, 757887, 786117, 842342, 724777, 682701, 701170, 729712, 762984, 781529, 825412, 845140, 899011, 839146, 974292, 911063, 929573, 938209, 839742, 757572, 810839, 817762, 795709, 775169, 848223, 814045, 864904, 813868, 883687, 1036663, 891950, 858269, 878698, 771510, 852526, 860010, 755746, 765839, 1068552, 1069738, 1126051, 1067893, 1157152, 1121435, 1228323, 1275612, 1214275, 1330401, 1462524, 1520109, 1456827, 1498925, 1420396, 1320973, 1360900, 1340513, 1288316, 1345586, 1226030, 1231867, 1304733, 1359264, 1378833, 1350013, 1371632, 1456688, 1433868]
5706A433868J186J48564Q7543j9699Q2599J3488J4889J41490J40988J54715J78913
5695B378544o1058j14359j77937O3131j17699j76024j20520j4162J03898Q6816
5685A850630p2663l6762K7231J28642R4070k5699N0303R3196P1639P7811q5647
5674B172751Q4500K08234J35621P5198K05381J57928J09805j51364j85427j57408
5664B655219j53085k8317P7074m4016j98598J26351M2852j73863O5034N5956J48283
5653B572890J13714m8935J26646J09475L3632J08299J34387J58847J04020R3770
5643C506745O3194N6134O1172J18742M6640j18998j06501r4528k1684l9555M8519
5632C519880k8356J10748J45875M2061N2540J49293P0760M998Q0111J50766J22355
$$ y = [1433868, 1435054, 1583618, 1671161, 1651462, 1734061, 1747549, 1762438, 1903928, 2044916, 2199631, 2378544, 2317486, 2203127, 2025190, 2088321, 1970622, 1794598, 1674078, 1659916, 1763814, 1850630, 1777967, 1741205, 1768436, 1897078, 1991148, 1965449, 2015752, 2108948, 2180587, 2258398, 2172751, 2257251, 2465485, 2601106, 2676304, 2881685, 3039613, 3149418, 2998054, 2812627, 2655219, 2502134, 2473817, 2550891, 2506875, 2308277, 2434628, 2477480, 2303617, 2368651, 2424607, 2572890, 2686604, 2637669, 2764315, 2873790, 2907422, 3015721, 3150108, 3308955, 3412975, 3506745, 3569939, 3626073, 3687245, 3805987, 3852627, 3733629, 3627128, 3532600, 3510916, 3471361, 3519880, 3491524, 3602272, 3748147, 3790208, 3842748, 3992041, 4062801, 4067799, 4147910, 4298676, 4421031]
5621D421031J35596J07474J84756J80413M2640J01566K26328J30203R3685Q2211
5611E705903J00924p7399J61705J36092N4044J49643J21200J00801P0464K91163
5601F814540J27830J43572O6488J44316L19025K64472J83159K23388K51932L30667
5591H869389L66677L03325L62533M25364M98637N57854M89959N33560P24903Q05253
5581A3937454R15999R44854J001048J263064J306608J442496J882908J972181
5573B4666612K065141K297835K566944K607944K182199J039931m55425j992238
5565C4978943k415614k376216k185668j715776j351855q10999o72902l22138O452
5556B3134227J25676L82734O49224R98668J223654J432259J695261K058882K189619
$$ y = [4421031, 4556627, 4664101, 4848857, 5029270, 5071910, 5173476, 5399804, 5530007, 5623692, 5705903, 5806827, 5729428, 5891133, 6027225, 6081269, 6230912, 6352112, 6452913, 6523377, 6814540, 6942370, 7085942, 7152430, 7296746, 7615771, 7880243, 8063402, 8286790, 8538722, 8869389, 9236066, 9539391, 9901924, 10327288, 10825925, 11383779, 11873738, 12407298, 13132201, 13937454, 14853453, 15798307, 16799355, 18062419, 19369027, 20811523, 22694431, 24666612, 26731753, 29029588, 31596532, 34204476, 36386675, 37426606, 36971181, 34978943, 32563329, 30187113, 28001445, 26285669, 24933814, 24122815, 23449913, 23127775, 23134227, 23259903, 23642637, 24291861, 25290529, 26514183, 27946442, 29641703, 31700585, 33890204]
5547C3890204K627664L064620L555556M122140M684098N105207M549395J620628
5539F3219512k155064m761216n712322n617383m933177m057015l422832k631139
5531B9929364k169174j805566j297727j118813p50160m74233m21082j35327J54477
5522B1911759J91218M98358N52831P83529J051212J225045J412219J505131J769959
5513C0901261J621475P83097m78597j810010k499964k699135k587157k224041
5505B1006929j905895j470608j332118j232237j281881r40982p89975o40858p36526
5496A0675849o09108n02380l01494k82723k51968k27071k29716k06566k5699j33280
5486G905844j90990j40415q2898j62148j21074q5190o6761J3491k00611k15114
$$ y = [33890204, 36517868, 39582488, 43138044, 47260184, 51944282, 57049489, 61598884, 63219512, 61064448, 56303232, 50590910, 44973527, 40040350, 35983335, 32560503, 29929364, 27760190, 25954624, 24656897, 23538084, 22787924, 22313691, 21892609, 21757282, 21911759, 22102977, 22601335, 23154166, 23937695, 24988907, 26213952, 27626171, 29131302, 30901261, 32522736, 33305833, 32827236, 31017226, 28517262, 25818127, 23230970, 21006929, 19101034, 17630426, 16298308, 15066071, 13784190, 12843208, 12053233, 11412375, 10675849, 10066741, 9564361, 9262867, 8980144, 8728176, 8501105, 8271389, 8064823, 8039124, 7905844, 7714854, 7574439, 7491541, 7329393, 7208319, 7123129, 7056368, 7069859, 6869248, 6654134]
5476F654134l02549j69545k06851k60970j75722l05702J3093r7174q9394r2015
5466D967305j00339j25937k6148m0044m1184k3537j12071J2620j24381j06918
5456D279366M6653J25288m6564p3830j42987K1504K35723n303j51989R172J39666
5445D436699n1526Q401O7448J3732j13820k16634M0985n7532N5005j0008r3838
5434D078912R5480m048J04667k0093M2464j37778j13309J72566J39103N3668N8907
5423D470539J65072Q5080J58542K1133J04712O6534k4919l2670l0183j61947P2567
5412D894460L2854L103M5786M8262q3927J35242K41368P6629J49328Q9456J54438
5401E786999K39329J95802J24880J49947K28784M04146L04810L34353L12872L35276
$$ y = [6654134, 6351585, 6182040, 5975189, 5714219, 5538497, 5232795, 5245888, 5148714, 5059320, 4967305, 4866966, 4741029, 4714881, 4674837, 4633653, 4610116, 4498045, 4510665, 4386284, 4279366, 4326019, 4451307, 4404743, 4330913, 4187926, 4209430, 4445153, 4439850, 4287861, 4297033, 4436699, 4385173, 4393574, 4461022, 4474754, 4360934, 4144300, 4185285, 4127753, 4182758, 4172750, 4078912, 4174392, 4170344, 4275011, 4254918, 4297382, 4159604, 4046295, 4218861, 4357964, 4411632, 4470539, 4635611, 4720691, 4879233, 4900366, 5005078, 5071612, 5046693, 5014023, 4983840, 4821893, 4894460, 4927314, 4930417, 4976203, 5024465, 4940538, 5075780, 5317148, 5393777, 5543105, 5632561, 5786999, 6026328, 6222130, 6347010, 6496957, 6725741, 7129887, 7434697, 7769050, 8081922, 8417198]
5391H417198N97815O55537N74013N37560M83021K65533j6308k32500m68580n92269
5381A0221020l65508l70338k92042j59006p7694L1067J16096J24640J34479K14861
5371I577575L27254K47648L69576M39136O72046O45954Q28226Q86882R45734J144939
5361A6084970J195150P68156q0760p96006j017541j162684j126817p73402o90050
5352A2401016n15452l97724m21376m24050k48447l00298j48147j9013J7414L3153
5342I977076J49944K16531K28429M02453M84753L11868L74366L40837L04009N1976
5332A2842242k41800m93040o64199m95079j99402l18404m18606k00124j20042
5323I691546j43599j40266J2334J45194j5369l2594k2810Q7078j1470j7477J59942
$$ y = [8417198, 9015013, 9670550, 10244563, 10782123, 11265144, 11530677, 11514369, 11281869, 10813289, 10221020, 9855512, 9485174, 9193132, 9034126, 8956432, 8987499, 9103595, 9228235, 9362714, 9577575, 9904829, 10152477, 10522053, 10961189, 11633235, 12279189, 13107415, 13994297, 14940031, 16084970, 17280120, 18048276, 17967516, 17171510, 16153969, 14991285, 13864468, 13091066, 12401016, 11885564, 11487840, 11066464, 10642414, 10393967, 10093669, 9945522, 9926509, 9943923, 9977076, 10127020, 10343551, 10571980, 10974433, 11459186, 11771054, 12145420, 12486257, 12790266, 12842242, 12600442, 12107402, 11443203, 10948124, 10748722, 10430318, 10011712, 9811588, 9691546, 9547947, 9407681, 9420015, 9565209, 9549840, 9517246, 9494436, 9581514, 9570044, 9552567, 9712509]
5312I712509J76540J64242K02295J45623R9184j53163j32933Q9942j551K31282
5302A0533970J84940L2119J41314K39717J36394K22521K49078L37605K43020K6663
5292A2347341J10909N9773K03214J02725L1074K34941K07012J69785K30047K03133
5282A3899954K15494K29480K10186L18030J75255L10012L34704J51350M09414
5273A6253879M59915L43609M15656L64936M80276N08000M67063M47847M91063
5264B0232244N92348M82479P62398P03391P20558P62672O19179P68362P63582
5255B6407213N60668N64408O43993Q91966R82850R91934Q33676R69472J125832
5246C3972012J245683J461858J495051J430277J404694J520186J838645J938617
$$ y = [9712509, 9889049, 10053291, 10255586, 10401209, 10500393, 10347230, 10214297, 10304239, 10302688, 10533970, 10718910, 10751029, 10892343, 11132060, 11268454, 11490975, 11740053, 12077658, 12320678, 12347341, 12458250, 12518023, 12721237, 12823962, 12855036, 13089977, 13296989, 13466774, 13696821, 13899954, 14115448, 14344928, 14555114, 14873144, 15048399, 15358411, 15693115, 15844465, 16253879, 16713794, 17057403, 17473059, 17837995, 18318271, 18826271, 19293334, 19741181, 20232244, 20824592, 21307071, 22069469, 22772860, 23493418, 24256090, 24875269, 25643631, 26407213, 26967881, 27532289, 28176282, 29068248, 30051098, 31043032, 31876708, 32846180, 33972012, 35217695, 36679553, 38174604, 39604881, 41009575, 42529761, 44368406, 46307023]
5238D6307023J909947J653546J481945J908826K229825K176271J912692J829294
5230F1409369K088161K550832L319111L998412M703578N480898O219852O856469
5222I6626682P463987Q114028Q368544Q257635P768974P928810Q192754P481570
5214A60202984N358727K748142J64546k542369n214263p185906p345975o358815
5206A39827071o360890p305314q385986q550484q252663p308222o320752n059468
5198H2283292l786426k622289j806880p79311j52265k81824o66809j047296j198500
5189F9941692o35849o4368N96445J427090J939950K682853K882959K499695R39073
5180H2209540q65051k222139l417473m698649n331574n288428m721497l914909
$$ y = [46307023, 48216970, 49870516, 51352461, 53261287, 55491112, 57667383, 59580075, 61409369, 63497530, 66048362, 69367473, 73365885, 78069463, 83550361, 89770213, 96626682, 104090669, 112204697, 120573241, 128830876, 136599850, 144528660, 152721414, 160202984, 165561711, 168309853, 168474399, 165932030, 160717767, 153531861, 146185886, 139827071, 133466181, 126160867, 117774881, 109224397, 100971734, 93663512, 87342760, 82283292, 78496866, 75874577, 74067697, 73288386, 73136121, 72854297, 72187488, 71140192, 69941692, 69305843, 69241475, 69837920, 71265010, 73204960, 75887813, 78770772, 81270467, 82209540, 81344489, 79122350, 75704877, 71006228, 65674654, 60386226, 55664729, 51749820]
5172E1749820l268002k618699k066967j720332j186056r48085r12432p11188l74899
5163C7943160j36579K33029M75390P36512J085918J215849R90015M25199q63120
5154D2105373k376450l231516l399300l026767k744783k364178j976846j680132
5146B1305401j458060j409901j118006r66916p31200o11342o91438m58508l33669
5137A3526361l40979m30121l78308k09335j81085o9590j6983j19363n70385o24873
5127A0585339m64624m93713l60574k94484l37471k51689j19509j53209k36274
5118G873792j49794j17439j33827j29740k4143m9807j75233K747L6505p9742r6546
5107F956773q8031n0772k2991O4847k2788p2831J9266J85784J13451J44084L9918
$$ y = [51749820, 48481818, 45863119, 43796152, 42075820, 40889764, 39941679, 39029247, 38318059, 37943160, 37806581, 38039610, 38515000, 39251512, 40337430, 41553279, 42543294, 42968493, 42105373, 39728923, 36497407, 33098107, 30071340, 27326557, 24962379, 22985533, 21305401, 19847341, 18437440, 17319434, 16352518, 15621318, 15009976, 14318538, 13860030, 13526361, 13185382, 12755261, 12376953, 12167618, 11986533, 11916943, 11899960, 11780597, 11210212, 10585339, 10120715, 9627002, 9266428, 8971944, 8634473, 8382784, 8263275, 8110066, 7873792, 7723998, 7606559, 7472732, 7342992, 7318849, 7269042, 7093809, 7096556, 7133061, 7053319, 6956773, 6868742, 6817970, 6794979, 6859826, 6837038, 6764207, 6783473, 6969257, 7082708, 7226792, 7266710]
5096G266710j4344j59515K5186K2167j15690m8948N5551J06008P0458J20263N6157
5085G384003J70236J41898K31300K45383L46201M40260N30546K29195M10009N02907
5075A0631938M60399N60098O32488Q98155R60314J167740J462225J543234J813191
5066B0129782K122853K414177K306343Q96725j447566k824609k963775k706274
5058A7927656k274843j769763j452445j236176j070026p46997o97131m64462l82159
5049G833654l32367j48425l36592l95749l06310k82953k65371k25828l12965k06979
5039E020115k23936m3134k964j18616j16972k00000J3760N4660q2322q1421l9099
5028D180071J1975L6848L5117J46400P7116P0785J13535R792R6421K62005J74728
$$ y = [7266710, 7252366, 7092851, 7118037, 7140204, 7024514, 6975566, 7031117, 7137125, 7207583, 7327846, 7384003, 7554239, 7696137, 7927437, 8172820, 8519021, 8959281, 9489827, 9719022, 10129031, 10631938, 11092337, 11652435, 12284923, 13183078, 14143392, 15311132, 16773357, 18316591, 20129782, 22252635, 24666812, 26973155, 27869880, 26422314, 23597705, 20633930, 17927656, 15652813, 13883050, 12430605, 11194429, 10124403, 9377406, 8680275, 8215813, 7833654, 7501287, 7352862, 7016270, 6620521, 6314211, 6031258, 5765887, 5540059, 5227094, 5020115, 4796179, 4753045, 4750081, 4631465, 4514493, 4314493, 4328253, 4382913, 4300591, 4219170, 4180071, 4192046, 4228894, 4264011, 4410411, 4487527, 4558312, 4671847, 4681639, 4778060, 5040065, 5214793]
5017E214793J49756J61093q7901j45699m06283l43098l18592l01333k22336j60442
5007C539958k42369j35355q5528j56327j7511j1937o579o2021q4524K1282j6402
4996B742687m0870J04904Q5265k9119R2540J82706J2680K54630J68606J43240
4986C717269K44876K13517K68733Q9626j64999m01670k98668j83498l92840k38445
4976B853901k09192j81781j27655l4700n1228j37336j23255j11689K2102p1858
4966A827309k6330j53140k274J17386P0242m6546j06667P6881n6476J10594J13675
4955A924654L9088Q0277N4042L0860n4913L086l7673r1105j15932j35282q8123
4944A608979J4409P832n3722J3899q6377M3528J95041j53387n6449m3324q7670
$$ y = [5214793, 5364549, 5525642, 5437741, 5292042, 4885759, 4542661, 4224069, 3922736, 3700400, 3539958, 3297589, 3162234, 3076706, 2920379, 2902868, 2890931, 2884352, 2822331, 2737807, 2759089, 2742687, 2701817, 2806721, 2891986, 2862867, 2955407, 3138113, 3150793, 3405423, 3574029, 3717269, 3962145, 4175662, 4444395, 4534021, 4369022, 3967352, 3668684, 3485186, 3092346, 2853901, 2644709, 2462928, 2335273, 2300573, 2249345, 2112009, 1988754, 1877065, 1899167, 1827309, 1800979, 1647839, 1645565, 1762951, 1833193, 1786647, 1679980, 1756861, 1700385, 1810979, 1924654, 1963742, 2044019, 2098061, 2128921, 2074008, 2077094, 2039421, 1948316, 1832384, 1697102, 1608979, 1623388, 1631220, 1577498, 1591397, 1505020, 1548548, 1743589, 1590202, 1533753, 1490429, 1402759]
4933A402759j06167j33798N0381R2499j23671p2695J15623l5179n9922J42807
4923A272637K4409k6054j2074j8043N1231K1734L710J6327r8985k0J63697J10555
4911A509124L3158j096p4130P6384M1833K9314q5332J7398J14738N9287N3947
4900A774625j30710r6458j12496p6019J50077j28282n5234j711N1116P2357n9847
4889A387418p1246j11494M1444j4853q020l5418Q0499N4579M618L1704N705p0367
4877A294569L5569o7225L4281k5657p4281L3617N6099L5780R1921O7629p2165
4866A410137j80021j1657j2060J42188j53518j60283M1901R3459Q0601l1954r552
4855A209241n5188j07407j5546j14733n7698k9593l4361J72433p8820l728q623
$$ y = [1402759, 1296592, 1162794, 1213175, 1305674, 1182003, 1109308, 1224931, 1189752, 1129830, 1272637, 1297046, 1270992, 1258918, 1240875, 1292106, 1313840, 1317550, 1333877, 1234892, 1234872, 1398569, 1509124, 1542282, 1541186, 1467056, 1543440, 1585273, 1614587, 1529255, 1546653, 1661391, 1720678, 1774625, 1643915, 1547457, 1434961, 1358942, 1509019, 1380737, 1325503, 1323792, 1374908, 1447265, 1387418, 1316172, 1204678, 1246122, 1231269, 1223249, 1187831, 1268330, 1322909, 1327527, 1359231, 1364936, 1294569, 1330138, 1262913, 1297194, 1271537, 1197256, 1230873, 1286972, 1322752, 1414673, 1482302, 1410137, 1230116, 1218459, 1206399, 1348587, 1195069, 1034786, 1076687, 1170146, 1250747, 1218793, 1209241, 1154053, 1046646, 1031100, 916367, 858669, 829076, 794715, 967148, 888328, 884600, 875977]
4844H75977L8047J4509o5764m7227K6988j18406P0899K0087J08444R7172o6457
4833I54269K0548m2819r9027j78295J50743o7899K2449j9726j9508K0087l4577
4822G06245m705K4146M4071N4217M4370K1141R543j07620M9725l7953l7895J19101
4810H84386o1210q3854L9303M4035M9609n6910o9233l1370J54351Q8230j4159
4799I43178J8611q9623k5063J2051n9013M2816M2698Q0889r995q1274l5589r1066
4787G48620N6151p0219l7202M3982m9792Q3201N7685l773o6676r78M1563q108
4775G94454l6151j8538j1672m7155Q8114J46704j38093J54498l7617j19936J21480
4764H96088O0563q8615o1105M8261K8988k6365p4369Q001j576q6196L9463J14102
$$ y = [875977, 914024, 928533, 862769, 815542, 842530, 724124, 795023, 815110, 923554, 1020726, 954269, 974817, 931998, 832971, 654676, 805419, 737520, 759969, 740243, 720735, 740822, 706245, 701540, 725686, 769757, 823974, 868344, 889485, 899028, 791408, 841133, 803180, 765285, 884386, 823176, 739322, 778625, 822660, 872269, 815359, 746126, 714756, 869107, 957337, 943178, 961789, 872166, 847103, 859154, 800141, 842957, 885655, 966544, 956549, 875275, 839686, 748620, 804771, 734552, 697350, 741332, 691540, 774741, 832426, 828653, 761977, 760999, 802562, 794454, 758303, 739765, 728093, 680938, 769052, 915756, 777663, 932161, 894544, 774608, 896088, 956651, 868036, 806931, 855192, 884180, 857815, 783446, 791447, 789871, 703675, 743138, 857240]
4752H57240j08285o0716J24225P7926j05181l4389L0050K6928q6189J31801O6596
4741I20006J7530L3737n6887j4721p7465m4973j660R5441j10639o8656j8924M442
4729F77231J06456j09834n688j8106K3244J16780o0527K9453j27853R0061O0905
4718G82122m5426J4398L221q660k057m9610j2524l3364P1612N9650q2372J5300
4706G12290K4375J0236j00000o741Q9985n6001m7355K8099n0478j6150Q9759N3824
4694G31843l9511P2392n9752l3188j5275Q5428M9677J1868j1798j19959l4755
4683F36970J09918O0232q8734j9982P6630k4871j6755L2954l2834r285R5817L7131
4671H57191p3691O6319K4098l3757J46103M1408P3638k013q9687K8072j2814P838
$$ y = [857240, 748955, 688239, 812464, 890390, 785209, 750820, 780870, 807798, 721609, 853410, 920006, 937536, 971273, 914386, 899665, 822200, 777227, 775567, 871008, 760369, 691713, 672789, 677231, 783687, 673853, 668165, 650059, 673303, 790083, 729556, 759009, 631156, 721217, 782122, 736696, 751094, 754315, 745655, 743598, 693988, 681464, 648100, 719712, 779362, 696990, 712290, 736665, 746901, 646901, 640160, 730145, 674144, 626789, 654888, 604410, 588260, 678019, 731843, 692332, 764724, 704972, 671784, 656509, 741937, 791614, 803482, 791684, 671725, 636970, 746888, 807120, 718386, 698404, 775034, 750163, 733408, 766362, 733528, 724243, 820060, 857191, 783500, 849819, 873917, 840160, 986263, 1027671, 1101309, 1099296, 1009609, 1037681, 1024867, 1032705]
4659A032705P5640q0388o4710K7057K03682Q3164l1457j02168j16108N1143j5144
4648A063416P9573M866L0252Q441P8854M6072n2865l9799J10285K8034j7402j9284
4636A320443J39951P5187j39050J26481L6027J04346k910J5545L7094k0405J34803
4625A827512o3979j26210J73503L8006N1095l4846O9511O9857J98213J49055q2807
4614B268910J6521J33459Q5066O1756O3040J4229J61223J23796O9042Q7178L0419
4603C114639K33439L20089J41134J95398J90009K94431J84580K99622L58478N38506
4593E870325N25796M69072O55394J009903J197261N35566m57452r08968j008284
4584G888613q34643n96539n62771m14547k73554k23763j08534k08716k39999j73672
$$ y = [1032705, 1108345, 1027957, 963247, 990304, 1193986, 1277150, 1245693, 1143525, 1027417, 1078560, 1063416, 1142989, 1147855, 1178107, 1186548, 1265402, 1311474, 1258609, 1218810, 1329095, 1357129, 1339727, 1320443, 1460394, 1535581, 1396531, 1523012, 1559039, 1663385, 1660475, 1676020, 1713114, 1692709, 1827512, 1763533, 1637323, 1810826, 1848832, 1899927, 1865081, 1934592, 2004449, 2202662, 2351717, 2268910, 2285431, 2418890, 2503956, 2565712, 2628752, 2642981, 2804204, 2928000, 2997042, 3084220, 3114639, 3348078, 3668167, 3809301, 4004699, 4194708, 4489139, 4673719, 4973341, 5331819, 5870325, 6396121, 6865193, 7520587, 8530490, 9727751, 10263317, 9805865, 8896897, 7888613, 7053970, 6457431, 5894660, 5480113, 5206559, 4982796, 4874262, 4665546, 4425547, 4251875]
4574D251875p6713J0551k6204k5443L3325J1946K094m844J44983P9976L9625Q7737
4562D528908J50792O9709O5708N9196R6156J53802N1593Q2757M1868J19503R590
4551E429582r3913j04325J30378N123K8944N6559K9612L9882O4062O1821Q6327
4540E734052J73859Q7390O8371P0347J01004Q5673K16419K21366o0237K13467
4530F911711K04054m3139J16922O1719K3868N7385P5013J55434K82501J39568
4520G985036J08003J85718K48678K20612K76873K35016L47853M11387M13084M13277
4510A0845537N61120N72331N53067N65672O28989Q02263R26735Q43824R04680
4501A7204218J097867J353201J453898J680532J827769J858190K235967K329820
$$ y = [4251875, 4175162, 4185713, 4159509, 4134066, 4167391, 4179337, 4181431, 4176587, 4321570, 4401546, 4441171, 4528908, 4679700, 4749409, 4815117, 4874313, 4970469, 5124271, 5175864, 5258621, 5300489, 5419992, 5429582, 5335669, 5231344, 5361722, 5366845, 5395789, 5452348, 5481960, 5521842, 5585904, 5647725, 5734052, 5907911, 5995301, 6063672, 6134019, 6235023, 6320696, 6537115, 6758481, 6698244, 6911711, 7115765, 7072626, 7189548, 7251267, 7275135, 7332520, 7407533, 7562967, 7845468, 7985036, 8093039, 8278757, 8527435, 8748047, 9024920, 9259936, 9607789, 10019176, 10432260, 10845537, 11406657, 11978988, 12532055, 13097727, 13726716, 14528979, 15455714, 16299538, 17204218, 18302085, 19655286, 21109184, 22789716, 24617485, 26475675, 28711642, 31041462]
4493C1041462K112350J517675N29209r22297j814130j991055j614007j388020
4485B7471187j109272p32784l08170N1724K27659N28414O46131R10740J093539
4476B8779168J216815J489555J853153K235006K665034L067692L241348K927666
4468D7475437K326136J271341k98975j997390l472643l963955m128636l523013
4460C3688302k986978k367578j912827j445677j066436q79828p33075m68452l03089
4451B1524362j34384J38391M13399O14172P65983J085318J160004J104015J065351
4442B7736611M82048p95693j782542k457295k461995k302535j979590j772959
4434A4666050j349126j332258j019121p40276q32120o91325o62595m76050l72386
$$ y = [31041462, 33153812, 34671487, 35200696, 34278399, 32464269, 30473214, 28859207, 27471187, 26361915, 25629131, 25320961, 25372685, 25600344, 26128758, 26774889, 27685629, 28779168, 29995983, 31485538, 33338691, 35573697, 38238731, 41306423, 44547771, 47475437, 49801573, 51072914, 50773939, 48776549, 45303906, 41339951, 37211315, 33688302, 30701324, 28333746, 26420919, 24975242, 23908806, 23028978, 22295903, 21827451, 21524362, 21389978, 21528369, 21941768, 22555940, 23321923, 24407241, 25567245, 26671260, 27736611, 28218659, 27422966, 25640424, 23183129, 20721134, 18418599, 16439009, 14666050, 13316924, 11984666, 10965545, 10225269, 9393149, 8701824, 8039229, 7563179, 7190793]
4425G190793l23610l33587k90373j51880l67300k62258l18244k01221q5976k09330
4415D647014j42571p1977j54178q6113k01417j04020k9447j62884l8785j71979
4405C483643j07n5442j26449l6440L7665q6354l6684j09902o2991o6648j32216
4394B808075L0769O4396J3157K3196j0829j33894J3615K8762K7022r526N1950
4383B906693N9288O233l0224N6808N7951j13610j40251k51905N8131n9604J337
4372B550847l1629K1546J07928l9966J8456m2113m0955P6370J9041Q9638N3729
4361B782892n1724J73679j9594m9695j27759N6420j5178r8931J2228j60911k40530
4350B260897p9676q0317m2253Q3982j51394r9662L1384J30371k7896j41447m4036
$$ y = [7190793, 6867183, 6533596, 6243223, 6091343, 5724043, 5461785, 5143541, 4942320, 4856344, 4647014, 4504443, 4432466, 4278288, 4192175, 3990758, 3886738, 3857291, 3694407, 3655622, 3483643, 3483536, 3428094, 3301645, 3265205, 3302870, 3216516, 3179832, 3069930, 3006939, 2940291, 2808075, 2838844, 2903240, 2916397, 2939593, 2928764, 2794870, 2808485, 2837247, 2864269, 2854743, 2906693, 2965981, 2972214, 2941990, 2998798, 3056749, 2943139, 2802888, 2550983, 2609114, 2549510, 2550847, 2519218, 2540764, 2648692, 2608726, 2627182, 2585069, 2544114, 2620484, 2639525, 2729163, 2782892, 2731168, 2904847, 2885253, 2835558, 2707799, 2764219, 2749041, 2650110, 2662338, 2501427, 2260897, 2181221, 2100904, 2058651, 2142633, 1991239, 1891577, 1922961, 2053332, 2025436, 1883989, 1839953]
4339A839953J26743L00R0391j22409j0155N9127o7731j27370m4176r4432j08008
4328A542233Q1443m4344j14514j04990m6432p389K4724o9489r8678p0437J3030
4317A105157o0439O3559N3348P0357l5897l4218n8526K3606j9723o045j8402m1477
4305A041300k4688o5961O0529Q1776J06431m0682q5857J0316k8548k6121r3414
4294I35081J374j3217L2987O6982n7695n2071K1577N7255O804j2676q5519k0894
4282H79988J6578j09963N9904j7191M3511M7563O7319n9715r7771J64012N0842
4271A045077P9103j5222n4065n2333o0180M3616l050j52155m1003J34409Q8682
4260A012879k8817K8823l086m5619l6989M8522j8760m6968n847K362K09n1047
$$ y = [1839953, 1966696, 1966996, 2057387, 1934978, 1924823, 1983950, 1916219, 1788849, 1744673, 1650241, 1542233, 1623676, 1579332, 1464818, 1359828, 1313396, 1306007, 1330731, 1261242, 1162564, 1092127, 1105157, 1044718, 1108277, 1161625, 1231982, 1196085, 1161867, 1103341, 1126947, 1107224, 1101179, 1082777, 1041300, 1016612, 950651, 1011180, 1092956, 1199387, 1158705, 1072848, 1083164, 1054616, 1028495, 935081, 936455, 923238, 956225, 1023207, 965512, 913441, 935018, 992273, 999077, 986401, 900882, 879988, 896566, 786603, 846507, 829316, 872827, 920390, 987709, 927994, 830223, 994235, 1045077, 1124180, 1108958, 1054893, 1002560, 942380, 985996, 982946, 830791, 789788, 924197, 1012879, 984062, 1012885, 1009799, 964180, 927191, 975713, 956953, 909985, 904138, 906500, 906709, 855662]
4248H55662J52428L415J5326q6246J552O1961J70366O51P1881M2448N1548n2967
4236A288025k6299J45719L2472r0513k686N6507l0234m7925P686K10368m2085
4225A501035M9311l992r1348j2407m7896j1358J47733p165R4002n9938L3233O4611
4213A655821p507Q1801K1347o4025Q0761R1473O7145n9524R3428K8125O114Q7530
4201B082489P8932o6152r5223k1632q8487M8652J01862L3087P6888q1778m3241
4190B025397O7281r2605J63935P8808r5048M9995j05594N7273j8261q6423l6349
4179B008409n519P0510n2260p33k7030L2081j9175k9887r8294L8567J06910o2957
4167A960622O1986k3548n9282J6786Q665j8634j9848l5861p906K7809l2980o5760
$$ y = [855662, 1008090, 1011505, 1026831, 940585, 942137, 1004098, 1174464, 1175115, 1246996, 1289444, 1340992, 1288025, 1261726, 1407445, 1439917, 1349404, 1346718, 1403225, 1372991, 1325066, 1332752, 1543120, 1501035, 1550346, 1546354, 1455006, 1442599, 1394703, 1383345, 1531078, 1523913, 1617915, 1557977, 1591210, 1655821, 1648314, 1730115, 1751462, 1687437, 1768198, 1859671, 1926816, 1867292, 1960720, 1988845, 1994959, 2082489, 2161421, 2095269, 2000046, 1978414, 1889927, 1938579, 2040441, 2073528, 2150416, 2068638, 2025397, 2092678, 2000073, 2164008, 2242816, 2147768, 2197763, 2092169, 2149442, 2131181, 2044758, 2008409, 2002890, 2073400, 2021140, 2020407, 1993377, 2025458, 2006283, 1976396, 1878102, 1916669, 2023579, 1960622, 2022608, 1999060, 1939778, 1956564, 1965229, 1946595, 1926747, 1890886, 1882980, 1910789, 1877809, 1812049]
4155A812049l996J51271j3042k8708o9840n7314J16053L0024n6360o3688J10679
4144A927128k7224l1174N2792M2407m8937k8960J53639K0662k946j30839o7635
4133A858913K8866k6190M7664m9711R976R6663l5394R9132l5358l0889p8704Q3378
4121A968346N3146k7308m2477O592k6341J7278K4327J2204l8460r1245P72M9823
4109A906657J61276L1123n5757R9372L001P770L2152o004p3650K5590j3700Q79
4097B118709J22684j1222O3736O2733l1536r702N5791J6924N8916Q1201l5542
4086B492692j0514Q0056j37637l4856J64265o587L7376Q7611M4906Q5613j56987
4075B645938K0345K093k4084L2681J3173Q9577P3957k0818K4279n0980O4978K07128
$$ y = [1812049, 1808053, 1959324, 1946282, 1917574, 1847734, 1790420, 1906473, 1936497, 1880137, 1816449, 1927128, 1899904, 1868730, 1921522, 1963929, 1914992, 1886032, 2039671, 2060333, 2057387, 1926548, 1858913, 1887779, 1861589, 1909253, 1859542, 1869518, 1966181, 1930787, 2029919, 1994561, 1963672, 1884968, 1968346, 2021492, 1994184, 1951707, 1958299, 1931958, 1949236, 1973563, 1985767, 1947307, 1856062, 1856834, 1906657, 2067933, 2099056, 2043299, 2142671, 2145672, 2153442, 2185594, 2179590, 2105940, 2131530, 2117830, 2118709, 2241393, 2230171, 2293907, 2356640, 2325104, 2315402, 2371193, 2388117, 2447033, 2528234, 2492692, 2482178, 2562234, 2424597, 2389741, 2554006, 2547419, 2584795, 2672406, 2717312, 2802925, 2645938, 2666283, 2668376, 2644292, 2676973, 2690146, 2779723, 2853680, 2832862, 2857141, 2806161, 2871139, 3078267]
4063C078267l2372N6480K5238L3415K3169O8331O0735q5687r1653P5489J21731
4052C333143R0291Q6997L2032P1315J4993j13804N7529J31030O4479N3101j7054
4041C804052j1492Q9246J76006k1312K24445N8515P7463R4967m1698J56020J7349
4030D623561K6561J55840J15053N3536o1822j2887J97606J5200P2720R6157J23256
4019E404781R1156L9604J27583J59172M5369J33176K09268J61628J45327N6494
4009F573558J99649M3213J35147K62102K24769J20491J50974K12359K42738K11430
3999H376430K36074L32040K71651K37156K05268K43905J50219K56348K90793K53075
3989A0852959K86849K75661M12959K42051J62744M68303L41807K39438K18496
$$ y = [3078267, 3045895, 3102375, 3127613, 3161028, 3184197, 3252528, 3313263, 3227576, 3135923, 3211412, 3333143, 3423434, 3510431, 3542463, 3613778, 3628771, 3514967, 3572496, 3703526, 3768005, 3821106, 3804052, 3792560, 3881806, 4057812, 4036500, 4260945, 4319460, 4396923, 4491890, 4450192, 4606212, 4623561, 4650122, 4805962, 4921015, 4974551, 4912729, 4899842, 5097448, 5112648, 5185368, 5281525, 5404781, 5495937, 5535541, 5663124, 5822296, 5867665, 6000841, 6210109, 6371737, 6517064, 6573558, 6773207, 6816420, 6951567, 7213669, 7438438, 7558929, 7709903, 7922262, 8165000, 8376430, 8612504, 8944544, 9216195, 9453351, 9658619, 9902524, 10052743, 10309091, 10599884, 10852959, 11139808, 11415469, 11828428, 12070479, 12233223, 12701526, 13043333, 13282771, 13501267]
3980A3501267K45852L47407L30278L37478L53183M33351L20830K30890M16982
3971A6517518M34173L86916L38528K93816L76244N20891M84559M49478M49948
3962B0252071N18601N47160N13871N80711O79649N78553N15391O98985Q74016
3953B5759008P78173Q08727Q76371R07716R26441J030705J227494J168967J177124
3944C4660726J310986J400473J495958J667079J749622J924938J855297J958953
3936D8024032K263163K319530K408094K362281K645428K821477K906528K988009
3928F8738542L049149L244152L247516L556756L540389L541702L577466L643134
3920I6138806L719722L849317L660432L755196L835783L771669L648185L597810
$$ y = [13501267, 13747119, 14094526, 14424804, 14762282, 15115465, 15548816, 15869646, 16100536, 16517518, 16951691, 17338607, 17677135, 17970951, 18347195, 18868086, 19352645, 19802123, 20252071, 20770672, 21317832, 21831703, 22412414, 23092063, 23670616, 24186007, 24884992, 25759008, 26537181, 27345908, 28222279, 29129995, 30056436, 31087141, 32314635, 33483602, 34660726, 35971712, 37372185, 38868143, 40535222, 42284844, 44209782, 46065079, 48024032, 50287195, 52606725, 55014819, 57377100, 60022528, 62844005, 65750533, 68738542, 71787691, 75031843, 78279359, 81836115, 85376504, 88918206, 92495672, 96138806, 99858528, 103707845, 107368277, 111123473, 114959256, 118730925, 122379110, 125976920]
3912A25976920L507676L380495L238712K989669K760193K709929K368333K245070
3904A49176997J982481J765365J505506J252095R77952N75251M75448J97536j80475
3895A57728156m94832q87790j272937j623350j885798k151731k440665k567545
3887A44403508k744297k923241l143175l241719l358873l435034l611832l892548
3879A18052789m015834l995365m328423m228466m243398m085425m080536m038268
3871H5037074l949413l660737l657227l507868l441687l396372l229132l152761
3863E7041877l022964l002157k909684k738574k507517k234006k247332k006636
3855C6373007j970795j901477j633685j511692j442732j225900j324658j238050
$$ y = [125976920, 129484596, 132865091, 136103803, 139093472, 141853665, 144563594, 146931927, 149176997, 151159478, 152924843, 154430349, 155682444, 156660396, 157235647, 157711095, 157908631, 157728156, 157233324, 156345534, 155072597, 153449247, 151563449, 149411718, 146971053, 144403508, 141659211, 138735970, 135592795, 132351076, 128992203, 125557169, 121945337, 118052789, 114036955, 110041590, 105713167, 101484701, 97241303, 93155878, 89075342, 85037074, 81087661, 77426924, 73769697, 70261829, 66820142, 63423770, 60194638, 57041877, 54018913, 51016756, 48107072, 45368498, 42860981, 40626975, 38379643, 36373007, 34402212, 32500735, 30867050, 29355358, 27912626, 26686726, 25362068, 24124018]
3847B4124018j085266r68512r87206q40263p61450p28266n52888n87599n54298
3838A7058270n96192m26689l42886l98341l37796l22841l23143l12984l31992
3829A3665406k11569j69931l08629k52661j40301k18420j56966j71847j00563
3820A1934519k82271q5247j2117k17572k52253o8381n8264j19805n8841n6307
3810A0723461j88200j37287q3061m7546j14872j16338j41155n0451q3288j17079
3800I644184j5431p0949j15479j62879p7941k881k9289k4332j58321l24q255j81175
3788H796928j09664N9479k1897M8848p8649J8063n8694J4445Q2449o7931j57343
3777H526034P3044l9603r0707M8071l5859k2297j6134j1896o0177p9380o2945
$$ y = [24124018, 23038752, 22070240, 21083034, 20242771, 19481321, 18753055, 18200167, 17612568, 17058270, 16462078, 16035389, 15692503, 15294162, 14956366, 14633525, 14310382, 13997398, 13665406, 13453837, 13283906, 12975277, 12722616, 12582315, 12363895, 12206929, 12035082, 11934519, 11652248, 11567001, 11554884, 11337312, 11085059, 11016678, 10958414, 10838609, 10779768, 10723461, 10535261, 10397974, 10314913, 10267367, 10152495, 10036157, 9895002, 9844551, 9761263, 9644184, 9628753, 9557804, 9442325, 9279446, 9201505, 9198624, 9169335, 9145003, 8986682, 8986358, 8978103, 8796928, 8687264, 8746743, 8724846, 8773694, 8695045, 8713108, 8654414, 8668859, 8751308, 8683377, 8526034, 8599078, 8559475, 8468768, 8516839, 8480980, 8458683, 8442549, 8430653, 8370476, 8291096, 8228151]
3766H228151L0458P8837J30314n4621N3416j0537M5030l6957M5652N2871l4050
3755H528564l2273k9049N0083l1010n3432j8460q962m7980K9023R0859j08628
3744H368735O111K5229p8689m5154j0347J171r4804J9715j37884p2491N4014p6116
3732G959490m7237n0249k0845r2888K5097n3054j411k7687j8118n1451K7516o7279
3720G581884J9630R2992Q4252j31247k6116J29118J03744L6464j10280J27572
3710G908013n3096K0506J07681P113J15050m070o9289N8549J02302P5705J19975
3699H388439n1265R6017N3053K5761J44576q9756J58764N6290M2569O9574L2308
3688H926330Q552O5268O3616J46674M3505K9996J45849J31587j0258J96806N439
$$ y = [8228151, 8258609, 8337446, 8467760, 8413139, 8466555, 8456018, 8501048, 8464091, 8509743, 8562614, 8528564, 8496291, 8467242, 8517325, 8486315, 8432883, 8414423, 8405461, 8357481, 8386504, 8477363, 8368735, 8374846, 8400075, 8321386, 8276232, 8265885, 8267056, 8172252, 8191967, 8054083, 7981592, 8035606, 7959490, 7912253, 7862004, 7841159, 7748271, 7773368, 7720314, 7718903, 7691216, 7673098, 7621647, 7649163, 7581884, 7601514, 7694506, 7778758, 7647511, 7621395, 7750513, 7854257, 7890721, 7780441, 7908013, 7854917, 7875423, 7983104, 7990217, 8105267, 8101197, 8031908, 8090457, 8192759, 8268464, 8388439, 8337174, 8433191, 8486244, 8512005, 8656581, 8566825, 8725589, 8781879, 8824448, 8894022, 8926330, 8934882, 9000150, 9063766, 9210440, 9253945, 9283941, 9429790, 9561377, 9551119, 9747925, 9753364]
3677I753364N8221J50926J04670Q2753R8080J65998J48219J75510M8183J52574
3667A0938498J1587J31711R4575J51092J03425K25556K25245J72078J40156J30267
3657A2324190J50847J80212K28613J90251P3432Q0707K26183K62789L41885J99129
3647A4258238J76357K64508J35402J78358L42022K65892K04527K64738K14145
3638A6304187K33763L05536K54994K06316K89647K16471K56593L95404K82458
3629A8745369K05597L25440M00199M76960L87140L25030M78044M47619N60865
3620B2352263N32082M97986M65514N52165O25259O50143N75033P05314P12400
3611B7668159P05668P58125P96855P46563R47602J052867R77641J018683J163172
$$ y = [9753364, 9811585, 9962511, 10067181, 10149934, 10248014, 10414012, 10562231, 10737741, 10785924, 10938498, 10950085, 11081796, 11176371, 11327463, 11430888, 11656444, 11881689, 12053767, 12193923, 12324190, 12475037, 12655249, 12883862, 13074113, 13147545, 13228252, 13454435, 13717224, 14059109, 14258238, 14434595, 14699103, 14834505, 15012863, 15354885, 15620777, 15825304, 16090042, 16304187, 16537950, 16843486, 17098480, 17304796, 17594443, 17810914, 18067507, 18462911, 18745369, 18950966, 19276406, 19676605, 20153565, 20540705, 20865735, 21343779, 21791398, 22352263, 22884345, 23382331, 23847845, 24400010, 25025269, 25675412, 26250445, 26955759, 27668159, 28373827, 29131952, 29928807, 30675370, 31622972, 32675839, 33653480, 34672163, 35835335]
3602C5835335J226653J218837J412786J370570J351657J512360J537897J443452
3594D6909547J627199J654501J637530J706299J820520J790183J866238J862922
3586F0874939K010062J878516J914131K005389J898834J610834J437912J466080
3578G5096697J318449J194228J013716J016210Q98539J078452J145105J055577
3570H3816973J023063J078302R36668Q45665O94119N13528M59622M18807M44094
3561I0230841M67623N19808P66250R08340J139742J358689J402708J711077J827414
3552A00332492J891019K330162K405342K570401L003187L282546L572672L826718
3544A23214539M162542M422140M873116N084994N483455N884534N928150O264488
$$ y = [35835335, 37061988, 38280825, 39693611, 41064181, 42415838, 43928198, 45466095, 46909547, 48536746, 50191247, 51828777, 53535076, 55355596, 57145779, 59012017, 60874939, 62885001, 64763517, 66677648, 68683037, 70581871, 72192705, 73630617, 75096697, 76415146, 77609374, 78623090, 79639300, 80537839, 81616291, 82761396, 83816973, 84840036, 85918338, 86855006, 87700671, 88394790, 88908318, 89367940, 89786747, 90230841, 90698464, 91218272, 91984522, 92892862, 94032604, 95391293, 96794001, 98505078, 100332492, 102223511, 104553673, 106959015, 109529416, 112532603, 115815149, 119387821, 123214539, 127377081, 131799221, 136672337, 141757331, 147240786, 153125320, 159053470, 165317958]
3536A65317958O660159O807618P212413P583339P606653P874652Q046462P861300
3528B24970554P809585P684270P353814P228140P041274O870502O824003O835467
3520B82617609P059627P147278P290545P384792P406672P301154O942082O303089
3512C39452848O005982N549608N174971N027784M925923M918537N065421N357250
3504C81478324N778671N995220O402695O545622O961242P275617P673578P901666
3496D36012635P490272O815347N608047M113853K460880P08119j149912k847411
3488D59211830m142230m484566m501273m156223l624344k809600k331191j920727
3480D31241676j646895j387763j007812q32005q85989o56618j03407R99799K188405
$$ y = [165317958, 171978117, 178785735, 185998148, 193581487, 201188140, 209062792, 217109254, 224970554, 232780139, 240464409, 247818223, 255046363, 262087637, 268958139, 275782142, 282617609, 289677236, 296824514, 304115059, 311499851, 318906523, 326207677, 333149759, 339452848, 345458830, 351008438, 356183409, 361211193, 366137116, 371055653, 376121074, 381478324, 387256995, 393252215, 399654910, 406200532, 413161774, 420437391, 428110969, 436012635, 443502907, 450318254, 455926301, 460040154, 462501034, 463209153, 462059241, 459211830, 455069600, 450585034, 446083761, 441927538, 438303194, 435493594, 433162403, 431241676, 429594781, 428207018, 427199206, 426367201, 425481212, 424824594, 424721187, 425720986, 427909391]
3471D27909391K800764K815674K068877J94675k083942m441859o990640r065807
3463D13207133j0032355r854712q807175p515232o401894n206223m294476m160180
3455C56934886m943979o942408r741901j3020300j5821802j8050787j9409800
3448B69003909j9875588j9673945j8765666j6898021j4800226j2810930j1109355
3441A55070178r690657q315938p339716o406159n710196n129363m514976m287393
3433A03675780m034173l997957l580598l441799l575101l334334l095341l073845
3425G5542632l023614k742167k588597k573281k473627k309586k056632j949306
3417E5825822k091130k037019k123194j956638j779826j717412j753318j654847
$$ y = [427909391, 430710155, 433525829, 435594706, 435789381, 433705439, 429263580, 422272940, 413207133, 403174778, 393320066, 384512891, 376997659, 370595765, 365389542, 361095066, 356934886, 351990907, 345048499, 335306598, 322286298, 306464496, 288413709, 269003909, 249128321, 229454376, 210688710, 193790689, 178990463, 166179533, 155070178, 145379521, 137063583, 129723867, 123317708, 117607512, 112478149, 107963173, 103675780, 99641607, 95643650, 92063052, 88621253, 85046152, 81711818, 78616477, 75542632, 72519018, 69776851, 67188254, 64614973, 62141346, 59831760, 57775128, 55825822, 53734692, 51697673, 49574479, 47617841, 45838015, 44120603, 42367285, 40712438]
3409D0712438j479557j406982j391996j111433j150460j130109j043849q03959
3401C1194093q01610p56955q24859o16428o66692p35677n63731n70552o02462
3392B5055127n49615n35060m96515m68382l38238m12094k96197m59181m61828
3383B1038017l62069l03437k94320m42035l39028k92121k50600k72234k64044
3374A8218129k36016j72797k08377k49153k90387k25656j98968l06567k26935
3365A6103273p0194k28229l2011q8983k71869k62411o0762r9347o0691r1390j72024
3354A4665362r6214r5032Q924j25385j42838K08545o0233R506m6970j02979l0667
3343A4192019K9782N0252o7475j5356o4860l6323J12858l8542R2861N9136P3867
$$ y = [40712438, 39232881, 37825899, 36433903, 35322470, 34172010, 33041901, 31998052, 31194093, 30392483, 29635528, 28810669, 28194241, 27527549, 26791872, 26228141, 25657589, 25055127, 24505512, 23970452, 23473937, 23005555, 22667317, 22255223, 21959026, 21499845, 21038017, 20675948, 20372511, 20078191, 19636156, 19297128, 19005007, 18754407, 18482173, 18218129, 17982113, 17809316, 17600939, 17351786, 17061399, 16835743, 16636775, 16330208, 16103273, 16033079, 15804850, 15772839, 15683856, 15411987, 15149576, 15088814, 14989467, 14928776, 14837386, 14665362, 14569148, 14474116, 14483040, 14357655, 14214817, 14423362, 14363129, 14372635, 14325665, 14222686, 14192019, 14221801, 14272053, 14204578, 14189222, 14124362, 14088039, 14200897, 14162355, 14255216, 14314352, 14388219]
3332A4388219N0282N7037J24863K2437K1497K6812l42N095K00962J07769J17711
3321A5122342M5586R2527O7013K13308K70127N8890J55099K05119L7099J08542
3311A6375652J27683R5198J28977K27021J79063L23534J95756J28792J72755L94613
3301A8349044J70127L36383J94910J58085M28712K66125K41436K42255L12335
3292B0699412L29256L08123K85969K49880M65271L66545L49072L36116L77709
3283B3767353M85987M76071N00563N53207M66667O12266O20023O69220P36339
3274B8887696O31650P69094O86767R53904R39606P98797P23381O44586O80580
3265C5716061O66995O80840P24630P28772N77051O02719O20070O55747P47021
$$ y = [14388219, 14438501, 14495538, 14620401, 14642838, 14664335, 14691147, 14690805, 14695900, 14896862, 15004631, 15122342, 15167928, 15260455, 15327468, 15540776, 15810903, 15869793, 16024892, 16230011, 16267110, 16375652, 16503335, 16598533, 16727510, 16954531, 17133594, 17457128, 17652884, 17781676, 17954431, 18349044, 18519171, 18855554, 19050464, 19208549, 19637261, 19903386, 20144822, 20387077, 20699412, 21028668, 21336791, 21622760, 21872640, 22337911, 22704456, 23053528, 23389644, 23767353, 24253340, 24729411, 25229974, 25783181, 26249848, 26862114, 27482137, 28151357, 28887696, 29519346, 30288440, 30975207, 31929111, 32868717, 33667514, 34390895, 35035481, 35716061, 36383056, 37063896, 37788526, 38517298, 39094349, 39697068, 40317138, 40972885, 41719906]
3256D1719906P88876Q67261Q28198R17710O12417Q29857O73560P61712P63093
3247D8762590P94390Q36762Q91921Q57757R76988J043499J157855J020062J317216
3238E7659040J184156J206772J209825J305924J318912J182088J174394J362831
3230F7603942J196655J005081R89434J071503R83972Q15058O37835M78221N19325
3221G5301026L01924J35805L7887k6465k48163l61536n08177o80577p25277q29825
3211G2396622r58862r82518j091890j068622j098698j175605j342957j298143
3203F3379327j303321j319828j419848j271480j195474j221207j133289j086379
3195E3428501j148589j015585q61697q82465q49737r13594p53879m70544o84735
$$ y = [41719906, 42508782, 43376043, 44204241, 45121951, 45734368, 46564225, 47237785, 47999497, 48762590, 49556980, 50393742, 51285663, 52143420, 53120408, 54163907, 55321762, 56341824, 57659040, 58843196, 60049968, 61259793, 62565717, 63884629, 65066717, 66241111, 67603942, 68800597, 69805678, 70795112, 71866615, 72850587, 73665645, 74303480, 74781701, 75301026, 75602950, 75738755, 75776642, 75750177, 75502014, 75140478, 74632301, 73951724, 73226447, 72396622, 71437760, 70455242, 69363352, 68294730, 67196032, 66020427, 64677470, 63379327, 62076006, 60756178, 59336330, 58064850, 56869376, 55648169, 54514880, 53428501, 52279912, 51264327, 50402630, 49520165, 48670428, 47756834, 47002955, 46532411, 45847676]
3186D5847676n78517n93295n05360m76524m93446n54186n38627o81166n82321
3177D0844234q69981r16549q87547q83186r25820q60841r89088q92231q25448
3168C2793543o05821p00498n47476n47825m65115m41878k42860j35186l03863
3159B8803021l91716o33329q03137o67863n74692n55546m18117n27527l71621
3150B3859473l16800k89655r297l7891P2041L4534R7551L76071L85008M48328
3140B4619363L63541N72864N87926R50867J455959J959447J894108k61714k164176
3131B9978185j892974j325412p13744o47712r02927j081672j077359r78100r09262
3122B0449023p11025p59050o55150l23036k94629k8435L6693n5088J48745L50258
$$ y = [45847676, 45269159, 44675864, 44170504, 43693980, 43200534, 42646348, 42107721, 41426555, 40844234, 39974253, 39057704, 38170157, 37286971, 36361151, 35500310, 34511222, 33618991, 32793543, 32187722, 31487224, 30939748, 30391923, 29926808, 29484930, 29242070, 29106884, 28803021, 28411305, 27777976, 26974839, 26306976, 25732284, 25176738, 24758621, 24231094, 23859473, 23542673, 23253018, 23243721, 23205830, 23277871, 23312405, 23409956, 23786027, 24171035, 24619363, 24982904, 25555768, 26143694, 27094561, 28550520, 30509967, 32404075, 32142361, 29978185, 28085211, 26759799, 26046055, 25398343, 24495416, 23413744, 22336385, 21358285, 20449023, 19737998, 18978948, 18323798, 18000762, 17706133, 17677698, 17714391, 17659303, 17808048, 18158306]
3112A8158306M09965O15042Q09877R96288J386220J755491J157966r83241k424153
3103B1881761k194163j612807j195695j082496n49463m24388k23765r5877j28246
3094A4374861l96980m68909m47338m26861m61686l33564j84792o4030r8918o5195
3084A1426588J42113J93099K32845j47958p52077p02682o49556n13395l94201
3075H834776l49026k78086j96791k01844k18788o2907l8960L0945r1199j38954
3065G289166K8007N350k2510J22500Q272j0793J94678J66203J64720L55489M72680
3054H773762J98513l76518o85779n57764n07191l77970k86557k88696k84195k27946
3044E379659n2707j49662k86663q3218J5222j86251q4477o8651p0343l391N8348
$$ y = [18158306, 18568271, 19183313, 19993190, 20989478, 22375698, 24131189, 25289155, 24305914, 21881761, 19687598, 18074791, 16879096, 15796600, 15247137, 14822749, 14598984, 14503107, 14374861, 13977881, 13508972, 13061634, 12634773, 12173087, 11839523, 11654731, 11590701, 11491783, 11426588, 11568701, 11761800, 11994645, 11846687, 11094610, 10391928, 9742372, 9228977, 8834776, 8485750, 8207664, 8010873, 7809029, 7590241, 7527334, 7488374, 7519319, 7428120, 7289166, 7317173, 7322523, 7300013, 7422513, 7430785, 7419992, 7614670, 7780873, 7945593, 8301082, 8773762, 8972275, 8595757, 7909978, 7352214, 6845023, 6467053, 6180496, 5891800, 5607605, 5379659, 5326952, 5177290, 4890627, 4807409, 4822631, 4636380, 4551903, 4483252, 4412909, 4409518, 4467866]
3033D467866n0773J7987m2933k03338L6775j35100k73037N0219O3945j04746j46776
3022C680089m5270J49169l7056j32588l9588j82852m5429R8174Q407j20828N5931
3011C388159q8212p779q1242q0447j25621O5200R8758q6369j10312J9436K1239
3000C012810j11537J4155p1556n3311K1153o8599o519r837j51892J6495L4337
2989B625699m5060K9679l3481k27o6446Q449K9231n0085K4110J171r9868j5565
2977B407607P4346l5361J9793L733n6260r9115j14693N7744N6497j2540L4171
2966B335922j13503N877j0372m4114J54716r3273r5382k3596m516M5968o9456
2955B088271K6454K0075m2624p1857l2683P8692M0021o493J0512M8482m5531k1207
$$ y = [4467866, 4417093, 4435080, 4392147, 4188809, 4225584, 4090484, 3817447, 3867666, 3931611, 3826865, 3680089, 3634819, 3783988, 3746932, 3614344, 3574756, 3391904, 3346475, 3444649, 3453056, 3332228, 3388159, 3299947, 3292168, 3210926, 3130479, 3004858, 3070058, 3168816, 3082447, 2972135, 2991571, 3012810, 2901273, 2915428, 2843872, 2790561, 2811714, 2743115, 2736596, 2726759, 2574867, 2591362, 2625699, 2580639, 2610318, 2576837, 2576610, 2510164, 2518613, 2547844, 2497759, 2521869, 2523040, 2423172, 2407607, 2481953, 2446592, 2466385, 2470118, 2413858, 2314743, 2200050, 2257794, 2314291, 2301751, 2335922, 2222419, 2228296, 2217924, 2173810, 2328526, 2235253, 2139871, 2116275, 2111759, 2157727, 2088271, 2114725, 2134800, 2092176, 2020319, 1987636, 2066328, 2106349, 2099856, 2110368, 2158850, 2113319, 2092112]
2943B092112j4971k219J35102j69874j17685J58603J76301J5722n0649R96M7006
2932B270444L4874L3935O2773r6822l0461O825m2204K8386n419Q3451P8719O5480
2920B489981N6354q8093J5511n8927m4354R6409j0295n9868l4188l6885R6335
2909B421980L9146j04001M3010M5553m7477J546J01271l2496L34o7366J16470
2898B517970O7136j0550J34490m7049L6837N8430K08749O1907k3637K5474P876
2887C037633K9999K3232J12m6857K7810P0044J26681j0460P8598J20499J5027
2876C472318Q7878R2685O787j8994o0399P806r3011K3928Q7448o846M3011l6695
2864C605916m5969p617J104R8133l019j3227Q6607l5962p596K08147N0717m1522
$$ y = [2092112, 2077141, 2074922, 2210024, 2040150, 1922465, 2081068, 2257369, 2273091, 2222442, 2223438, 2270444, 2305318, 2339253, 2402026, 2305204, 2274743, 2281568, 2239364, 2267750, 2262331, 2345782, 2424501, 2489981, 2546335, 2458242, 2473753, 2414826, 2370472, 2466881, 2456586, 2396718, 2362530, 2325645, 2421980, 2461126, 2357125, 2400135, 2445688, 2398211, 2399757, 2501028, 2468532, 2468866, 2401500, 2517970, 2585106, 2574556, 2709046, 2661997, 2698834, 2757264, 2966013, 3027920, 3004283, 3029757, 3037633, 3067632, 3090864, 3090976, 3044119, 3071929, 3141973, 3268654, 3258194, 3336792, 3457291, 3472318, 3560196, 3652881, 3659668, 3640674, 3580275, 3588081, 3495070, 3518998, 3606446, 3599600, 3642611, 3605916, 3559947, 3552330, 3553434, 3651567, 3648548, 3635321, 3721928, 3685966, 3678370, 3886517, 3937234, 3895712]
2852C895712J42840J05121O5591P5673J01974J08545L9715O0427K03564J00527
2842D899689L8681N5751p1251P037O4828j89269q9303j65338j74227j18554j3681
2831D244363p628n363p4540l3367L5946o8474m6598Q3328J66531N7951P5290L19
2819D427758j1209k1796J42003P2088P0709O89L9714j32611j03604r3751m364
2808D385626j36029m9574n663j61701q2781j88965j58471o8046j23279l3927J152
2797C378342j44083L1254k4505l321n8466o0724Q9893O4004K7519r7392q7370
2786C115151r4596j8447J2900j65406J6006n4126j83207j66577n5989j30730j10827
2775B164152j05607j85183n9306K5405p3493O0422k2664n4633j37826o9492j7502
$$ y = [3895712, 4038552, 4143673, 4209264, 4284937, 4386911, 4495456, 4535171, 4595598, 4799162, 4899689, 4938370, 4994121, 4922870, 4929907, 4994735, 4805466, 4716163, 4550825, 4376598, 4258044, 4244363, 4236735, 4231372, 4156832, 4123465, 4159411, 4090937, 4044339, 4127667, 4294198, 4352149, 4427439, 4427758, 4416549, 4394753, 4536756, 4608844, 4679553, 4680242, 4719956, 4587345, 4483741, 4389990, 4385626, 4249597, 4200023, 4194360, 4032659, 3949878, 3760913, 3602442, 3534396, 3411117, 3377190, 3378342, 3234259, 3265513, 3241008, 3237687, 3179221, 3118497, 3208390, 3272394, 3299913, 3202521, 3115151, 3020555, 3002108, 3015008, 2849602, 2865608, 2811482, 2628275, 2461698, 2405709, 2274979, 2164152, 2058545, 1873362, 1814056, 1839461, 1765968, 1826390, 1803726, 1749093, 1611267, 1541775, 1524273]
2764A524273j7195o2184j7041K2427p8090o6185K957r1803J7813P1035j10773
2753A195234N879j2679j18770K2295k9125m7899M6058n6113n4650p908M9436r7929
2741H93829Q62n5231k7625l0746P6839K8476l5140m7524j06441K7298j54010P1140
2729F41727L6517K1917l7128K6036l1511q2205J9843k9442N3940M4803j9109q5370
2717E60018j4732q7184J10488K9884p8059k1591n0802q2630J5950M4411J07546
2706E33299q1863r7456M6397j8615O4947K7672k6259q453l5105m9040k1733J3275
2694C47066O0902l6303O0974m9825q5034P7969l4910m1545j20321P8088K0072
2683B77133l2366J21999J40600p3268Q279J1014l7651j713K4506M4800j80505
$$ y = [1524273, 1507078, 1444894, 1427853, 1450280, 1372190, 1306005, 1308962, 1217159, 1234972, 1306007, 1195234, 1201113, 1188434, 1069664, 1091959, 1062834, 1014935, 1060993, 1004880, 950230, 942322, 991758, 893829, 894691, 839460, 811835, 781089, 857928, 886404, 851264, 803740, 697299, 724597, 570587, 641727, 678244, 700161, 663033, 689069, 657558, 575353, 595196, 565754, 619694, 664497, 645388, 560018, 545286, 458102, 568590, 598474, 520415, 498824, 448022, 365392, 381342, 425753, 533299, 451436, 353980, 400377, 381762, 446709, 474381, 448122, 439669, 404564, 355524, 333791, 347066, 407968, 371665, 432639, 382814, 297780, 375749, 340839, 299294, 178973, 257061, 277133, 244767, 366766, 507366, 434098, 442377, 453391, 415740, 414027, 438533, 483333, 302828]
2672C02828o5437J13931l2284j39037o8413J08119j3545j5980R4762m1622r5539
2661A47783L5690J36006j43222r1646N1758Q2436o0679j09269K4411R8456o4453
2650A07271J3207l2738P3761R4470K6003p9378o746O6830j12043k4146O8990p7644
2638A17837J81831m9347p5608K383J1012O717m8609R8529o3792j22202N5480J3783
2626A28014l6915K9547M2292L9564q3509J36K904J9418m1864P9921M465J9273
2614B03246j5161j30799p0213L1535J05093J0672r271l8882L8692P7014j07462
2603I4464m9502O8513O9574j32600N7688R7693k8881j28408L4639l8103Q0514
2592A25591j10370N703Q1864R5681J3069n6610j7337R4407m4387j05903O0726
$$ y = [302828, 237391, 351322, 319038, 180001, 111588, 219707, 206162, 190182, 284944, 243322, 147783, 183473, 319479, 176257, 84611, 136369, 218805, 158126, 48857, 73268, 171724, 107271, 120478, 87740, 161501, 255971, 281974, 202596, 195850, 262680, 150637, 126491, 195481, 117837, 299668, 250321, 174713, 177096, 188108, 194825, 146216, 244745, 180953, 58751, 114231, 128014, 91099, 120646, 162938, 202502, 118993, 119129, 122033, 141451, 99587, 179508, 183973, 203246, 188085, 57286, -12927, 18608, 123701, 134373, 125102, 86220, 124912, 201926, 94464, 44962, 113475, 183049, 50449, 108137, 205830, 176949, 48541, 83180, 45077, 125591, 15221, 20924, 102788, 198469, 211538, 154928, 137591, 231998, 187611, 81708, 142434]
2581A42434k1323K7955o9170q130P3112j0735p1342n004j6195o5663l15M5305
2569B0929l4181J1584o0822K5834P1950J7993J03722L0648q4375O3099n5165j16272
2557e056L1179J05774o6170n5303k9187N2288L1932K9008r9774j74463M0331J22442
2545a6999p1989M7307J14795j2767k3418J06937q487j01405J3743J18307j05565
2534F0459j82296N7145J01524k0976J22178r2574k924k9252l6495L8752K0911
2523C6452Q2392j27043O6100m117P497m3053Q4125L3695m0626j7073N1307j9340
2511A10316j19367p1511P6764K1925L7791p3751j13451K09192M5059P146j55040
2500b4927j7586k3636k3411L5662P2270J1576p8939j7243L54j8991K0810O9586
$$ y = [142434, 121111, 149066, 79896, 71766, 144878, 134143, 62801, 57797, 41602, -24061, -24376, 20929, -13252, -1668, -62490, -36656, 35294, 53287, 157009, 187657, 103282, 166381, 111216, -5056, 26123, 131897, 65727, 10424, -18763, 33525, 65457, 94465, -5309, -179772, -139441, -16999, -88988, -41681, 73114, 60347, 36929, 143866, 135379, 33974, 47717, 166024, 60459, -121837, -64692, 36832, 15856, 138034, 45460, 42536, 13284, -23211, 15541, 36452, 118844, -8199, 57901, 53784, 61281, 18228, 102353, 136048, 95422, 78349, 129656, 110316, -9051, -80562, -3798, 18127, 55918, -17833, -131284, 77908, 122967, 130113, -24927, -42513, -66149, -89560, -53898, 18372, 29948, -48991, -66234, -65880, -84871, -64061, 5525]
2488E525r3848L1873N9012J16913m5554o0342j2600o341k7177Q726O0746n9390
2476b2457o0009P2639L4698j4574n3418K1416k6444J5408L525p355J26483r9144
2464i232j26312J12440O2488k2956M8407n6676k5877l6727R2857p3201J2113L7278
2452A4602k2553K7975K1889m9499r4141Q8119K8377o8135q845k4034M1175m540
2440d9610R1406k4154n7303N8730M2517k4244o785o8568N5267K4331r6795M0639
2428a4569M2975m5574n6415P0540j15234p647l6741k2598L1676O2459n3404M6439
2416i8093k9892n4031R4222J04875p1616k8090m9275N0975k0714o2336O862J09281
2404d7832K5251o6245R3294j10140r3066L7351N1369J429Q466P2752m1104O4803
$$ y = [5525, -88323, -56450, 2562, 119475, 73921, 13579, 979, -5362, -32539, -23813, 36933, -22457, -82466, -9827, 24871, 10297, -43121, -21705, -48149, -32741, -29216, -36571, 89912, -9232, -135544, -23104, 39384, 16428, 64835, 8159, -17718, -54445, 38412, -34789, -22676, 14602, -7951, 20024, 41913, -7586, -101727, -13608, 14769, -53366, -62211, -86245, -45070, -49610, 41796, 17642, -39661, 19069, 61586, 37342, 30557, -38011, 17256, 41587, -55208, -14569, 28406, -17168, -73583, -3043, -118277, -125924, -162665, -185263, -153587, -91128, -144532, -98093, -127985, -182016, -87794, 17081, -54535, -82625, -131900, -80925, -101639, -163975, -157113, -47832, -22581, -88826, 4468, -105672, -198738, -161387, -110018, -108589, -100123, -27371, -68475, -3672]
2392c672K6380M9043k7172o0250l8473j50107N3236R6961j9507j2391K2825Q70
2380f2257M886n3173P2857j7726L2690m3465l483l296P255N036q9551P4899o6267
2367a41595Q6057k2052L8476q301p2956O6543r8452j0275K9198j3599Q8561J22018
2355F3623j46340L8417M2062M5976p4966m5205j5831m4229J28251m8261K5521
2344c0982J2848q4728l5569Q6331N641k1408O6303L488r9943n2229l5246Q5426
2332a00068J21287l4723J06274j15152p3005N8041O5068n340l2639Q1192O3396
2321A34331k3521l3436p1702J1430P9761J28135k36830m4865Q5703o2540l2994
2310f6528L9351Q1425j58967Q0070P4732R576n9916j0364M4649k066M3690l7830
$$ y = [-3672, 22708, 71751, 44579, -15671, -54144, -204251, -151015, -54054, -73561, -85952, -63127, -62257, -57371, -110544, -37687, -55413, -22723, -66188, -69671, -72967, -65712, -60676, -150227, -75328, -141595, -55538, -77590, -39114, -47415, -120371, -53828, -152280, -162555, -133357, -146956, -58395, 63623, -82717, -44300, -2238, 43738, -31228, -76433, -92264, -136493, -8242, -56503, -30982, -18134, -102862, -138431, -52100, -46459, -67867, -1564, 1924, -98019, -150248, -185494, -100068, 21219, -13504, 92770, -22382, -95387, -37346, 27722, 22382, -10257, 70935, 134331, 110810, 77374, 5672, 17102, 96863, 224998, -11832, -56697, 29006, -33534, -66528, -27177, 54248, -104719, -24649, 50083, 59659, -257, -10621, 34028, 31962, 75652, 37822]
2298C7822j54549O146L7497P6576r349o6948q1359L4879R9725L5748l494j08477
2286i5783O1351o6153n3787J19797k5920j08423O3475K1940r2004K6499J1962
2275a37046K0846l3287L1058m7376J04712j815J994J5220J17218J2818j09934
2264b5592J06769j4715o5000L2338J3153j06544r3314M2720M0540J1894Q0352
2253B2601j21583p8816Rn6132R205L6345N0107O3958N3092Q4223m7294J13157
2241A28872j19417r3579l2682M7944R2654j4529L2978Q5140k0003j38628J5464
2230a5786Q4158o2121k1829n1401K8737J3273M3886J8762o4954O3811L2907Q3553
2218A52996K8562j38903n8405J7082j3666L0374j2160N1636P8765k9228m9893
$$ y = [37822, -116727, -110581, -73084, 3492, -5857, -72805, -154164, -119285, -19560, 16188, 12694, -95783, -34432, -100585, -154372, -34575, -60495, -168918, -105443, -83503, -175507, -149008, -137046, -116200, -149487, -118429, -165805, -61093, -62908, -60914, -45694, 71524, 84342, -25592, 81177, 66462, 1462, 33800, 46953, -59591, -152905, -110185, -69645, -57751, 22601, -98982, -177798, -177789, -233921, -224716, -188371, -138264, -74306, -21214, 63009, 15715, 128872, 9455, -84124, -116806, -68862, 23792, 9263, 42241, 127381, 107378, -31250, -15786, 68372, 6251, -15578, -66979, -38242, -24969, 18917, 37679, -27275, 36536, 69443, 152996, 181558, 42655, -15750, 1332, -12334, 18040, 5880, 57516, 136281, 107053, 57160]
2207E7160p7550J3323O2765n7309n408j5011O9251L354m6899O3951J74401k7638
2195B14390Q411q1291k19007N7171J04867m4302K2970J2232j2672J7605j5958
2184F4416M0050R0611o3638p5866M5913K4220M9201o5144N9510N9157K6048l8923
2172B15555l7651j5214n0259J7035O5443o6216Q0433M2377j8780P5535j36249
2161A72009n8527K6371l6114q685M9825J9674J27369k302q8720n1063j2931p9454
2149E7452J08842O9076n555j02765M8108M2622Q4021r6932M2306o1065J5765R0952
2137B92827k3507J09490k7560N374K9472P6329K6650k5151n7545k4225M5353L1374
2125D58881R0776Q5692m2987L5018O2634L6577M8193q230k2119O877O2672M3921
$$ y = [57160, -20390, -7067, 55698, -1611, -7019, -22030, 47221, 50575, 3676, 67627, 242028, 214390, 222801, 141510, -77497, -20326, 84541, 40239, 63209, 75441, 62769, 80374, 64416, 104466, 195077, 131439, 55573, 101486, 125706, 174907, 109763, 169273, 228430, 254478, 215555, 177904, 162690, 112431, 129466, 194909, 128693, 209126, 251503, 232723, 308258, 172009, 113482, 139853, 103739, 95054, 144879, 164553, 291922, 289620, 200900, 149837, 136906, 57452, 166294, 235370, 229815, 127050, 175158, 217780, 301801, 204869, 247175, 186110, 201875, 292827, 269320, 378810, 351250, 356624, 386096, 462425, 489075, 463924, 406379, 382154, 427507, 458881, 549657, 635349, 592362, 627380, 690014, 726591, 774784, 766554, 744435, 751312, 813984, 857905]
2113H57905j24015M3432O0642J2449N2874j6848Q415L0624l2961J0816j04893
2102G98440K08830J44458q9040P036L1998M7462J18008O683r2778m831J18101
2091A294367P7291L0667N4517O6119L0084M4465P5126K9922R041R6283R8804N50
2079A907236o3303O8873L0731J66056R0689j7826J41385K31035p6914K4354J00234
2068B602550J33059K03106J52008L9014K12201J99257L16830K57303K24775L94322
2058D734425M37972N88943M67027M90058M51132N83562P09191Q02288Q68466J043502
2048A1176566J425274J759899J862419K137056K767794M110557M786500J728703
2040C1754768m403061n485347m195619l204872k374327j982010j447957j149929
$$ y = [857905, 733890, 777322, 837964, 850413, 903287, 886439, 894854, 925478, 892517, 903333, 798440, 1007270, 1151728, 1062688, 1069724, 1101722, 1149184, 1267192, 1273875, 1181097, 1176266, 1294367, 1371658, 1402325, 1456842, 1522961, 1553045, 1597510, 1672636, 1702558, 1711599, 1807882, 1906686, 1907236, 1843933, 1912806, 1943537, 2109593, 2200282, 2182456, 2323841, 2554876, 2477962, 2502316, 2602550, 2735609, 2938715, 3090723, 3129737, 3341938, 3541195, 3858025, 4115328, 4340103, 4734425, 5172397, 5761340, 6228367, 6718425, 7169557, 7753119, 8462310, 9264598, 10133064, 11176566, 12601840, 14361739, 16224158, 18361214, 21129008, 25239565, 30026065, 31754768, 27351707, 21866360, 17670741, 14465869, 12091542, 10109532, 8661575, 7511646]
2032G511646r10583q17344n45287m79493l19691k80376p9862m37903l73147l59821
2022B908139j92364k09807k05095j27242j90359j75643j33882j46728r501m1572
2012A475946j60248p0827j26480j4753j02562o6968M3310K2468k3597j08465K0475
2001H88299q9910n4753m2280j20070M3921M4666q420K205o2943j01471N9499o5174
1989D93569k13857j13508J42997J19469l4419K8640l6153j5591p0170k0919p784
1978B72274q9001R9387J4970j3682r407P0601l777l2514j3658l8394k9490Q499
1966B35808O87O4468j23202O4963K18k5218L1598j41680j6780J5k8064k4493P3745
1953A12065J415j5762j0280n1512K6680J64060K441J651n8086k1432m2916M4989
$$ y = [7511646, 6601063, 5783719, 5238432, 4758939, 4439248, 4158872, 4079010, 3641107, 3267960, 2908139, 2715775, 2505968, 2300873, 2173631, 1983272, 1807629, 1673747, 1527019, 1517518, 1475946, 1315698, 1244871, 1118391, 1103638, 1001076, 934108, 977418, 999886, 976289, 867824, 888299, 798389, 743636, 701356, 581286, 625207, 669873, 661453, 663658, 600715, 499244, 558743, 493569, 279712, 166204, 309201, 428670, 394251, 422891, 386738, 371147, 300977, 280058, 272274, 183273, 282660, 297630, 283948, 274541, 345142, 341365, 308851, 295193, 256799, 227309, 235808, 236495, 300963, 177761, 242724, 242942, 217724, 249322, 107642, 90862, 90877, 62813, 38320, 112065, 113480, 97718, 87438, 35926, 62606, 226666, 229107, 230758, 172672, 151240, 108324, 153313]
1941A53313p5505j07203J00189K1365j52540O9782Q6872m3982o8209j6723Q10
1930c1831K1478j2495K4448J54934q1735m6871j36235L806K7458L9432l974O2399
1918B0814j9753r8779n8428J81367k8096j34866J42836l0585j0737k2739M547
1907e4419q284L7762O6322Q7939J4362q7902j13600O2696L5274L1890P3533j30663
1895A4910n1361m7034J03236n5782P811m9427O761M3386J6024m9237j0928O1910
1883i731o3468j0926N1607J4216q9250J00890P7748k0614L2002L8463k6318j4704
1871G9915m4199j18914J7816M4413m078M1718j08023O9412m8658P6847r290m3926
1859d6967L2246K2513j01162L7119J69564k8136j16143M9644p1733L8661K0562
$$ y = [153313, 77808, -29395, 70794, 92159, -60381, 9401, 96273, 52291, -15918, -32641, -31831, -10353, -22848, 1600, 156534, 74799, 27928, -108307, -104501, -77043, -37611, -41585, 20814, 1061, -97718, -156146, 25221, -2875, -137741, 5095, -25490, -36227, -58966, -54419, -62703, -24941, 41381, 129320, 143682, 55780, -57820, 4876, 40150, 72040, 145573, 14910, -36451, -83485, 19751, -36031, -28220, -77647, -70886, -27500, -11476, -60713, -71641, -9731, -73199, -84125, -32518, -18302, -107552, -6662, 71086, 50472, 82474, 120937, 94619, 79915, 35716, -83198, -65382, -20969, -25047, 16671, -91352, -21940, -70598, 6249, -3041, -46967, -14721, 7792, -93370, -56251, 113313, 85177, -30966, 18678, -53055, -14394, 6168]
1848F168O425K0598j43130k9923l2251J36045J29923j85780j0602O2321K0803
1837a9403K2138j38151Q1065m1078j12189K0339J67283L6773j73717k8334M2132
1826a43142N1891L2960R2656j01365J4571n4914k5833J19258j9225N6357K8030
1815E1244q2150n5801P0076N6980J9293p5413L1623P6948l066j04877M235p1610
1803h2518j4236M6675p9994J52416J5596q1407K2614q6685L1576j0234J1997J11618
1791C7418r505j30527j3608k3067Q852J00779N6588M1626m524q3188o5787m2579
1779a27522J33253N9426Q962P8450j04210m895K6797O1995l265l7606m142j02710
1767a5467J12387o6475j9753L2336m8811j901K6044m0139n0237p8805M2897P4784
$$ y = [6168, 12593, 33191, -109939, -139862, -172113, -36068, 93855, -91925, -102527, -40206, -19403, 2735, -135416, -54351, -95429, -207618, -187279, -19996, 16777, -156940, -185274, -143142, -91251, -58291, 34365, -67000, -52429, -107343, -133176, -13918, -33143, 23214, 51244, -30906, -86707, -16631, 40349, 59642, -15771, 15852, 92800, 89734, -15143, -10908, -82518, -96754, -50079, -130073, 22343, 37939, -43468, -20854, -107539, -75963, -86197, -74200, 37418, 27913, -102614, -116222, -139289, -130437, -29658, 26930, 68556, 64032, -19156, -84943, -127522, 5731, 65157, 74119, 152569, 48359, 43464, 70261, 132256, 128991, 91385, 87243, -15467, 96920, 30445, 10692, 43028, -5783, -7684, 18360, -21779, -72016, -150821, -107924, -33140]
1755c3140l2013n0667K3579J01640L1397n3915J0754L0999P7186m7742j8048n1777
1743a1747k8143L0826j42710O1399J36109j45188n834Q8557o6787m1492m0725
1732a65735N8514k1482m166O8620R3903o2994n0158K8262l3167L9302K2531m7382
1720g3952j1479p831N764m3906p4301L5661O6898P1024R7549j22152j4471M9174
1708b2022k933m2842l9384O7293L4026j00074k3471L483O7671M3795j18140n5012
1696a87610J31264r700r8706R5392k036j19868l6079N1781o577K4918J8226N897
1684a33098N9819K202p9844K8647K4116J06064O1419m6436N9848j52012p1258
1673a40533l1007L1099K4583k6430n0233Q1770N9263N1030k6538M7188q3266J4899
$$ y = [-33140, -65153, -115820, -92241, 9399, 40796, -13119, -2365, 28634, 105820, 58078, 40030, -11747, -39890, -9064, -151774, -90375, 45734, -99454, -105288, -16731, -83518, -125010, -165735, -107221, -128703, -132869, -64249, 29654, -33340, -83498, -55236, -88403, -49101, -26570, -73952, -85431, -93262, -87498, -131404, -205705, -170044, -103146, -32122, 65427, -56725, -71196, -22022, -24955, -67797, -107181, -39888, -5862, -105936, -129407, -125924, -58253, -14458, -132598, -187610, -56346, -66046, -164752, -69360, -71396, -191264, -227343, -175562, -182139, -157221, -138995, -133098, -73279, -71077, -150921, -122274, -98158, 7906, 69325, 22889, 82737, -69275, -140533, -171540, -140441, -115858, -142288, -192521, -110751, -51488, -458, -26996, 20192, -63074, -48175]
1661d8175m631l2805J3372l7396O4113M0057J6518p3058R4726j28888j382R429
1649h8120L9921n7179l9802Q6444m7876m3783P6448j9374q2180J14023L1123p9859
1637a10214L5145k1704L9616P8256j46031j9984R7788k518M3973O2783J6134K1444
1625I4688j3437P291n8025n9283J7137R4846L0463j15818p7288K3353Q3493R638
1613C7058m6847r707M5722j09071k5845K7614l2991m0960P3086k629J2470J1840
1601f0260m8405m3953k8233M3864M0357K0557M8696j01835k6429k40O3159N4111
1589c8611o0787K1329L0890r7821L1791k0858o6477R2230J654L7616l9736j0563
1577a19343O0369R6923k300q1026m173m3323q9451J04216j923L3739n5697N3455
$$ y = [-48175, -52806, -85611, -72239, -109635, -45522, -5465, 11053, -62005, 32721, -96167, -97549, -88120, -48199, -105378, -145180, -58736, -106612, -150395, -73947, -93321, -175501, -61478, -30355, -110214, -75069, -96773, -57157, 21099, -124932, -144916, -47128, -49646, -5673, 57110, 73244, 94688, 81251, 88542, 30517, -28766, -11629, 83217, 113680, -2138, -79426, -56073, 27420, 37058, -9789, -19496, 26226, -82845, -108690, -81076, -114067, -155027, -81941, -84570, -72100, -60260, -108665, -152618, -180851, -136987, -96630, -76073, -27377, -129212, -155641, -155881, -92722, -38611, -99398, -78069, -47179, -145000, -113209, -134067, -200544, -108314, -106660, -69044, -108780, -119343, -58974, 37949, 35649, -45377, -49550, -92873, -182324, -78108, -80031, -46292, -101989, -48534]
1565d8534q2772J76450L9812j5190q3503o8412J26336m6482l2182J8031Q6141
1554F9695L0657m7903j40075N0595R3843j22644q0356L8836l492J9985n948N2795
1542d4012L3607p5539l670J05773l2127j1677n7220l852n9112L4561J6064N8540
1530c8664j3671l7187L8876R0538l660K8275n1767n6633o638j7187K3362J9763
1518b4593j6627n2096M3875P5652K6443j32711q4541J15472j590n3688m124j0155
1506a18683J56827n3361l2400O0598K4514K3583m7642M1272o7928r671o341J4346
1494a4886O4557k2084o1579l4143J5200K2933J05108q6145p8511J9109J7164n4370
1482a07647J9711M6543K2424j414k4276j25528Q3328R7680l4780o7667p3286m9863
$$ y = [-48534, -131306, 45144, 84956, 69766, -13737, -82149, 44187, -2295, -34477, -16446, 69695, 100352, 52449, -87626, -37031, 56812, -65832, -146188, -107352, -110844, -90859, -96807, -44012, -10405, -85944, -89614, 16159, -15968, -27645, -84865, -88717, -147829, -113268, -97204, -38664, -52335, -89522, -50646, 39892, 36232, 64507, 12740, -43893, -50531, -67718, -44356, -24593, -41220, -93316, -49441, 26211, 52654, -80057, -164598, -49126, -50716, -104404, -108528, -118683, 38144, -15217, -47617, 12981, 37495, 61078, 13436, 54708, -13220, -22891, -29232, -14886, 49671, 27587, -33992, -68135, -52935, -30002, 75106, -11039, -89550, -70441, -53277, -107647, -87936, -41393, -18969, -20383, -44659, -170187, -86859, 10821, -23959, -91626, -164912, -214775]
1470b14775R1885P6417p4216k8318M3227K8098L2295n8780j7314l0868m2150J52837
1458d1662M7602l1337j02967l2322J45584K1916k5139J1100n9501K3511l4204
1447g7419j0273P6842r0774L7933l7980L602k0893k2157J06746j4319M3773l8469
1435d3388n7001M6665l4452k9062Q297L4599Q1413k6402N4879m9244o0522l6825
1423a11043J06148J7193l256m8754N3795K5827N20p2176n9921M8025m3608j238
1411h8488O9661K3970p6133l7322J3589Q1274k3452r5453k6511L623N8372J9760
1399g7110m01j8864j1988J88771q5653k2226J7660n8217J9333O4357J7376L796
1387C6834Q691j2087Q216N1907l8918o4671j06078j27018K02788k5484P0592m5811
$$ y = [-214775, -122890, -46473, -120689, -149007, -105780, -77682, -45387, -104167, -121481, -152349, -194499, -41662, 5940, -25397, -128364, -160686, -15102, 6814, -18325, -7225, -66726, -43215, -77419, -87692, -10850, -101624, -63691, -101671, -98069, -118962, -141119, -34373, -48692, -4919, -43388, -100389, -53724, -88176, -117238, -108941, -74342, 7071, -19331, 35548, -13696, -74218, -111043, -4895, 12298, 9042, -39712, 14083, 39910, 40430, -31746, -91667, -43642, -87250, -88488, -18827, 5143, -70990, -108312, -94723, -13449, -36901, -132354, -158865, -155242, -96870, -77110, -77511, -96375, -108363, 80408, -5245, -27471, -9811, -68028, -48695, 15662, 33038, 36834, 45525, 33438, 41654, 93561, 54643, -10028, -116106, -243124, -40336, -65820, 4772, -41039]
1375d1039o5870k3276M0061M361n733o842k6404n043m8365K2780J4267l529J10011
1362c4621N9453l5694r7900p5031J27578j8491j931J7455P7753k7212M6721r4434
1350e6354q7696M3025M2871J20591K2040k21419O523J1026L0227L3017K4691q7060
1338a18518k0049j920q067J05312N1833M8404k6489K3338p9644k0729P4915m3598
1326a5212q2716J35975j6639k2650J24125o5659m7383r5619N6461m0683k5380
1315i5380J14645r6101j05420M7389Q1848j08428j8607R4366P7893J10971p0308
1304C2868m8850n7704j6757l6532J52050J31014j19336r1976j3506M7537k7712
1293d8904J2877M4856L6162k8910K4414L9701k962q6761k832r2590j05537J85027
$$ y = [-41039, -106909, -130185, -90124, -85763, -91496, -98338, -124742, -129785, -178150, -155370, -141103, -144632, -34621, 24832, -10862, -108762, -183793, -56215, -74706, -76637, -59182, 18571, -8641, 38080, -56354, -144050, -101025, -58154, 62437, 84477, -136942, -130419, -119393, -89166, -56149, -31458, -118518, -138567, -140487, -148554, -43242, 8591, 56995, 30506, 53844, -25800, -46529, 28386, -15212, -97928, 38047, 21408, -1242, 122883, 57224, 9841, -85778, -29317, -70000, -95380, 19265, -76836, -182256, -134867, -53019, -161447, -180054, -85688, -7795, 103176, 32868, -15982, -73686, -90443, -126975, 25075, 156089, 36753, -55223, -68729, -21192, -48904, -36027, 8829, 44991, 16081, 40495, 80196, 77234, -9527, -12359, -104949, -210486, -25459]
1281b5459J37502j67738n9596J81724R002n9207k0270o4053p881K4149j2510k0038
1269h4375J01917J7179k8751j16152M3738n0029q630L4904L9413L6449j3420O6255
1257C8498P5047n8673j67440K0636J35572j35858J01454M7553J6195q4349q776
1246b0141q748k945K1604k6335J25165l1636j8669j02007r517k8259n2360m2066
1234a95914J92958Q5925k3638n0468r3173O9080m8361J10716n5660J5714j1302
1223d123j16232j4257k753P6166O6535j9824N2259n6513j51257J34096o259M7578
1211E416K2080M8654j552n8956j05494J09052j89593O3038J3208k6146M3096L1909
1199d5288j9637o8075K0l6535k5946J02989N4590j11655j0356M1065N2588r4821
$$ y = [-25459, 112043, -55695, -115291, 66433, 75435, 16228, -4042, -68095, -75976, -51827, -64337, -84375, 17542, 34721, 5970, -110182, -66444, -116473, -125103, -90199, -50786, -14337, -27757, 38498, 113545, 54872, -112568, -91932, 43640, -92218, 9236, 56789, 72984, -11365, -20141, -28889, -31834, -10230, -36565, 88600, 56964, 38295, -63712, -73229, -101488, -153848, -195914, -2956, 82969, 59331, 8863, -84310, -15230, -63591, 47125, -8535, 7179, -4123, -120355, -134612, -137365, -61199, 5336, -14488, 37771, -18742, -169999, -35903, -42162, 5416, 27496, 76150, 74598, 15642, -89852, 19200, -170393, -107355, -94147, -120293, -77197, -45288, -64925, -133000, -132980, -169515, -195461, -92472, -37882, -149537, -159893, -118828, -66240, -161061]
1187a61061l044Q4527K0934q98N3763l9686K4116m3752O9781o6310k1106R2734
1175I998j2177k7416o9535l8821M1146M0238J04266K2621k5930P5812p6833p1705
1163b8336l4220l2811K857K0611j9209k2250K8516M526M0130j0456k7775j26620
1151b05037M1188J80760k1977l5100m1283L0381K964J6276m9445Q8605N279m6525
1139c3914m1393j6925Q8684k4656m9587L3407L0728k7756m5465j103M6611Q12
1127d0557o2789K8Q3827K5296l5333p0209M2925O1333Q5234L4275j3265l8023
1115G2742K219O2028l6419j13092J5900m1947j7857P5416p0312j12233O831N908
1103a50816P6075j3311j1412N6389P6348j5381n8915N936L9194P2674m3034K1732
$$ y = [-161061, -164105, -79578, -58644, -59542, -5779, -45465, -21349, -65101, 4680, -61630, -82736, 9998, -2179, -29595, -99130, -137951, -96805, -56567, 47699, 70320, 44390, 120202, 43369, -28336, -62556, -95367, -92510, -71899, -91108, -113358, -84842, -80316, -40186, -50642, -78417, -205037, -163849, 16911, -5066, -40166, -81449, -51068, -48104, -31828, -81273, 7332, 12611, -33914, -75307, -92232, -3548, -28204, -77791, -44384, -13656, -41412, -86877, -87980, -41369, -40557, -103346, -103318, -19491, 5805, -29528, -99737, -56812, 4521, 89755, 124030, 110765, 72742, 74961, 136989, 100570, -12522, 3378, -38569, -56426, 18990, -51322, -163555, -156724, -150816, -74741, -88052, -99464, -43075, 33273, 17892, -41023, -35087, 4107, 76781, 33747, 55479]
1091E5479l451l6370O7517o1085J168N4352p8390Q849P9954j80292j0585j1859
1079a14713m24K5832L0472M9294J4431Q5162j56352o6121L9326N6994k2602Q7832
1067B9131L2210k6955k0090K3150l6241L2942P4892n2756o0478N4256n5541n7390
1055f2870R1284r6383Q4892K0333J3143p7097j36931Q3331l0013J9126J9535L4067
1043c7583m4900j1226j5989J35396R064l1281N9381O2805k8480j41978O5277n5875
1031c5389K33j15835R450k5868M2869J33183L9217m7610m8241K0807k4569J9204
1019c2549J3563J10o0219p0642J03724N3751o5131K6421j7979N606L5687N9262
1007E1604l4073N2711o2786j8832M7420j7356M9682M0826o3578J12565L9085j53704
$$ y = [55479, 52028, 15658, 83175, 22090, 23258, 77610, -780, 8069, 88023, -92269, -102854, -114713, -115137, -89305, -58833, -9539, 4892, 90054, -66298, -132419, -93093, -36099, -58701, 29131, 61341, 34386, 14296, 37446, 1205, 34147, 109039, 56283, -4195, 50061, -5480, -62870, 28414, -67969, 16923, 37256, 50399, -26698, -163629, -80298, -110311, -91185, -71650, -37583, -82483, -93709, -109698, 25698, 34762, 3481, 62862, 125667, 97187, -44791, 20486, -35389, -35156, -150991, -141541, -167409, -124540, 8643, 47860, 250, -47991, -27184, -51753, -32549, -18986, -18876, -79095, -149737, -46013, 7738, -57393, -30972, -48951, -43345, -7658, 51604, 17531, 70242, 7456, -11376, 36044, 18688, 68370, 109196, 45618, 158183, 197268, 43564]
995D3564N0553q4436o620m4222l2541P7189n38n1670m7543o71J33830p5052p037
982d5194K2394m3081N106l4814M1135P068L266j4413J0546L7100J23821l1621
970H1313n9150r0653m5591Q3012j6299k5562J7494o019q4374j361J48583j3883
958a2490j559P8224O0675P546n0617J7425q3953O337J079p6172O913k8486J7850
945e7228J17720q9420L839M0027m9666O3709j08900K7552K8326J08096j0284j05910
933c2139O4360q1009m3927L3439k3193L2601R6180l1327o494O4905j21901j757
921e0262M3240J1873J8076p9360N6637p797n9420J2332K1208R3020n8213M2068
909D3402R530k6419L4965j00535K9682o8616M7515J43541m4104j33314K6726Q5633
$$ y = [43564, 94117, 9681, 3061, -41161, -73702, 3487, 2949, -48721, -96264, -96935, 36895, -38157, -45194, -22800, -65881, -60775, -95589, -54454, -47386, -44120, -58533, -47987, -10887, 112934, 81313, 22163, -68490, -114081, -31069, -47368, -72930, -55436, -61455, -145829, -147190, 1393, -12490, -14049, 64175, 124850, 132396, 81779, 99204, 15251, 21588, 22667, -53505, -46592, -75078, -57228, 60492, -28928, -25089, 14938, -34728, 28981, -79919, -52367, -24041, 84055, 73771, -32139, 32221, -48788, -92715, -59276, -82469, -49868, 46312, 14985, 8491, 73396, -48505, -50262, -7022, 4851, 22927, -56433, 204, -7593, -67013, -54681, -33473, 59547, 1334, 43402, 52932, 26513, 61478, -39057, -9375, -77991, -30476, 113065, 68961, -64353, -37627, 48006]
897D8006l4285L4940l9342j5675L8693o9557k2396n2085P5343O6152J8380M838
885E3012O1703R1640r7001N6767O1532p1745m4097m1419j19213J2184l1192N2432
873a5397k6987m7792j4224M7226N6349N43L8470M5524o6556j23430n6821K02224
861C9129N7070j20948p434l7384J7604J11472M6840q5959K9019P1587l6719j53495
849f9218p3399J0738K3177J02826O5051L7970M3641r8929P3399m3395k9381Q1477
837A23957p0584r9753J2781l1823J0640Q2875L884r6770J06272l5651J05855N3245
825A64928o8246N130o0626l0642K3562L7467r5866o7782M2496M0493L2127l5398
813a2357n266n2260O3554L2283L5100n8841l1160L5078N5559o91o4406k6522J18365
$$ y = [48006, 13721, 48661, 9319, -6356, 32337, -37220, -59616, -111701, -36358, 29794, 48174, 53012, 114715, 206355, 109354, 166121, 227653, 155908, 111811, 70392, -48821, -36637, -67829, -15397, -42384, -90176, -104400, -57174, -825, -282, 38188, 83712, 17156, -106274, -163095, 39129, 96199, -24749, -32183, -69567, -51963, 59509, 106349, 20390, 49409, 120996, 84277, -69218, -142617, -131879, -108702, -5876, 59175, 97145, 140786, 41857, 115256, 71861, 42480, 123957, 53373, -46380, -33599, -65422, -54782, 28093, 31977, -64793, 41479, 5828, 111683, 164928, 96682, 101812, 41186, 10544, 34106, 71573, -24293, -92075, -49579, -9086, 23041, -12357, -17623, -69883, -6329, 25954, 61054, 2213, -28947, 6131, 61690, 60999, -3407, -29929, 88436]
800H8436r7415r6537l9441P6188P1896L5688m938m8784J23862j27865L0614m8432
788c6728O3204K4962m7050R8081J30611r7988j18668j1689P009p7050P4861J4459
776B4014J3717m1793J255J6385O380L5751j1093K0741P0663r2066l9290J33844
764A38508o4409j6889L0612K8249p60q3943m1565j3371L7391L7690K1290p4687
752a884O5883n790k8901J34636q7077l2555M4360k2642Q149N6458L3673q8102
740G6208o7384m8365k3655M9112l1753O4341J18650j35383n114j61333l150J76328
728H502O3539j8738K818n0m397O4145m1888p4113J709j3467K4586j03678L0933
715f0099J35239l2006P2664p1116j40907M0030k126R4110R5963j41369o6751M4071
$$ y = [88436, -8979, -105516, -144957, -68769, 3127, 38815, 33877, -14907, 108955, -18910, 11704, -36728, 26476, 51438, 4388, 102469, 233080, 135092, 16424, 4735, 11744, -65306, 9555, 24014, 37731, -4062, -2807, 13578, 19958, 55709, 44616, 65357, 136020, 43954, 4664, 138508, 74099, 57210, 87822, 116071, 115311, 31368, -10197, -23568, 13823, 51513, 72803, -1884, 63999, 58209, 29308, 163944, 76867, 44312, 88672, 66030, 74179, 130637, 164310, 76208, 8824, -39541, -63196, -14084, -45837, 18504, 137154, 1771, -3343, -164676, -167826, 8502, 72041, 53303, 56121, 56071, 51674, 115819, 73931, -182, 1527, -11940, 12646, -91032, -60099, 75140, 43134, 115798, 44682, -96225, -56195, -58321, 35789, 131752, -9617, -76368, -32297]
703c2297m5623L0857N5320j00641N9389J50793m3953j9314P6422m491p1540L2109
691H7031O9124j45905R822M3673J9540p0332R89j28307K7941R5956L2505P4202
679A16239J9285r6353R9M0411r9448j4882J8136j4571l978R512o0925o0252L0809
666a15918M9201R7548P907q4352J41022J7877j03821R1527m8039k5046r1839L5147
654b8786l5162k1746P5955j07101J22454J5945O2973m3396J2138J5666l0261K1715
642F0394q2877R6928m9831r240o0162O7441n2559R5432m366q4673L6484L6538
630D9509j3832K1189l78O1422O4000j8819K271o3900J9239r6971R1673m7064N5669
617A24008j2552K9082o4721M3105k7924j3852N8501l8599O3344n2968p287n2508
$$ y = [-32297, -77920, -47063, 8257, -92384, -32995, 117798, 73845, 54531, 130953, 126462, 54922, 87031, 156155, 10250, 20072, 63745, 83285, 12953, 13942, -114365, -86424, 9532, 42037, 116239, 135524, 39171, 39270, 79681, -19767, -34649, -16513, -31084, -35062, -25550, -86475, -146727, -115918, -66717, 30831, 38738, -45614, 95408, 113285, 9464, 100991, 52952, 27906, -63933, -28786, -63948, -85694, -9739, -116840, 5614, 21559, 84532, 41136, 53274, 68940, 38679, 60394, -22483, 74445, 24614, 15374, -44788, 22653, -29906, 65526, 61160, -23513, 12971, 49509, 35677, 56866, 56488, 117910, 181910, 163091, 165362, 101462, 120701, 23730, 115403, 68339, 124008, 111456, 140538, 75817, 118922, 90998, 77146, 135647, 97048, 160392, 107424, 100137, 47629]
605D7629j26123n9993K24158J8294q6365p2846k4662m549N9795J12986j0740j6130
593F1454l1434L7203k9913J4199J2671j17437L1007J49736N6968p3742j03593
582G119M3850M3561M5480K061j2167N1942r0309L8716j1740l9483N7603m9892
570H6741K17m2342k451k8185j39510o697J40215n095j8042l5052P9031q1826L7681
557a5315j7695Q058P8469R361k2846J5491J07016k5004j2113n2984K5103J1803
545A09344r2152k35M2792q0399k4448o042L5244K5370O0323L6672l4846k3282
533D8341m9092M25O5629K8516j1143m5407O6106k1956l4580k295L998L9703j03411
520a5166n8339j6889K1578L0836L1665L0218P2601P572n383j23017J44754K1183
$$ y = [47629, -78494, -138487, 85671, 103965, 17600, -55246, -79908, -84457, -24662, 88324, 77584, 61454, 30020, 67223, 37310, 51509, 64180, -53257, -22250, 127486, 184454, 110712, 7119, 50969, 94530, 140010, 142071, 129904, 181846, 91537, 130253, 118513, 79030, 136633, 86741, 86958, 44616, 42165, 13980, -125530, -132227, 7988, 2893, -15149, -50201, 28830, -52996, -15315, -33010, -24952, 53517, 62878, 40032, 55523, 162539, 137535, 125422, 72438, 97541, 109344, 17192, 16957, 59749, -20650, -45098, -51140, -15896, 9474, 69797, 106469, 71623, 48341, -751, -326, 65303, 93819, 82676, 37269, 103375, 81419, 46839, 44544, 48542, 88245, -15166, -73505, -90394, -68816, -37980, -6315, 23903, 96504, 104076, 98693, -24324, 120430, 141613]
508A41613l8518M3196J808j55632n1664J69599J672j44336j1089P7851M9838R0757
496A75095o4246M5554J3486n7822j9162J03033p8126n8994p4927J5297O7617L1160
484I7965O743L8130m4750m0647M2618n2936m5431N7445M9968r8236P0434K7890
472A09193k8440M5635k409p1216l781R8542m2486k4727J6283l8141M0886P2600
460A71939L0511O1019o2081j36796P2997n7144m0394N6265o162O4458J5864j2512
448A57964r5742N2418k4894j3107j2714l3743L5743p5322k8420J1514L1042N4090
436E8829l2856j0540K0383k4368L2516J3398M3599M1957r7560J25154n3481n0675
424F6356j0332J08848m6757k2536j9111J4778p4682L1799Q9887J1128L4554l2821
$$ y = [141613, 103095, 146291, 148099, -7533, -59197, 110402, 112074, -32262, -43351, 34500, 84338, 175095, 110849, 156403, 169889, 112067, 92905, 195938, 117812, 58818, -16109, -812, 66805, 97965, 104708, 142838, 98088, 57441, 100059, 47123, 1692, 59137, 109105, 10869, 81303, 109193, 80753, 126388, 123979, 52763, 48982, 147524, 105038, 80311, 96594, 58453, 99339, 171939, 202450, 263469, 201388, 64592, 137589, 80445, 40051, 96316, 90154, 154612, 170476, 157964, 62222, 114640, 89746, 76639, 63925, 30182, 65925, -9397, -37817, -26303, 4739, 58829, 25973, 15433, 35816, 11448, 43964, 57362, 100961, 142918, 45358, 170512, 117031, 66356, 56024, 164872, 118115, 95579, 76468, 91246, 16564, 48363, 138250, 149378, 183932, 151111]
412A51111k7513m4909K8225K2334m0419p5175R4843P0126P4099p5190n8131j08271
400A1130J2178N3258R8500n0139m0301K7491j00254K1001K8091M4490R0563o356
388A89652k712k7522L4713n3597j07326J7636O4160L7280R7969j64804M7975Q5996
376B19420j4019n4401j09284R8857Q486M3455k319q6760j696L4196n4842j51615
364g0522P1229Q9023N3957J6331L151m3170J6282l5054k1298q167K7087P688j76807
351g0270n2330J46789J3276j7333m1j519R7609L2960M325l1962r1398K7455K3388
338H0949O2853K6599J6003k1947n1564N1689r0334Q6484L4429l7533l914L740
326A57454O0396K9889j12794M4023K6732o4286P5139R2114n6014j03594n72K0967
$$ y = [151111, 123598, 78689, 106914, 129248, 88829, 13654, 108497, 178623, 252722, 177532, 119401, 11130, 23308, 76566, 175066, 124927, 84626, 112117, 11863, 32864, 60955, 105445, 196008, 189652, 186940, 159418, 194131, 140534, 33208, 50844, 115004, 152284, 250253, 85449, 133424, 219420, 205401, 151000, 41716, 140573, 149059, 192514, 190195, 103435, 101739, 135935, 81093, -70522, 707, 89730, 143687, 160018, 163169, 119999, 136281, 101227, 79929, 71762, 98849, 106537, -70270, -122600, 24189, 37465, 20132, 20091, 18572, 116181, 149141, 153466, 121504, 30106, 57561, 80949, 143802, 170401, 186404, 164457, 112893, 164582, 74248, 160732, 195161, 157628, 153714, 157454, 217850, 247739, 134945, 178968, 205700, 141414, 216553, 308667, 252653, 149059, 148487, 169454]
314A69454m9611K1422M6726m8413m338k7724J8602R3419n0870j91351J8808N8707
302E4831j2879J37090O5877p4338j07874N2271K0256j1200k3882m7254J7133r409
290F0622n3576M4067Q9942k3328K239N3077q1147r5652K1766O8266N830K4761
278A16867M5740q304k1823P0242j75N8654r6133q7849P8277m6441k2752J00917
266A87220o875l6446o1312l668Q2987O824M7029n0604r5782M8201P683l7291O5861
$$ y = [169454, 119843, 141265, 187991, 139578, 135240, 107516, 126118, 219537, 168667, -22684, -3876, 54831, 41952, 179042, 244919, 170581, 62707, 114978, 135234, 124034, 100152, 52898, 70031, 60622, 7046, 51113, 141055, 117727, 119966, 173043, 91896, -3756, 18010, 86276, 92106, 116867, 162607, 154303, 132480, 202722, 202547, 261201, 165068, 77219, 155496, 109055, 86303, 187220, 180345, 143899, 82587, 78919, 161906, 168730, 215759, 165155, 69373, 117574, 125257, 87966, 153827]
$$ [...]
##END NTUPLES=NMR SPECTRUM
##END=
